##TITLE=1H_GF0607
 CDCl3, 8 sc, 
 7.07.2021
##JCAMPDX= 6.0         $$ Bruker NMR JCAMP-DX V2.0
##DATA TYPE= NMR FID
##DATA CLASS= NTUPLES
##ORIGIN= UXNMR, Bruker Analytische Messtechnik GmbH
##OWNER= root
$$ XWIN-NMR		Version 3.5
$$ Wed Jul  7 10:33:52 2021 Russian Standard Time (UT+4h)  she@DPX200
##.OBSERVE FREQUENCY= 200.131506
##.OBSERVE NUCLEUS= ^1H
##.DELAY= (6, 6)
##.ACQUISITION MODE= SIMULTANEOUS
##.ACQUISITION SCHEME= undefined
##.AVERAGES= 8
##.DIGITISER RES= 18
##SPECTROMETER/DATA SYSTEM= spect
##.PULSE SEQUENCE= zg30
##.SOLVENT NAME= D2O
##.SHIFT REFERENCE= (INTERNAL, D2O, 0, 15.7039)
##AUDIT TRAIL= $$ (NUMBER, WHEN, WHO, WHERE, WHAT)
$$ ##TITLE= Audit trail, XWIN-NMR		Version 3.5
$$ ##JCAMPDX= 5.01
$$ ##ORIGIN= Bruker BioSpin GmbH
$$ ##OWNER= she
$$ F:/spectra/data/she/nmr/H-F/1/audita.txt
$$ ##AUDIT TRAIL=  $$ (NUMBER, WHEN, WHO, WHERE, WHAT)
(   1,<2021-07-07 10:32:21.79 +0400>,<she>,<DPX200>,
      <created by zg, POWCHK disabled, PULCHK disabled
       configuration hash MD5:
       00 E9 B6 7A A2 85 ED C7 34 08 36 98 17 FE 4E 26
       data hash MD5: 16K
       E6 45 C9 8D DB 14 96 08 A5 C2 83 7A 66 A7 F9 BC>)
$$ ##END=
$$ 
$$ hash MD5
$$ D8 E3 ED 33 8A 52 D4 85 C2 B6 ED 42 53 71 18 A2
##$RELAX= 
##$RELAX= 
##$RELAX= 
##$RELAX= 
##$RELAX= 
##$RELAX= 
$$ Bruker specific parameters
$$ --------------------------
##$DU= <F:/spectra>
##$EXPNO= 1
##$NAME= <H-F>
##$PROCNO= 1
##$TYPE= <nmr>
##$USER= <she>
##$AMP= (0..31)
100 100 100 100 100 100 100 100 100 100 100 100 100 100 100 100 100 100 
100 100 100 100 100 100 100 100 100 100 100 100 100 100 
##$AQSEQ= 0
##$AQ_mod= 1
##$AUNM= <au_zg>
##$AUTOPOS= <>
##$BF1= 200.13
##$BF2= 200.13
##$BF3= 200.13
##$BF4= 200.13
##$BF5= 200.13
##$BF6= 200.13
##$BF7= 200.13
##$BF8= 200.13
##$BYTORDA= 1
##$CFDGTYP= 0
##$CFRGTYP= 5
##$CHEMSTR= <none>
##$CNST= (0..31)
1 1 145 1 1 1 1 1 1 1 1 1 1 1 1 1 1 1 1 1 1 1 1 1 1 1 1 1 1 1 1 1 
##$CPDPRG= <>
##$CPDPRG1= <>
##$CPDPRG2= <>
##$CPDPRG3= <>
##$CPDPRG4= <mlev>
##$CPDPRG5= <mlev>
##$CPDPRG6= <mlev>
##$CPDPRG7= <mlev>
##$CPDPRG8= <mlev>
##$CPDPRGB= <>
##$CPDPRGT= <>
##$D= (0..31)
0 1.2 0 0 0 0 0 0 0 0.06 0 0.03 0 0 0 0 0.0002 0 0 0 0 0 0 0 0 0 0 0 0 
0 0 0 
##$DATE= 1625639541
##$DBL= (0..7)
120 120 120 120 120 120 120 120 
##$DBP= (0..7)
150 150 150 150 150 150 150 150 
##$DBP07= 0
##$DBPNAM0= <>
##$DBPNAM1= <>
##$DBPNAM2= <>
##$DBPNAM3= <>
##$DBPNAM4= <>
##$DBPNAM5= <>
##$DBPNAM6= <>
##$DBPNAM7= <>
##$DBPOAL= (0..7)
0.5 0.5 0.5 0.5 0.5 0.5 0.5 0.5 
##$DBPOFFS= (0..7)
0 0 0 0 0 0 0 0 
##$DE= 6
##$DECBNUC= <off>
##$DECIM= 32
##$DECNUC= <off>
##$DECSTAT= 4
##$DIGMOD= 1
##$DIGTYP= 9
##$DL= (0..7)
0 120 120 120 120 120 120 120 
##$DP= (0..7)
150 150 150 150 150 150 150 150 
##$DP07= 0
##$DPNAME0= <>
##$DPNAME1= <>
##$DPNAME2= <>
##$DPNAME3= <>
##$DPNAME4= <>
##$DPNAME5= <>
##$DPNAME6= <>
##$DPNAME7= <>
##$DPOAL= (0..7)
0.5 0.5 0.5 0.5 0.5 0.5 0.5 0.5 
##$DPOFFS= (0..7)
0 0 0 0 0 0 0 0 
##$DQDMODE= 0
##$DR= 18
##$DS= 0
##$DSLIST= <SSSSSSSSSSSSSSS>
##$DSPFIRM= 0
$$ [...]
##$SUBNAM2= <"">
##$SUBNAM3= <"">
##$SUBNAM4= <"">
##$SUBNAM5= <"">
##$SUBNAM6= <"">
##$SUBNAM7= <"">
##$SUBNAM8= <"">
##$SUBNAM9= <"">
##$SW= 20.0188882624521
##$SWIBOX= (0..15)
0 0 2 0 0 0 0 0 0 0 0 0 0 0 0 0 
##$SW_h= 4006.41025641026
##$TD= 16384
##$TD0= 1
##$TE= 0
##$TE2= 300
##$TE3= 300
##$TEG= 300
##$TL= (0..7)
0 120 120 120 120 120 120 120 
##$TP= (0..7)
150 150 150 150 150 150 150 150 
##$TP07= 0
##$TPNAME0= <>
##$TPNAME1= <>
##$TPNAME2= <>
##$TPNAME3= <>
##$TPNAME4= <>
##$TPNAME5= <>
##$TPNAME6= <>
##$TPNAME7= <>
##$TPOAL= (0..7)
0.5 0.5 0.5 0.5 0.5 0.5 0.5 0.5 
##$TPOFFS= (0..7)
0 0 0 0 0 0 0 0 
##$TUNHIN= 0
##$TUNHOUT= 0
##$TUNXOUT= 0
##$USERA1= <user>
##$USERA2= <user>
##$USERA3= <user>
##$USERA4= <user>
##$USERA5= <user>
##$V9= 5
##$VALIST= <valist>
##$VCLIST= <CCCCCCCCCCCCCCC>
##$VD= 0
##$VDLIST= <DDDDDDDDDDDDDDD>
##$VPLIST= <PPPPPPPPPPPPPPP>
##$VTLIST= <TTTTTTTTTTTTTTT>
##$WBST= 1024
##$WBSW= 4
##$XGAIN= (0..3)
0 0 0 0 
##$XL= 0
##$YL= 0
##$YMAX_a= 160918
##$YMIN_a= -191426
##$ZGOPTNS= <>
##$ZL1= 120
##$ZL2= 120
##$ZL3= 120
##$ZL4= 120
##$ABSF1= 10
##$ABSF2= 0
##$ABSG= 5
##$ABSL= 3
##$ALPHA= 0
##$AQORDER= 0
##$ASSFAC= 0
##$ASSFACI= 0
##$ASSFACX= 0
##$ASSWID= 0
##$AUNMP= <proc_1d>
##$AZFE= 0.1
##$AZFW= 0.1
##$BCFW= 1
##$BC_mod= 2
##$BYTORDP= 1
##$COROFFS= 0
##$CY= 11.3945322036743
##$DATMOD= 1
##$DC= 2
##$DFILT= <>
##$DTYPP= 0
##$F1P= 15.9154993809931
##$F2P= -4.1035820241983
##$FCOR= 0.5
##$FTSIZE= 0
##$FT_mod= 4
##$GAMMA= 1
##$GB= 0.15
##$INTBC= 1
##$INTSCL= 1
##$ISEN= 128
##$LB= 0.24
##$LEV0= 0
##$LPBIN= 0
##$MAXI= 10000
##$MC2= 0
##$MEAN= 0
##$ME_mod= 0
##$MI= 1.114404
##$NCOEF= 0
##$NC_proc= 0
##$NLEV= 6
##$NOISF1= 3.799351
##$NOISF2= 2.8
##$NSP= 1
##$NTH_PI= 0
##$NZP= 0
##$OFFSET= 15.70392
##$PC= 1
##$PHC0= -11916.34
##$PHC1= 15.80099
##$PH_mod= 1
##$PKNL= yes
##$PPARMOD= 0
##$PSCAL= 0
##$PSIGN= 0
##$REVERSE= no
##$SF= 200.130013532006
##$SI= 16384
##$SIGF1= 3
##$SIGF2= 2
##$SINO= 400
##$SIOLD= 16384
##$SREGLST= <1H.CDCl3>
##$SSB= 0
##$STSI= 0
##$STSR= 0
##$SW_p= 3612.71676300578
##$SYMM= 0
##$S_DEV= 0
##$TDeff= 0
##$TDoff= 0
##$TI= <>
##$TILT= no
##$TM1= 0
##$TM2= 0
##$TOPLEV= 0
##$USERP1= <user>
##$USERP2= <user>
##$USERP3= <user>
##$USERP4= <user>
##$USERP5= <user>
##$WDW= 1
##$XDIM= 8192
##$YMAX_p= 0
##$YMIN_p= 0
$$ End of Bruker specific parameters
$$ ---------------------------------
##NTUPLES= NMR FID
##VAR_NAME=  TIME,          FID/REAL,        FID/IMAG
##SYMBOL=    X,             R,               I
##VAR_TYPE=  INDEPENDENT,   DEPENDENT,       DEPENDENT
##VAR_FORM=  AFFN,          ASDF,            ASDF
##VAR_DIM=   8192,          8192,            8192
##UNITS=     SECONDS,       ARBITRARY UNITS, ARBITRARY UNITS
##FACTOR=    0.0002496,     1,               1
##FIRST=     0,             0,               0
##LAST=      2.0444736,     0,               0
##MIN=       0,             -191426,         0
##MAX=       2.0444736,     160918,          0
$$ Real data points
##PAGE= N=1
##DATA TABLE= (X++(R..R)), XYDATA
$$ [...]
2413a247K794j360j760K538l47k176J793J331k760N92K163j800j004K240n17k317
$$ -1247 1547 187 -1573 965 618 -1558 235 1566 -1194 -602 1561 -239 -1243 997 480 -1837
2429a837K507J025k936P02K394k176j048K629q08k153K412Q51k981Q99K083k674
$$ -1837 670 1695 -1241 -539 1855 -321 -1369 1260 452 -1701 711 1562 -1419 -520 1563 -1111
2445a111m39L532j480k730K957Q72l100R99K195k374p52L107j470j621K258J32
$$ -1111 -1550 1982 502 -2228 729 1601 -1499 -500 1695 -679 -1431 1676 206 -1415 843 975
2461I75k404J391J472k714J07K625j755j115K293l28k415J978J329k591O90K019
$$ 975 -1429 -38 1434 -1280 -1173 1452 -303 -1418 875 547 -1868 110 1439 -1152 -462 1557
2477A557k027r45K664q59k010K251O23k779Q48K139j957p62K825j386j804K511
$$ 1557 -470 -1415 1249 390 -1620 631 1254 -1525 -677 1462 -495 -1257 1568 182 -1622 889
2493H89J86k788J554J941k767j41K505j111j855K265N49k522J422J142j940k48
$$ 889 1075 -1713 -159 1782 -985 -1126 1379 268 -1587 678 1227 -1295 127 1269 -671 -919
2509i19K170j396j118K439n89j975J708R02k043L01J897j590j001K436q66j748
$$ -919 1251 -145 -1263 1176 587 -1388 320 1222 -821 -520 1377 -213 -1214 1222 356 -1392
2525a392J509J360k405J00K478k041p27K461j143j616J839Q67k752J120J999k275
$$ -1392 117 1477 -928 -828 1650 -391 -1118 1343 200 -1416 423 1290 -1462 -342 1657 -618
2541f18p24K528l88k272J825N85k157Q76J726k411k38K626j171j504J696M85k237
$$ -618 -1342 1186 798 -1474 351 936 -1221 -345 1381 -1030 -1268 1358 187 -1317 379 864 -1373
2558a373J009J772k129R9J713j348j045K075m43j647J596J003k508L90K072j642
$$ -1373 -364 1408 -721 -622 1091 -257 -1302 773 330 -1317 279 1282 -1226 -836 1236 -406
2574d06r97K465n66j852J894M60k355R99J909k211p26K538j046j757K324M39k303
$$ -406 -1403 1062 496 -1356 538 998 -1357 -358 1551 -660 -1386 1152 106 -1651 673 1112 -1191
2591a191J065J646k041l70K258j252j774K298M62k292J068J419j999n4K058j306
$$ -1191 -126 1520 -521 -891 1367 115 -1659 639 1101 -1191 -123 1296 -703 -757 1301 -5
2607ej418K242O7k004J693P59k208L45K073j492j178K169j42k180J589Q10k141
$$ -5 -1423 819 886 -1118 575 1334 -874 -529 1544 52 -1126 1043 901 -1279 310 1120 -1021
2624a021N63K002j751q31J875m87j801J963O23k046N74J795k133m27K050p16j457
$$ -1021 -458 1544 -207 -1038 837 350 -1451 512 1135 -911 -337 1458 -675 -1102 948 232 -1225
2641a225J674N73k440J199J405j836l05K028j050j192J813K13k274J332J488j958
$$ -1225 449 1022 -1418 -219 1186 -650 -955 1073 23 -1169 644 857 -1417 -85 1403 -555
2657e55k09J949j299j070K094n55k040J710R97k097L96K039j751j024K400r17
$$ -555 -764 1185 -114 -1184 910 355 -1685 25 1022 -1075 -679 1360 -391 -1415 985 68
2673F8j563K017O59k424Q60J735k002m80K224q97j618K162j4j629Q68J236j696
$$ 68 -1495 522 1181 -1243 -383 1352 -650 -1130 1094 197 -1421 741 727 -902 -34 1202 -494
2690d94k90K358j404j578J977K88k164J430J116j778m50K179j209j405K420l56
$$ -494 -784 1574 170 -1408 569 857 -1307 123 1239 -539 -989 1190 -19 -1424 996 640
2706F40j654J322Q71j966J16J956j455j149K289J0k161J771N05j963K88K019j668
$$ 640 -1014 308 1179 -787 -671 1285 -170 -1319 970 980 -1181 590 1095 -868 -580 1439 -229
2723b29r32J867j94j958J762P97k165P35J605j812l35J931p62j540J741N19k339
$$ -229 -1161 706 512 -1446 316 1113 -1052 -317 1288 -524 -859 1072 310 -1230 511 1030 -1309
2740a309J151J349j654m65K132j142j509J837N45j997J065J240j941j37J968j261
$$ -1309 -158 1191 -463 -928 1204 62 -1447 390 935 -1062 3 1243 -698 -835 1133 -128
2756a28j220K133j14j895J394Q43k168P06J544j327r12J979m12j712J509R94k047
$$ -128 -1348 785 671 -1224 170 1013 -1155 -449 1095 -232 -1144 835 423 -1289 220 1214 -833
2773h33O48J607j833n22J941p83j522J765L51j888N81J852j796m64J948j047r92
$$ -833 -185 1422 -411 -933 1008 225 -1297 468 819 -1069 -488 1364 -432 -896 1052 5 -987
2790i87J696K07k068J049J280j589k06J817j143r65J850k89j513J028R47j849
$$ -987 709 916 -1152 -103 1177 -412 -618 1199 56 -909 941 652 -861 167 1114 -735
2806g35L40J508j463q76K084n65j330J137Q56k269P24J705j445n01J896q13j540
$$ -735 -395 1113 -350 -1226 858 293 -1037 100 956 -1313 -589 1116 -329 -830 1066 253 -1287
2823a287J497N42j528L10J486j399l27J510o43j523J823J31j552P62J296j484
$$ -1287 210 752 -776 -466 1020 -379 -706 804 161 -1362 461 592 -960 -198 1098 -386
2839c86m40J640r24r03J579J26j815J201R24j620l39K010j266q82J606q5j429
$$ -386 -826 814 -110 -1013 566 692 -1123 78 1002 -618 -957 1053 -213 -1095 511 426 -1003
2856a003J092R03j803R8J477p86q54J848o12j526J381J009j937K07J716j467o67
$$ -1003 89 992 -811 -713 764 -22 -876 972 360 -1166 215 1224 -713 -506 1210 -257 -924
2873i24J857o70j283J447O11j794M53J352j531j53J653r25q72J399M94j967P84
$$ -924 933 263 -1020 427 1038 -756 -303 1049 -482 -635 1018 93 -779 620 1114 -853 -69
2890f9J077j424m03K120j114j399K076l01j368R42R07j688J02J784j341q16J535
$$ -69 1008 -416 -819 1301 187 -1212 864 563 -805 137 1044 -644 -542 1242 -99 -915 620
2907F20j55j857J612Q62k093O66J502j236p81J673q56r41J527K46j678N42J507
$$ 620 465 -1392 220 1082 -1011 -345 1157 -79 -860 813 -43 -984 543 789 -889 -347 1160
2924A160j582n49J673m85j260J492J43j625L73J464j345MJ474j018q99J469K68
$$ 1160 -422 -971 702 217 -1043 449 592 -1033 -660 804 -541 -537 937 -81 -980 489 757
2941G57j610P13Q27j491K66J726j400r46J648R1j377J107O08j299J8J560j378
$$ 757 -853 -140 687 -804 -538 1188 -212 -1158 490 581 -796 311 919 -380 -362 1198 -180
2958a80n45J262Rj275J115N20j930Q39J135j301m92J550k59j449J186Q79j863
$$ -180 -725 537 546 -729 386 906 -1024 -185 950 -351 -843 707 448 -1001 185 1064 -799
2975g99O62Q63q93n42J703r27j369J629N03j449M22R75j457J65J547j165q90J702
$$ -799 -137 726 -167 -709 994 67 -1302 327 830 -619 -197 778 -679 -514 1033 -132 -1022 680
2993F80J7j408Q10O57j531M28J453j344o49J498j93j207J202M05j624M76J253
$$ 680 697 -711 99 756 -775 -347 1106 -238 -887 611 418 -789 413 818 -806 -330 923
3010I23j147p15J549l77j418J524N22j568K25J592j186o13J243m45j337J695L98
$$ 923 -224 -939 610 233 -1185 339 861 -707 -482 1110 -76 -689 554 109 -1228 467 865
3027H65j710M92J008r76j83J638j017j094J192L53j652J039O85q52k37J293p97
$$ 865 -845 -353 655 -321 -504 1134 117 -977 215 568 -1084 -45 640 -212 -449 844 47
3044D7j050J484mj353J010N63j573N96J592j357o24J314p20q11J188O47j578J97
$$ 47 -1003 481 477 -876 134 697 -876 -280 1312 -45 -669 645 -75 -886 302 949 -629 -432
3062d32J445j132l58J473l17j516J183L84j553O44J210j333m45J603n01j129J053
$$ -432 1013 -119 -477 996 679 -837 346 730 -823 -179 1031 -302 -747 856 355 -774 279
3079B79K79j366Q35Q31j282l44J445n43r29J400j85j122P93O87j301j04J677j398
$$ 279 558 -808 27 858 -424 -768 677 134 -795 605 420 -702 91 778 -523 -627 1050 -348
3097c48m29J138j1j171J182N08j700M08J451j219q44J622l39j391J392P54j762
$$ -348 -777 361 350 -821 361 869 -831 -423 1028 -191 -1035 587 248 -1143 249 1003 -759
3114g59N00R49r97m69J465l43j167R80P02j679N34J121j480O7J294p52p91J255
$$ -759 -259 690 -307 -776 689 346 -821 159 861 -818 -284 837 -643 -576 718 -34 -825 430
3132D30N2j070N16Q76j436J94J454q36r42J497m23j068J297K35j468L29J125p82
$$ 430 482 -588 -72 804 -632 -438 1016 180 -762 735 312 -756 541 776 -692 -363 762 -20
3150b0o26J261k31j258J408J49j463N03J202j287n86J729n80r50J043O92j362
$$ -20 -646 615 384 -874 534 683 -780 -277 925 -362 -948 781 201 -749 294 986 -376
3167c76j55J429j119m07J087j76j045J104L00j640R69Q41j312k44J590q10r80
$$ -376 -531 898 -221 -628 459 283 -762 342 642 -998 -29 812 -500 -744 846 36 -944
3184i44J526M3j474R36R05j695J53J268o88r82J639l84j302J301N99j759M44J309
$$ -944 582 625 -849 87 992 -703 -550 718 30 -952 687 303 -999 302 901 -858 -414 895
3202H95j094m67J370l02j575J359L60j377M63J266j256m55J478m26j060J282o
$$ 895 -199 -666 704 402 -1173 186 546 -831 -368 898 -358 -813 665 239 -821 461 455
3219D55r66L46P41j365L19J106m15r91J281K03j538Q15Q35r90l44J148n40p46
$$ 455 -511 -165 576 -789 -470 636 221 -770 511 714 -824 -9 826 -164 -508 640 100 -646
3237f46J244J6j418P20R11j507K78J148r50o85J523j18j520J080N01j078K71Q61
$$ -646 598 614 -804 -84 827 -680 -402 746 -204 -889 634 516 -1004 76 577 -501 -230 631
3255F31q54o28J509l93r85R49O09j525N55J189j419l26J613o72r14J150j29j061
$$ 631 -223 -851 658 265 -720 229 838 -687 -132 1057 -362 -688 925 253 -661 489 360 -701
3273g01O15Q05j398j92J724n32j103Q81J5j021P91Q74j165j17J291j026n40J103
$$ -701 -86 719 -679 -871 853 321 -782 99 114 -907 -116 758 -407 -524 767 -259 -799 304
3291C04l02q29Q47Q74j309m6J537j302o19J543k37j325P56O84j086J45J218j162
$$ 304 2 -827 20 894 -415 -461 1076 -226 -845 698 461 -864 -108 576 -510 -365 853 -309
3309c09l56J272k37j239J248O3j045N93O31o53k57J060n98j180J504j85j038Q38
$$ -309 -665 607 370 -869 379 442 -603 -10 621 -32 -289 771 173 -1007 497 312 -726 112
3327A12O19j339k45J493r51m95J287k51j096J031N39j278K25J198o69o45J222
$$ 112 731 -608 -853 640 -311 -806 481 230 -866 165 704 -574 -349 849 180 -465 757
3344G57l16j289J121P37j483L45R26j212l2J028k05j115Q59N77j061k63J461j187
$$ 757 441 -848 273 1010 -473 -128 798 -414 -446 582 377 -738 121 698 -363 -626 835 -352
3362c52k97J451m89j148J088M24j270M83L99r35l3J468r81n50R75L74j250M01
$$ -352 -649 802 313 -835 253 677 -593 -110 289 -646 -679 789 -192 -742 233 607 -643 -242
3380b42P99j140K47J025o98r04J270K76j474Q41R56j584L36J100j133l63J274
$$ -242 557 -583 -336 689 -9 -913 357 633 -841 0 956 -628 -292 808 -325 -688 586
3397E86k96j186J331l6j042M00R33p08p94J504l64j073Q16M68r60J31J188j019
$$ 586 290 -896 435 399 -643 -243 690 -18 -812 692 328 -745 71 539 -421 -290 898 -121
3415a21n81J623n34j188J178K45j179M29J014j146l4J099p73p61J177Mj160O08
$$ -121 -702 921 387 -801 377 622 -557 -128 886 -260 -294 805 32 -729 448 452 -708 -100
3433a00P63q26k59J061o65q88J477r6j162Q83N08j224j02J431p96p94J404j0j495
$$ -100 663 -163 -422 639 -26 -914 563 467 -695 188 696 -528 -630 801 5 -789 615 605 -890
3452h90Q36P34j156L43P49o79p64J463l72j324J465j16j146M47J058r63l75J252
$$ -890 -54 680 -476 -133 616 -63 -827 636 264 -1060 405 289 -857 -410 648 -315 -690 562
3470E62l39r75J006M29j295M29R88j079k21R82o92m62R81n2r69O55N85r02J54
$$ 562 223 -752 254 683 -612 -183 805 -274 -495 487 -205 -667 314 262 -707 -52 533 -369 -215
3489b15R44p35o43J213j21r10O42J87j087L88R56o20k07N51J77j216J009M82j242
$$ -215 729 -6 -649 564 443 -467 175 362 -725 -337 619 -1 -208 343 520 -696 313 795 -447
3508d47L15J075j337J25P92l30p13J041j33j089N68R39j044K7P19m92o41R07L33
$$ -447 -132 943 -394 -269 523 193 -520 521 388 -701 -133 806 -238 -211 508 16 -625 282 615
3527F15j194N47Q11j066l45J231p86n00J032K05j254R46N58j183K41J148r21q34
$$ 615 -579 -32 779 -287 -632 599 -187 -687 345 550 -704 242 800 -383 -142 1006 85 -749
3545g49J271K1j259P56N14q33l6P36n21o48J057j07q72R91J75j334K71J525j278
$$ -749 522 543 -716 40 554 -279 -315 421 -100 -748 309 202 -670 321 496 -838 -567 958 -320
3564c20m64J609o96r33J284J08j180N83N66j295K63R45k68q83P98L35j035O47
$$ -320 -784 825 129 -804 480 588 -592 -9 557 -738 -475 470 202 -681 117 452 -583 64
3582F4O31r17l11J220l46j198J472o7j329M82R31j240K84J091q01n47J013l36
$$ 64 695 -222 -533 687 341 -857 615 548 -781 -299 632 -608 -324 767 -34 -581 432 96
3600I6o37P79L30r43mJ427j407j79J010j63p86N57N19j406M90J048p86p18J320
$$ 96 -541 238 568 -375 -379 1048 -359 -538 472 309 -477 80 599 -807 -317 731 -55 -773 547
3619E47l02q86J179pj391O54Q52r67j93J333q78p31J106M0j341J009N24q95j79
$$ 547 245 -641 538 531 -860 -206 646 -321 -514 819 -59 -790 316 356 -985 24 548 -347 -526
3638e26J163n35o51Q13L45j138M50N78j264J10J185l18q36J217m47q99R66L09
$$ -526 637 102 -549 264 609 -529 -79 499 -765 -655 530 212 -624 593 146 -753 213 522
3656E22j187K99J109j075l86J372l66j174J339J52j126J51Q76q30l27J238n32
$$ 522 -665 -366 743 -332 -718 654 288 -886 453 605 -521 -370 506 -324 -651 587 55
3673E5p84Q38M49q61K33P37q13l64J258o57r38J134N96j577P04O89j034J03J126
$$ 55 -729 109 558 -303 -70 667 -146 -510 748 91 -847 287 883 -694 10 699 -335 -232 894
3692H94n34p48O26j5n96M07N30j078P6J055o02m34J089m01j096J200K29j026L46
$$ 894 360 -388 238 223 -373 34 564 -514 -438 617 15 -419 670 269 -827 373 602 -424 -78
3711g8Q76j109P1R45m33q16P61J94j065M38Q63j079J34P44M4j057P92K13p23J58
$$ -78 798 -311 -240 705 272 -544 217 411 -654 -216 647 -432 -298 446 490 -567 225 438 -285 -127
3731a27Q76j275p2J114l37j037J063l1p17O27O25j166O7R18p26n30J002oj040
$$ -127 749 -526 -598 516 179 -858 205 174 -543 84 709 -457 -390 528 -198 -728 274 268 -772
3750g72Q05N32j033l2J274j011l59J018l15p68Q64M6j059P14Q96j135k78J219
$$ -772 33 565 -468 -500 774 -237 -596 422 107 -661 203 249 -810 -96 800 -335 -613 606
3768F06m16j315J223K82o42PQ19j140QJ219m20q09J016P6j123Q21M84j002j82
$$ 606 190 -1125 98 380 -262 -255 564 -576 -568 651 231 -578 438 514 -609 212 696 -306 -488
3787d88J022l93k41N49j55r26P97M06r23J85Q69p08l99R80k49j059R42L35q69
$$ -488 534 141 -100 449 294 -632 165 571 -352 -167 702 -6 -405 575 326 -733 209 544 -325
3806c25K16N80o02l67J058l32r09R90K46j032L20P14o95j67P74l95r00J026N08
$$ -325 -109 471 -131 -498 560 228 -681 309 555 -477 -157 557 -138 -305 469 74 -826 200 708
3825G08j384M69R24r29k33R42n56o11R81o7r16O89M75r95J88P93m19r43J205J65
$$ 708 -676 -207 717 -212 -445 497 -59 -670 311 244 -672 17 492 -503 -315 478 59 -884 321 486
3845D86r69P42K93j077J37R41q87r5R50j95j204J156L20j375Q39L69o92k77J231
$$ 486 -483 259 552 -525 -388 553 -334 -429 521 326 -878 278 598 -777 62 431 -261 -538 693
3864F93P8j490Q56O77j292N60N37j100o8J216p29o03R45O30j554O10N70r56P5
$$ 693 771 -719 137 814 -478 82 619 -481 -549 667 -62 -665 280 910 -644 -34 536 -420 -345
3883c45P64m55n69P75L35q70K53P33j076K67Q11p87k85R74j35q79M87L78r43N05
$$ -345 419 -36 -605 170 505 -365 -112 621 -455 -188 623 -164 -449 525 390 -489 -2 376 -567 -62
3903f2M16m60n14Q08O3p37N83K70p67K11O83o73j03P30m29n57O04N99j237N38
$$ -62 354 -106 -620 188 251 -486 97 367 -400 -189 494 -179 -282 448 19 -538 66 665 -572 -34
3923c4P47r76m54J214n21o04Q43K19j152M69Q45r08J23N02m25n53Q85r9n06O47
$$ -34 713 -263 -717 497 -24 -628 215 434 -718 -249 596 -312 -189 313 -112 -665 220 121 -385 262
3943B62M09r58J8P12n17o23P87L58j063O41Q77j305M8J055q30k52J022m68m62
$$ 262 671 -287 -269 443 -74 -697 90 448 -615 26 903 -402 -354 701 -129 -381 641 173 -289
3962b89N29M96j119J40Q93r58k26Q01j85p48Q54J09p93M42O65r36pJ047p04n39
$$ -289 240 736 -383 -243 650 -308 -534 267 82 -666 188 297 -496 -54 611 -325 -332 715 11 -528
3982e28O63J38j069P69N98p09k79R20m88n15Q78q4q57M88P30q52o5Q96n60n87
$$ -528 135 273 -796 -27 571 -138 -417 503 15 -500 378 294 -563 -75 655 -197 -262 634 74 -513
4002e13R80l59p92P37N85j226K35P72m26k92Q43k92r47R47K71r37K82R27p91m62
$$ -513 467 108 -684 53 638 -588 -353 419 -7 -299 544 252 -695 252 523 -414 -132 795 4 -458
4022d58P66k32q24R71L55j028J59Q23o65k72Q64m17o76P62J29q82P06L98j155
$$ -458 308 76 -748 223 578 -450 -291 532 -133 -405 459 42 -634 128 257 -625 81 479 -676
4041f76K51R33n39n37Q80j06p86M76J082j125j45J065j044l93J069m19m99P49
$$ -676 -425 508 -31 -568 312 206 -580 -104 978 -147 -292 773 -271 -664 405 -14 -513 236
4059B36J42r28M35O42m34p81Q80r3p30R30L02j124M17N70p63j60J081n92n48P89
$$ 236 378 -550 -115 527 93 -688 192 99 -631 299 601 -523 -106 464 -299 -459 622 30 -518 271
4079B71p2p61L80N99n10QO96n98m44O73N3r49M51O26q78L39P76r11l22P40J61
$$ 271 199 -562 -182 417 -93 -85 611 13 -431 242 295 -654 -203 423 -455 -116 660 -251 -573 167 328
4100C28p71O11M55p83m71J147n68o10J178j37r41P15K78r72L86P08p79m30R24
$$ 328 -443 168 623 -160 -631 516 -52 -662 516 379 -562 153 431 -541 -155 553 -226 -656 268
4119B68k12l91L89J93q34N26P01j030j35P37p2o59Q11k26n77M21M99p92qJ044
$$ 268 56 -335 54 247 -587 -61 640 -390 -525 212 140 -519 292 66 -511 -90 409 -383 -391 653
4139F53o00l37O39K56j158L62N12m19j08P90m95m80P28R4j103Q62M16r50K72O22
$$ 653 53 -284 355 611 -547 -185 327 -92 -200 590 95 -385 343 437 -666 196 612 -338 -66 556
4159E56n20m72R92m61q19N33Q68r66j81J126p86k79O95J29j132Q09O60j383K61
$$ 556 36 -436 556 95 -724 -191 677 -289 -470 656 -130 -409 286 415 -717 92 752 -631 -370
4178c70Q59q44K18N22j7o99O00J11q63L76N91p99j68J225p40p62R32K53j049P67
$$ -370 489 -355 -137 385 368 -331 269 380 -483 -107 484 -315 -483 742 2 -760 172 425 -624 143
4198A43L42p73o1J207r21o37J269l61p56N95N15j142L02Q02m61l32M88J21j034
$$ 143 485 -288 -349 858 -63 -700 569 208 -548 47 562 -580 -278 524 63 -269 219 340 -694
4217f94R27K37j110M20O63r15K19N24J01q96N01K92o40K86N53q47j95J189k68
$$ -694 233 470 -640 -220 443 -472 -253 271 372 -524 -23 269 -371 -85 468 -379 -574 615 347
4236C47r57P58P5p24N23N61q51j50J055o48l53Q78j07r79P86K70j003M50J012
$$ 347 -610 148 223 -501 22 583 -268 -418 637 -11 -364 514 407 -572 214 484 -519 -69 943
4255I43q63m38Q11kr76P24K69l48l64Q98p26k52P10j24p45P13K10j044L18M21
$$ 943 80 -358 453 451 -525 199 468 120 -244 654 -72 -324 386 262 -483 230 440 -604 -286 135
4275A35l61l72J110m25n20O18K43q21M42P44j117k10J043m10o91P89Q5p76N10
$$ 135 -226 -598 512 87 -433 185 428 -393 49 793 -324 -534 509 99 -592 197 282 -494 16
4294A6N72r44j56Q75n74m03J100k18p81L89P65q83j21Q44n07p05J011K87r17L90
$$ 16 588 -356 -512 363 -211 -614 486 268 -513 -124 641 -242 -363 481 -26 -731 280 567 -350 40
4314D0K31q34L15J007r32m26J085m89m14O44J71q03L42Q42j002k64J011m47o53
$$ 40 271 -563 -248 759 -173 -599 486 -3 -417 227 398 -405 -63 779 -223 -487 524 77 -576
4333e76Q33K43r79M01P41q89n0R18l99o13O93k8q77O47L73q69K85P05n70k96P65
$$ -576 257 500 -479 -78 663 -226 -276 642 243 -370 323 295 -582 65 438 -431 -146 559 -11 -307 458
4354D58j68p29J38R50o73m43R77o00m69R34k89p70P54K49o31N77J07o51n56J265
$$ 458 290 -439 -301 649 -24 -467 510 -90 -559 375 86 -684 70 319 -312 265 372 -279 -835 430
4374D30l11q78J074m3p72N49O31j051J05Q93m91p37Q97J15r48L19P07q22J7Q26
$$ 430 119 -759 315 272 -500 49 680 -371 -266 627 136 -601 296 411 -537 -218 489 -333 -316 510
4394E10m03j050J329N8r69R38K4p98J63Q38n79m46O86k21m73M57O05q30j68O65
$$ 510 107 -943 386 444 -525 413 437 -361 -198 640 61 -385 301 80 -393 64 669 -161 -329 336
4414C36j94p47P78K82p29O74l7r05N09L44o29K5P96l78m88N66J64q66L14O97q84
$$ 336 142 -605 173 455 -274 400 363 -542 -33 311 -318 -293 503 125 -363 203 367 -499 -185 512 -372
4435c72J10O39m83m02N57M3n67O64J84p60k0J101o13m64P36q9j063O78N03p69
$$ -372 -262 377 -106 -508 49 92 -475 189 373 -387 -407 694 81 -383 353 264 -799 -121 382 -387
4455c87J33R33p79m97J117m70n83Q02J21p75L92M78p59J32N07l08m36M20J00n95
$$ -387 -254 679 -100 -597 520 50 -533 269 390 -385 7 485 -274 -142 365 57 -379 41 141 -454
4475d54L88N08p46q6Q44m02q80J043m8m15M62L58j040K42L59k23m30P53p0o40
$$ -454 -66 442 -304 -390 454 52 -828 215 167 -248 214 572 -468 -226 133 -90 -520 233 163 -477
4495d77O19L41j100K25Q92l91q04Q33J83r60Q37L55q59J57O45p88L7P98n86n65
$$ -477 142 483 -617 -392 500 109 -695 138 321 -639 198 553 -306 -149 496 -292 -255 543 -43 -608
4515f08R76J91q09J66O78r66J15Q39j47r18N20M77q64M70Q7l52m55Q05l57N6L31
$$ -608 368 559 -250 -84 594 -372 -257 582 435 -483 37 514 -350 120 207 -145 -600 205 -152 -96 235
4536B35J41p05K35Q76q27l77J022q31j72N70k4q34P50M76m94k86P52p00k77O41
$$ 235 376 -329 -94 782 -45 -422 600 -231 -403 167 143 -691 59 535 41 -245 507 -193 -470 171
4556A71kl95L62j4n45M48L37o18K1O93q5j028R59J0q45M53N10n43k13P07o15l23
$$ 171 169 -226 136 122 -423 25 362 -256 -235 458 373 -655 304 314 -531 -78 432 -111 -324 383 -232 -555
4578e55Q62k18o39R67m0n65J4P37q56r4Q00k02p61P43L82j087n3J334q87m36J006
$$ -555 307 89 -550 417 377 -188 -174 563 -293 -387 413 211 -550 193 575 -512 -565 769 -118 -554 452
4599D52j36n99J99M16o31K2Q60o55l10P17p8m34M60L01j000N45L56q51j04Q40
$$ 452 316 -283 -84 332 -299 -277 583 -72 -382 335 257 -177 283 584 -416 129 485 -366 -470 370
4619C70j05p81O61K84p14J67O94p91l54J148l70n29N27K90j095P29M54r76J24
$$ 370 265 -516 145 429 -285 -118 576 -215 -569 579 209 -320 207 497 -598 131 585 -391 -267
4638b67N62n33l29J059p1j033P47L17r83K31O61k80l83O82j6r66P99J54r02M21
$$ -267 295 -238 -567 492 421 -612 135 452 -531 -300 361 81 -302 380 364 -602 197 351 -551 -130
4658a30N64q80k7J081m38o45N63N40q95K2Q48p40l32P16k0p21N54L85r59M88M23
$$ -130 434 -446 -473 608 170 -475 88 628 -267 -245 603 -137 -469 247 227 -494 60 445 -514 -26 397
4679C97n25k55Q97n93o02O05K13p25P08L96j017K57M07m1q61J053m5p85M90M51
$$ 397 -128 -383 514 -79 -681 -76 137 -588 120 516 -501 -244 163 122 -739 314 269 -516 -26 425
4699D25o59k8O78l90m25O23j12m80P64n6o50J99N41p22j22O14R3p55P87L29r39
$$ 425 -234 -262 416 26 -399 224 112 -368 396 340 -310 -111 430 -292 -414 200 293 -462 325 654 -285
4720b85K2R64q07j25Q24n59n44P36K80j186M87M87n30k30Q34m33o89P62K32o21
$$ -285 -263 701 -106 -231 593 34 -510 226 506 -680 -193 294 -236 -466 368 -65 -754 8 240 -381
4740c81M93K89m95m3N77m02m10P74J3p45O39J32j032M68P69r27k62P39J66r48
$$ -381 112 401 -94 -137 440 38 -372 402 415 -330 309 441 -591 -123 646 -281 -543 196 362 -586
4760e86N29M24q66PQ26o66j64R55j10p74P94m3q24M12M56n82M8M63j68p61R15
$$ -586 -57 367 -499 -492 334 -332 -496 459 349 -425 369 326 -498 -86 370 -212 -164 299 131 -630 285
4781B85R5q58L08O97p62O8P58m65nNJ6l88L34J50m71J28N02p03O3N53j79n09N78
$$ 285 380 -478 -170 527 -235 -167 591 126 121 126 142 -246 88 238 -233 -105 397 -306 -243 310 131 -378 200
4804B00K06r25R3Q71l12l06O79k75r31P49P20j066K75L58m27m39J036l54o73P66
$$ 200 406 -519 -426 445 133 -173 506 231 -700 49 769 -297 -22 336 -91 -530 506 152 -521 245
4824B45J67r95L39P64m98l11O12j63p80P37L01q82K07M91p45P5M67j82k61O81
$$ 245 412 -583 -244 520 22 -289 323 160 -620 117 418 -464 -257 234 -511 -436 31 -151 -412 269
4844B69J2p21L36N25p50N9P74j16n86M31k13q73P30N70p82m8O92m09m93J108m21
$$ 269 281 -440 -104 421 -329 -270 504 388 -198 233 20 -853 -123 447 -335 -383 309 -100 -593 515 94
4865I4m91K95M07q35K31R44r54N7O66l34n36N03K94o03j2O75o45m6P75l40n33
$$ 94 -397 -102 305 -530 -299 645 -309 -252 414 80 -456 47 341 -262 -274 401 -244 -290 485 145 -388
4886c88L65J67j39j63O29q65Q2O22k04k27N51l95l58L40M28q07QQ53n41j38L57
$$ -388 -23 144 5 -158 471 -394 -312 310 106 -121 430 35 -323 17 445 -362 -354 499 -42 -180 177
4907A77%o98O65J44n54O0O25o59k45Q30n10n83Q70L30q44M52M02n95l64J023k17
$$ 177 177 -521 144 288 -266 -206 419 -240 -485 345 -165 -748 122 452 -392 60 462 -133 -497 526 309
4928C09r05Q56P0p01L48N62p46n6N40j1r47O44J3k46L44J97n30o2Q18k97o46Q06
$$ 309 -596 260 330 -371 -23 539 -207 -263 277 266 -681 -37 -24 -270 74 271 -259 -321 497 200 -446 360
4950C60j79n54M98J06n41J88O18p10n6P67k98n95O43P4n11R1P02q84m13J170l88
$$ 360 181 -373 125 231 -310 -122 496 -214 -270 497 199 -396 247 321 -190 -99 603 -281 -694 476 88
4971H8k71K64K04q24K39O34l71m64O41K56p36L01K79m48J00K95m43j24R26q11
$$ 88 -183 81 285 -539 -300 334 -37 -501 140 396 -340 -39 240 -208 -108 187 -256 -380 546 -265
4991b65N9N59l68o57O81N12n77l4M51m00m34P77k76m95M12O44n53j87M24m17l15
$$ -265 -206 353 -15 -672 9 521 -56 -90 361 -39 -473 304 28 -467 -55 589 36 -151 273 -144 -459
5012d59P20J24j176P48K96n75J64O75m90m28P61k87p50L96K85k51j16O86m42k14
$$ -459 261 385 -791 -43 253 -322 -158 517 27 -401 360 73 -677 -281 4 -247 -363 323 -119 -333
5032c33O43Jo22N31q3o13L02N80q38P8R69n92p05R75L04j018N07J99m26j95O25
$$ -333 310 311 -311 220 137 -476 -174 406 -432 -354 615 23 -682 293 597 -421 86 285 -141 -336 289
5053B89l68j74N23K08r33M36K37o32nQ49n73k67N31Q9p90Q28M32j111M05N21m23
$$ 289 -79 -253 270 478 -455 -19 218 -414 -419 430 -143 -410 121 210 -580 248 680 -431 -26 495 72
5074G2k67M99j65l68N00J45r07N58L50n21k74R08m84k91M91N9o94L93M75p07j05
$$ 72 -195 304 139 -229 271 416 -491 67 417 -104 -378 530 46 -245 246 305 -389 4 479 -228 -333
5095c33P60k15o89R59p1o90K70K95l96j73N13j87n95R54k75n69P83p3r66N52N98
$$ -333 427 212 -477 482 411 -279 -9 286 -110 -283 230 43 -552 402 127 -442 341 268 -698 -146 452
5116D52p63j85Q84j18q40O94M37r20K92L19O2p44Q36l98n10Q73J0p05J04Q41p09
$$ 452 -311 -496 388 270 -570 124 561 -359 -67 252 314 -430 406 8 -502 371 381 -324 -220 621 -88
5137h8j71M38l55l26P01J91p83K91M42n62r1N24j49m21O07j05m20K30K82q01L50
$$ -88 -259 179 -176 -502 199 390 -393 -102 340 -222 -313 211 62 -359 248 143 -277 -47 235 -566 -216
5158b16N61o73j5P47k64n62O13Q3l23k12P64m13o32J022k17n80M31J21o06M85
$$ -216 345 -328 -343 404 140 -422 191 274 -49 -261 503 90 -542 480 263 -317 114 235 -371 114
5178A14J71m98j44O87l72l51P08L0q64M95L38n95j11P05k36n41N75K2n19M02J74
$$ 114 285 -213 -357 330 -42 -393 315 345 -519 -24 314 -281 -392 313 77 -464 111 133 -386 16 190
5199A90n98K09O89o87o7M85l11m89P05L90r94K74N83l93n73J033j95p05M39J77
$$ 190 -408 -199 490 -197 -264 221 -90 -579 126 516 -478 -204 379 -14 -587 446 251 -454 -15 162
5219A62n11j5P41n52j32P84m14m13M23K27n05J48J18j37l62J049p66j97N53L15
$$ 162 -349 -364 377 -175 -307 477 63 -350 73 300 -205 -57 61 -76 -438 611 -155 -352 201 516
5239E16p51J81M04n29P6P20o85k32O50j92o68O44K96r37J41Q64o25p9O10k00o04
$$ 516 -235 -54 350 -179 -103 617 -68 -300 350 158 -510 134 430 -507 -366 498 -127 -206 404 204 -400
5260d00N01K03m80J59K83m71k19P21r2n30O09j54l48j6M83o79K55O00m84l01P14
$$ -400 101 304 -176 -17 266 -205 -424 297 205 -325 284 130 -218 -234 249 -430 -175 425 -59 -360 354
5281C54lq97K62P23r24J13O60l25l77Q41K5p42J79M61o93p5N45r1j03K70j20n96
$$ 354 351 -546 -284 439 -485 -372 288 -37 -414 427 452 -290 -111 350 -343 -418 127 36 -67 203 83 -513
5303e13O90K09n37j04P29m75n30R23k81o80P02n9l24J83L79k62k71P20l37m69
$$ -513 177 386 -151 -255 474 -1 -531 392 111 -569 133 74 -250 -67 312 50 -221 499 162 -307
5323c07P44k00o85O51J50n35l66Q55k36m49O54M1n10q0O17k56n13P86l00k61M90
$$ -307 437 237 -448 203 353 -182 -548 307 71 -378 276 317 -193 -273 344 88 -425 361 61 -200 290
5344B90k6n93M66K15n76p5P94m23o70J195l79p55O10K60n82q9P96m44j89O10q7
$$ 290 264 -329 137 352 -224 -299 495 72 -598 597 218 -537 73 333 -249 -338 458 14 -175 435 348
5365C48o72K50M15n63J59M97n79oM79k74o22P83j9n71J32Q31q37J63M26k74n36
$$ 348 -324 -74 341 -222 -63 434 -145 -151 328 54 -568 215 196 -375 -243 588 -249 -86 340 66 -470
5386d70M43M76o97L07L69o27j5O82q78q4R04k97p50N93L11o77K88N26k70o44Q00
$$ -470 -27 449 -248 59 428 -199 -214 468 -410 -494 410 113 -637 -44 267 -410 -122 404 134 -510 290
5407B90j84m15M03M7l06l34O64k40k18O95m05m11L88M52o15k10O66l56j12N18
$$ 290 106 -309 94 141 -165 -499 165 -75 -293 402 -3 -414 -26 426 -189 -399 267 -89 -201 317
5427C17m1p47J46N92o01L44N66o35k83P92l01l47K39K87q55O83M82j014K06O20
$$ 317 276 -471 -325 267 -334 10 576 -59 -342 450 149 -198 41 328 -527 156 638 -376 -170 450
5447D50m00o33P94M3r23Q09M86q29j65R27l79n56P30o4o29N27R6o30J68O34p13
$$ 450 50 -583 211 254 -669 140 626 -203 -368 559 180 -376 354 290 -339 188 284 -346 -178 456 -257
5468b57K82M35j79q32N59Ql93K40N54n78l37P00M3p20M41J88m50K36M38n12qL68
$$ -257 25 460 281 -551 8 16 -377 -137 417 -161 -498 202 245 -475 -34 154 -296 -60 378 -134 -142 226
5490B26k16k24N97j75o29M84L11l82l20O02k64m61O74q4m99K75K12m00K66L60
$$ 226 10 -214 383 208 -421 63 374 -8 -328 274 10 -451 223 139 -360 -85 127 -273 -7 353
5510C53j74k99L27pq05O80N7l98L59M09q77P2Q53m86n95O57L05m44p1M84n11j15
$$ 353 179 -120 207 200 -605 75 132 -266 93 502 -375 -303 550 64 -531 126 431 -13 -84 400 -111 -226
5532b26R38o02n03O12L6m93M45L7l64j7O04n04m7J00M09r16N73L95p83jK66L2
$$ -226 712 110 -393 219 255 -238 207 244 -120 -137 467 -37 -84 16 425 -491 82 477 -306 -307 -41 -9
5554im95N04k4n2J1N24n90M28M1k74m22N06j42n84O87L82p92M23L39m69k81O26
$$ -9 -504 0 -24 -76 -65 459 -131 297 338 64 -358 148 6 -578 109 491 -301 122 461 -8 -289 337
5576C37j54m65L54L14p15K94M33n19k71P85k49n78N89j47m53L69M09l98l3L52
$$ 337 183 -282 72 386 -329 -35 398 -121 -392 393 144 -434 155 8 -445 -76 333 -65 -98 254
5596B54j2l65L52k26k78M17K86j83j59o6q2j92P59n21k57K37M20p96K46P23n61
$$ 254 242 -123 229 3 -275 142 428 245 86 20 -62 -254 505 -16 -273 -36 384 -412 -166 557 -4
5617dn07R62j16o48K4P54r68L84M49k55k05K40P5m60M57j13j96p0N28o12Q8Q26
$$ -4 -511 451 335 -313 -289 465 -503 -119 330 75 -130 110 185 -275 182 69 -127 -197 331 -281 -193 633
5639F33o33j65K25K56n37L7K37m19l8O79j67k43M85k16l86L71J77n68J02N33l09
$$ 633 0 -165 60 316 -221 -184 53 -366 -404 275 108 -135 350 134 -252 119 296 -272 -170 363 54
5660E4n17R28k75m91M62J67o80Q4N95l45n09R99n95j87L53K86j97k50L45n34K40
$$ 54 -463 465 190 -301 161 328 -352 -268 327 -18 -527 472 -123 -310 43 329 132 -118 227 -307 -67
5681f7M30l67n70P21p2l74K55M68n00k43M14Ql30K42J18q2k17Q16p30J9K65k78
$$ -67 363 -4 -574 147 75 -299 -44 424 -76 -319 95 103 -227 15 133 51 -166 650 -80 -61 204 -74
5703g4l75R83n00m79P48L9k59j41N33m47m59O98j76m48L15J77l50j44P03n37q5
$$ -74 -449 534 34 -445 303 342 83 -58 475 28 -431 267 91 -357 -42 135 -215 -359 344 -193 -278
5724b78M03l6m63L59J83l70M0O41o24r8M74k14l28K23M47p31M02L76m51l26Q80
$$ -278 125 89 -374 -15 168 -202 -162 479 -145 -243 231 17 -311 -88 359 -372 30 406 -45 -371 509
5745E09p05N6K08J91n08K39R5l69k7N21k27l24O54l30n26N47J17l91K5M12l66
$$ 509 -196 -140 68 259 -249 -10 85 -284 -311 210 -17 -341 313 -17 -543 4 121 -270 -245 167 -199
5766a99j18O30k81n61N74Q8m76J49M39n83K09M16j36m96N96J63r22N03M26m36
$$ -199 -317 313 32 -529 45 133 -343 -194 245 -338 -129 287 151 -345 251 414 -508 -5 421 -15
5786a5k68O52l61k76L60J27k96O9J62k58J76L04m12p7L16j18k84M26j3n50K34
$$ -15 -283 369 8 -268 92 219 -77 -8 154 -104 72 376 -36 -113 203 85 -199 227 214 -336 -102
5807a02O38m74o39Q14J37q68M17Q5j09L1K78k61p9N08l93l05N23J47n38Q9P31
$$ -102 536 62 -577 237 374 -494 -77 8 -101 -70 208 -53 -132 376 -17 -322 201 348 -190 -101 630
5828F30o82j46O56m70l33P88j09m37R4K33q4k12K30n4l84L24J18k74j24P14n31
$$ 630 -52 -198 458 -12 -345 443 334 -103 -9 224 140 -72 158 104 -280 44 162 -112 -236 478 -53
5849e3M0J90j02j77M55o9p24M51K81o50L28N57n17N5M4j30j22J05K36m67J82N79
$$ -53 -13 177 75 -102 353 284 -440 11 292 -358 -30 527 10 65 109 -21 -143 -38 198 -269 -87 492
5871D92o19p4N80k77m29N63L15p91J49M47m84m05R65k95l74M87p1q02N07M85l30
$$ 492 -127 -201 379 102 -327 236 551 -240 -91 356 -128 -533 432 137 -237 250 179 -623 -116 369 39
5892C9k19O22n66j41M03J93o28J74O36o81J31O72n66k92K85J29l91L08L6M4k83
$$ 39 -180 442 -124 -265 138 331 -297 -123 513 -168 -37 635 69 -223 62 191 -200 108 144 188 -95
5913i5J97q8k98N13j77j78L18J33o81K21O37q41R1M38j59m07Q52l45n39L08O56
$$ -95 102 14 -284 229 52 -126 192 325 -356 -135 502 -339 -248 190 31 -376 476 131 -408 -100 556
5934E56o26q5L81k48j12K70j73j24L09P2m74K41M09l94l54O09r3m06K54K00l39
$$ 556 -70 -155 226 -22 -134 136 -37 -161 148 220 -254 -13 396 2 -352 257 164 -242 12 212 -127
5955a27n6L05j63K75j67M5m68N08J38o19K01K18m76K58O97n15o75P16K89n26Q2
$$ -127 -183 122 -41 234 67 112 -356 152 290 -329 -128 90 -386 -128 569 54 -621 95 384 -142 -60
5976f0K88k75j07N27j22n30L47N0k76L07k86j3L68r9k93N8K07l4k05m4N50o72
$$ -60 228 -47 -154 373 251 -279 68 118 -158 149 -137 -150 218 119 -174 -116 91 57 -148 -192 358 -314
5998c14K6Q38o95k06P71j71n95L09L86m95P3M06n87j81N64k0j75J35Q2o90M95
$$ -314 -288 550 -145 -351 420 249 -346 -37 349 -146 -73 333 -254 -435 129 109 -66 69 151 -539 -44
6019d4L98m53p4N16m11j93K44Qj72J86K09l27k12L13k52M1N57l75j46J26M88n84
$$ -44 354 -99 -173 343 -68 -261 -17 -9 -181 5 214 -113 -325 -12 -264 -223 334 -41 -187 -61 427 -157
6041a57K21L82m60k41L63ql68L50K79n73r8J108o69n9J68k58k77K33L56m06J7
$$ -157 64 446 -14 -255 108 100 -268 82 361 -212 -310 798 129 70 238 -20 -297 -64 292 -114 -97
6062i7L07m72K1O45p52LO40j48l41P8N64m26k60O56l02k06M14k50k4j22L43m63
$$ -97 210 -262 -241 404 -348 -345 295 147 -194 -116 448 22 -238 418 116 -90 324 74 50 -72 271 -192
6084a92J42L90l87j91L94j38m26L50L70p34L38L65k96j16L97o7m45OL11j26k5
$$ -192 -50 340 -47 -238 156 18 -408 -58 312 -422 -84 281 -15 -131 266 199 -246 -240 71 -55 -80
6105h0M87l02j62m1L8l38O62K0m42j04M78l57J35Q2K1k47N07l3j10k38L96m89
$$ -80 407 105 -57 -98 -60 -398 264 284 -158 -262 216 -141 -6 76 97 -150 357 324 214 -24 372 -117
6127a17J8K45k24l8J48J62m49M33J63p71M1N51k95j30K39K32o45O37K58o82j34
$$ -117 -99 146 -78 -116 32 194 -255 178 341 -430 -389 162 -133 -263 -24 208 -437 200 458 -224 -358
6148c58N71l06j3K56J61m52K25L53p48N26J60o52NK29K10j93J64K01l28j4N50
$$ -358 213 -93 -106 150 311 -141 84 437 -311 215 375 -277 -272 -43 167 -26 138 339 11 -3 547
6169E47m73j55K75j63j90K20J7l72L29K88k95j08M99n81J22J98k8o83O28N52q52
$$ 547 74 -81 194 31 -159 61 78 -294 35 323 28 -80 419 -162 -40 158 130 -553 75 627 -225
6190b25K49K52j80m65O26r6l31J59M07m44j70K27n7R0P6P7n97L11K65l74J4M16
$$ -225 24 276 96 -369 257 161 -170 -11 396 -48 -218 9 -48 42 118 195 -402 -91 174 -200 -186 230
6212B30l29m19Q91j44o38O17o3j38k2K33m12J24J66l86j11N56j17m14K23K42o06
$$ 230 -99 -518 373 229 -409 208 145 7 -15 218 -194 -70 96 -290 -401 155 38 -376 -153 89 -517
6233e17K90M56k28l51O60P7p32K74J20K0j48L28l57k55M82K26n17L04k4l74M02
$$ -517 -227 229 1 -350 310 387 -345 -71 49 69 -79 249 -108 -363 119 345 -172 132 108 -266 136
6254A36O3j32k63N85n3r72P21J29l66P5K41j54m50L63P1Kj16J83l60L40L46l04
$$ 136 199 67 -196 389 336 -636 85 214 -152 -77 164 10 -440 -77 -6 -4 -120 63 -297 43 389 85
6276H5k98M70l24k98L10Q4l63L55R9m99L50L76n42K09r4K78n35K31L88n85n6M90
$$ 85 -213 257 -67 -365 -55 29 -334 21 120 -379 -29 347 -195 14 -80 198 -337 -106 282 -303 -359 131
6298A31j60j41L71p8k55M64Q6q35J97P08o04l68O42m4m57L66Q2m66P0N14k86j16
$$ 131 -29 -170 201 123 -132 332 418 -417 -220 488 -116 -484 158 114 -343 23 105 -361 -291 223 -63 -179
6320a79M25o5m48O4K56k42J04Mj35n6P17l58l64K43J08j02r3L82m77K06K82l42
$$ -179 246 181 -267 -203 53 -189 -85 -81 -216 -272 445 87 -277 -34 74 -28 -121 261 -216 -10 272 -70
6342g0j07L39Q9j82j52M70m09J90K34m19k02O91j02p46L96J39k16k01L85l30j32
$$ -70 -177 162 251 69 -83 387 -22 168 402 -17 -219 472 370 -376 20 159 -57 -258 127 -203 -335
6363c35L16J98m23K10L20n28L25K62k38k46M90k00n16M10J67m61P2L53k83j33
$$ -335 -19 179 -244 -34 286 -242 83 345 107 -139 351 151 -365 45 212 -249 -177 176 -107 -240
6383b40N13J25o21L59J40m23L45m8l19O7L15k36j1J19n9k17L45J52k46j16K61
$$ -240 273 398 -223 136 276 -147 198 150 -169 -102 213 -23 -34 85 26 -191 154 306 60 -56 205
6404B05j56k56M83m9n48L49J36k40J51Q4jl43L30J37o95Q54m9p07M15J64k76l31
$$ 205 49 -207 276 227 -321 28 164 -76 75 159 158 -185 145 282 -413 441 392 -315 100 264 -12 -343
6426c43L44OJ2K09J90p48M2M14l18K07L14P2p70M32l3j09J97N8m08K09M84m49
$$ -343 1 7 19 228 418 -330 -288 126 -192 15 329 401 -369 63 30 -79 118 176 -232 -23 461 12
6448A2m2L46k36j40K9M40o03K00J37k03j73L69l49o4K59J30j37K41J11p14L52
$$ 12 -30 316 80 -60 -31 409 -194 6 143 -60 -233 136 -213 -277 -18 112 -25 216 327 -387 -35
6469c5K37p5n34L62q5j42M26j31k35K76M51l51m80L84N2m38j8O50o21L35N7k49
$$ -35 202 127 -407 -45 -130 -272 154 23 -212 64 515 164 -316 68 120 -318 -336 314 -307 28 85 -164
6491a64j5K58k9k74J42K54k98r6N17k50l39L67J51m12L17J03l52K3K98k69j03
$$ -164 -179 79 50 -224 -82 172 -126 -222 295 45 -294 73 224 -188 129 232 -120 -97 201 -68 -171
6512a71M43m23O0L76m4n56J30M09l34j09O05l78m48M95O9l24N7N11m54k82M28
$$ -171 272 -151 -91 285 241 -315 -185 224 -110 -219 386 8 -440 55 124 -200 -143 368 -86 -368 60
6533F0O3k91K92k25m0K65k0q3j15Q1m9q8K93j47n39M45L60l13j53L02l16J25K92
$$ 60 123 -168 124 -101 -141 124 104 21 -94 -13 -62 -150 143 -4 -543 -98 262 -51 -204 98 -218 -93 199
6556A99j05k94M08k0l31r3L23p3j31M36j65j75j84K52p4R5J08O8l38L11l0j46
$$ 199 94 -200 208 188 -143 -236 87 14 -117 319 154 -21 -205 47 -27 68 176 244 -94 217 187 41
6578D1l2J14l81K20K39j67j17K13j66j97K45J12m01J46L61m46L76J16k87m56P89
$$ 41 9 123 -258 -38 201 34 -83 130 -36 -233 12 124 -277 -131 230 -216 160 276 -11 -467 322
6599C22j92m11j4L30j3l24K95o7j58L88j5l76K35O3k61K31K42l04j87K56J5j76
$$ 322 130 -281 -295 35 22 -302 -7 -74 -232 156 141 -235 0 63 -198 33 275 -29 -216 40 55 -121
6621a21K83K40m27p4K44k01m6N56q9m88J70k80N3J78p9j05j76N02J41p14P59j23
$$ -121 162 402 -25 -99 145 -56 -102 454 365 -123 47 -233 -180 -2 -81 -186 -362 140 281 -433 326 203
6643B03o76M45K01l1k76J22j55r4M27k87p9J18K23n12J51K37K6k14M87j83n09
$$ 203 -473 -28 173 142 -134 -12 -167 -261 166 -121 -200 -82 141 -371 -220 17 43 -171 316 133 -376
6664c76K83M57k25j95J88j41k27K50m3k86L34j12J72j34Q2o8k72N52q5m56K49
$$ -376 -93 364 139 -56 132 -9 -236 14 -29 -315 19 -93 79 -55 27 -41 -313 239 154 -302 -53
6685e3L09k37rL41o44L40M25m65j29J13o4j51r2N28j71j15K76k69r2K44m7j25
$$ -53 256 19 10 351 -293 47 472 7 -122 -9 -73 -224 -316 212 41 -74 202 -67 -159 85 38 -87
6707h7L94k8o37K21M30l99k49N88m14q4P7M3J35r9J36Q3M6J32n7l15J11R8l97
$$ -87 307 279 -358 -137 293 -106 -355 233 -181 -265 -188 -145 -10 -109 27 110 156 288 231 -84 27 125 -272
6730b72L74J69l58k79N60o7k66M06j21k91J24K64n26K41R4Q3j52K00m1j55Q5J71
$$ -272 102 271 -87 -366 194 127 -139 267 146 -145 -21 243 -283 -42 52 135 -17 183 142 -13 72 243
6752B43m63K73L15n41J05K69m09j1L52K27l57j40N89k17k30L55j91j27K3J78j63
$$ 243 -220 53 368 -173 -68 201 -208 -219 133 360 3 -137 452 235 5 360 169 42 65 243 80
6773H0n7j53R5j01J60Q0l30K17j76M1J62K83l73j9K38k28p2J48J53M1k86K51k10
$$ 80 23 -130 -35 -136 24 104 -226 -9 -185 -144 18 301 -72 -91 147 -81 -153 -5 148 189 -97 154 -56
6796e6P9Q9l09K1K68p4r5O0J80r0j74L23j26j98M29Q7n35l4L10p2j54K94l74O
$$ -56 23 112 -197 -176 92 18 -77 -17 163 73 -101 222 96 -102 327 414 -121 -155 155 83 -71 223 -151 -145
6820a45K33J24k27Q7r8j63j2J82j38j63L85K60m26j57L47r9P2kj94K61k60K37
$$ -145 88 212 -15 72 -26 -189 -201 -19 -157 -320 65 325 -101 -258 89 -10 62 60 -134 127 -133 104
6842A04k46R2q5J34o0P6J1Q2J99m41Q6J90K0m09J43J49J07k6M9p4k18L10j45m06
$$ 104 -142 -50 -135 -1 -61 15 26 108 307 -134 -48 142 162 -247 -104 45 152 126 175 101 -117 193 48 -358
6866c58N45q1m76O09L3k62k14L46N4j77P9P9l11J59Q4j83k83L29J9Q4j23P5j24
$$ -358 187 106 -370 239 272 10 -204 142 196 19 98 177 -134 25 109 -74 -357 -28 -9 75 -48 27 -97
6889i7o7L26k42M8J83k61l98O35M1l76K77P0j9l81L41q2k99K73K02m75N6L18k01
$$ -97 -164 162 -80 -32 151 -110 -508 127 168 -208 69 139 120 -261 80 -2 -301 -28 174 -301 -245 73 -128
6912a28K04K70k35k91L66j78R8p2j04j12J4J63k35L8J46L6l5M0j40L8J15R4l7
$$ -128 76 346 111 -180 186 8 106 34 -70 -182 -168 -5 -240 -202 -56 -20 -55 -15 -155 -117 -2 92 55
6935E5k0K2j32j36K30n6n2J39o2m38L82K36k24J27qJ11o1l41N30m18J38M5P0l6
$$ 55 35 57 -75 -211 19 -37 -89 50 -12 -450 -68 168 -56 71 63 174 113 -228 302 -116 22 67 137 101
6959A01p9J8J2P1P0j89k2O2l8k4J55l18M8J53K63o40K43J87K0k45K87K4k83OJ81
$$ 101 22 40 52 123 193 4 -18 44 6 -18 137 -181 -133 20 283 -357 -114 73 93 -152 135 159 -124 -118 63
6984F3QRK10m87n0L45q6q0M67k11l73L01K04n65J07K62j20j51L09j31l4L53q1
$$ 63 71 80 290 -197 -247 98 12 -68 399 188 -185 116 320 -245 -138 124 4 -147 162 31 -3 350 269
7007B69l64J13P2K0l00M88k62p7K56N0n48J42K46j8K74o6l90j74M27k47K0%J83
$$ 269 -95 18 90 110 -190 298 36 -41 215 265 -283 -141 105 87 361 295 -95 -269 158 -89 -69 -69 114
7030A14m88L51J2j03k29L20k97L02K01Q1l95PJ57j41J57r3L23m20K20j93O4J54
$$ 114 -374 -23 -11 -114 -343 -23 -320 -18 183 264 -131 -124 33 -108 49 -44 279 -141 79 -114 -50 104
7052A04K3j84j0K30l02j4J35L5l46K90J19j59L9M20l94K2J37q4l33J74J26M3j46
$$ 104 127 -57 -67 163 -139 -153 -18 17 -329 -39 80 -79 -40 380 -14 8 145 61 -272 -98 28 71 -75
7075g5n6Q3j08L7J89k15J76Lj07O2K1Q8P4M1k40p7J09J69l82K72P4j14k14R5J64
$$ -75 -131 -48 -156 -119 70 -145 31 34 -73 -11 10 98 172 213 -27 -104 5 174 -208 64 138 24 -190 -95 69
7100F9k94M30k86j33J9M56m07N5L7J38k82L74K5k79l6L04n8k04N14m49n6K49j76
$$ 69 -225 205 -81 -214 -195 261 -146 -91 -54 84 -198 176 201 -78 -114 190 132 -72 442 -7 -63 186 10
7123A0J12j93L55j59k06K09k26k54J31M80k18No9r5J61K68m68J00j3L05m39rN76
$$ 10 122 -71 284 125 -81 128 -98 -352 -221 259 41 46 -23 -118 43 311 -157 -57 -70 235 -204 -213 363
7146C63k07k90J99j02k39N56k09j71M14k18q6J10Mj85K39l2j71l49M43l4j29o7
$$ 363 156 -134 65 -37 -276 280 71 -100 314 96 10 120 124 -61 178 146 -25 -374 69 35 -94 -161
7168a61J35k3k0K30j8k59K08N4o4J4L1j93P9K24k68N8K13l96Q2nK76k31M7l7m1
$$ -161 -26 -49 -69 161 143 -116 92 146 82 96 127 -66 13 237 -31 27 240 -156 -74 -79 197 -34 13 -24 -65
7193f5nK10k4k16J88m8j56J6K52j74r5L13q0m06J71L97l41j16L17k1j50L14k01
$$ -65 -70 140 116 -100 88 40 -116 -100 152 -22 -117 196 116 -290 -119 278 -63 -179 138 117 -33 281 80
7216H0l49M70K32n87L4J28j25N1p6j8k24L54J79k42l5N80m89N8J79l02J83L1k01
$$ 80 -269 201 433 -154 -120 8 -117 -66 -142 -160 -384 -30 149 -93 -128 452 -37 21 200 -102 81 112 -89
7239h9J65j15J75m14M42j21J89k87l2J84k62L13j23j91J61q4J31o3K32l9m34M57
$$ -89 76 -39 136 -278 164 43 232 -55 -87 97 -165 148 25 -166 -5 -89 42 -21 211 172 -262 195
7261A95M3m38J75j21K00j59q2L90k88J28l8r9J52K3o5N9o9j27k58N11J40k81o9
$$ 195 238 -200 -25 -146 54 -105 -187 203 -85 43 5 -94 58 81 16 75 6 -121 -379 132 272 -9 -78
7284g8P6P6j21M41m70J24j40J61l64O2L78k33p4M32l22j93M57r7l02J68K60k58
$$ -78 -2 74 -47 394 -76 48 -92 69 -295 -233 145 -88 -162 270 -52 -245 212 115 -187 -19 241 -17
7306a7k82P17m19K9j38M9P6J58l89J99o6K63j65j69J96r4j88M83k44j89o4K42
$$ -17 -299 418 -1 28 -110 -61 15 173 -216 -17 -83 180 15 -154 42 -52 -240 243 -1 -190 -254 -12
7328a2j08j97L45L6k95J53J80J13j70k32K7n5L54k03J12j28J32j65J36o0p3j62
$$ -12 -120 -317 28 64 -231 -78 102 215 45 -187 -160 -215 139 -64 48 -80 52 -113 23 -37 -110 -272
7350b72M02j48r0L06j78j3K00j39k18R8Q2M7l6K10l98l3l2L84l48lM76l94l31
$$ -272 130 -18 -108 198 20 7 207 68 -150 -52 30 77 41 251 -147 -180 -212 172 -176 -179 297 -97 -428
7373d28N81j72k23K05J13k02J73M8Oj16L85m28n3L24k48K48k62L7L7J14J73l03
$$ -428 153 -19 -242 -37 76 -126 47 95 101 -15 370 -58 -111 213 -35 213 -49 -12 25 139 312 9
7395IJ5j0k46q5N79k72j9j18M21k37k87L92o2j45j02K67K1j52k2m4L1J99m29o5
$$ 9 24 14 -232 -317 262 -10 -29 -147 274 37 -250 142 80 -65 -167 100 121 -31 -53 -97 -66 133 -296 -361
7419c61N23p4k03J10P2P5l55K64j04l2M41m0m42J45K66j04k61K79l39Q2j17K19
$$ -361 162 88 -115 -5 67 142 -213 51 -53 -85 356 316 -126 19 285 181 -80 199 -140 -58 -175 44
7441D4j00j41K52J22k01J7Oj61K09j92RK17l01L83k69M2j30P8K66l93L37j58j26
$$ 44 -56 -197 55 177 -24 -7 -1 -162 47 -145 -136 81 -220 163 -106 -64 -194 -116 150 -243 94 -64 -190
7464a90j52L61J59l95K55j21J91j48j22K39J1r5j30J50J09J10l26j16K07J5k22
$$ -190 -342 19 178 -217 38 -83 108 -40 -162 77 88 -7 -137 13 122 232 -94 -210 -3 12 -210
7485b10K99n9l5j78L83J1m00L01K0n13M93Q0n32K44J75j56nK02K3j8O3n9N1k7
$$ -210 89 30 -5 -183 200 211 -189 112 132 -381 112 192 -340 -96 79 -77 -82 120 143 125 188 129 180 153
7509A53l1K1m1p7k48R5RJ06j05l3L79k40j12K80j31J88j52K99m64J35J32k75J71
$$ 153 122 143 102 25 -223 -128 -119 -13 -118 -151 228 -12 -124 156 25 213 61 360 -104 31 163 -112 59
7532E9J15j37K9Mr7J99J44q6j25p3r3O5j70K11m9K5J24o6j84J58m9r2q5L38j70
$$ 59 174 37 66 70 -27 172 316 230 105 32 -61 4 -166 45 -4 21 145 79 -105 53 4 -88 -173 165 -5
7557ep8L6m9J66m0m4j09K31k38j56Q9K48M5q9m6K40k11k3J29j42j28K60L0m00
$$ -5 -83 -47 -96 70 30 -14 -123 108 -130 -286 -197 51 96 7 -39 201 -10 -33 96 -46 -174 86 116 -284
7581b84L54L3k29Qo6Q1k17M27j58O9j34J04R6j90J83j63M1k19N00l69J5K61Nl4
$$ -284 70 103 -126 -118 -184 -103 -320 107 -51 18 -116 -12 84 -106 77 -86 -45 -264 236 -133 -118 143 148 114
7605A14k13K16m52J62J16o0J29O1j74O4J50j50Qk72K55l01L94r9j22K13J25l43
$$ 114 -99 117 -335 -173 -57 -117 12 73 -101 -37 113 -37 -29 -301 -46 -347 47 -52 -174 39 164 -179
7627a79K48O5p5KM1Q3m27K40j24J59j19J66k27K7J73l02J80j0q8J90K77m17L99
$$ -179 69 134 59 61 102 185 -242 -2 -126 33 -86 80 -147 -120 53 -249 -69 -79 -167 23 300 -117 282
7650B82l18P1j54j77L30O2l12K4M27l04J67j62K98k58J05o3K75k54k59L51r3N0
$$ 282 -36 35 -119 -296 34 96 -216 -192 235 -69 98 -64 234 -24 81 18 293 39 -220 131 38 88
7672H8k0J44q0j80J25j41P8r4jJ99J33k56j01J61j1j42J08p3M9K27k33O5K4k77
$$ 88 68 212 132 -48 77 -64 14 -80 -81 118 251 -5 -106 55 44 -98 10 -63 -14 213 -20 45 69 -208
7696b08N9N6M52l4m80K29P1l76o7J19L03m8o8J15j26K99k28j58J31j52RK60J30
$$ -208 -149 -93 359 325 -155 74 145 -231 -298 -179 124 76 8 123 -3 296 68 -90 41 -111 -102 158 288
7719B88k29j49J45j32k43L74p9L1j56p7K2J49J20m90K15L66m6j88J99k6k98M18
$$ 288 59 -90 55 -77 -320 54 -25 6 -150 -227 -205 -56 64 -426 -211 155 109 -79 120 94 -204 214
7741B14l12J0o9k0%J15k45M07j22k06K03K50k80J14j59n1L25k92K05o1J69j81
$$ 214 -98 -88 -157 -177 -177 -62 -307 100 -22 -228 -25 225 -55 59 -100 -151 174 -118 87 26 195 14
7763A4j72K15L03k05j44J07j72m7J25l3k09J75j41k03O28l47j84K08J17Q0j96
$$ 14 -158 57 360 155 11 118 -54 -101 24 -9 -218 -43 -184 -387 241 -106 -290 -82 35 115 -81
7784h1K33o6p0Q2J7k3p8j74k12K86PK60m27L30k13J71j88R8k79J17J55m9J19J52
$$ -81 152 86 16 98 115 92 14 -160 -372 -86 -79 181 -246 84 -129 42 -146 -48 -327 -210 -55 -104 15 167
7808A67j50k14O55l26l60L42k97K15j62R2J56j52P4r4M1R6J06l12j4m3J58j40
$$ 167 17 -197 458 132 -228 114 -183 32 -130 -38 118 -34 40 -54 -13 83 189 -123 -137 -180 -22 -162
7830a62J16Jj63K11J52j05k4r4J28j04L5p8L7P2L00k50O7o0k33K50K9P6m7P1l87
$$ -162 -46 -45 -208 3 155 50 26 -68 60 -44 -9 -87 -50 22 322 72 139 79 -154 96 125 201 154 225 -162
7855a62J48J18J50l49Q0p0P9q8j39K58r0L15k49R4k58K62k56j04L32j37P0O5r0
$$ -162 -14 104 254 -95 -15 -85 -6 -94 -233 25 -65 250 1 95 -163 99 -157 -261 71 -66 4 69 -21
7878b1m6J88j05Q3j62K15j16M5l12J45OK54j93n5J78m16J84K24J90k96l1M6l0
$$ -21 -67 121 16 99 -63 152 36 81 -231 -86 -80 174 -19 -74 104 -312 -128 96 286 -10 -41 5 -25
7901b5j04M38l84K66j82J29p6m81L02O7nQ0j31K7J5M6P0j98L47m2k59L09r8l78
$$ -25 -129 309 -75 191 9 138 62 -419 -117 -50 -55 25 -106 -79 -64 -18 52 -146 201 159 -100 209 111 -267
7925b67J07K89k00pK44j15K17k50p9R4k21J99l9J99q8Q6j4J49m04j19K06K42j40
$$ -267 -160 129 -71 -78 166 51 268 18 -61 33 -188 11 -28 171 83 169 155 304 -100 -219 -13 229 89
7948H9j62N0Rj66j43N05k31j59L77k12j47L75k91%n6M38m54J68K33l16j59K62
$$ 89 -73 -23 -14 -180 -323 182 -49 -208 169 -43 -190 185 -106 -106 -162 276 -178 -10 223 -93 -252 10
7970A0j2lj11J33o2p1J65j50J10r3Km0K77k95J62n7j28L4K15j85j2K26l67K51
$$ 10 -2 -5 -116 17 -45 -116 49 -101 9 -84 -82 -122 155 -140 22 -35 -163 -129 86 -99 -111 115 -252 -1
7994aJ17j87R4K9j68j2K05jl7L0P0k32J88q3j23n1L27l72MJ90j10P3j29O8K30
$$ -1 116 -71 23 52 -116 -128 77 76 39 69 139 -93 95 12 -111 -162 165 -207 -203 -13 -123 -50 -179 -111 119
8019A19J74m87K64RR9k79j10J91J6k53M22k81O5L58m15J15K9j53J03J53J36j11
$$ 119 293 -194 70 79 178 -101 -211 -20 -4 -257 165 -116 -51 307 -108 7 36 -117 -14 139 275 164
8041A64k38j05R8j63K82j17Q1O6k17J44J40l6l9r7p8K9K36k04J60j41J45k67K88
$$ 164 -74 -179 -81 -244 38 -79 2 68 -149 -5 135 99 60 -37 -115 -86 150 -54 106 -35 110 -157 131
8064A31k05L38k83J27j6k1k28L26k17N0l51N13l36J79J47j21kJ31j54J65j34r7
$$ 131 -74 264 -19 108 92 71 -157 169 -48 2 -349 164 -172 7 154 33 31 162 8 173 39 -58
8086e8K02k42K82k28J49j04n2L0J67j49o1j34M04l93k7M2J64N5j80J70k52K39
$$ -58 144 -98 184 -44 105 1 -51 -21 146 -3 -64 -198 206 -187 -214 -172 -8 47 -133 37 -215 24
8108B4j09J26l05L26j97j0j16M04P6j45j49j83J79lQ8K6J37j35K54k17j85J52
$$ 24 -85 41 -264 62 -135 -145 -261 143 219 74 -75 -258 -79 -82 6 32 169 34 288 71 -114 38
8130C8l2m1R4k58J29J20J56j90j54K8j37L48Nj51J51p5Q7j06o4K63k65r5K48K8
$$ 38 6 -35 59 -199 -70 50 206 16 -138 -110 -247 101 106 -45 106 31 118 12 -52 211 -54 -149 99 127
8154A27J7j58J97j23J04k85K79l1j05K57l32J37k46J70j7j70J77j4j58J31O0j21
$$ 127 144 -14 183 60 164 -121 158 127 22 279 -53 84 -162 8 -9 -179 -2 -16 -174 -43 17 -104
8176a04k21O39j67k58J72k38J81l3J72Nj83J10K2l6l4
$$ -104 -325 314 147 -111 61 -177 4 -29 143 148 -35 75 97 61 27
8191B7
$$ Imaginary data points
##PAGE= N=2
##DATA TABLE= (X++(I..I)), XYDATA
0@%%%%%%%%%%%%%%%qJ6j6J6j6K4l2L2m0M8n5O4p3Q5r5J07j23J43j62J79k03K28
$$ 0 0 0 0 0 0 0 0 0 0 0 0 0 0 0 0 -8 8 -8 8 -8 16 -16 16 -24 24 -31 33 -40 45 -50 57 -66 77 -85 94 -109 119
37A19k53K84l16L51l90M32m78N28n83O44p10P80q58R47j047J154j272J407j559
$$ 119 -134 150 -166 185 -205 227 -251 277 -306 338 -372 408 -450 497 -550 604 -668 739 -820
56h20J732j934K170k449K785l202L739m444N418o859R197j3578K4358r3553j13986
$$ -820 912 -1022 1148 -1301 1484 -1718 2021 -2423 2995 -3864 5333 -8245 16113 -77440 -191426
71a91426L00680n6746k00640J78630O0947k31847Q6580J73579j66031o2014J66590
$$ -191426 109254 52508 -148132 30498 91445 -140402 -53822 119757 -46274 -108288 58302
82E8302o3858p6359J49407k9878j58369J17832Q9122j43382K1523J25643j13694
$$ 58302 -5556 -81915 67492 37614 -120755 -2923 86199 -57183 -35660 89983 -23711
93b3711n4945J58583k9659j42027R9777P1934j15997K6828Q4453j06756k4970
$$ -23711 -78656 79927 50268 -91759 8018 79952 -36045 -9217 75236 -31520 -56490
104e6490J23284m7036q3483J03152L633j19695P7605P9075j42883j0553J54939
$$ -56490 66794 19758 -63725 39427 43060 -76635 970 80045 -62838 -73391 81548
115H1548o0645j09094J14179L1529j36336M4775J18594r6532n9234J20180p353
$$ 81548 20903 -88191 25988 57517 -78819 -34044 84550 -11982 -71216 48964 41611
126D1611r4390O5168L4504r2217L5501Q4731p5838l0433Q6809m5665o2736J06729
$$ 41611 -52779 12389 46893 -45324 -9823 74908 -930 -31363 55446 9781 -52955 53774
138E3774Q281j22669N9103Q7304j06848j8503J06113o4262p2674J13478J3164
$$ 53774 62055 -60614 -1511 85793 -21055 -39558 66555 2293 -70381 43097 56261
149E6261j11355M8333N0279r8104K7420R5415r7422m3997J26993l3704j05122
$$ 56261 -55094 -6761 43518 -54586 -27166 68249 -29173 -73170 53823 20119 -85003
160h5003J04242L6706j43298M9778J38120j13948p3501J38388j9181j12215J00711
$$ -85003 19239 55945 -87353 -37575 100545 -13403 -86904 51484 32303 -79912 20799
171B0799N3795j27829K3083J03990p9334l8174R4219m3531o3200J05147N289j14784
$$ 20799 74594 -53235 -30152 73838 -5496 -43670 50549 7018 -56182 48965 54254 -60530
183f0530N8807O5283j05078N384J05812p3389o5729J10851R89j09536N2319N8752
$$ -60530 -1723 63560 -41518 -36134 69678 -3711 -69440 41411 42400 -67136 -14817 43935
195D3935q4139J3014P8695p0171l7931Q9745k1597o7768P3045J8458r0893M9207
$$ 43935 -40204 -27190 51505 -18666 -56597 33148 11551 -56217 16828 35286 -55607 -6400
207f400P8594r9285l2767J13184k5366q3326Q1774L3907j04973K0775R0791o2908
$$ -6400 72194 -27091 -59858 53326 27960 -55366 26408 60315 -44658 -23883 66908 4000
219D000m8469P8476m749o0103N2061J6324p6238K4628N8039n5300j2129O4434
$$ 4000 -44469 34007 29258 -30845 21216 37540 -38698 -14070 43969 -11331 -23460 40974
231D0974m2449n1871P8247J0592q9904L6239O6129p0572j6148P9514l8973o0869
$$ 40974 -1475 -53346 24901 35493 -54411 -18172 47957 -22615 -38763 40751 1778 -59091
243e9091P1672K0941o9923L2460M3221o7910M616P1707n3333l6791Q6205j4514
$$ -59091 12581 33522 -36401 -3941 39280 -28630 -24014 47693 -5640 -42431 43774 29260
255B9260p9147O7383M0680j00737J2405R6483o2886n5093R4248n941r2647N5618
$$ 29260 -49887 17496 58176 -42561 -30156 66327 3441 -51652 42596 36655 -55992 -374
267c74M9137q1255P202P0699n5368l0590P2116k6237n9724O8866J6335q0873L9762
$$ -374 48763 -32492 -25290 45409 -9959 -40549 31567 5330 -54394 14472 30807 -50066 -10304
280a0304N8427q2211j2129Q9158l9839o0882P9212J7045q1960L2824N2958o5634
$$ -10304 48123 -34088 -46217 42941 3102 -57780 21432 38477 -43483 -10659 42299 -23335
292b3335l956P1347l9846l7470O5897j0566o0552N3509K6157p6719K2598P2619
$$ -23335 -27291 44056 4210 -33260 32637 22071 -38481 15028 41185 -35534 -12936 59683
304E9683o3400l9869P9556j5104p2069O0075L9395p9753K768O7731m1566l6264
$$ 59683 -3717 -43586 35970 20866 -51203 8872 48267 -31486 -28718 39013 -2553 -38817
316c8817N7138q306m8978M6891K1989o0129J5453M2696m8825o119O5643l0974
$$ -38817 18321 10015 -38963 7928 29917 -30212 -14759 27937 -20888 -27007 38636 7662
328G662n2473O1718K0185p1599K0666N8074n3754k0077O9629j8679n6830M6173
$$ 7662 -44811 16907 37092 -34507 -13841 44233 -9521 -29598 40031 21352 -35478 10695
340A0695K0167n4371K1816M0213n0677o810N6277l6326m0109O3302M17o7045M3366
$$ 10695 30862 -23509 -1693 38520 -12157 -18967 37310 984 -39125 24177 24594 -42451 915
353I15M2241p4099m417P4315l9349n1222O8800J1531o9593L1904M1429o0841J483
$$ 915 43156 -30943 -35360 38955 -394 -51616 17184 28715 -40878 -8974 32455 -28386 -26903
366b6903N9866l7068k7517N8109j5004n0978N3583J9753p0903K6713O1682o1358
$$ -26903 32963 -4105 -31622 26487 11483 -39495 14088 33841 -37062 -10349 51333 -10025
378a0025k3555P3594k5386n9155O0872K4373o8639J8600M9669n2146j4124N6707
$$ -10025 -33580 40014 14628 -44527 16345 40718 -27921 -9321 40348 -11798 -25922 30785
390C0785k7855l5823N5350k946n5659L9372K7645o3546R583O0985m4006l4056
$$ 30785 2930 -32893 22457 19511 -36148 3224 30869 -32677 -23094 37891 -6115 -40171
402d0171O5266n281o4334L9522L9735n4760l14N1382k9983k7325M5345l857m0452
$$ -40171 25095 19814 -44520 -4998 34737 -20023 -20337 31045 1062 -26263 19082 15225 -25227
415b5227L2431J9595m2267J4886L4622m4576j3435N4814j5812m4552M2842J8559
$$ -25227 7204 26799 -15468 -582 34040 -10536 -23971 30843 15031 -29521 13321 31880
427C1880n6483J1088M7955m0131k5802N2035m587m2946L0428J5562m4473J2791
$$ 31880 -24603 -13515 34440 -5691 -31493 20542 15955 -26991 3437 18999 -25474 -12683
439a2683L5529l6057r046M5635k3123l5207M7056N789n4600L0227M2925n3434
$$ -12683 22846 -13211 -22257 23378 255 -34952 12104 17893 -36707 -6480 36445 -16989
451a6989j1669N9605k3027m4321M8525J4975n2438K1956L8507m6545q656M6365
$$ -16989 -28658 30947 7920 -36401 12124 27099 -25339 -3383 35124 -11421 -20077 26288
463B6288k4770k4876M7520q047m7339L7368K4304n6327Q464N1253m1631k4851
$$ 26288 1518 -23358 24162 16115 -31224 6144 30448 -25879 -17415 33838 -7793 -32644
475c2644N9921j1240n5843L8321K7760m9612Q574M2236l6506j7525M6215j4994
$$ -32644 27277 16037 -39806 -1485 26275 -23337 -14763 27473 -9033 -26558 19657 4663
487D663l4928M0383P558m4589K8255L1147n1304l586N4698k7053l5344N1629P370
$$ 4663 -30265 10118 17676 -26913 1342 32489 -18815 -22401 32297 5244 -30100 21529 28899
500B8899n5017K3155L7713m4733q149M6655k0137k8793L7366j240l8017K5213
$$ 28899 -26118 -2963 34750 -9983 -18132 28523 8386 -20407 16959 15719 -22298 2915
512B915J8546m1030R762L8946l6009k0517M7054j0944m2902L7864K3924m9232
$$ 2915 21461 -19569 -9807 29139 -6870 -27387 19667 8723 -34179 3685 27609 -21623
524b1623L686M3955k9667k4749M1974j671l6031K8138J6937l8069R132K9610l1148
$$ -21623 -17937 26018 -3649 -28398 13576 11905 -24126 4012 20949 -17120 -7988 21622 -9526
537i526o951M1690j7912l1775L9338Q088m9371K0292L9686m1801j3915M8872j5581
$$ -9526 -16477 25213 7301 -24474 14864 22952 -26419 -6127 33559 -8242 -22157 26715 11134
550A1134l9830L5662J3855m3724J3166L3751l2180r530L4671k1393k2623L9924
$$ 11134 -28696 6966 20821 -22903 -9737 24014 -8166 -17696 16975 -4418 -27041 12883
562A2883q40l9935K7666K2377m3346N237M3917l3079k6616N0764J315m5635K5993
$$ 12883 12043 -27892 -226 22151 -21195 -15958 27959 -5120 -31736 19028 20343 -25292 701
575G01K3640m1339M905L9652k6457j9075L7488q468l0667L1679P778m1677K1061
$$ 701 24341 -16998 -12093 27559 1102 -17973 19515 11047 -19620 12059 19837 -21840 -779
588g79L3904m1022j1573M5030j9405l4788M0584J2894m7832J3363L6360l4430
$$ -779 33125 -7897 -19470 25560 6155 -28633 11951 24845 -22987 -9624 26736 -7694
600g694j4525L7919j2875k5306L1964M450l4551J7915K0461l3442K731L5632k4166
$$ -7694 -22219 15700 2825 -22481 9483 13933 -20618 -2703 17758 -15684 -12953 22679 -1487
613a487j9681M0891m836m0487K6144K4589l6465J448L5517k3822k2168L4910r55
$$ -1487 -21168 19723 14887 -25600 544 25133 -11332 -9884 25633 1811 -20357 14553 13598
626A3598l2411K1470J5068l1242R649K6251l1736j0474L7625j2613k9702L3328
$$ 13598 -18813 2657 17725 -13517 -3868 22383 -9353 -19827 17798 5185 -24517 8811
638H811J0301m4336J3080L6646l4210j6302M2195p942l3976K8539J3797l6713
$$ 8811 19112 -25224 -12144 24502 -9708 -26010 16185 8243 -25733 2806 16603 -20110
650b0110R105K9153k4912o413L1692j7037k1731L2625J135l3688K3245K1641l7083
$$ -20110 -11005 18148 -6764 -13177 18515 1478 -20253 12372 13507 -20181 3064 24705 -12378
663a2378J095L7889k4580k5969L7113L466l5219K0207K0256l4616R9L0680k0520
$$ -12378 -11283 26606 2026 -23943 13170 16636 -18583 1624 21880 -12736 -12637 18043 -2477
676b477j3736L0661r095k5966K7967Q256l8126J4571L1077l2850r548M0000j5162
$$ -2477 -16213 14448 5353 -20613 7354 15610 -22516 -7945 23132 -9718 -19266 20734 5572
689E572l2866L2900J4084l8197R709L1091k5720j1281L0200j1037k1731K6899
$$ 5572 -27294 5606 19690 -18507 -8798 22293 -3427 -14708 15492 4455 -17276 9623
701I623M886k6830J5171J4749k8283K780K8946k2544j6936L3530n01l3415J8093
$$ 9623 14509 -12321 2850 17599 -10684 -7904 21042 -1502 -18438 15092 14591 -18824 -731
714g31J7758l0883J293L0584j7672j8966K5576M06k3523J5862J0636k5960Q321
$$ -731 17027 -13856 -12563 18021 349 -18617 6959 7365 -16158 -296 10340 -15620 -7299
727g299K4744k2451j1252K7459r299k2686K7352J1555l4132O549K9795k2324j5429
$$ -7299 17445 -5006 -16258 11201 1902 -20784 6568 18123 -16009 -9460 20335 -1989 -17418
740a7418L0540l806k5744K1248J3548k8091L089K1420j8244o716K6065j1753k0469
$$ -17418 13122 9316 -16428 4820 18368 -9723 -6634 14786 -3458 -10174 15891 4138 -16331
753a6331K5576L115l0777J5644K1366k9500l302L3468j7129k4987K9394N815l1041
$$ -16331 9245 12360 -18417 -2773 18593 -10907 -14209 19259 2130 -22857 6537 12352 -18689
766a8689J5083K1726k7540j821K6641j8148j4005K8596m203k4174K3150J0533
$$ -18689 -3606 18120 -9420 -11241 15400 -2748 -16753 11843 7640 -16534 6616 17149
778A7149l2507R241K8171k6973j1671L5695p967k9592K4387J2371l1684O511K5950
$$ 17149 -15358 -6117 22054 -4919 -16590 19105 11138 -18454 5933 18304 -13380 -6869 19081
791A9081k0561j0147K5366r476j9899K1698L555k4727J4683J5195k5824O35K6347
$$ 19081 -1480 -11627 13739 4263 -15636 6062 9617 -15110 -427 14768 -11056 -10421 15926
804A5926j8339j7707K8233K482k7286J5100J7440k6170k753K5866j1098j4536
$$ 15926 -2413 -20120 8113 10595 -16691 -1591 15849 -10321 -13074 12792 1694 -12842
816a2842K0275j08j9013J4016R736k2301M193K1004j6614q066K4093r107k2800
$$ -12842 7433 7325 -11688 2328 12064 -10237 -6044 14960 -1654 -9720 14373 5266 -17534
829a7534K1374J2514k6913L294K3695j7924j3126K4612k979k3138J5985J2309
$$ -17534 3840 16354 -10559 -7265 16430 -1494 -14620 9992 7013 -16125 -140 12169
841A2169k1167L422J6607j7496n731K2295q213j7063K1282M791k6027J1650J9098
$$ 12169 -8998 -5576 11031 -6465 -12196 10099 1886 -15177 6105 10896 -15131 -3481 15617
854A5617k3775m482K8463j0191k1639K2061O928k4914R052J8294k0032k631K2280
$$ 15617 -8158 -12640 15823 5632 -16007 6054 12982 -11932 -2880 15414 -4618 -7249 15031
867A5031j2612j4449K0974j512k0413J7874J0248k6163L962K4080j9507j3884
$$ 15031 2419 -12030 8944 7432 -12981 4893 15141 -11022 -7060 17020 -2487 -16371
879a6371K7026l072k4234J8776J2594k5916J546K1405j4829q753K1621o069j7582
$$ -16371 10655 7583 -16651 2125 14719 -11197 -9651 11754 -3075 -11828 9793 3724 -13858
892a3858J8252M264k1771J0975J5371k1045j129K4488j3875j6914K2155L855k3322
$$ -13858 4394 8658 -13113 -2138 13233 -7812 -8941 15547 1672 -15242 6913 10768 -12554
905a2554J1144J7582k0715m696K0710r740j3279J7860J407j7585J0255R593j8643
$$ -12554 -1410 16172 -4543 -9239 11471 1731 -11548 6312 7719 -9866 389 9982 -8661
918h661K491J6875j4898q697K2626l315k1324J4513J1052k1776K337K1458j2933
$$ -8661 -6170 10705 -4193 -12890 9736 6421 -14903 -390 10662 -11114 -8777 12681 -252
931b52j2524J8961M36j8274J1546R382j6818L911J5446j3687o294J7576o924j3267
$$ -252 -12776 6185 6621 -11653 -107 9275 -7543 -3632 11814 -1873 -8167 9409 2485 -10782
945a0782J7470N143k1456P727J7381j9519o484K2277o160j7052J6286O300k0146
$$ -10782 6688 11831 -9625 -1898 15483 -4036 -10520 11757 5597 -11455 4831 11131 -9015
958i015N585J4133j5581l445J8021q271j2089J7350j638j9086J4225J1968k0886
$$ -9015 -3430 10703 -4878 -8323 9698 1427 -10662 6688 5050 -14036 189 12157 -8729
971h729J228K0934j4100j2861K1954l41k1771J3433J3881j8915p46J7080j2126
$$ -8729 -7501 13433 -667 -13528 8426 8085 -13686 -253 13628 -5287 -6033 11047 -1079
984a079q357J7875k645j5207J3571N166j8385O970J4173j7586l792K1576q618
$$ -1079 -9436 8439 5794 -9413 4158 9324 -9061 -2091 12082 -5504 -9296 12280 3662
997C662j6469J7208M735k0812O758J6279j5554n246J7603o883j3437J4706J951
$$ 3662 -12807 4401 9136 -11676 -4918 11361 -4193 -9439 8164 1281 -12156 2550 4501
1010D501j4548R800R369j6643J291J6521j2008r779J9151q01j8193J3238J0794
$$ 4501 -10047 -247 9122 -7521 -6230 10291 -1717 -11496 7655 6854 -11339 1899 12693
1023A2693k0177l24J9025r087j1203J5862Q01j5718Q887Q401j4638J466J3579
$$ 12693 -7484 -7808 11217 2130 -9073 6789 7590 -8128 759 9160 -5478 -4012 9567
1036I567j0472n258J4393n226j4142J3751O194j7587N088J5400j5244p259J8678
$$ 9567 -905 -6163 8230 3004 -11138 2613 8807 -8780 -3692 11708 -3536 -10795 7883
1049G883m049j5637J3885O760j6558M459J2750j3160l632J5822o947j0799J6670
$$ 7883 3834 -11803 2082 8842 -7716 -3257 9493 -3667 -7299 8523 1576 -9223 7447
1062G447O07j8114J0358J1440j8289O89J9344j1989j3265J9295J425j9957R595
$$ 7447 8054 -10060 298 11738 -6551 -5862 13482 1493 -11772 7523 8948 -11009 -1414
1075a414J2611j7064l14J6749j1334r626J5443j969j3422J2928N267j7583O022
$$ -1414 11197 -5867 -6181 10568 -766 -10392 5051 3082 -10340 2588 7855 -9728 -3706
1088c706J4028j6107m952J9607p067j3855J6223M277j9093O495J3686j3569l690
$$ -3706 10322 -5785 -10737 8870 1803 -12052 4171 8448 -10645 -4150 9536 -4033 -7723
1101g723J6462p026j0510J3934M0j4362J0185Q450j5197J730J4766j1765q918
$$ -7723 8739 1713 -8797 5137 5177 -9185 1000 9450 -5747 -4017 10749 -1016 -9934
1114i934J7265j523j7084J1403J0942j6702j292J5188q926r022J4497N42j3325
$$ -9934 7331 5808 -11276 127 11069 -5633 -6925 8263 -663 -9685 4812 5354 -7971
1127g971P470O530j1761K345J0493j0069l843J4320m441j1586J1071L988j4380
$$ -7971 -501 6029 -5732 -3387 7106 -2963 -6806 7514 3073 -8513 2558 6546 -7834
1140g834M936J3491j1742o241J5046l269j2389J0764M977j3741M926J0545j1118
$$ -7834 -2898 10593 -1149 -7390 7656 4387 -8002 2762 7739 -6002 -1076 9469 -1649
1153a649l621J2709o602r085J3662J405j5943Q237J0365j6199j409J7704q700
$$ -1649 -5270 7439 837 -8248 5414 6819 -9124 -887 9478 -6721 -8130 9574 874
1166H74j2430J6056K899j7018O506J1462j3639j974J5128p213q524J2309j164
$$ 874 -11556 4500 7399 -9619 -3113 8349 -5290 -7264 7864 651 -7873 4436 3272
1179C272j1875J0015N720j3885L790J2842j2909n265J6151m888j2799J3363N346
$$ 3272 -8603 1412 7132 -6753 -2963 9879 -3030 -8295 7856 2968 -9831 3532 8878
1192H878j6276M459J1888j2199l736J4200n657r616J2530O23j4394Q329Q511j4201
$$ 8878 -7398 -2939 8949 -3250 -6986 7214 1557 -8059 4471 5094 -9300 -971 7540 -6661
1206f661J378J4618j0283r270J5970n8j6239R362J0439j3884o59J4477q628r361
$$ -6661 -5283 9335 -948 -10218 5752 5694 -10545 -1183 9256 -4628 -5287 9190 562 -8799
1220h799J2787J634j0891O626N420j0925K079J0235r562m330J2012l277r328J0610
$$ -8799 3988 5622 -5269 1357 6777 -4148 -2069 8166 -1396 -5726 6286 3009 -6319 4291
1234D291K690j4047M076J1508r583m720J2150l839r822R694K877j2114M756Q731
$$ 4291 6981 -7066 -2990 8518 -1065 -5785 6365 2526 -7296 2398 5275 -6839 -2083 6648
1248F648r436j768J0995p301q150J3202J452j3988P658R690j3813j611J4911p198
$$ 6648 -2788 -4556 6439 -862 -9012 4190 5642 -8346 -688 9002 -4811 -6422 8489 1291
1262A291j0789J3228L791j3833M911R122j0952k130J2006n585p423J0985p68j0464
$$ 1291 -9498 3730 7521 -6312 -1401 7721 -3231 -5361 6645 1060 -6363 4622 3854 -6610
1276f610P486M661j1745L515J0902j0162n639J3170l063j1584J0834M693j3229
$$ -6610 876 5537 -6208 -2693 8209 -1953 -7592 5578 2515 -9069 1765 6458 -6771
1289f771L186J1122r803m445J1434m206q351J1375K162j2724O218Q490j2843K57
$$ -6771 -3585 7537 -2266 -6711 4723 517 -7834 3541 5703 -7021 -803 7687 -5156 -4899
1303d899J4045q038r580J3671J698j4112O165R782j2038j960J3189n623r217J0047
$$ -4899 9146 1108 -8472 5199 6897 -7215 -1050 8732 -3306 -5266 7923 2300 -6917 3130
1317C130J400j0002O450N121j0399J040R945p900m628J0559l284r052J0206M089
$$ 3130 4530 -5472 978 6099 -4300 -3260 6685 -1215 -5843 4716 1432 -7620 2586 6675
1331F675j2636K592R902q432l763J1361l249r585R199L378j0723L385Q114r382
$$ 6675 -5961 -3369 6533 -1899 -5662 5699 2450 -7135 2064 5442 -5281 -1896 6218 -3164
1345c164n17J0910o212q178J1073J411j2495O249R275j1662k053J2841o029j0114
$$ -3164 -3681 7229 1017 -7161 3912 5323 -7172 -923 8352 -3310 -5363 7478 1449 -8665
1359h665J0948L374j1202M137P756r353k072J0250n018o495R170j36q775O840
$$ -8665 2283 5657 -5545 -1408 6348 -3005 -5077 5173 155 -6340 2830 2694 -6081 759
1373G59M360j1350K231J0676p408n401J1278k333r973Q846M723j1931K439R829
$$ 759 5119 -6231 -4000 6676 -732 -6133 5145 2812 -7161 1685 6408 -5523 -3084 6745
1387F745p409l407R844m856p622R808K137j0678N154P700j1515o25J2181o982
$$ 6745 -664 -4071 5773 917 -6705 3103 5240 -5438 -284 7416 -4099 -4724 7457 475
1401D75q181J1719K142j2795N349Q170j0170k089J1452m721p475R136L19r113
$$ 475 -7706 4013 6155 -6640 -1291 6879 -3291 -5380 6072 1351 -6124 3012 3331 -5782
1415e782N955M664q857J842P922o631m222J0080k384r268Q426M551j0336K155
$$ -5782 173 4837 -4020 -2178 5744 -887 -5109 4971 2587 -6681 1745 6296 -4040 -1885
1429a885Q746p990m285J0005j770p941P074L068r221K699O856q064j607R524m012
$$ -1885 6861 -1129 -5414 4591 2821 -5120 1954 5022 -4199 -1500 5356 -2708 -4315 5209 1197
1444A197p348Q991J596j0951M412Q674r714k340J1195l773r117Q369L101r517
$$ 1197 -6151 2840 4436 -6515 -2103 6571 -3143 -5483 5712 1939 -7178 1191 4292 -5225
1458e225L776O968p892j649Q797m259n831Q097L2q437O758N002j0340P26R680
$$ -5225 -1449 5519 -2373 -4022 4775 516 -5315 2782 2814 -5623 1135 6137 -4203 -3477 6203
1473F203o525n399J0511r36j0259O863N430r959N29Q804o497l241Q980k631q125
$$ 6203 -322 -5721 4790 3854 -6405 458 5888 -4071 -3542 5262 -1235 -4476 4504 1873 -6252
1488f252P583K690r267L895Q062r462k466J1254m496q799R289K958j0071L998
$$ -6252 1331 4021 -5246 -1351 6711 -2751 -5217 6037 1541 -7258 2031 4989 -5082 -1084
1502a084P916r056k752R952l454o500P910J200q565M367N278q778O61Q586n996
$$ -1084 6832 -2224 -4976 4976 1522 -4978 2932 4132 -4433 -66 5212 -3566 -2905 5681 -315
1517c15m575R588j567r146O861M725r627P82R223o145m569P855j442p363O146
$$ -315 -4890 4698 3131 -6015 846 5571 -4056 -3274 5949 -196 -4765 3090 1648 -5715 431
1532D31L753q199K166O322o483k276Q299l126o914Q242K448r335K625P385p208
$$ 431 4184 -4015 -1849 4473 -2010 -4286 4013 887 -6027 2215 4663 -4672 -2047 5338 -1870
1547a870l218R708k555p406O868K845q592K529O355o397j459P690l768n576P316
$$ -1870 -5088 4620 2065 -5341 1527 4372 -4220 -1691 4664 -1733 -3192 4498 730 -4846 2470
1562B470N80q493N106N836q659K5Q341n540n701Q943J89q568N011N556q518N02
$$ 2470 3050 -5443 -337 5499 -3160 -3135 5206 -334 -6035 2908 3097 -5471 -460 5096 -3422 -2920
1578b920P927n635m035Q325j041p084O029K652q626K685Q131p445l271R624l113
$$ -2920 5007 -628 -4663 3662 2621 -4463 1566 4218 -4408 -1723 6408 -1037 -4308 5316 2203
1593B203p724P594K625r260L093P820p450l028Q459l065o233P192J215p830M305
$$ 2203 -5521 2073 4698 -4562 -1469 6351 -1099 -4127 4332 1267 -4966 2226 3441 -4389 -84
1608h4M748p492n11P847m863m904Q631l44q407M988N337q419k41Q129m407m349
$$ -84 4664 -2828 -3339 4508 -355 -5259 3372 3028 -5379 -391 4946 -3473 -3714 4415 8 -4341
1624d341P696n70p754N127L868p130J445O360n843l274Q243k117p108P022K674
$$ -4341 3355 2785 -4969 158 4026 -3104 -1659 4701 -1142 -4416 3827 1710 -5398 1624 4298
1639D298q532K907O599o967l339Q771j949o488N977K694p966K208N951o250j278
$$ 4298 -4234 -1327 5272 -1695 -5034 3737 1788 -4700 1277 3971 -3995 -1787 4164 -2086 -3364
1654c364P134l399m961P299Jp787M747N090p560k06Q047m539n320P755J08p499
$$ -3364 3770 371 -4590 2709 2710 -5077 -330 4760 -2800 -3006 5041 502 -4818 2937 3045 -4454
1670d454N013M664p361J33O436m767l556P172j426o134N995K741p760J435O559
$$ -4454 559 5223 -2138 -2005 4431 -336 -3892 3280 1854 -4280 1715 4456 -3304 -1869 4690
1685D690n970k820Q348k376o888O114L019q066K247O117n635k317P107k341n681
$$ 4690 -1280 -4100 4248 1872 -5016 1098 4117 -3949 -1702 4415 -1220 -3537 3570 1229 -4452
1700d452N862J568o842L183N044o767m41P081m385m629P507P22p514L736N094
$$ -4452 1410 2978 -3864 -681 4363 -2404 -2845 4236 -149 -4778 2729 3451 -4063 -327 4767
1715D767p330l40P219m274m387O929L0o318L782K997o460J435O043n037l026O868
$$ 4767 -2563 -2903 4316 42 -4345 2584 2614 -3704 78 3075 -3385 -1950 4093 -944 -3970 2898
1731B898j388o577N920K839p381J656O619n487l398P290j498n757N346K552o804
$$ 2898 1510 -5067 853 3692 -3689 -2033 4586 -901 -4299 2991 1493 -4264 1082 3634 -3170
1746c170J888N243n351j304O059k859m125N980J007o986L361M808o753o26P193
$$ -3170 -1282 3961 -1390 -2694 3365 506 -3619 2361 3368 -3618 -257 4551 -2202 -2828 4365
1761D365l776m757O539O76o984L209M721n933k15O039m403l398O461m08o565M954
$$ 4365 589 -4168 2371 3047 -3937 -728 3993 -1940 -2155 3884 -519 -3917 2544 2136 -4429 525
1777E25L512o932J531O005n636l438P684p88o674N179L098p402K109N408n254
$$ 525 4037 -2895 -1364 4641 -995 -4433 3251 2463 -4211 968 4066 -3336 -1227 4181 -1073
1792a073k388O563j860m578N090Q91o325K988M738o007m77O498m022m227O291
$$ -1073 -3461 3102 1242 -3336 1754 2645 -3680 -692 4046 -1961 -2438 4060 38 -4189 2102
1807B102J90o488L874M090o209k24O205l953l531N943k34n269M152K327o347J657
$$ 2102 2292 -4196 -322 3768 -2441 -2665 3540 -413 -3944 1999 1765 -3504 648 2975 -3372 -1715
1823a715N426m689k294O344j571n621N056K546o780J323N994m540k519N771j231
$$ -1715 3711 -978 -3272 3072 1501 -4120 936 3482 -3298 -1975 4019 -521 -3040 2731 1500
1838A500n258M575K021n381J503M557m648j511N615k869l648N507R57n835K740
$$ 1500 -3758 817 2838 -2543 -1040 3517 -1131 -2642 2973 104 -3544 1963 2920 -2915 -175
1853a75L781n678l80N898l296m204O249K37n615K820L685n580L54O152m210l431
$$ -175 3606 -2072 -2452 3446 150 -4054 2195 2432 -3183 -363 3322 -2258 -1904 4248 38 -3393
1869c393N964n42n658M450K771o391J207O154m823l368O412j008n494M628K988
$$ -3393 2571 2029 -3629 821 3592 -2799 -1592 4562 -261 -3629 2783 1775 -3719 909 3897
1884C897o598J096N417m460k096N056j465m159M750J163n880K179M172n088q1
$$ 3897 -2701 -1605 3812 -648 -2744 2312 847 -3312 1438 2601 -3279 -1100 3072 -2016 -2097
1899b097N429l289l631N431J46n784L616L482n289R5N296l490l448N545j33n134
$$ -2097 3332 43 -3588 1843 1989 -3795 -179 3303 -1986 -1891 3405 -85 -3533 2012 1879 -3255
1915c255M136K106n370J211M766m462k425N757q01n313M350K514n994R63N060
$$ -3255 881 2987 -2383 -1172 3594 -868 -3293 2464 1663 -3650 700 3214 -2780 -1817 3243
1930C243l998k439N666j201m605L697K021m935J371M079l617j549N006k017l914
$$ 3243 -755 -3194 2472 1271 -3334 363 2384 -2551 -1180 2899 -718 -2267 2739 722 -3192
1945c192M838N81m716K451L377n106j33N112l067l369N326M82n431L025K995n398
$$ -3192 1646 2227 -2489 -38 3339 -1767 -1900 3212 145 -3224 2102 2584 -2847 178 3173 -2225
1961b225N34M904l345k573M920m75n055M001K312n632R23N222l754k723N369j292
$$ -2225 -1691 3213 -132 -2705 2215 1740 -3315 686 2998 -2634 -1711 3511 -243 -2966 2403 1111
1977A111m780M133K584n138N85M607l549j948M794j775l748M248J471m603J601
$$ 1111 -3669 464 3048 -2090 -1505 3102 -447 -2395 2399 624 -3124 1124 2595 -2008 -407
1992d07K826m053m39M920k543l432M736K04m607K442L142m517l77N013k774l266
$$ -407 2419 -1634 -2073 2847 304 -3128 1608 1812 -2795 -353 2789 -1728 -2105 2908 134 -3132
2008c132M236K60m526L347K532m732N22M737l496k627M527n56m128L675K478n129
$$ -3132 1104 1364 -3162 185 2717 -2015 -1493 3244 -252 -2879 1648 1092 -3036 639 3117 -2012
2024b012L12M895l587k381M556o47l628L252J518m246J034L496l431o44L912j979
$$ -2012 -1700 3195 -392 -2773 1783 1136 -2492 760 2278 -1968 -934 2562 -869 -1513 2399 420
2040D20l061M044P12m838K226L170l844n41M724k611l354M304O70m604K650K922
$$ 420 -2641 1403 2115 -2723 -497 2673 -1171 -1712 3012 401 -2953 1351 2021 -2583 67 2989
2056B989m881K96M371l167k347M631k36m453L274K384n011L95M684l217k340M667
$$ 2989 -1892 -1596 2775 -392 -2739 1892 1656 -2797 477 2861 -2150 -1755 2929 -288 -2628 2039
2072B039m78m176K869K328m509R91L755l086j967M295j223l507L299R77l978J872
$$ 2039 1561 -2615 254 2582 -1927 -936 2819 -267 -2234 2061 838 -2669 630 1607 -2371 -499
2088d99L261m061j070M684k266k981M388N76m297J674L273m371j71M335k601k119
$$ -499 2762 -1299 -2369 2315 49 -2932 1456 2032 -2265 -591 2682 -1689 -1860 2475 -126 -2245
2104b245L518J50l957K632K176m407Q13M304l145k068L962m05m047K746K602m214
$$ -2245 1273 1423 -2534 98 2274 -2133 -1320 2984 -161 -2229 1733 1328 -2719 27 2629 -1585
2120a585N62L631k882j742L719o06l268K987J448l942J077K928l247j099M043
$$ -1585 -1023 2608 -274 -2016 1703 1097 -2171 816 2264 -1678 -601 2327 -920 -2019 2024
2135B024j246l466L586Q17l793J911K693l843k47L952j754k732K911P35l566J979
$$ 2024 778 -2688 898 1715 -2078 -167 2526 -1317 -1564 2388 634 -2098 813 1548 -2018 -39
2151c9K450l562k80L832k402k362L793l68l498K813K026m171M53L838k818k258
$$ -39 2411 -1151 -1431 2401 -1 -2363 1430 1062 -2436 377 2403 -1768 -1315 2523 -295 -2553
2167b553M269m62l627K473K050l996M46L459k764j275L865j377l011L233P99m057
$$ -2553 1716 1254 -2373 100 2150 -1846 -1400 2059 -705 -1980 1885 508 -2503 730 1529 -2528
2183b528J997L024l354p99M008k086k729L859J40l777K142K358l603P3L305k123
$$ -2528 -531 2493 -861 -1660 2348 262 -2467 1392 1532 -2245 -103 2255 -1348 -1275 2030 -93
2199i3k189M120k40l841K601J700l794O59L385k549j671L949j065l172K538J671
$$ -93 -2282 1838 1598 -2243 358 2058 -1736 -1077 2308 -241 -1912 2037 972 -2200 338 2009
2215B009l525P71L251k856j688M135j479k808L044P19l266J621K464l235n62L176
$$ 2009 -1516 -745 2506 -350 -2038 2097 618 -2190 854 1573 -1693 -72 2392 -843 -1405 1771
2231A771j505k181L387J7l333J600K356l273j77L579k099j980L188j13l221K027
$$ 1771 266 -1915 1472 1489 -1844 -244 2112 -1161 -1338 2241 142 -1838 1350 1237 -1984 43
2247D3J779l095L08L251k421j663L362o58k984K324J395l092O18K878k327j982
$$ 43 1822 -1273 -965 2286 -135 -1798 1564 906 -2078 246 1641 -1451 -833 2045 -282 -2264
2263b264L886j043k590K496J174l176N05K795k526r86L225r40k376K604M84l048
$$ -2264 1622 579 -2011 485 1659 -1517 -1012 1783 -743 -1729 1496 556 -1820 784 1268 -1780
2279a780J430K153k731m20L309j720k285K821L44l271K316J864l235KL070j932
$$ -1780 -350 1803 -928 -1348 1961 241 -2044 777 1121 -2150 166 2030 -1205 -1203 1867 -65
2295f5j824K984k24k757K292J619l663O36L104k655j284L487p47l107K590J315
$$ -65 -1889 1095 871 -1886 406 2025 -1638 -1002 2102 -553 -1837 1650 903 -2204 386 1701
2311A701l132O84K859k211j434L049p09k888K868P49k903J205K389k949l39K644
$$ 1701 -1431 -747 2112 -99 -1533 1516 807 -2081 787 1536 -1367 -162 2227 -722 -1061 1583
2327A583j354k069K858M23l168J511K069k942j96K969j727j808K805J13k869J844
$$ 1583 229 -1840 1018 1441 -1727 -216 1853 -1089 -1285 1684 -43 -1851 954 1067 -1802 42
2343D2J741l227L42L277k552j455L111n12l029K418J727l346Q68K891k680j337
$$ 42 1783 -1444 -1102 2175 -377 -1832 1279 767 -2262 156 1883 -1463 -595 2296 -384 -1721
2359a721K958n70k634K393J073k629N73K208k296p96K615r11k072K631K29k802
$$ -1721 1237 667 -1967 426 1499 -1130 -557 1651 -645 -1441 1174 263 -1809 822 1051 -1751
2375a751J470K134k613n08K803j485j688K636o2k707J631J961k729M3K768k180
$$ -1751 -281 1853 -760 -1268 1535 50 -1638 998 936 -1771 -140 1821 -908 -865 1903 -277
2391b77j433K807l12k856K250J475k812O19K690k387j321K940m79k642J991J451
$$ -277 -1710 1097 785 -2071 179 1654 -1158 -539 2151 -236 -1557 1383 904 -1738 253 1704
2407A704l004O06K177j769j341K941n28k272J942O54k243J014J600k007m17K377
$$ 1704 -1300 -694 1483 -286 -1627 1314 786 -1486 456 1110 -1133 -119 1481 -526 -943 1434
2423A434j422j537K295L05k606J121K201k607m34K589j243j670K588J20k639J711
$$ 1434 12 -1525 770 1075 -1531 -410 1791 -816 -1250 1339 96 -1574 1014 1134 -1505 206
2439B06J536k966J46K932j965j412K661j78k617J513J845l119L95K383j523j379
$$ 206 1742 -1224 -1078 1854 -111 -1523 1138 960 -1657 -144 1701 -1418 -1023 1360 -163 -1542
2455a542K619l24k752K253J220k682Q72J795k237m38K358o72j992K088L62k123
$$ -1542 1077 753 -1999 254 1474 -1208 -336 1459 -778 -1216 1142 470 -1522 566 928 -1195
2471a195R86J837k519m14K717j492j400K363K06k783J684J269k314J69K556j817
$$ -1195 -209 1628 -891 -1305 1412 -80 -1480 883 1089 -1694 -10 1259 -1055 -886 1670 -147
2487a47j263K591k61k704J990J314k278r5K875k072j612K612j53k556K254O94
$$ -147 -1410 1181 920 -1784 206 1520 -758 -853 2022 -50 -1662 950 797 -1759 495 1189
2503A189k278N39J938j624j147K456o22j548J697L37k028P90J682k078l41K336
$$ 1189 -1089 -550 1388 -236 -1383 1073 451 -1097 600 937 -1091 -301 1381 -697 -1038 1298
2519A298j009j676K154K43k549J418J693k229k45K552k063j125K334q4k187J753
$$ 1298 289 -1387 767 1010 -1539 -121 1572 -657 -902 1650 -413 -1538 796 712 -1475 278
2535B78R07j868k01K345j754j073K473l75k174J726J086k444L01J951j533r79
$$ 278 1185 -683 -884 1461 -293 -1366 1107 732 -1442 284 1370 -1074 -773 1178 -355 -1334
2551a334K407m54k217J722R53k198P44J853k158m52K026p41j528J864N95k312
$$ -1334 1073 619 -1598 124 1077 -1121 -377 1476 -682 -1134 892 151 -1377 487 1082 -1230
2567a230J155J567k027m79K313j261j592K424O0k030J081J262k288K75J941j087
$$ -1230 -75 1492 -535 -1014 1299 38 -1554 870 930 -1100 -19 1243 -1045 -770 1171 84
2583H4j496K236kk130J485R79k242N09J871j457j232K372k42k194J507J180k027
$$ 84 -1412 824 822 -1308 177 1156 -1086 -577 1294 -163 -1395 977 735 -1459 48 1228 -799
2600g99L22K037j849r20K374p20j813J816O42k085Q37J387j934j31K015j048j337
$$ -799 -477 1560 -289 -1209 1165 445 -1368 448 1090 -995 -158 1229 -705 -836 1179 131 -1206
2617a206J718O73k500J234J540k243k40K194j329j405K543k60k016R52J464j909
$$ -1206 512 1185 -1315 -81 1459 -784 -1024 1170 -159 -1564 979 719 -1297 -345 1119 -790
2633g90K9K038j626j377K367N5k129J589J117k143J99J868j420j016K055k86j719
$$ -790 -761 1277 -349 -1726 641 696 -1433 156 1273 -870 -671 1197 -223 -1239 816 530 -1189
2650a189J483R70k496O51J791j852m12K418q89j872J841M77k247R58J709j830
$$ -1189 294 1264 -1232 -581 1210 -642 -1054 1364 475 -1397 444 921 -1326 -368 1341 -489
2666d89o75K228q10j426J688M09k057J089J584k163l7J809j032j202K097l51j958
$$ -489 -1164 1064 254 -1172 516 925 -1132 -43 1541 -622 -659 1150 118 -1084 1013 662 -1296
2683a296J235J183j956M10J892j718p78K022m54j801J400Q09j817M88J774j633
$$ -1296 -61 1122 -834 -424 1468 -250 -1028 994 540 -1261 139 948 -869 -381 1393 -240
2699b40n06J752q60j246J413N31j905R18J664k324j72J876r25j174J509L55j837
$$ -240 -746 1006 146 -1100 313 844 -1061 -143 1521 -803 -975 901 -24 -1198 311 666 -1171
2716a171J023J458j929l38J961o58j548K134m11k110J411J402j838j61K158j450
$$ -1171 -148 1310 -619 -957 1004 346 -1202 932 521 -1589 -178 1224 -614 -775 1383 -67
2732f7j150K077m17j902J582J045j844K46J700j220j301K218m81j790J638R45
$$ -67 -1217 860 443 -1459 123 1168 -676 -430 1270 50 -1251 967 486 -1304 334 1279
2748A279k171L46J653j574n09K033o61j566J537O38j912N85J300j496j51K035
$$ 1279 -892 -546 1107 -467 -976 1057 396 -1170 367 1005 -907 -322 978 -518 -669 1366
2764A366j497j216K037N27k342J001J461j970J75J895j518j085J813R0j732J144
$$ 1366 -131 -1347 690 1217 -1125 -124 1337 -633 -458 1437 -81 -1166 647 737 -995 149
2780A49R82j898K27J832j384p62J590m97j246J122R67k114N21J997j850n30J818
$$ 149 1131 -767 -540 1292 -92 -854 736 239 -1007 115 1082 -1032 -511 1486 -364 -894 924
2797I24p37j240J462O69j919N20J378j846N4J896j025j235J485M56j834P94J115
$$ 924 187 -1053 409 1078 -841 -321 1057 -789 -735 1161 136 -1099 386 842 -992 -198 917
2814I17j383k86J400o25j042J824k26j628R18J005j664Q0J513p23j038J833l88
$$ 917 -466 -752 648 23 -1019 805 579 -1049 -131 874 -790 -710 803 80 -958 875 487
2831D87j808J334Q03j407L2J651j102q88J862n40j781J349R64j852N71J404j391
$$ 487 -1321 13 816 -591 -559 1092 -10 -898 964 424 -1357 -8 956 -896 -325 1079 -312
2848c12l60J253rj416J393N32j794M34J292j513l52J930j047j530K155J84j959
$$ -312 -672 581 572 -844 549 1081 -713 -279 1013 -500 -852 1078 31 -1499 656 840 -1119
2865a119J320P49j301l00J611q06j129J712j80j704J237J205k051k06K129j042
$$ -1119 201 950 -351 -651 960 154 -975 737 557 -1147 90 1295 -756 -962 1167 125
2881A25r76J491n6j587J177Q86j960L93J543j035p82J655n56j509J417O33j758
$$ 125 -851 640 584 -1003 174 1060 -900 -507 1036 1 -781 874 318 -1191 226 859 -899
2898h99O34J327j199p99J854r85j240J456N62j766R35J038j566j32J673r59j077
$$ -899 -265 1062 -137 -936 918 -67 -1307 149 711 -1055 -120 918 -648 -780 893 -66 -1143
2915a143J767k8j650J131Q60j603K9J690j135j017J659R5j521J033Q28j573OJ613
$$ -1143 624 596 -1054 77 937 -666 -637 1053 -82 -1099 560 655 -866 167 995 -578 -572 1041
2933A041j292m54J433n22j334J278P12j754L51J553j150o00J493o39j324J685
$$ 1041 -251 -705 728 206 -1128 150 862 -892 -541 1012 -138 -738 755 116 -1208 477
2949D77K76j635P56J011j331l16J751p36j363J534J46j415R05R15j450j98J646
$$ 477 753 -882 -126 885 -446 -762 989 253 -1110 424 570 -845 60 975 -475 -673 973
2966I73p75j426J724o8j619J278R63j657J93J613j264q19J424k35j538J520P85
$$ 973 198 -1228 496 428 -1191 87 1050 -607 -414 1199 -65 -884 540 305 -1233 287 1072
2983A072j733M60J004r56p88J524m15j132J241L21j573O39J171j178m82J759p76
$$ 1072 -661 -201 803 -153 -941 583 168 -964 277 598 -975 -336 835 -343 -825 934 158
3000A58j197J246K37j308P12J267j775N8J419p66r91J513L6j690J016Q93j455
$$ 158 -1039 207 444 -864 -152 1115 -660 -602 817 51 -940 573 609 -1081 -65 828 -627
3017f27N0J736r94r46J391J3j586J220R05j441j94J263p27r43J857n56j459J331
$$ -627 -577 1159 165 -781 610 623 -963 257 1162 -279 -473 790 63 -880 977 421 -1038 293
3035B93O34j579L42J237j165m15J569o28j204J233K93j293O78J083j438m92J659
$$ 293 927 -652 -310 927 -238 -653 916 288 -916 317 610 -683 -5 1078 -360 -852 807
3052H07q42r38J284N24j660O77J356j837k94J543m56j120J608k15j386R70J016
$$ 807 -35 -973 311 835 -825 -148 1208 -629 -923 620 164 -956 652 437 -949 21 1037
3069A037j467j71J573r25q80J524k69j279R96P28j489J34R59n57p93J515k66j542
$$ 1037 -430 -601 972 47 -833 691 422 -857 139 867 -622 -488 471 -86 -879 636 370 -1172
3087a172J547L21j514M25J061r68l74J541p20j193J391M66j674O07J274j341k10
$$ -1172 375 696 -818 -393 668 -300 -674 867 147 -1046 345 811 -863 -256 1018 -323 -533
3104e33J351o93r43J064j09q97O01Q96j129l42J558q70o39J137Q0j359R74P22
$$ -533 818 125 -818 246 137 -760 -159 737 -392 -734 824 -46 -685 452 532 -827 147 869
3122H69j219k27J153n59n02J251j32j461R92P52j435M77R31j080p03J666k55j212
$$ 869 -350 -577 576 17 -485 766 634 -827 165 917 -518 -41 890 -190 -893 773 518 -694
3140f94J132K80j531N84J125j500R6J424p26j210J569K94j548L01J579j525m22
$$ -694 438 718 -813 -229 896 -604 -508 916 190 -1020 549 843 -705 -404 1175 -350 -772
3157g72J459n73q46J285k4j518R14J191j673O5J211p88n79J153l29j206J070P83
$$ -772 687 114 -732 553 529 -989 -75 1116 -557 -492 719 -69 -648 505 176 -1030 40 823
3175H23j506M89J156j344k57J265l61j392J318K94q93N1J074r45o63J730n14j348
$$ 823 -683 -194 962 -382 -639 626 265 -1127 191 485 -408 -357 717 -228 -891 839 325 -1023
3193a023J309J76j545Q51J114j163o67J902p72j045J379Mj386P46J065j217k31
$$ -1023 286 462 -1083 -232 882 -281 -948 954 182 -863 516 520 -866 -120 945 -272 -503
3210e03J287o51p67J251p7j444J368L15j251K51J022q44p64J357m12r04R56P05
$$ -503 784 133 -634 617 540 -904 464 779 -472 -221 801 -43 -807 550 138 -766 190 895
3228H95j299K98R52j292j63J287l63j269J255K32j239O89R23j051l65J560r79
$$ 895 -404 -106 846 -446 -609 678 315 -954 301 533 -706 -17 906 -145 -510 1050 71
3245G1q74J325O9j178N77Q30j002m95J520o84r49J437j69j321Q24Q12j138j05
$$ 71 -803 522 591 -587 -10 820 -182 -677 843 159 -790 647 478 -843 -19 793 -345 -450
3263d50J089n85p88J529k10j459R99M27q24m64J441q33l92J021k87r89J080M20
$$ -450 639 54 -734 795 585 -874 125 552 -272 -736 705 -128 -520 501 214 -775 305 725
3281G25j440M99J339j429l58J367o85p05J248K9j324O77Q63j180m51J596p19o09
$$ 725 -715 -216 1123 -306 -664 703 18 -687 561 590 -734 -57 806 -374 -825 771 52 -557
3299e57R54L76j509P27P08j009j71J283o49q29J326k13j132O82Q00j559M40J232
$$ -557 397 773 -736 -9 699 -310 -481 802 153 -676 650 437 -695 -13 787 -772 -332 900
3317I00j106n96J381q2j530J244O25j214O9P90o31l07J097m26j085J154M55j344
$$ 900 -206 -802 579 497 -1033 211 836 -378 -309 481 -150 -457 640 214 -871 283 738 -606
3335f06M75P21j002j47R38j54j161J334j08q88M93Q55j363Q4J285q46q41J463
$$ -606 -131 590 -412 -559 379 225 -936 398 290 -598 -105 750 -613 -529 756 -90 -931 532
3353E32m3j299R08O85j073l62J343r26n06J095K83j308P05Q67j491J96J156p62
$$ 532 489 -810 98 783 -290 -652 691 -235 -741 354 637 -671 34 901 -590 -394 762 0
3371@q21J303l86j117J238N68j308J2J155n91k40Q63l07j155J091J37r55P01N80
$$ 0 -821 482 96 -1021 217 785 -523 -511 644 53 -187 676 369 -786 305 442 -513 188 768
3390G68j358J18R35m56q30J178K25j186O26R20j113j39P21j73r67Q47N24j253
$$ 768 -590 -472 463 7 -823 355 580 -606 20 940 -173 -312 409 236 -731 116 640 -613
3408f13P53P40j405j71J730r85o02J131l8j322Q21P49r79%P92n52p95J134j83
$$ -613 140 880 -525 -696 1034 49 -553 578 540 -782 39 788 -191 -191 601 49 -746 388 205
3427B05m32L82M39j134L92Q72r06m50J225m17r29R00N47j421L91J226j112m10
$$ 205 -227 155 594 -540 -148 724 -182 -632 593 176 -753 147 694 -727 -336 890 -222 -632
3445f32J328m67j306J379K39j319K74R94r44J7J184r10n50J002K61j310O83Q36
$$ -632 696 229 -1077 302 541 -778 -504 490 -454 -437 747 -163 -713 289 550 -760 -77 759
3463G59j332L67R99q68p43J265k05q85R75M06j359R3J129p52m96J158o3j075Q25
$$ 759 -573 -206 793 -75 -818 447 242 -643 332 738 -621 -528 601 -151 -647 511 448 -627 198
3482A98N28j235K79R17q60l92J385m32j188R64O71j496N58Q22r65m15J333p74
$$ 198 726 -509 -230 687 -173 -565 820 388 -800 164 835 -661 -103 719 -246 -661 672 -102
3500a02k66O85L10r98L89O98j148J66R75p27m55R00N8r98N95K65r29L03J104o66
$$ -102 -368 317 627 -371 18 716 -432 -266 709 -18 -473 427 485 -513 82 347 -582 -279 825 159
3520A59o45Q49r2o11O05K76r16m5J157p64p62J346m19r45J023N92j319K44Q09
$$ 159 -486 363 271 -340 265 541 -375 -420 737 -27 -789 557 138 -807 216 808 -511 -267 542
3539E42p18l21R16k37r81R18N03j037J62R37j007l31J209q22j93O04L13p43M38
$$ 542 -176 -497 419 182 -799 119 622 -415 -253 684 -323 -654 555 -267 -460 144 457 -286 152
3558A52L35p87k36J024n45p38J003K73j118O54O55j231L45P03m89o61J198l48
$$ 152 487 -300 -536 488 -57 -795 208 481 -637 17 672 -559 -214 489 0 -661 537 189
3576A89j145J163M40j127J91J141p72n36J178m33q78P99K72j096N19Q14p61j45
$$ 189 -956 207 647 -480 -289 852 80 -456 722 289 -589 210 482 -614 -95 719 -42 -187
3594a87N43k60p88J016K8r84O37Q29r64j60R98m92p08Q30j80r14O13N22p76J56
$$ -187 356 96 -692 324 352 -632 5 834 -130 -290 708 216 -492 338 158 -756 -143 379 -397 -241
3614b41P72o52m14J213k03j188J011J88j243L32J178p15q49J431p1j305J185R8
$$ -241 531 -121 -535 678 475 -713 298 486 -757 -425 753 38 -811 620 549 -756 429 527
3632E27j125J86J055p55l23Q98k33r71P46M23r78K71R87r89l47R68j89r04J044
$$ 527 -598 -412 643 -112 -435 463 230 -741 5 428 -550 -279 708 -281 -628 340 151 -753 291
3651B91M33j346M61Q55q78l00Q68j61p20R62j89j070P78O49o20m53J106p25m49
$$ 291 724 -622 -161 694 -184 -484 384 223 -497 465 276 -794 -16 633 13 -440 666 -59 -508
3670e08Q40J28j029R12M44j330k5J287q75m79J249k74j060R58K74q01K80O33p63
$$ -508 332 460 -569 343 787 -543 -568 719 -156 -635 614 340 -720 238 512 -289 -9 624 -139
3689a39m36J201k44q01O34N54j419N15R75j145l94J223n47n73Q57m2p97N41N96
$$ -139 -575 626 382 -419 215 769 -650 -135 840 -305 -699 524 -23 -596 261 219 -578 -37 559
3708E59j186R2J101n57o92J110j86q08O80P26j169o2R53n42l98Q98m56p72N01
$$ 559 -627 -535 566 9 -683 427 241 -567 113 839 -330 -392 561 19 -379 519 63 -709 -208
3727b08Q91j110K18P43p65l55P98o1q33R12L94j150K63Q89o96n66J209o59o03
$$ -208 683 -427 -209 534 -231 -586 212 151 -682 230 624 -526 -263 626 -70 -636 573 -86 -689
3746f89J154P2r96K81R43r61l63J095o20m80Q10M98j610Q89N97j129J86J141p85
$$ -689 465 537 -459 -178 765 -196 -559 536 -84 -564 246 744 -866 23 620 -509 -323 818 33
3765C3o05J283l52r92P55O67j352Q9J052r97J58N59lr72P73K82r63M03J006j087
$$ 33 -572 711 359 -633 122 789 -563 -474 578 -419 -261 298 295 -677 96 378 -585 -182 824 -263
3785b63k46J260o28o69O03J97q25L73O57o14j93R24j96o93N86p0p62N43O30j000
$$ -263 -509 751 123 -546 57 254 -571 -198 459 -155 -348 576 380 -313 273 203 -559 -16 614 -386
3805c86m6J180q02n70R66j60o78M72P50j037k19J228r33n63J193r9j001P97L27
$$ -386 -432 748 -54 -624 342 182 -496 -24 726 -311 -530 698 -235 -798 395 296 -705 92 419
3824D19q92K43J029j198m01J519k81j105Q01M28j160M00R33q73n74J320l67j096
$$ 419 -473 -230 799 -399 -800 719 438 -667 134 562 -598 -198 735 -138 -712 608 241 -855
3842h55J063J37p96M30P69r89o4R78o15p17R46R4q16L66O14o96k08R27n61o62
$$ -855 208 345 -451 -21 748 -241 -305 673 58 -659 287 381 -435 -69 545 -151 -359 568 7 -655
3862f55R90J24j130Q84N78j172R1J081q09m33R49j66r42N92N85q83P7P74p14k97
$$ -655 335 459 -671 213 791 -381 -290 791 -18 -451 498 332 -610 -18 567 -316 -239 535 -179 -476
3882d76Q71k76r96Q33P66j326L88Q96r95l97J414o10o79P40M19j165M75O93q70
$$ -476 395 119 -877 -44 722 -604 -216 680 -315 -712 702 92 -587 153 572 -593 -118 575 -295
3901b95j89J137n01p09R17Q6j209Q33M80p32k41J056o44q31J128M2p85M82M59
$$ -295 -484 653 152 -557 360 446 -763 70 550 -182 -423 633 -11 -842 286 328 -457 25 484
3920D84p84k80J165p00n63J183j22j013N43M81q62M30O62q62k12J057l24p00O63
$$ 484 -300 -580 585 -115 -678 505 383 -630 -87 394 -468 -38 624 -238 -450 607 283 -417 246
3939B46L18j148O13P25p75j07M82j97n60O83K81j033M11Q82q74l85P70l47j007
$$ 246 564 -584 29 754 -21 -128 354 157 -403 280 561 -472 -61 821 -53 -438 332 -15 -1022
3958a022J383n8q63O15M47p45j37J036m74q33Q74J68q52L17P43r56R0R80q50k54
$$ -1022 361 303 -560 55 502 -243 -380 656 182 -651 223 391 -461 -144 599 -357 -267 713 -137 -391
3978c91R12k55n80N99J21n83k01J000o64j30O60l82o09M39N28r10K29Q05n57m54
$$ -391 521 266 -314 285 406 -177 -378 622 -42 -172 488 106 -503 -64 464 -446 -217 588 31 -423
3998d23R05j49p34Q29J4j061N13N48q69J1P37k26o57P58L46r20K08P63q49M0P19
$$ -423 482 333 -401 428 442 -619 -106 442 -427 -416 321 95 -562 196 542 -378 -170 593 -256 -216 503
4019E03l85m33O40k31n39N84O07j097J98R87p50m80Q41k69q61Q10K53m26k12J102
$$ 503 118 -315 325 94 -445 139 746 -351 -153 834 84 -396 445 176 -685 125 378 -48 -260 842
4039H42j133j52O21J20r18R24J30p25K08O07p05m7Q52n50o91P45J17q13M36R74
$$ 842 -291 -443 178 298 -620 304 434 -291 -83 524 -181 -228 624 74 -617 128 245 -568 -132 842
4059H42j174R0P40n23m12N93J06o62K66O08q49r6J012m29m42P24K4q15J96P74
$$ 842 -332 -242 498 -25 -437 156 262 -400 -134 474 -375 -471 541 112 -330 394 418 -397 -201 573
4079E73r72J1Q51n90m05R88l58q27Q86Om96j15R23p35j47P64l09m72O33K8q35
$$ 573 -399 -388 463 -127 -532 456 98 -729 157 163 -333 -448 475 -260 -407 357 48 -424 209 237 -598
4100e98M71Q42r73k87J155m73o43O69K84o59J24P67p74l58J027m58n02M77L36
$$ -598 -127 715 -258 -545 610 137 -506 163 447 -212 -88 679 -95 -453 574 116 -386 91 427
4119D27j080N11O77j165j06J464p19m61P61Pp12M13M76p75M9P21n02m35P37j15
$$ 427 -653 -142 535 -630 -736 728 9 -452 309 316 -396 17 493 -282 -233 488 -14 -449 288 173
4139A73o91R19R9j157M70O08o61j18Q18j25q57N65M02p83L43N68q79q4J012q05
$$ 173 -518 401 500 -657 -187 421 -240 -358 460 335 -522 43 445 -338 5 573 -306 -390 622 -183
4159a83o23R49M15j174O36M71p48l46J217n75p16R11K06j041N87M41q12M9P93
$$ -183 -806 143 558 -616 20 491 -257 -603 614 39 -677 234 440 -601 -14 427 -385 -336 457
4178D57n12o49R71l25l28M18M50q97K57Q63r44l74J055l17q30P45O91r11n5N68
$$ 457 -55 -704 267 -58 -386 32 482 -415 -158 705 -239 -613 442 125 -705 40 731 -180 -235 333
4198C33m73j76J102n46q25P07L11q49L67M50j047J13Q97k96p86Q84P9p69L04P60
$$ 333 -140 -316 786 240 -585 122 433 -416 -49 401 -646 -533 364 68 -718 166 245 -524 -220 540
4218E40q74O7O12l81l19O98l15l46M96M84q15n4J023p89o17J069l02o36O19K25
$$ 540 -334 -267 345 -36 -355 343 28 -318 178 662 -153 -207 816 27 -590 479 177 -459 160 385
4238C85p72K63O75o05l28J082n86p18J084k16o35J76R39q81j13Q40m28r99J133
$$ 385 -387 -124 551 -54 -382 700 114 -604 480 264 -371 -195 744 -137 -250 590 162 -837 296
4257B96J91q66N13M22r69r4R15m17o59Q34J01p99M24L72n44p0Q49o84j87Q18k22
$$ 296 487 -379 134 556 -413 -507 408 -9 -668 166 267 -532 -108 264 -280 -350 499 -185 -372 446 224
4278B24p38O87K20p24P0P04n22k00M90J00p05K90M89p56J98P13p37n7Q63m03q03
$$ 224 -514 173 393 -331 -261 443 -79 -279 211 311 -394 -104 385 -371 -173 540 -197 -254 609 206 -597
4299e97Q69K14r11M06O10q70j31P36n11k63M60N09j091L91J023p81n01Q23j38
$$ -597 272 486 -425 -19 591 -279 -410 326 -185 -448 12 521 -570 -179 844 63 -438 385 247
4318B47o00N77L78j305Q44K77m87l09Q26o31n25J279k73q93M19P94j074K13Q78
$$ 247 -353 224 602 -703 141 418 -69 -378 448 -183 -708 571 298 -595 -176 618 -456 -243 635
4337F35q58l17J007k06q22Q21Q5r24O84L96o77l92J158l05q61O34J53k71m3N77
$$ 635 -223 -540 467 261 -561 260 345 -579 105 501 -176 -568 590 285 -576 58 211 -60 -103 474
4357D74r10QQ55m24n03Q75P4q42N08L51r34K35M99k40m56O63J26q51N54K32p27
$$ 474 -436 -428 427 3 -500 375 449 -393 115 466 -468 -233 266 26 -430 233 359 -492 62 294 -433
4378d33J88O41o62l06R61k09p83O33M93q03J6R61q00n00J193o25l86P56J59j049
$$ -433 -245 396 -266 -572 389 180 -603 30 523 -280 -264 697 -103 -603 590 -35 -421 335 494 -555
4398e55M23O05n00k71Q36k53q09Q15Q3o73j5N71l59QN47l34n11P63n7q92O37M06
$$ -555 -132 473 -27 -298 538 285 -524 291 374 -299 -314 257 -102 -94 453 119 -392 371 314 -578 59 465
4420D65p08m6N99l88m42P84p5n29M89O53j273L09P26o61n81J283l22q12P14K56
$$ 465 -243 -289 310 -78 -520 264 189 -340 149 802 -471 -162 564 -97 -678 605 283 -529 185 441
4440D41q04L14N46n97j08O64k46p43P53M9p75K06N71l72l86P84k89n71Q59k23
$$ 441 -363 -49 497 -100 -208 456 210 -533 220 269 -506 -300 271 -101 -487 297 8 -563 296 73
4460G3p01P75m1o17L02O20l71l68Q34k77r11Q68K80p45j69J200r96l16P71j52
$$ 73 -628 147 106 -511 -209 411 40 -328 506 229 -682 186 466 -279 -448 752 -244 -560 211 59
4480E9p27P12N58p77J41K67k71l88J132o73o20O99J40p54L15N10m18j56O00o3
$$ 59 -668 44 602 -175 -34 233 -38 -426 706 33 -587 112 252 -502 -187 323 -95 -251 349 286
4500B86p29Q42qp32r3R30q14j09P95k92k54K31K35q74P20L94p66L50J19l83l20
$$ 286 -443 399 391 -341 -434 496 -318 -427 368 76 -178 53 288 -586 134 528 -238 112 231 -152 -472
4521d72R58k29o92O85J50n34j79Q48p19K2M69J27r23N92K02p81L20O93p77q6N85
$$ -472 486 257 -435 250 400 -134 -313 535 -184 -162 307 434 -489 103 305 -476 -156 537 -240 -326 259
4542B59np01N74Q4n57M46K93k58n39J066o93p06Q83J15o40J77O19r15M34N42n13
$$ 259 254 -447 127 211 -346 100 393 135 -404 662 -31 -737 146 261 -379 -202 417 -498 -64 478 -35
4563c5l46O20J02j094P12M59o82j99R39o77k47O13j37n89M82M61m16K9N41j99
$$ -35 -381 239 341 -753 -41 418 -264 -463 476 -201 -448 165 28 -561 -79 382 -34 -5 536 337
4583C37o77Q32m32n64R58n4p94M05P40j041l7R06l87o73N19M40p29L27M40p21
$$ 337 -340 492 60 -504 454 400 -394 11 751 -290 -327 579 192 -481 38 478 -251 76 516 -205
4603b05o9N01k60n11O77J17p59M71M79q67L65O43o76n49R24k8o48L07N91q63K53
$$ -205 -274 227 -33 -544 133 250 -509 -38 441 -426 -61 582 -94 -643 281 253 -395 -88 503 -360 -107
4624a07N24n98m9O00N9q92O65K77r65K59P53p15j27P76l95p92O43N64r12K55Q79
$$ -107 417 -181 -230 370 429 -463 202 479 -486 -227 526 -189 -316 460 65 -727 -84 480 -432 -177 702
4645G02r05K6M19j99l48L51J65m97jN21l96N8O56m85n43Q94o2r08P28L71j152
$$ 702 -203 -177 242 43 -305 46 211 -286 -287 234 -162 -104 552 67 -476 418 356 -552 176 547 -605
4666f05K53J108q65n17Q04K47p28J93P29r22l4Q82p29j35O50%o96M31J61m33P4
$$ -605 -352 756 -109 -626 178 425 -303 -110 619 -303 -337 545 -184 -319 331 331 -365 66 227 -206 -132
$$ [...]
8191b6
##END NTUPLES=NMR FID
##END=
