##TITLE=1H_DMSO
 , 8 sc, 
 2.06.2021
##JCAMPDX= 6.0         $$ Bruker NMR JCAMP-DX V2.0
##DATA TYPE= NMR FID
##DATA CLASS= NTUPLES
##ORIGIN= UXNMR, Bruker Analytische Messtechnik GmbH
##OWNER= root
$$ XWIN-NMR		Version 3.5
$$ Wed Jun  2 11:52:05 2021 Russian Standard Time (UT+4h)  she@DPX200
##.OBSERVE FREQUENCY= 200.131506
##.OBSERVE NUCLEUS= ^1H
##.DELAY= (6, 6)
##.ACQUISITION MODE= SIMULTANEOUS
##.ACQUISITION SCHEME= undefined
##.AVERAGES= 8
##.DIGITISER RES= 18
##SPECTROMETER/DATA SYSTEM= spect
##.PULSE SEQUENCE= zg30
##.SOLVENT NAME= CD3CN
##.SHIFT REFERENCE= (INTERNAL, CD3CN, 0, 15.7039)
##AUDIT TRAIL= $$ (NUMBER, WHEN, WHO, WHERE, WHAT)
$$ ##TITLE= Audit trail, XWIN-NMR		Version 3.5
$$ ##JCAMPDX= 5.01
$$ ##ORIGIN= Bruker BioSpin GmbH
$$ ##OWNER= she
$$ F:/spectra/data/she/nmr/H-F/1/audita.txt
$$ ##AUDIT TRAIL=  $$ (NUMBER, WHEN, WHO, WHERE, WHAT)
(   1,<2021-06-02 11:46:11.53 +0400>,<she>,<DPX200>,
      <created by zg, POWCHK disabled, PULCHK disabled
       configuration hash MD5:
       00 E9 B6 7A A2 85 ED C7 34 08 36 98 17 FE 4E 26
       data hash MD5: 16K
       8F BB BE A0 23 75 48 57 73 6F 59 A0 BD A7 AB 1E>)
$$ ##END=
$$ 
$$ hash MD5
$$ F9 25 90 4A FD AE 8F 56 C2 83 42 88 0C B1 55 99
##$RELAX= 
##$RELAX= 
##$RELAX= 
##$RELAX= 
##$RELAX= 
##$RELAX= 
$$ Bruker specific parameters
$$ --------------------------
##$DU= <F:/spectra>
##$EXPNO= 1
##$NAME= <H-F>
##$PROCNO= 1
##$TYPE= <nmr>
##$USER= <she>
##$AMP= (0..31)
100 100 100 100 100 100 100 100 100 100 100 100 100 100 100 100 100 100 
100 100 100 100 100 100 100 100 100 100 100 100 100 100 
##$AQSEQ= 0
##$AQ_mod= 1
##$AUNM= <au_zg>
##$AUTOPOS= <>
##$BF1= 200.13
##$BF2= 200.13
##$BF3= 200.13
##$BF4= 200.13
##$BF5= 200.13
##$BF6= 200.13
##$BF7= 200.13
##$BF8= 200.13
##$BYTORDA= 1
##$CFDGTYP= 0
##$CFRGTYP= 5
##$CHEMSTR= <none>
##$CNST= (0..31)
1 1 145 1 1 1 1 1 1 1 1 1 1 1 1 1 1 1 1 1 1 1 1 1 1 1 1 1 1 1 1 1 
##$CPDPRG= <>
##$CPDPRG1= <>
##$CPDPRG2= <>
##$CPDPRG3= <>
##$CPDPRG4= <mlev>
##$CPDPRG5= <mlev>
##$CPDPRG6= <mlev>
##$CPDPRG7= <mlev>
##$CPDPRG8= <mlev>
##$CPDPRGB= <>
##$CPDPRGT= <>
##$D= (0..31)
0 1.2 0 0 0 0 0 0 0 0.06 0 0.03 0 0 0 0 0.0002 0 0 0 0 0 0 0 0 0 0 0 0 
0 0 0 
##$DATE= 1622619971
##$DBL= (0..7)
120 120 120 120 120 120 120 120 
##$DBP= (0..7)
150 150 150 150 150 150 150 150 
##$DBP07= 0
##$DBPNAM0= <>
##$DBPNAM1= <>
##$DBPNAM2= <>
##$DBPNAM3= <>
##$DBPNAM4= <>
##$DBPNAM5= <>
##$DBPNAM6= <>
##$DBPNAM7= <>
##$DBPOAL= (0..7)
0.5 0.5 0.5 0.5 0.5 0.5 0.5 0.5 
##$DBPOFFS= (0..7)
0 0 0 0 0 0 0 0 
##$DE= 6
##$DECBNUC= <off>
##$DECIM= 16
##$DECNUC= <off>
##$DECSTAT= 4
##$DIGMOD= 1
##$DIGTYP= 9
##$DL= (0..7)
0 120 120 120 120 120 120 120 
##$DP= (0..7)
150 150 150 150 150 150 150 150 
##$DP07= 0
##$DPNAME0= <>
##$DPNAME1= <>
##$DPNAME2= <>
##$DPNAME3= <>
##$DPNAME4= <>
##$DPNAME5= <>
##$DPNAME6= <>
##$DPNAME7= <>
##$DPOAL= (0..7)
0.5 0.5 0.5 0.5 0.5 0.5 0.5 0.5 
##$DPOFFS= (0..7)
0 0 0 0 0 0 0 0 
##$DQDMODE= 0
##$DR= 18
##$DS= 0
##$DSLIST= <SSSSSSSSSSSSSSS>
##$DSPFIRM= 0
$$ [...]
##$SUBNAM2= <"">
##$SUBNAM3= <"">
##$SUBNAM4= <"">
##$SUBNAM5= <"">
##$SUBNAM6= <"">
##$SUBNAM7= <"">
##$SUBNAM8= <"">
##$SUBNAM9= <"">
##$SW= 40.0377765249041
##$SWIBOX= (0..15)
0 0 2 0 0 0 0 0 0 0 0 0 0 0 0 0 
##$SW_h= 8012.82051282051
##$TD= 16384
##$TD0= 1
##$TE= 0
##$TE2= 300
##$TE3= 300
##$TEG= 300
##$TL= (0..7)
0 120 120 120 120 120 120 120 
##$TP= (0..7)
150 150 150 150 150 150 150 150 
##$TP07= 0
##$TPNAME0= <>
##$TPNAME1= <>
##$TPNAME2= <>
##$TPNAME3= <>
##$TPNAME4= <>
##$TPNAME5= <>
##$TPNAME6= <>
##$TPNAME7= <>
##$TPOAL= (0..7)
0.5 0.5 0.5 0.5 0.5 0.5 0.5 0.5 
##$TPOFFS= (0..7)
0 0 0 0 0 0 0 0 
##$TUNHIN= 0
##$TUNHOUT= 0
##$TUNXOUT= 0
##$USERA1= <user>
##$USERA2= <user>
##$USERA3= <user>
##$USERA4= <user>
##$USERA5= <user>
##$V9= 5
##$VALIST= <valist>
##$VCLIST= <CCCCCCCCCCCCCCC>
##$VD= 0
##$VDLIST= <DDDDDDDDDDDDDDD>
##$VPLIST= <PPPPPPPPPPPPPPP>
##$VTLIST= <TTTTTTTTTTTTTTT>
##$WBST= 1024
##$WBSW= 4
##$XGAIN= (0..3)
0 0 0 0 
##$XL= 0
##$YL= 0
##$YMAX_a= 245814
##$YMIN_a= -243826
##$ZGOPTNS= <>
##$ZL1= 120
##$ZL2= 120
##$ZL3= 120
##$ZL4= 120
##$ABSF1= 10
##$ABSF2= 0
##$ABSG= 5
##$ABSL= 3
##$ALPHA= 0
##$AQORDER= 0
##$ASSFAC= 0
##$ASSFACI= 0
##$ASSFACX= 0
##$ASSWID= 0
##$AUNMP= <proc_1d>
##$AZFE= 0.1
##$AZFW= 0.1
##$BCFW= 1
##$BC_mod= 2
##$BYTORDP= 1
##$COROFFS= 0
##$CY= 11.3945322036743
##$DATMOD= 1
##$DC= 2
##$DFILT= <>
##$DTYPP= 0
##$F1P= 15.9154993809931
##$F2P= -4.1035820241983
##$FCOR= 0.5
##$FTSIZE= 0
##$FT_mod= 4
##$GAMMA= 1
##$GB= 0.15
##$INTBC= 1
##$INTSCL= 1
##$ISEN= 128
##$LB= 0.24
##$LEV0= 0
##$LPBIN= 0
##$MAXI= 10000
##$MC2= 0
##$MEAN= 0
##$ME_mod= 0
##$MI= 1.114404
##$NCOEF= 0
##$NC_proc= 0
##$NLEV= 6
##$NOISF1= 3.799351
##$NOISF2= 2.8
##$NSP= 1
##$NTH_PI= 0
##$NZP= 0
##$OFFSET= 15.70392
##$PC= 1
##$PHC0= -11481.81
##$PHC1= 24.40099
##$PH_mod= 1
##$PKNL= yes
##$PPARMOD= 0
##$PSCAL= 0
##$PSIGN= 0
##$REVERSE= no
##$SF= 200.130013532006
##$SI= 16384
##$SIGF1= 3
##$SIGF2= 2
##$SINO= 400
##$SIOLD= 16384
##$SREGLST= <1H.CDCl3>
##$SSB= 0
##$STSI= 0
##$STSR= 0
##$SW_p= 3612.71676300578
##$SYMM= 0
##$S_DEV= 0
##$TDeff= 0
##$TDoff= 0
##$TI= <>
##$TILT= no
##$TM1= 0
##$TM2= 0
##$TOPLEV= 0
##$USERP1= <user>
##$USERP2= <user>
##$USERP3= <user>
##$USERP4= <user>
##$USERP5= <user>
##$WDW= 1
##$XDIM= 8192
##$YMAX_p= 0
##$YMIN_p= 0
$$ End of Bruker specific parameters
$$ ---------------------------------
##NTUPLES= NMR FID
##VAR_NAME=  TIME,          FID/REAL,        FID/IMAG
##SYMBOL=    X,             R,               I
##VAR_TYPE=  INDEPENDENT,   DEPENDENT,       DEPENDENT
##VAR_FORM=  AFFN,          ASDF,            ASDF
##VAR_DIM=   8192,          8192,            8192
##UNITS=     SECONDS,       ARBITRARY UNITS, ARBITRARY UNITS
##FACTOR=    0.0001248,     1,               1
##FIRST=     0,             0,               0
##LAST=      1.0222368,     0,               0
##MIN=       0,             -243826,         0
##MAX=       1.0222368,     245814,          0
$$ Real data points
##PAGE= N=1
##DATA TABLE= (X++(R..R)), XYDATA
0 0 0 0 0 0 0 0 0 0 0 0 0 0 0 -5 8 -8 8 -8 8 -8 15 -16 16 -16 23 -24 29 -32 37 -40 47 -51 56 -64 72 -80 88
37 88 -99 109 -117 132 -145 160 -176 192 -210 231 -255 280 -308 340 -374 414 -458 511 -572 644
57 644 -731 836 -969 1137 -1361 1663 -2096 2751 -3819 5763 -10016 23936 -27445 -197870
71 -197870 240852 -101215 -113609 245814 -199878 10512 184186 -243826 127219 79585
81 79585 -226849 209720 -42538 -153087 236926 -150420 -42692 203407 -217363 75940
91 75940 118663 -227171 172673 5135 -178594 223514 -108007 -84907 216531 -192263 29378
102 29378 154703 -227066 135236 54471 -204648 206319 -58306 -131744 225682 -155416
112 -155416 -27456 189478 -212934 81680 107831 -217583 168631 1892 -169195 212253
122 212253 -101657 -80895 202755 -177132 24551 143584 -206510 120615 50529 -183486
132 -183486 183675 -52561 -114842 198681 -139883 -18592 162879 -189936 80760 86056
142 86056 -190886 158423 -11971 -143264 195333 -106380 -59669 182856 -173752 38574
152 38574 124763 -197607 126806 36171 -172647 183215 -60485 -105771 194292 -141127 -14208
163 -14208 158006 -185992 78946 84112 -184597 150597 -8372 -138086 183302 -96174
173 -96174 -58880 169723 -157518 32679 114083 -177629 113534 31111 -152293 163697 -57900
184 -57900 -88715 171161 -130614 -3519 134906 -169100 81581 64766 -164412 145323
194 145323 -21102 -118478 172200 -101007 -43492 156241 -155265 41352 102200 -170849
204 -170849 114866 24246 -144743 159115 -57865 -84312 163810 -123798 -5208 128712
214 128712 -157650 72574 63467 -151841 129891 -15116 -108795 153080 -87264 -40061 137208
225 137208 -135273 36701 87175 -147768 102303 16103 -122471 140680 -57910 -66407 142851
236 142851 -116441 5966 108956 -145260 76424 47953 -137724 127525 -24595 -96289
246 -96289 146997 -90630 -31638 130490 -133973 39909 82664 -144291 100631 15725 -119576
257 -119576 135709 -53476 -66447 136986 -107877 1462 104659 -134277 67139 47297
267 47297 -126552 114363 -20522 -87170 131638 -81686 -26400 115064 -121057 40296
277 40296 69264 -129095 96165 6025 -104098 127312 -58612 -52740 126293 -108498 11862
288 11862 93661 -131322 73483 37937 -121753 116777 -26760 -82512 131256 -84225 -23788
299 -23788 113720 -120333 39548 69036 -126459 91727 8769 -101648 120023 -51842
309 -51842 -52626 117852 -97732 7883 86420 -117786 64626 34128 -107552 103508 -25560
320 -25560 -70184 115223 -77586 -15566 97354 -109128 42381 54926 -112722 89134 -1070
331 -1070 -87979 113324 -56476 -41517 109327 -97583 14795 78616 -114534 66861 29281
342 29281 -103562 101965 -26217 -67892 111794 -74148 -16774 94440 -102835 36917
352 36917 54690 -105642 79916 2782 -82340 101854 -48225 -39252 97666 -85758 12693
363 12693 68851 -100693 60413 22943 -89683 92091 -28434 -55744 100015 -72379 -7609
374 -7609 82482 -98020 42600 44055 -99115 82366 -5553 -75591 101869 -53898 -33454
385 -33454 96438 -89019 16682 67588 -102291 62325 22694 -90613 92204 -26953
395 -26953 -57172 99047 -68965 -10482 81434 -93004 37631 44032 -93287 75194 -3540
406 -3540 -69986 92893 -49265 -29306 86545 -81665 18343 58028 -92803 60919 14761
417 14761 -80052 87818 -32210 -46963 92409 -71081 -1963 73805 -92235 43484 36971
428 36971 -90596 78107 -8734 -66892 93446 -51788 -27358 85999 -81646 17989 58004
439 58004 -91099 57809 16806 -78260 82406 -27191 -46735 85992 -63041 -4712 68138
450 68138 -82019 37173 33684 -79746 68493 -8445 -57247 81706 -47657 -20432 73802
461 73802 -74219 21270 47112 -81724 57430 8501 -68566 79136 -32259 -38281 81209
472 81209 -65083 1480 63331 -81941 40732 30141 -78853 69873 -10019 -56773 81792
483 81792 -47169 -21401 73761 -72173 18424 48010 -79022 52774 11056 -66204 73204
494 73204 -27717 -37141 74805 -58703 812 57302 -74199 38004 25290 -70449 65173
505 65173 -13134 -48521 75528 -48276 -13984 66549 -71322 24375 40565 -76514 56978
516 56978 4173 -62660 75648 -33490 -33284 75817 -63017 4179 57558 -77111 40349
527 40349 25548 -72381 66233 -12085 -50272 75504 -45914 -16434 66096 -67566 20480
538 20480 40617 -71841 51252 5695 -57934 68245 -29760 -29619 67443 -56902 5746 49345
550 49345 -69040 39217 18762 -63367 62435 -16502 -41554 69757 -47520 -9275 59569
561 59569 -66696 25281 34658 -69405 53528 1428 -55221 68597 -31823 -27946 66976
572 66976 -56913 5549 49360 -67805 36883 20350 -62077 58438 -12727 -41458 65023
583 65023 -41612 -11277 55343 -59309 20837 32040 -61564 46898 1087 -48080 60505
594 60505 -29706 -22372 58437 -52662 9002 41352 -62174 38178 13590 -55921 57953
605 57953 -17855 -35546 63380 -45159 -6160 53214 -61551 24887 30001 -62984 49897 -408
617 -408 -49222 62686 -30458 -23705 60201 -52699 7092 43098 -61666 35525 15805 -55202
629 -55202 54496 -14767 -35097 59345 -40990 -6489 48977 -56249 23325 26140 -56850 46868
641 46868 -3316 -42709 58220 -31924 -17543 54607 -52435 12257 37087 -59826 39182 10122
653 10122 -52292 56496 -19434 -31889 59996 -44236 -3817 48933 -58125 24872 26292 -57871
665 -57871 47082 -2186 -43725 57373 -29340 -19455 53491 -48484 8732 36646 -55077 33806
677 33806 11292 -47707 49611 -16131 -28502 52413 -38772 -2473 41751 -51095 23816 20515
689 20515 -50213 43841 -5844 -36544 52694 -30784 -13615 48347 -48079 12737 32043 -53597
701 -53597 36031 7897 -46083 50558 -18060 -27560 52847 -39422 -2687 42460 -51032 22407
713 22407 22125 -50124 41491 -3065 -37073 49975 -26817 -15277 45840 -43289 9843 30267
725 30267 -48445 31918 7253 -41083 45496 -17413 -23129 47210 -37545 885 36664 -48055
737 -48055 24841 16545 -46329 42762 -8095 -32829 50168 -31031 -10925 45153 -46535 13891
749 13891 29016 -50756 35386 5842 -42657 48205 -18566 -24344 49232 -38114 -501 38291
761 38291 -47953 22933 18262 -45755 40049 -5718 -32225 46680 -27618 -10916 41288 -41968
773 -41968 12734 25405 -45221 32706 3153 -36785 44058 -19712 -18890 44043 -37546 3832
785 3832 32809 -45889 25657 13321 -42792 41134 -9466 -29203 46542 -29871 -8625 40677
797 40677 -42864 13747 25173 -45411 32371 4039 -37081 42772 -17445 -20095 42521 -33996
809 -33996 1161 31919 -41626 21389 13762 -38615 35592 -7289 -25905 40336 -25979 -6809
821 -6809 34607 -37674 13827 19958 -39552 30848 122 -31232 40017 -19905 -14807 39086 -35137
834 -35137 5523 28324 -41759 24725 10485 -38197 38004 -10001 -25295 42107 -28094 -6371
846 -6371 36026 -39234 13901 21298 -40691 30449 1649 -32192 39187 -17934 -15872 37914 -32582
859 -32582 4043 27084 -38631 22588 9455 -34590 34992 -10449 -21551 38222 -27588 -2871
871 -2871 31446 -37590 16688 16449 -37974 32171 -2969 -28662 39688 -21843 -12076 37338 -35429
884 -35429 7606 25842 -40408 25389 8104 -35573 36885 -11313 -22282 39298 -27605 -3966
896 -3966 32188 -36761 14738 17501 -36646 29172 -969 -27460 35815 -18544 -11715 33196 -30846
909 -30846 6551 22148 -34911 22714 5585 -29875 32790 -12230 -17179 34330 -26841 -81
921 -81 27123 -34647 17085 13012 -33826 30057 -4328 -24664 35712 -20629 -9552 32714 -31885
934 -31885 7762 21934 -35391 22944 6079 -30378 32345 -10843 -18187 33675 -24660 -1921
946 -1921 26746 -32021 14323 13363 -31131 26517 -3074 -22313 31672 -18438 -7875 28517 -28864
959 -28864 8584 17918 -31714 22864 2501 -26333 31363 -13771 -14035 31948 -26820 2068 24444
972 24444 -33331 17927 10722 -31702 29553 -5750 -22306 34030 -20856 -7513 30254 -30810
984 -30810 8926 19214 -33157 22912 3738 -27354 30930 -12256 -14946 31030 -24728 860
996 860 23300 -30586 16036 9750 -28454 26753 -6043 -18913 30351 -20142 -4522 26005 -28945
1009 -28945 11058 14895 -30285 23842 -66 -23949 30677 -15122 -11588 29932 -26460 3619
1021 3619 21899 -31379 17861 8668 -28726 27636 -6418 -19293 30632 -19560 -5546 26252
1033 26252 -27650 9063 15716 -28727 20897 1771 -22729 27114 -12102 -11276 26320 -22426
1045 -22426 2675 18797 -26759 15635 6583 -24063 24404 -7246 -15147 26813 -19227 -2279
1057 -2279 22368 -26397 11301 12185 -27016 22232 -1176 -20908 27814 -14363 -9672 26672 -24149
1070 -24149 3917 19126 -28095 16501 7052 -25267 24948 -6525 -16446 27203 -18221 -3758
1082 -3758 22734 -25150 9512 12683 -25571 20077 -383 -19438 25275 -13143 -8322 23809
1094 23809 -22376 4933 16080 -25709 16971 4019 -22343 24707 -9248 -13121 26217 -20385
1106 -20385 -386 21089 -26567 12642 10614 -26258 22700 -2503 -19573 27261 -14999 -8199
1118 -8199 25252 -23756 4949 17231 -26628 16577 5293 -23024 23842 -7506 -13903 24978
1130 24978 -17996 -1718 19880 -23587 10476 9886 -23018 19656 -2343 -16506 23528 -13749
1142 -13749 -5852 21296 -21499 6266 13560 -23720 16793 2358 -19933 23119 -9467 -11195
1154 -11195 23773 -19001 289 18658 -23968 11663 9154 -23169 20164 -2418 -16939 23727
1166 23727 -13171 -6848 21588 -20469 4554 14352 -22622 14488 3872 -19146 20483 -7218
1178 -7218 -10975 21134 -16176 -235 16322 -20742 10403 7305 -19852 18273 -3638 -13725
1190 -13725 21373 -13761 -3904 18956 -20483 7136 11582 -22121 16616 1107 -18230 22151
1202 22151 -9869 -9761 22312 -18551 1152 17063 -22786 11799 7728 -21509 19498 -3346
1214 -3346 -15052 22351 -13396 -5081 19628 -19866 5898 12091 -21217 15078 1694 -17087
1226 -17087 20182 -8928 -8600 19936 -17042 2041 14448 -20654 12106 5179 -18857 19069
1238 19069 -5509 -12148 21179 -14865 -2304 17961 -20592 8180 10281 -21275 16719 114
1250 114 -16828 21184 -9959 -8456 20575 -17520 1740 15097 -20717 11205 6257 -18860 17630
1263 17630 -3735 -12539 19492 -12401 -3416 16473 -17593 6177 9414 -18134 13869 145
1275 145 -13979 17795 -8969 -6270 17031 -15672 3034 11853 -18346 11643 3560 -16365 17359
1288 17359 -5746 -10210 18846 -13751 -1467 15688 -18490 7684 8758 -18790 15016 -263
1300 -263 -14621 18701 -9113 -7035 17883 -15646 2099 12758 -18213 10487 4609 -16196 16038
1313 16038 -4446 -10142 17365 -12178 -1595 14123 -16621 7281 7204 -16593 14223 -1658 -12190
1326 -12190 17438 -10222 -4473 16133 -16263 4585 10578 -18256 12697 2203 -15670 17768
1338 17768 -6854 -9150 18538 -14329 -377 14813 -18340 8450 7554 -17906 15106 -1366
1350 -1366 -13170 17960 -9698 -5423 16373 -15357 3388 10779 -17004 11017 2703 -14288 15579
1363 15579 -5798 -7956 15965 -12594 286 12178 -15968 8367 5252 -15164 14239 -3056
1375 -3056 -10436 16467 -10599 -3038 14549 -15539 5152 9052 -16712 12114 1365 -13859 16150
1388 16150 -6581 -7762 16304 -12868 30 12650 -15947 7611 6102 -15166 13103 -1650
1400 -1650 -10762 15197 -8699 -3904 13460 -13305 3689 8377 -14378 10128 1249 -11673 13817
1413 13817 -6130 -5920 13828 -11889 1434 10194 -14611 8553 3806 -13582 13621 -3724 -9036
1426 -9036 15356 -10510 -2114 13320 -14825 5455 7973 -15590 11769 663 -12591 15255
1438 15255 -6759 -6590 15031 -12476 916 11155 -15016 8034 4623 -13765 12933 -2925
1450 -2925 -9049 14430 -9515 -2077 12121 -13497 5301 6638 -13839 11282 -612 -10531 14240
1463 14240 -7757 -4384 13509 -12962 2993 9272 -14922 9750 2618 -13170 14171 -4764
1475 -4764 -8183 15173 -11025 -1240 12525 -14602 5950 6972 -14668 11561 -82 -11278 14236
1488 14236 -6868 -5341 13424 -11732 1628 9399 -13473 7874 3201 -11817 11891 -3548
1500 -3548 -7199 12715 -9192 -843 10238 -12329 5639 5071 -12233 10636 -1383 -8972 12947
1513 12947 -7553 -3407 12001 -11894 3115 8062 -13405 8936 2135 -11672 12655 -4299
1525 -4299 -7154 13382 -9741 -995 10906 -12763 5319 5910 -12677 10202 -389 -9528 12455
1538 12455 -6400 -4105 11520 -10653 2248 7677 -12064 7888 1858 -10249 11388 -4433
1550 -4433 -5705 11853 -9609 460 9167 -12338 6643 3964 -11852 11263 -2445 -8309 13146
1563 13146 -8417 -2578 11783 -12427 3926 7494 -13477 9551 1362 -11279 12879 -5057
1575 -5057 -6397 13060 -10172 -79 10086 -12696 6090 4757 -12013 10538 -1586 -8361 12176
1588 12176 -7308 -2692 10643 -10985 3534 6371 -11709 8708 471 -9346 11585 -5515 -4581
1601 -4581 11432 -10113 1440 8364 -12169 7142 3152 -11230 11131 -2855 -7531 12419 -8180
1614 -8180 -2091 10776 -11503 3806 6638 -12094 8666 1040 -9831 11349 -4595 -5333 11218
1627 11218 -8903 272 8390 -10847 5573 3600 -10043 9263 -1946 -6636 10459 -6837 -1591
1640 -1591 8887 -9899 3858 4974 -10340 8338 -322 -8069 10723 -5650 -3608 10395 -9691
1653 -9691 1862 7438 -11407 7037 2544 -10360 10596 -3045 -6780 11640 -7953 -1553 9870
1666 9870 -10933 4016 5750 -11244 8524 311 -8795 10831 -5101 -4204 10373 -9092 1348
1679 1348 7239 -10637 6449 2264 -9357 9783 -3288 -5576 10504 -7995 -291 8412 -10616
1692 -10616 5176 4091 -10511 9398 -1410 -7718 11311 -6678 -2902 10439 -10347 2664
1704 2664 7009 -11537 7601 1906 -9981 10661 -3561 -6059 11141 -8040 -840 8946 -10457
1717 -10457 4383 4705 -10214 8331 -505 -7489 10014 -5388 -2970 9098 -8692 2146 5856
1730 5856 -9653 6585 1150 -8064 9255 -3819 -4391 9508 -7812 438 7314 -9849 5219
1743 5219 3291 -9458 8764 -1634 -6773 10221 -6173 -2402 9220 -9279 2483 6108 -10142
1756 -10142 6734 1520 -8579 9311 -3279 -5063 9603 -7179 -384 7473 -9097 4250 3590
1769 3590 -8740 7622 -1116 -6117 8955 -5528 -1847 7879 -8370 2887 4722 -9033 6918
1782 6918 139 -7294 9238 -4541 -3622 9173 -8319 1191 6843 -9930 5823 2582 -9144
1795 -9144 9142 -2300 -6296 10121 -6682 -1697 8813 -9455 3170 5288 -9826 7135 564
1808 564 -7799 9307 -4051 -3989 9046 -7722 762 6368 -9080 5267 2327 -8106 8184 -2435
1822 -2435 -5210 8955 -6398 -585 7340 -8740 4047 3839 -8850 7630 -803 -6745 9335
1835 9335 -5186 -2861 8861 -8414 1732 6182 -9590 5913 2081 -8408 8647 -2448 -5482
1848 -5482 9231 -6287 -1238 7625 -8443 3110 4345 -8500 6465 104 -6434 8131 -3986
1861 -3986 -2884 7606 -6882 1283 5164 -7917 5051 1375 -6868 7466 -2771 -4014 7922
1874 7922 -6246 -10 6335 -8154 4049 3071 -8071 7203 -1047 -5952 8638 -5026 -2351
1887 -2351 8016 -7805 1861 5431 -8738 5634 1555 -7557 8011 -2648 -4557 8384 -6117
1900 -6117 -496 6655 -7982 3592 3276 -7749 6677 -879 -5485 7947 -4780 -1770 7081 -7391
1914 -7391 2465 4287 -8034 6083 302 -6545 8176 -3893 -3272 8182 -7194 928 6140 -8749
1928 -8749 5002 2468 -8171 7904 -1820 -5615 8912 -5667 -1724 7781 -8093 2516 4829
1941 4829 -8548 6020 824 -6936 7944 -3225 -3684 7822 -6312 333 5764 -7666 4123
1954 4123 2290 -7000 6723 -1677 -4550 7499 -5157 -909 6318 -7244 2969 3468 -7492 6098
1968 6098 -269 -5833 7724 -3995 -2712 7462 -6783 1091 5401 -7948 4650 2058 -7233
1981 -7233 7072 -1708 -4833 7787 -5013 -1342 6643 -7043 2358 3932 -7305 5356 347
1994 347 -5721 6922 -3221 -2737 6670 -5863 917 4671 -6921 4293 1389 -6131 6556 -2295
2008 -2295 -3673 7094 -5454 -145 5784 -7288 3542 2895 -7313 6458 -823 -5471 7840
2021 7840 -4478 -2229 7324 -7072 1627 5034 -7991 5082 1508 -6954 7293 -2333 -4265 7675
2035 7675 -5539 -570 6165 -7259 3175 3122 -7117 5997 -655 -5125 7197 -4190 -1778 6484
2049 6484 -6578 1995 4027 -7202 5265 503 -5961 7173 -3212 -3113 7272 -6176 545 5529
2063 5529 -7621 4106 2433 -7227 6693 -1273 -5094 7692 -4641 -1795 6847 -6862 1847
2076 1847 4399 -7369 4906 1035 -6120 6688 -2447 -3440 6762 -5182 -45 5122 -6498 3229
2090 3229 2260 -6098 5589 -1134 -4125 6429 -4192 -1068 5585 -6154 2288 3269 -6540 5109
2104 5109 55 -5252 6692 -3247 -2619 6653 -5830 733 4971 -7034 3945 2078 -6562 6229
2118 6229 -1346 -4530 7033 -4397 -1425 6130 -6368 1984 3760 -6722 4828 490 -5373 6369
2132 6369 -2836 -2691 6238 -5362 681 4457 -6435 3879 1459 -5798 6031 -1968 -3569 6616
2146 6616 -4951 -324 5449 -6721 3096 2817 -6802 5845 -600 -5157 7162 -3951 -2203 6769
2160 6769 -6388 1290 4724 -7263 4477 1546 -6407 6525 -1926 -4020 6941 -4826 -730
2173 -730 5667 -6438 2606 3007 -6395 5180 -325 -4719 6318 -3456 -1847 5785 -5638 1445
2187 1445 3773 -6305 4332 747 -5341 6117 -2468 -2991 6360 -5109 124 4993 -6493 3235
2201 3235 2421 -6319 5581 -754 -4650 6599 -3700 -1914 6073 -5762 1237 4134 -6394 3989
2215 3989 1265 -5510 5696 -1808 -3306 5970 -4325 -395 4715 -5630 2536 2294 -5491 4775
2229 4775 -684 -3889 5704 -3491 -1249 5111 -5375 1787 3170 -5918 4417 298 -4917 5993
2243 5993 -2731 -2606 6095 -5174 420 4673 -6407 3421 2067 -6088 5626 -1057 -4305 6451
2257 6451 -3916 -1473 5731 -5817 1666 3593 -6234 4340 623 -5077 5850 -2457 -2658 5808
2271 5808 -4836 433 4251 -5913 3391 1573 -5412 5414 -1553 -3463 6042 -4316 -590 5097
2285 5097 -5972 2499 2817 -6162 5015 -194 -4805 6325 -3212 -2302 6109 -5443 752 4452
2299 4452 -6370 3613 1750 -5769 5526 -1255 -3846 6065 -3869 -1085 5157 -5442 1804 3009
2313 3009 -5616 4144 211 -4356 5344 -2544 -2047 5121 -4570 757 3587 -5396 3335 1108 -4797
2328 -4797 5064 -1693 -2979 5519 -4087 -352 4572 -5523 2390 2491 -5620 4611 -232 -4354 5751
2343 5751 -2932 -2063 5491 -4911 706 3919 -5710 3285 1467 -5126 5014 -1317 -3293 5455 -3719
2358 -3719 -684 4501 -5132 2083 2389 -5164 4248 -358 -3829 5290 -3020 -1457 4922 -4911 1364
2373 1364 3228 -5560 3930 598 -4769 5533 -2280 -2715 5778 -4631 100 4581 -5909 2915
2387 2915 2251 -5784 5063 -630 -4253 5989 -3345 -1692 5477 -5216 1193 3628 -5771 3720
2401 3720 959 -4861 5237 -1871 -2774 5388 -4123 -53 4134 -5267 2639 1827 -5007 4594 -923
2416 -923 -3444 5357 -3436 -994 4727 -5106 1743 2907 -5474 4078 314 -4515 5418 -2334 -2479
2431 -2479 5469 -4470 168 4240 -5513 2720 2015 -5264 4586 -619 -3781 5344 -3042 -1445 4776
2446 4776 -4635 1155 3067 -5059 3382 653 -4192 4668 -1884 -2260 4740 -3880 238 3565 -4885
2461 -4885 2679 1420 -4579 4474 -1141 -3088 5119 -3481 -747 4476 -5013 1862 2682 -5347 4073
2476 4073 172 -4356 5350 -2437 -2284 5329 -4470 334 4022 -5417 2869 1730 -5053 4667 -924
2491 -924 -3443 5296 -3327 -971 4533 -4826 1688 2640 -5056 3880 37 -3921 5015 -2553 -1760 4828
2507 4828 -4512 894 3352 -5264 3372 972 -4697 5012 -1715 -2917 5456 -4030 -373 4523 -5376
2522 -5376 2287 2493 -5454 4398 -132 -4215 5430 -2671 -2005 5167 -4538 612 3673 -5249 2990
2537 2990 1360 -4669 4544 -1206 -2953 4932 -3391 -557 4036 -4632 1902 2131 -4668 3846 -296
2552 -296 -3508 4769 -2654 -1421 4479 -4356 1042 3037 -4974 3258 813 -4379 4732 -1635 -2713
2567 -2713 5061 -3720 -382 4185 -4926 2039 2328 -4976 3966 -87 -3835 4891 -2423 -1798 4631
2582 4631 -4109 653 3243 -4747 2852 1046 -4169 4291 -1373 -2498 4591 -3423 -170 3649 -4566
2597 -4566 2217 1727 -4493 4067 -711 -3247 4881 -3026 -1078 4458 -4652 1417 2870 -5136 3642
2612 3642 524 -4354 5003 -1990 -2496 5148 -4038 -24 4046 -5118 2427 1977 -4904 4237 -530
2627 -530 -3510 4948 -2844 -1300 4429 -4396 1201 2785 -4775 3321 457 -3909 4534 -1976 -2034 4562
2643 4562 -3856 363 3402 -4752 2667 1341 -4442 4355 -1063 -3024 4893 -3230 -845 4296 -4641
2658 -4641 1563 2692 -4978 3497 409 -4094 4671 -1904 -2275 4717 -3712 10 3647 -4570 2201
2673 2201 1733 -4262 3698 -570 -3011 4333 -2559 -965 3830 -3896 1209 2337 -4182 3045 255
2688 255 -3318 4150 -1883 -1613 4120 -3664 571 3084 -4387 2578 1152 -4111 4070 -1082 -2769
2703 -2769 4604 -3112 -710 4017 -4391 1530 2444 -4624 3432 257 -3729 4444 -1959 -1954 4394 -3642
2719 -3642 289 3217 -4428 2407 1249 -4016 3881 -1002 -2599 4304 -3001 -487 3566 -4167 1761
2734 1761 1900 -4254 3563 -319 -3219 4454 -2490 -1330 4215 -4073 957 2905 -4675 3017 846
2749 846 -4131 4369 -1408 -2587 4659 -3343 -434 3864 -4430 1755 2137 -4458 3493 -26 -3401
2764 -3401 4314 -2099 -1562 4050 -3603 582 2795 -4138 2504 870 -3604 3754 -1215 -2160 4007
2779 4007 -2963 -177 3210 -3953 1853 1601 -3907 3410 -410 -2893 4144 -2355 -1163 3868 -3732
2794 -3732 868 2656 -4228 2703 810 -3727 3871 -1195 -2358 4152 -2908 -420 3413 -3889 1540
2809 1540 1869 -3900 3094 -85 -2937 3827 -1985 -1256 3570 -3320 738 2370 -3802 2517 537
2824 537 -3250 3635 -1448 -1835 3821 -3094 112 2979 -3992 2078 1351 -3861 3559 -678 -2765 4190
2840 4190 -2579 -954 3793 -3864 1088 2452 -4228 2882 548 -3560 3955 -1488 -2041 4040 -3105
2855 -3105 -55 3138 -3920 1903 1461 -3714 3319 -556 -2581 3855 -2385 -761 3372 -3560 1221
2870 1221 1997 -3807 2877 85 -3055 3823 -1843 -1481 3768 -3328 446 2784 -3995 2286 1117
2885 1117 -3701 3568 -807 -2530 4017 -2545 -779 3501 -3647 1121 2217 -3878 2697 426 -3170
2900 -3170 3582 -1411 -1728 3575 -2831 70 2699 -3489 1788 1161 -3263 3040 -633 -2184 3448
2915 3448 -2252 -551 2978 -3298 1228 1733 -3487 2715 18 -2794 3551 -1749 -1369 3503 -3106
2930 -3106 400 2592 -3737 2104 1025 -3463 3330 -769 -2342 3725 -2391 -686 3221 -3413 1126
2945 1126 1926 -3581 2625 195 -2839 3425 -1574 -1385 3324 -2897 424 2342 -3431 2094 741
2960 741 -3078 3212 -1076 -1870 3502 -2645 -126 2841 -3526 1679 1443 -3526 3068 -354 -2646 3743
2976 3743 -2093 -1096 3505 -3333 747 2411 -3768 2373 761 -3312 3402 -1054 -2063 3620 -2552
2991 -2552 -374 2935 -3375 1382 1574 -3363 2706 -149 -2487 3307 -1773 -1029 3065 -2933 676
3006 676 2020 -3303 2204 462 -2822 3147 -1205 -1652 3319 -2578 -18 2644 -3344 1584 1324 -3314
3022 -3314 2874 -299 -2444 3408 -1871 -1081 3186 -2965 555 2204 -3371 2045 775 -2974 2977
3037 2977 -873 -1837 3152 -2198 -259 2541 -2974 1257 1330 -2940 2512 -273 -2111 3003 -1779 -772
3053 -772 2747 -2775 805 1734 -3133 2261 257 -2629 3122 -1319 -1454 3224 -2605 154 2492 -3333
3069 -3333 1701 1160 -3176 2896 -483 -2294 3367 -2010 -826 3018 -2970 802 1906 -3258 2199
3084 2199 460 -2715 3037 -1192 -1451 3023 -2480 98 2302 -3042 1662 910 -2858 2737 -693
3099 -693 -1903 3127 -2142 -433 2668 -2978 1171 1531 -3161 2452 48 -2545 3189 -1515 -1306 3148
3115 3148 -2669 239 2345 -3208 1707 1048 -3003 2716 -493 -2122 3104 -1866 -743 2707 -2743
3130 -2743 738 1712 -2905 2001 318 -2358 2689 -1096 -1234 2691 -2218 167 2005 -2744 1531
3145 1531 769 -2558 2470 -639 -1713 2838 -1929 -419 2455 -2761 1025 1477 -2903 2209 94
3160 94 -2360 2896 -1287 -1262 2887 -2390 158 2191 -2917 1525 982 -2704 2490 -451 -1868 2829
3176 2829 -1745 -576 2431 -2558 854 1426 -2712 2026 56 -2117 2672 -1333 -966 2578 -2374
3191 -2374 452 1810 -2808 1785 532 -2502 2696 -918 -1552 2906 -2170 -196 2405 -2889 1236
3206 1236 1308 -2941 2377 -117 -2253 2933 -1475 -1053 2776 -2476 348 1967 -2877 1652 690 -2530
3222 -2530 2504 -681 -1583 2699 -1864 -275 2192 -2541 1066 1141 -2535 2113 -185 -1884 2596 -1450
3238 -1450 -756 2432 -2362 583 1642 -2689 1782 433 -2367 2554 -894 -1460 2723 -2001 -203
3253 -203 2248 -2641 1075 1271 -2672 2089 -6 -2072 2607 -1232 -1003 2485 -2143 288 1754 -2493
3269 -2493 1450 627 -2227 2213 -635 -1396 2406 -1713 -179 1953 -2342 1038 994 -2338 2022 -254
3285 -254 -1745 2483 -1466 -645 2314 -2323 621 1536 -2620 1784 353 -2282 2513 -937 -1366 2635
3301 2635 -2010 -122 2093 -2588 1149 1074 -2527 2116 -217 -1860 2515 -1411 -724 2296 -2228 552
3317 552 1470 -2460 1669 261 -2030 2324 -997 -1074 2356 -1999 172 1751 -2468 1388 682 -2310
3333 -2310 2251 -563 -1565 2581 -1698 -426 2255 -2462 837 1376 -2611 1901 191 -2140 2488
3348 2488 -1039 -1188 2496 -1985 26 1937 -2436 1194 901 -2307 2007 -272 -1606 2323 -1352
3363 -1352 -567 2058 -2071 617 1265 -2238 1595 176 -1813 2174 -969 -946 2176 -1865 185 1631
3379 1631 -2298 1286 662 -2163 2083 -482 -1500 2384 -1527 -429 2125 -2227 682 1321 -2380
3394 -2380 1664 243 -1961 2241 -898 -1092 2249 -1797 11 1696 -2184 1141 723 -2047 1866
3409 1866 -393 -1343 2156 -1412 -310 1805 -2055 804 1021 -2122 1778 -125 -1690 2196 -1232
3424 -1232 -691 2094 -2051 465 1518 -2363 1498 397 -2042 2276 -688 -1282 2391 -1735 -197
3439 -197 1980 -2278 914 1084 -2311 1822 -6 -1705 2241 -1136 -804 2090 -1882 312 1447 -2153
3455 -2153 1345 466 -1882 1990 -711 -1143 2099 -1583 -35 1718 -2081 1041 784 -2051 1811 -267
3471 -267 -1525 2261 -1304 -625 2021 -2022 511 1401 -2209 1423 380 -1947 2019 -683 -1284 2240
3487 2240 -1523 -225 1769 -1993 782 987 -1921 1476 25 -1527 1972 -951 -728 1845 -1640
3502 -1640 370 1196 -1914 1230 316 -1651 1794 -749 -966 1860 -1489 -29 1507 -1991 1008 724
3518 724 -1933 1793 -309 -1430 2120 -1284 -552 1926 -1944 502 1270 -2163 1420 292 -1817 1997
3534 1997 -725 -1052 2056 -1548 -58 1597 -1975 944 748 -1875 1676 -259 -1310 1939 -1205
3549 -1205 -386 1723 -1817 637 1013 -1937 1494 49 -1546 1957 -958 -759 1934 -1719 255 1398
3565 1398 -2084 1215 534 -1918 1881 -465 -1298 2091 -1353 -375 1808 -1929 607 1108 -2013 1420
3581 1420 192 -1629 1878 -777 -880 1853 -1483 46 1374 -1836 948 561 -1695 1570 -351
3596 -351 -1132 1775 -1176 -287 1520 -1715 635 874 -1809 1388 17 -1445 1819 -892 -730 1795
3612 1795 -1578 192 1333 -1890 1043 555 -1792 1654 -347 -1232 1890 -1160 -406 1660 -1694 546
3628 546 1072 -1753 1277 155 -1488 1683 -723 -785 1669 -1395 85 1202 -1667 1009 439 -1542
3644 -1542 1543 -477 -944 1705 -1209 -163 1459 -1742 798 767 -1720 1535 -136 -1242 1954 -963
3660 -963 -544 1794 -1651 334 1252 -1918 1083 497 -1679 1613 -449 -982 1785 -1252 -156 1562
3676 1562 -1727 638 800 -1693 1307 -126 -1253 1651 -917 -507 1495 -1514 373 1036 -1562 1128
3692 1128 249 -1434 1641 -667 -843 1691 -1370 -23 1348 -1729 865 663 -1727 1411 -152 -1296
3708 -1296 1745 -977 -543 1644 -1559 289 1134 -1726 1030 372 -1517 1518 -428 -965 1613 -1134
3724 -1134 -183 1337 -1498 607 701 -1489 1208 -83 -1104 1502 -814 -443 1412 -1366 356 934
3740 934 -1561 1049 200 -1335 1517 -585 -767 1603 -1249 7 1279 -1612 780 648 -1586 1382
3756 1382 -163 -1176 1661 -880 -485 1487 -1429 324 993 -1581 1021 289 -1338 1469 -527 -757
3772 -757 1497 -1190 19 1146 -1463 775 451 -1390 1330 -316 -921 1519 -1039 -228 1318 -1504
3788 -1504 557 747 -1577 1219 -38 -1260 1607 -807 -613 1523 -1406 184 1202 -1626 875
3803 875 533 -1493 1379 -300 -1041 1614 -976 -345 1343 -1381 413 861 -1439 1027 102 -1176
3819 -1176 1386 -656 -581 1354 -1163 112 1018 -1444 787 389 -1281 1284 -314 -874 1454 -1003
3835 -1003 -200 1278 -1401 550 733 -1483 1175 45 -1167 1464 -589 -631 1407 -1204 -10 1104
3851 1104 -1406 761 464 -1346 1219 -201 -960 1364 -761 -248 1234 -1283 511 609 -1253 950
3867 950 31 -1050 1237 -595 -472 1247 -1166 143 842 -1339 845 219 -1197 1287 -444 -723
3883 -723 1373 -1074 -103 1225 -1404 619 699 -1389 1188 -55 -996 1493 -759 -597 1405 -1307
3899 -1307 198 884 -1400 905 401 -1173 1310 -464 -689 1350 -1023 -27 1117 -1265 638 490
3915 490 -1309 1100 -121 -836 1307 -819 -334 1237 -1119 364 811 -1323 890 158 -1119 1369
3931 1369 -547 -617 1349 -1031 33 1013 -1368 658 573 -1304 1127 -132 -981 1293 -670 -471 1295
3948 1295 -1141 158 838 -1220 804 313 -1095 1111 -401 -532 1249 -904 -11 963 -1118 579
3964 579 492 -1222 986 -195 -787 1176 -760 -286 1115 -1183 326 713 -1346 797 146 -1094 1227
3981 1227 -406 -687 1293 -973 -99 1053 -1267 600 595 -1256 1015 -113 -896 1244 -681 -385 1116
3998 1116 -1094 247 703 -1150 828 88 -979 1177 -507 -494 1172 -942 93 897 -1174 697
4014 697 322 -1063 1122 -320 -781 1284 -894 -202 1087 -1263 463 696 -1256 942 101 -1094
4030 -1094 1291 -539 -543 1264 -1025 121 915 -1196 695 404 -1126 1058 -242 -838 1165 -683
4046 -683 -200 994 -1058 370 596 -1128 858 -1 -886 1125 -579 -452 1070 -983 154 813 -1145
4063 -1145 689 296 -1086 1076 -298 -735 1205 -813 -201 1083 -1113 369 681 -1227 855 81
4079 81 -1000 1183 -464 -568 1149 -894 -14 885 -1138 534 400 -1060 921 -170 -714 1080 -690
4096 -690 -196 941 -1032 349 544 -1075 817 -6 -836 1060 -531 -409 1108 -977 156 758 -1163
4113 -1163 721 255 -1070 1083 -327 -689 1191 -822 -150 1008 -1127 428 598 -1145 893 12
4129 12 -900 1123 -528 -423 1065 -948 134 749 -1096 671 244 -942 1009 -314 -565 1081 -826
4146 -826 -34 862 -1068 510 429 -1060 945 -141 -790 1146 -662 -303 1064 -1027 241 721 -1176
4163 -1176 751 208 -1037 1078 -329 -667 1144 -810 -122 944 -1067 402 525 -1109 820 -4
4179 -4 -856 1042 -496 -384 983 -894 149 673 -1023 622 211 -904 936 -308 -559 1007 -764
4196 -764 -57 817 -1029 473 441 -1033 875 -78 -803 1071 -596 -336 1021 -959 197 714 -1098
4213 -1098 671 237 -968 980 -295 -615 1050 -738 -88 873 -998 405 452 -968 813 -64 -728
4230 -728 993 -544 -269 898 -889 247 575 -982 718 79 -825 982 -449 -434 1015 -858 88
4247 88 778 -1067 595 333 -1014 968 -184 -697 1109 -662 -236 972 -996 293 616 -1079 734
4264 734 118 -895 991 -393 -493 987 -793 0 758 -969 492 319 -923 819 -174 -606 951
4281 951 -623 -185 839 -908 315 500 -968 729 24 -789 980 -454 -392 987 -828 75 741
4298 741 -1023 545 334 -964 899 -140 -685 1019 -600 -256 907 -893 213 603 -959 664
4314 664 179 -811 896 -328 -462 906 -708 16 669 -916 455 300 -858 803 -143 -575 890
4331 890 -624 -136 752 -882 342 478 -948 784 53 -676 1037 -468 -307 910 -836 150 640
4348 640 -985 561 252 -872 853 -251 -604 979 -631 -158 830 -849 285 501 -912 690
4364 690 15 -710 876 -432 -311 845 -779 125 555 -890 567 146 -778 849 -320 -473 897
4381 897 -714 -29 746 -917 440 376 -921 786 -73 -708 944 -508 -313 895 -836 156 632
4398 632 -948 556 223 -849 823 -226 -527 892 -605 -101 746 -828 322 413 -835 681 -16
4415 -16 -639 848 -425 -271 798 -740 171 541 -860 565 150 -758 824 -285 -485 903 -660
4432 -660 -40 734 -888 372 408 -908 747 -29 -712 892 -463 -338 854 -763 109 619 -887
4449 -887 521 216 -790 785 -215 -498 839 -600 -72 668 -809 342 342 -804 678 -108 -586
4466 -586 828 -521 -205 758 -791 235 470 -863 629 82 -729 858 -344 -402 890 -725 16
4483 16 682 -893 443 321 -868 755 -109 -603 879 -494 -240 787 -769 204 507 -867 575
4500 575 106 -710 792 -300 -376 797 -643 34 609 -809 435 273 -759 732 -171 -519 852
4517 852 -553 -162 743 -802 265 468 -865 633 78 -734 851 -350 -419 863 -676 -5 697
4534 697 -860 397 328 -836 699 -72 -625 833 -448 -248 763 -706 175 474 -812 529 123
4551 123 -665 752 -281 -372 777 -634 19 588 -811 410 242 -775 705 -164 -516 824 -556
4568 -556 -162 745 -802 261 466 -860 601 61 -709 823 -337 -369 821 -679 18 626 -835
4585 -835 427 284 -783 695 -138 -528 789 -508 -160 688 -747 255 393 -773 606 -14 -608
4602 -608 773 -403 -276 750 -695 131 542 -806 517 189 -738 767 -231 -489 860 -594 -91
4619 -91 722 -802 306 433 -837 630 27 -668 800 -364 -351 801 -670 52 579 -790 410
4636 410 240 -713 697 -154 -477 774 -525 -129 652 -720 261 357 -757 577 -6 -603 754 -378
4654 -378 -295 736 -681 83 554 -814 459 190 -753 733 -185 -514 802 -536 -130 712 -765 264
4672 264 435 -786 578 55 -644 756 -334 -343 745 -627 50 545 -765 405 206 -673 658 -160
4690 -160 -433 745 -514 -74 622 -716 304 324 -752 610 -47 -561 782 -414 -244 732 -686
4707 -686 148 533 -801 510 163 -710 738 -222 -459 793 -555 -86 644 -759 298 363 -747 595
4725 595 -3 -558 735 -363 -256 698 -629 117 452 -715 448 138 -643 677 -238 -372 721 -538
4743 -538 -22 592 -733 320 293 -730 615 -73 -555 761 -406 -262 707 -686 119 502 -788 459
4761 459 165 -697 701 -199 -464 756 -510 -107 642 -697 256 361 -722 537 9 -561 696 -343
4779 -343 -242 658 -603 111 467 -712 445 140 -634 647 -234 -399 724 -528 -47 604 -726 317
4797 317 323 -722 610 -27 -562 767 -384 -261 703 -654 99 503 -745 451 169 -684 667 -182
4815 -182 -425 701 -506 -74 572 -687 270 320 -672 552 -40 -509 695 -369 -197 646 -626 155
4833 155 420 -718 476 89 -597 671 -269 -350 699 -570 -5 566 -741 329 283 -723 607 -84
4851 -84 -537 736 -425 -234 682 -659 138 464 -731 446 142 -626 649 -205 -400 687 -499 -53
4869 -53 558 -662 295 287 -674 568 -76 -492 681 -401 -194 646 -629 150 441 -719 486 106 -631
4888 -631 691 -223 -388 741 -555 -29 606 -710 323 327 -727 580 -22 -561 726 -363 -256 694
4906 694 -618 86 480 -721 420 146 -624 631 -197 -382 685 -499 -39 549 -678 301 273 -670
4924 -670 575 -78 -474 698 -430 -185 650 -649 181 419 -726 501 88 -611 708 -270 -372 722
4942 722 -575 -8 560 -736 329 276 -705 584 -80 -519 696 -403 -199 642 -616 156 415 -693
4960 -693 476 85 -596 654 -274 -328 671 -549 16 520 -705 366 224 -660 614 -122 -464 733
4978 733 -455 -163 661 -679 194 411 -756 519 89 -646 713 -249 -370 743 -571 -15 600 -712
4996 -712 321 292 -702 594 -63 -504 708 -387 -200 637 -626 166 438 -697 474 89 -592 669
5014 669 -261 -323 678 -564 5 535 -719 360 249 -693 630 -114 -495 748 -468 -172 678 -686
5032 -686 184 422 -750 514 80 -643 716 -278 -356 716 -576 -1 554 -717 351 252 -682 603
5050 603 -99 -490 698 -439 -149 622 -650 224 363 -706 516 25 -554 697 -339 -279 692 -608
5068 -608 55 508 -733 415 211 -688 664 -155 -466 756 -493 -131 641 -684 213 388 -746 540
5086 540 60 -601 707 -301 -308 698 -572 42 529 -705 378 232 -656 627 -146 -432 705 -459
5104 -459 -118 605 -668 249 353 -703 539 7 -565 706 -332 -294 701 -624 68 517 -748 415
5122 415 217 -706 659 -152 -477 736 -487 -161 639 -708 210 387 -746 501 34 -596 695 -303
5140 -303 -316 653 -592 44 504 -703 370 183 -648 625 -168 -436 690 -502 -101 604 -684 268
5158 268 335 -714 573 -29 -554 718 -353 -273 684 -620 79 516 -741 426 182 -677 638 -163
5176 -163 -443 720 -497 -114 601 -664 263 346 -682 537 10 -539 667 -332 -246 650 -576 106
5194 106 456 -679 439 124 -611 646 -212 -355 683 -502 -38 558 -687 291 310 -690 577 -37
5212 -37 -521 720 -388 -236 671 -633 102 485 -713 426 168 -651 636 -181 -422 683 -491 -95
5230 -95 587 -672 247 327 -660 517 -32 -524 667 -343 -252 644 -607 104 448 -687 430 143 -614
5249 -614 624 -222 -389 703 -521 -63 563 -680 291 331 -707 580 -27 -527 717 -354 -245 674
5267 674 -621 94 468 -710 425 158 -597 638 -178 -384 663 -481 -49 545 -642 287 280 -635
5285 -635 542 -57 -471 671 -371 -175 604 -616 160 407 -681 464 101 -588 640 -237 -344 688
5303 688 -536 -26 544 -685 310 273 -663 567 -80 -482 675 -392 -199 614 -611 135 409 -675
5321 -675 424 88 -573 609 -233 -335 626 -493 -4 499 -655 303 237 -632 537 -101 -462 640
5339 640 -403 -166 585 -607 170 389 -683 449 84 -589 659 -254 -341 682 -532 -34 535 -684
5357 -684 296 259 -650 538 -66 -502 674 -360 -195 613 -589 148 421 -655 456 114 -547 601
5375 601 -190 -315 650 -536 8 510 -625 348 240 -603 568 -106 -374 651 -426 -82 593 -653
5393 -653 185 346 -690 492 25 -520 578 -294 -379 653 -520 2 492 -660 349 86 -578 563
5411 563 -169 -486 615 -430 -198 563 -579 175 336 -649 468 31 -494 607 -273 -250 608 -520
5429 -520 62 445 -636 345 164 -596 562 -149 -414 634 -416 -118 556 -608 193 345 -649 470
5447 470 28 -535 613 -270 -289 605 -526 34 456 -625 318 193 -585 530 -107 -400 612 -408
5465 -408 -115 549 -572 202 314 -600 462 11 -474 606 -275 -232 612 -520 71 435 -627 366 173
5484 173 -575 583 -138 -386 642 -425 -114 571 -599 217 329 -635 461 16 -502 599 -272 -255
5502 -255 591 -512 42 428 -616 335 173 -569 542 -146 -359 603 -426 -80 503 -582 224 275 -597
5521 -597 466 -27 -463 582 -318 -220 571 -538 85 409 -622 364 134 -558 567 -168 -368 602 -434
5540 -434 -73 520 -594 213 299 -589 468 -8 -472 589 -285 -226 558 -507 79 391 -591 340 136
5559 136 -507 529 -166 -312 582 -427 -37 492 -591 239 263 -582 487 -36 -452 596 -309 -195 583
5578 583 -509 97 432 -620 377 148 -558 563 -157 -348 608 -416 -67 514 -582 207 280 -587 462
5597 462 -12 -452 578 -287 -212 544 -500 87 385 -599 373 115 -532 536 -189 -331 586 -440 -52
5616 -52 488 -590 240 256 -592 472 -30 -451 600 -322 -207 569 -533 92 379 -615 356 112 -542
5635 -542 538 -166 -330 587 -414 -62 482 -562 227 244 -562 454 -17 -427 553 -302 -176 513 -510
5654 -510 121 358 -581 380 95 -488 549 -211 -308 583 -439 -22 461 -580 253 252 -570 503 -47 -446
5674 -446 588 -324 -180 560 -517 103 378 -587 373 118 -506 536 -180 -320 584 -418 -39 458 -569
5693 -569 262 230 -535 460 -35 -407 581 -328 -153 531 -522 131 361 -603 388 84 -506 557 -217 -308
5713 -308 583 -454 -28 476 -591 273 242 -582 497 -37 -443 589 -327 -182 551 -524 101 374 -590
5732 -590 367 97 -510 530 -200 -298 565 -432 -16 443 -548 268 202 -531 477 -76 -399 577 -348 -135
5752 -135 506 -535 155 326 -590 404 68 -485 564 -210 -275 569 -472 21 451 -575 279 221 -557
5771 -557 499 -84 -391 570 -339 -129 505 -516 141 319 -559 394 45 -458 528 -214 -262 550 -441 25
5791 25 416 -556 301 177 -529 508 -91 -366 566 -364 -108 510 -547 157 323 -602 426 43 -489
5810 -489 547 -226 -278 560 -453 7 436 -570 290 203 -539 492 -89 -380 567 -345 -111 514 -517
5829 -517 166 303 -550 405 33 -453 536 -251 -238 534 -477 58 397 -563 313 164 -517 508 -134 -349
5849 -349 581 -377 -87 505 -543 209 299 -561 441 44 -445 554 -247 -220 561 -465 56 410 -553 306
5869 306 170 -509 479 -111 -336 557 -373 -69 469 -512 204 253 -533 422 0 -421 564 -274 -193 527 -469
5890 -469 85 381 -559 342 133 -499 506 -156 -318 552 -383 -69 465 -547 202 260 -545 405 3 -425
5910 -425 535 -271 -213 520 -466 68 345 -533 325 124 -475 482 -151 -311 540 -383 -56 431 -523 215
5930 215 230 -526 437 -44 -382 537 -306 -164 515 -492 108 349 -560 353 96 -478 518 -161 -306 548
5950 548 -386 -36 463 -516 232 260 -527 434 -22 -384 544 -283 -168 492 -469 89 326 -532 357 101
5970 101 -460 488 -171 -257 524 -404 -9 408 -522 258 193 -489 428 -68 -373 547 -310 -148 502 -484 126
5991 126 325 -531 360 75 -445 485 -195 -267 514 -395 -20 404 -510 250 190 -506 422 -57 -354 505 -305
6012 -305 -147 468 -473 111 294 -501 351 48 -431 494 -214 -240 488 -407 15 388 -522 274 174 -484
6032 -484 442 -102 -351 524 -318 -115 465 -477 133 292 -512 365 63 -427 494 -203 -235 505 -387 9
6052 9 387 -497 272 172 -478 439 -71 -324 514 -307 -91 462 -462 167 281 -499 370 42 -417 490 -218
6073 -218 -213 493 -409 58 354 -517 277 164 -480 447 -93 -332 507 -327 -110 440 -451 155 282 -494 363
6094 363 44 -416 479 -212 -212 486 -417 30 354 -490 261 141 -463 430 -114 -304 483 -338 -70 424 -470
6115 -470 170 231 -493 377 14 -389 504 -232 -184 469 -423 57 346 -488 289 140 -457 451 -119 -305 489
6136 489 -322 -86 430 -480 218 299 -483 378 6 -381 472 -227 -186 462 -406 66 339 -468 293 118 -443
6157 -443 440 -139 -280 491 -334 -54 423 -464 185 237 -482 366 5 -369 490 -236 -173 470 -416 64 337
6178 337 -500 284 125 -449 423 -115 -305 492 -321 -74 412 -457 170 224 -463 365 10 -364 461 -241
6198 -241 -180 436 -419 73 307 -473 287 89 -431 427 -152 -263 475 -334 -35 401 -460 197 213 -485 383
6219 383 -19 -361 485 -243 -161 444 -399 72 313 -482 289 114 -435 427 -133 -272 475 -333 -40 384
6239 384 -440 199 215 -437 377 -23 -336 466 -262 -139 422 -407 88 295 -463 301 83 -403 433 -152
6259 -152 -247 472 -352 -27 365 -466 180 205 -474 367 -36 -345 461 -255 -148 437 -397 88 306 -462 307
6280 307 99 -401 429 -134 -237 446 -349 -28 358 -447 193 176 -444 374 -61 -333 449 -258 -125 405
6300 405 -424 103 277 -477 286 56 -409 438 -154 -233 450 -346 -14 369 -457 209 173 -452 386 -45 -323
6321 -323 469 -259 -137 412 -412 109 263 -461 296 62 -384 420 -153 -211 453 -338 -10 343 -437 212
6341 212 144 -422 391 -30 -278 470 -266 -87 426 -398 124 235 -487 324 72 -401 435 -168 -228 440 -323
6362 -323 8 349 -443 229 181 -374 393 -53 -313 464 -278 -117 402 -347 113 244 -479 310 28 -366
6382 -366 424 -235 -234 423 -342 -4 325 -482 271 113 -422 301 -130 -236 412 -265 -103 426 -374 68 279
6403 279 -441 415 47 -372 419 -243 -141 470 -419 -90 319 -343 184 117 -431 314 -139 -322 538 -253
6423 -253 -101 351 -388 146 232 -446 273 43 -330 475 -224 -268 506 -385 98 308 -442 250 82 -416 412
6444 412 -95 -232 538 -266 -148 381 -375 113 225 -429 343 59 -390 414 -174 -163 428 -368 6 317
6464 317 -434 228 107 -395 373 -112 -251 439 -261 -65 377 -419 161 230 -439 331 -3 -326 422 -214
6484 -214 -171 415 -380 38 295 -450 257 105 -414 403 -105 -274 459 -296 -67 384 -426 169 232 -434 340
6505 340 13 -331 429 -207 -160 415 -376 44 305 -445 263 101 -411 400 -114 -261 457 -314 -33 380
6525 380 -416 164 247 -404 336 40 -322 452 -221 -103 383 -362 113 235 -442 256 114 -442 362 -78
6545 -78 -311 405 -344 -99 352 -429 187 198 -431 389 19 -293 420 -240 -54 388 -424 115 334 -424 260
6566 260 107 -422 371 -173 -194 426 -303 -35 355 -421 180 118 -533 380 -62 -359 519 -274 -160 391 -460
6587 -460 26 305 -496 269 49 -370 393 -97 -328 473 -207 -89 344 -460 246 141 -414 368 -112 -328
6607 -328 385 -284 -72 456 -377 55 238 -480 317 43 -354 453 -176 -250 467 -312 17 355 -472 253
6627 253 162 -454 334 -55 -343 421 -254 -125 393 -431 126 276 -446 336 44 -383 451 -163 -257 444 -330
6648 -330 23 372 -457 255 167 -463 417 -76 -292 463 -296 -97 433 -435 129 266 -462 369 24 -391
6668 -391 455 -195 -209 454 -358 38 339 -472 237 156 -448 384 -101 -303 468 -295 -95 392 -428 134 258
6689 258 -458 336 29 -361 442 -199 -184 447 -379 26 317 -462 253 125 -421 410 -114 -279 472 -325
6709 -325 -61 382 -446 162 230 -464 359 2 -364 472 -223 -181 450 -382 55 325 -465 274 122 -426 418
6730 418 -102 -271 460 -322 -71 387 -441 178 226 -461 375 7 -346 450 -228 -154 430 -405 69 304 -458
6751 -458 301 111 -415 442 -130 -260 473 -338 -44 385 -467 197 205 -461 378 -24 -364 457 -241 -161 416
6772 416 -409 67 304 -483 285 80 -441 450 -151 -261 428 -354 -63 384 -452 208 204 -420 322 -48 -360
6793 -360 517 -264 -92 451 -390 70 287 -450 294 60 -387 480 -168 -257 433 -366 -38 338 -520 176
6813 176 165 -432 386 -34 -344 478 -270 -116 414 -411 128 273 -453 335 66 -379 442 -167 -220 459 -348
6834 -348 12 370 -457 220 160 -448 402 -76 -298 469 -276 -100 432 -421 149 272 -468 332 47 -388
6854 -388 455 -199 -210 474 -367 9 350 -474 237 150 -437 406 -70 -305 469 -298 -107 398 -434 136 251
6875 251 -471 330 35 -367 439 -207 -202 439 -387 33 338 -471 262 122 -441 404 -106 -304 476 -325 -76
6896 -76 404 -455 181 243 -470 351 13 -359 468 -229 -185 450 -396 50 324 -472 251 143 -413 429 -110
6917 -110 -270 482 -309 -65 383 -435 178 221 -459 372 -5 -351 450 -232 -157 441 -398 82 319 -464 288
6938 288 97 -418 433 -126 -253 471 -343 -36 383 -449 193 227 -453 368 -19 -363 458 -235 -150 446 -420
6959 -420 87 308 -470 296 82 -409 422 -140 -254 472 -350 -28 350 -442 207 190 -441 395 -39 -347
6979 -347 475 -270 -128 437 -430 91 297 -467 325 80 -412 447 -174 -248 468 -352 -31 382 -465 217
6999 217 183 -455 391 -49 -332 470 -275 -106 431 -418 116 283 -479 318 56 -386 468 -173 -227 466 -356
7020 -356 20 373 -456 263 163 -445 427 -71 -306 490 -291 -91 431 -433 127 265 -476 333 38 -390
7040 -390 455 -198 -221 461 -371 16 354 -472 245 156 -456 418 -76 -306 465 -282 -94 409 -453 148 241
7061 241 -465 342 14 -388 446 -216 -206 451 -400 40 335 -466 258 133 -446 430 -108 -302 494 -307
7081 -307 -84 414 -459 157 238 -474 359 22 -387 463 -219 -191 477 -393 55 341 -467 263 135 -431 430
7102 430 -120 -296 496 -326 -52 409 -447 157 245 -447 386 -1 -365 470 -236 -161 455 -420 69 347 -503
7123 -503 293 114 -419 477 -118 -262 516 -383 -83 440 -418 99 152 -517 352 2 -363 428 -196 -182 434
7144 434 -408 53 263 -447 343 48 -442 460 -105 -263 480 -353 -6 390 -465 168 215 -486 376 -45
7164 -45 -361 476 -282 -146 432 -435 97 296 -480 311 85 -420 441 -165 -251 476 -358 -28 393 -469 210
7185 210 189 -423 404 -44 -342 488 -266 -139 441 -426 108 295 -485 309 76 -418 452 -171 -235 474 -360
7206 -360 -11 374 -464 229 183 -462 423 -56 -323 488 -287 -121 453 -430 129 302 -479 332 84 -418
7226 -418 460 -178 -249 483 -351 9 381 -463 238 183 -448 408 -63 -300 479 -289 -107 425 -430 125 268
7247 268 -480 337 35 -388 459 -211 -219 463 -384 4 370 -489 239 153 -452 416 -73 -316 487 -308 -107
7268 -107 428 -442 136 256 -493 345 44 -397 459 -210 -219 467 -397 24 365 -477 258 154 -447 424 -104
7289 -104 -315 480 -307 -88 418 -440 158 253 -480 372 18 -409 474 -205 -189 457 -396 57 345 -471 273
7310 273 144 -449 445 -94 -308 482 -311 -83 414 -454 163 253 -473 369 14 -374 462 -230 -170 457 -411
7331 -411 64 349 -485 277 142 -448 444 -116 -303 482 -326 -62 411 -460 180 221 -481 365 -5 -387
7351 -387 463 -251 -190 457 -436 69 324 -496 289 106 -439 442 -129 -274 475 -352 -62 392 -470 182
7371 182 215 -484 371 -24 -372 478 -254 -151 450 -430 83 302 -502 306 88 -448 448 -157 -258 488
7391 488 -382 -38 400 -481 197 201 -485 395 -34 -364 491 -267 -144 471 -426 99 309 -503 313 87 -445
7412 -445 463 -160 -272 486 -360 -21 391 -488 210 193 -474 403 -48 -352 485 -281 -136 438 -445 126
7432 126 303 -502 330 56 -434 472 -203 -244 495 -384 -11 377 -499 224 192 -489 425 -66 -343 494 -303
7453 -303 -144 446 -466 132 271 -511 349 54 -414 473 -207 -241 479 -398 5 384 -496 240 174 -469 426
7474 426 -79 -336 493 -300 -119 435 -459 142 278 -509 368 41 -409 478 -213 -218 502 -412 32 386 -489
7495 -489 274 156 -466 451 -92 -318 506 -314 -90 433 -477 154 255 -496 373 21 -399 493 -228 -200
7515 -200 489 -412 51 359 -512 277 142 -460 460 -116 -310 504 -341 -75 430 -477 185 251 -512 383
7535 383 -2 -399 494 -249 -191 476 -428 50 341 -510 296 116 -466 460 -142 -300 499 -362 -50 412
7555 412 -491 191 236 -487 400 -10 -397 486 -252 -181 484 -431 67 321 -522 313 106 -439 469 -157 -281
7576 -281 497 -359 -42 417 -505 196 216 -492 403 -18 -371 509 -272 -158 475 -449 99 322 -501 326
7596 326 99 -431 460 -148 -273 491 -364 -29 402 -483 233 203 -488 399 -41 -354 504 -280 -132 473
7616 473 -438 111 319 -502 348 78 -430 485 -179 -259 500 -384 -24 389 -491 239 199 -479 417 -75 -365
7637 -365 501 -289 -141 448 -464 125 285 -498 340 55 -430 481 -198 -249 491 -387 20 371 -486 251
7657 251 168 -471 426 -88 -328 488 -312 -100 449 -461 139 274 -500 359 50 -427 475 -219 -236 489 -402
7678 -402 24 380 -479 265 165 -475 424 -76 -322 508 -309 -96 447 -452 145 268 -496 368 36 -402
7698 -402 483 -197 -193 489 -412 43 354 -479 265 142 -447 444 -92 -313 498 -323 -87 428 -462 166 255
7719 255 -503 382 20 -397 474 -228 -201 469 -413 36 340 -502 279 130 -454 421 -113 -279 500 -336
7739 -336 -77 433 -476 178 206 -477 359 -10 -376 477 -238 -191 448 -417 65 334 -498 294 124 -446 442
7760 442 -110 -287 492 -351 -64 399 -472 191 233 -481 395 -4 -378 488 -239 -163 457 -405 77 315 -472
7781 -472 299 108 -426 447 -122 -254 480 -334 -30 398 -457 207 202 -459 397 -19 -355 495 -266 -150 465
7802 465 -423 90 316 -495 308 91 -418 461 -152 -250 468 -350 -14 389 -480 219 203 -457 391 -32 -344
7823 -344 475 -258 -147 438 -410 94 301 -472 308 72 -425 448 -176 -237 459 -376 -18 358 -471 216
7843 216 182 -445 396 -67 -335 469 -272 -139 418 -433 117 282 -469 322 53 -419 449 -185 -240 464 -375
7864 -375 -8 352 -474 232 145 -447 402 -58 -317 467 -282 -109 415 -410 135 265 -463 329 36 -366
7884 -366 453 -188 -223 460 -381 17 347 -470 239 153 -433 418 -70 -296 476 -295 -95 421 -420 144 252
7905 252 -456 334 26 -372 446 -203 -210 438 -379 46 350 -463 249 144 -418 393 -98 -298 461 -300 -73
7926 -73 402 -418 157 229 -458 336 32 -364 432 -201 -185 441 -377 34 317 -451 270 133 -419 418 -85
7947 -85 -279 443 -301 -69 380 -428 162 217 -453 344 10 -358 446 -223 -164 430 -384 42 305 -446 276
7968 276 113 -404 408 -105 -264 451 -294 -54 380 -423 154 228 -450 346 -11 -332 457 -207 -155 432 -373
7989 -373 65 310 -439 270 107 -408 424 -129 -251 436 -312 -44 378 -425 181 199 -435 363 -6 -342
8009 -342 443 -218 -160 415 -378 67 294 -442 280 85 -399 410 -132 -248 428 -346 -38 361 -439 172
8029 172 189 -435 361 -21 -324 435 -246 -151 408 -382 76 280 -439 278 85 -398 415 -146 -234 424 -320
8050 -320 -37 352 -446 175 188 -422 358 -35 -313 431 -248 -139 400 -392 79 262 -432 292 78 -379
8070 -379 406 -142 -229 434 -316 -16 339 -430 188 192 -400 361 -33 -320 452 -247 -117 407 -383 92 268
8091 268 -452 289 69 -377 407 -146 -226 423 -338 -22 344 -429 181 167 -400 359 -44 -311 436 -257 -116
8112 -116 385 -405 102 273 -453 279 38 -365 397 -171 -219 413 -343 6 348 -451 210 160 -425 372 -58
8133 -58 -311 435 -251 -107 395 -398 96 249 -434 292 49 -358 421 -180 -205 433 -356 9 323 -426 203
8154 203 145 -408 368 -59 -308 434 -257 -94 400 -399 132 243 -439 319 51 -357 422 -177 -173 441 -350
8175 -350 21 341 -442 222 150 -410 389 -68 -293 441 -265 -95 389 -395 123 245
8191B45
$$ Imaginary data points
##PAGE= N=2
##DATA TABLE= (X++(I..I)), XYDATA
0 0 0 0 0 0 0 0 0 0 0 0 0 -6 8 -8 8 -16 16 -16 24 -25 32 -40 48 -56 65 -80 89 -104 120 -138 160 -183 207
33 207 -233 265 -297 336 -376 420 -468 521 -577 641 -712 788 -868 960 -1057 1164 -1283 1412
51 1412 -1556 1715 -1892 2086 -2307 2557 -2846 3176 -3563 4024 -4581 5271 -6151 7307 -8899
66 -8899 11209 -14724 18792 -208674 124467 82575 -242736 235202 -64578 -145547 243813
77 243813 -161231 -40021 213179 -233699 88538 116343 -233514 180506 2592 -183128
87 -183128 232152 -115933 -80994 217542 -196760 34810 151880 -229585 143219 45069
97 45069 -200107 210783 -69500 -122038 225946 -167047 -12237 182525 -220440 98494
107 98494 94951 -219360 184469 -15800 -163690 223489 -120568 -69308 207690 -194375 40255
118 40255 141544 -218985 137196 42797 -189717 197995 -63555 -114792 208255 -150911
128 -150911 -13893 166589 -198106 87447 84442 -194158 164029 -16933 -141135 197252
138 197252 -111909 -53173 179599 -176936 47210 116387 -196274 134759 24038 -165759
148 -165759 187844 -74012 -93708 193695 -153202 1353 151491 -194115 95465 72417
158 72417 -187130 165276 -23389 -134708 193862 -111876 -50545 174803 -171280 43969
168 43969 113615 -187335 125131 26304 -156878 173106 -64966 -88378 176584 -137391 377
179 377 135514 -173235 86816 61052 -164251 149365 -27558 -113541 172853 -107854 -34564
190 -34564 152062 -159932 52387 93084 -171276 125517 11281 -139848 166868 -72603
200 -72603 -74255 166785 -137681 8611 126093 -168234 87857 55682 -157452 144017 -26381
211 -26381 -108946 163751 -99595 -35521 143076 -146085 44042 88088 -155072 109989 13174
222 13174 -125227 146304 -62603 -64893 144702 -120442 10288 106462 -146419 81318 41852
233 41852 -134721 130669 -32601 -89018 146486 -98260 -21186 125445 -138965 51590
243 51590 73339 -145063 111231 3528 -115630 143254 -66497 -58413 140179 -119517 12058
254 12058 103317 -142731 78227 42254 -130858 123852 -27514 -87464 138014 -88662 -23739
265 -23739 117734 -126199 44176 68573 -131115 99357 3186 -102734 128217 -61838
275 -61838 -48557 123936 -110302 17499 87960 -130284 78808 29699 -117082 120081 -36085
286 -36085 -74358 131185 -92826 -13104 109730 -126495 51153 61433 -129037 102487 -1358
297 -1358 -100202 128287 -62893 -47600 122560 -107893 15310 87252 -125507 72749 31681
308 31681 -111860 110556 -29953 -71017 119766 -82201 -13653 98633 -112249 45581
318 45581 53100 -113081 91839 -5025 -85045 113896 -61002 -35720 106701 -100858 22208
329 22208 72566 -115038 74214 20437 -100455 107480 -36403 -61230 114121 -83861 -7448
340 -7448 92979 -110415 47317 49737 -109911 89649 -4526 -82977 109320 -56270 -36765
351 -36765 102008 -92833 16948 69996 -105497 64834 21698 -91581 95137 -30701
361 -30701 -55045 100679 -74051 -5300 80468 -97804 45094 39884 -96270 83582 -10741
372 -10741 -70093 100682 -58632 -26082 92336 -91912 24696 60810 -102398 69562 14118
383 14118 -87688 97394 -36008 -51569 101394 -77152 -3188 80797 -99141 45334 40944
394 40944 -96720 81943 -8081 -70784 97710 -53963 -28022 88945 -85346 20670 58132
405 58132 -94525 63025 13239 -79500 88524 -34245 -44358 90984 -72414 1887 70063
416 70063 -91748 47440 31219 -87650 80907 -15558 -61339 94025 -58491 -19719 83743
427 83743 -86887 26662 52953 -93902 66242 9578 -78082 89281 -35434 -43744 90353
438 90353 -70963 311 69638 -88344 42997 32655 -83704 73794 -11088 -58628 85346
449 85346 -50668 -19769 75181 -76297 22977 46245 -81927 58883 6103 -66487 79138
460 79138 -35044 -34198 78959 -66950 6632 58704 -81839 45773 23680 -76216 73553
471 73553 -17298 -51701 83181 -54008 -14574 72542 -77450 25860 44435 -81955 59613
482 59613 5980 -66668 78452 -33191 -35566 77874 -63433 3482 58303 -77364 40705
493 40705 24715 -71687 66868 -14305 -48045 75600 -48999 -12469 64837 -70700 25967
504 25967 37394 -74072 57663 300 -58336 74650 -37107 -27582 72732 -65418 10460
515 10460 52468 -77574 46225 19000 -70586 70754 -19253 -46348 78037 -52699 -10983
526 -10983 66355 -73079 26567 38821 -75454 56985 2468 -59434 72774 -33574 -29282
537 -29282 70197 -60251 7269 50206 -71108 40967 18085 -63683 63424 -17949 -40086
548 -40086 69245 -48796 -6575 57191 -66782 28381 30542 -67630 55996 -3807 -51354
559 -51354 69500 -37175 -22297 65687 -61334 12237 45844 -70413 43567 15044 -62396
570 -62396 64026 -18945 -39546 68786 -47692 -7750 56948 -64244 25056 31719 -64735
581 -64735 50737 -470 -49355 63155 -31525 -22163 59397 -53800 9900 40713 -61920
592 -61920 38810 11914 -54013 57436 -19708 -32249 61222 -46228 -2183 49355 -61109
603 -61109 28665 24849 -60700 52611 -6112 -45136 63699 -35801 -18380 59266 -56873 12890
615 12890 40449 -64146 40943 11985 -55866 58790 -18999 -34219 62106 -44799 -4651
626 -4651 50163 -59036 25381 26064 -58253 48387 -4055 -42761 58633 -32558 -16612 53683
638 53683 -52306 13520 34897 -58385 40047 7121 -49374 56261 -22596 -27666 58188 -46717
650 -46717 1249 45447 -59291 29978 21328 -57250 51415 -8001 -41241 60293 -35243 -15426
662 -15426 54565 -53626 13674 35855 -58786 38824 9043 -49648 53854 -19141 -28758 55272
674 55272 -41669 -1508 43003 -53097 25204 20378 -50832 44782 -6837 -35685 52507 -31718
686 -31718 -11650 46654 -48208 15147 28905 -52273 38013 3826 -43131 51344 -22270 -23157
698 -23157 51942 -42946 2561 39822 -53150 27624 18099 -50507 45905 -7782 -35823 52986
710 52986 -31455 -12796 47284 -47085 12792 30301 -50962 34617 6398 -42271 47323 -18461
722 -18461 -23278 47870 -38085 1182 36234 -47613 24972 15402 -44757 42116 -9336 -30260
734 -30260 48339 -31750 -7838 42102 -46228 16897 24991 -49094 37692 1308 -39670 49317
746 49317 -22988 -20307 48935 -41816 4136 36602 -50498 27506 15484 -46912 44001 -9091
758 -9091 -32045 49544 -30957 -9723 42884 -44696 14408 25840 -46980 34262 2781 -37381
770 -37381 44952 -20363 -18467 43911 -37835 4837 31540 -45295 26650 11144 -40984 41483
782 41483 -12062 -26195 45732 -32229 -4699 38458 -44373 17985 21630 -45543 36267 -457
794 -457 -35672 45647 -22226 -17299 43991 -38363 4852 31873 -44982 25275 12480 -40650 39006
807 39006 -9294 -26627 42801 -28027 -6572 35905 -39134 14398 20236 -40061 31133 -185
819 -185 -30717 39535 -20182 -13562 37586 -34786 7011 25903 -40403 25842 7475 -35696 38266
832 38266 -13085 -21887 41187 -30575 -2444 33884 -40713 17770 18248 -40968 33745 -1840 -31334
845 -31334 41495 -21362 -14194 39151 -35449 6109 27346 -40679 24530 9083 -35721 36420
857 36420 -11034 -21943 38860 -27912 -2823 31320 -37308 16735 15721 -36883 31757 -3865
869 -3865 -26816 38476 -22545 -9691 35233 -35510 10120 22848 -39505 27601 4543 -33608
881 -33608 38338 -15069 -19294 39679 -31060 -266 31370 -39444 18691 15599 -38238 32845
893 32845 -3613 -27875 38772 -21456 -11084 35138 -33480 7825 23005 -36829 24117 5603
905 5603 -30872 33771 -12625 -17256 34532 -27126 449 26382 -34332 17738 11496 -32564 30288
918 30288 -6245 -22436 35054 -22420 -6588 30978 -33003 10983 19144 -35467 25904 2626
930 2626 -29283 34516 -14485 -16091 34781 -27963 785 26757 -34537 17152 12494 -32692 28972
943 28972 -4389 -22973 33401 -19694 -7899 29445 -29652 8709 18193 -31833 22741 2489
955 2489 -25772 30673 -13698 -13032 30537 -26251 3176 22383 -32023 18710 8299 -29584 29667
968 29667 -8174 -19489 33257 -22874 -4350 28483 -32096 12126 16842 -33562 25745 912
980 912 -26854 33092 -15140 -13731 32365 -27334 2535 23818 -32643 17794 9637 -29736 28233
993 28233 -6551 -19510 31279 -20620 -4601 26293 -29060 11162 14555 -29797 23763 -807
1005 -807 -22761 30071 -15902 -9792 28557 -26871 5739 19695 -31058 19890 5774 -27442
1017 -27442 29167 -9621 -17082 31289 -22669 -2591 25848 -30156 12362 14317 -30328 24049
1029 24049 -345 -23312 29711 -14473 -10964 28049 -24629 3562 19671 -28381 16661 6749
1041 6749 -24937 25093 -7395 -15305 26897 -19245 -1996 21729 -25900 11617 10997 -25775 22169
1054 22169 -2573 -18985 27047 -15583 -7253 25103 -24788 6439 16806 -27946 18724 4300
1066 4300 -24275 26531 -9341 -14701 27991 -20726 -1624 22705 -27056 11681 12051 -26782 21932
1079 21932 -1297 -20007 26608 -14011 -8472 24589 -22924 4927 16362 -25789 16805 4068
1091 4068 -21927 24126 -9150 -12345 25086 -19961 541 19439 -25597 13373 8607 -24644
1103 -24644 22985 -4609 -17364 26873 -16905 -5544 24108 -25168 7761 15373 -27335 19245
1115 19245 2908 -22896 26048 -10149 -13051 26496 -20538 -280 20589 -25707 12158 9900
1127 9900 -24445 21212 -2818 -17252 24660 -14374 -5977 21784 -21883 6454 13429 -23576
1139 -23576 16928 1790 -19153 22847 -10183 -9801 22838 -19478 2056 17003 -23840 13428
1151 13428 6852 -22246 21530 -5001 -15205 24383 -15676 -4496 21401 -22532 7166 13387
1163 13387 -23970 16996 2361 -19712 22537 -8941 -10883 22556 -17719 239 17106 -21875
1175 -21875 10936 7639 -20452 18549 -3459 -13884 21198 -13436 -3828 18305 -19761 7133
1187 7133 10608 -20893 16288 60 -16538 21275 -10700 -7792 20861 -18944 3147 15119
1199 15119 -22581 13541 5480 -20692 20785 -5671 -13700 23023 -15507 -3382 19714 -21554
1211 -21554 7681 11679 -22390 16708 972 -17729 21485 -9723 -8816 20794 -17716 2048
1223 2048 14854 -20988 12134 5260 -18757 18851 -5546 -11670 20562 -14794 -1557 16866
1235 16866 -20159 9003 8748 -20326 17303 -1685 -15288 21304 -11800 -6361 20011 -19048
1247 -19048 4154 13857 -21673 13650 4413 -19118 19784 -5932 -12068 21094 -14593 -2374
1259 -2374 17380 -19508 7530 9685 -19539 15210 -57 -14783 18827 -9326 -6577 17582
1271 17582 -15915 3013 11879 -18192 11538 3261 -15701 16960 -6105 -9138 17954 -13919
1283 -13919 -203 14282 -18179 8899 6943 -17925 15871 -2236 -13200 19039 -10989 -5205
1295 -5205 17613 -17117 4048 11958 -19163 12296 3489 -16620 17501 -5670 -10162 18406 -13250
1308 -13250 -1386 14769 -17382 7503 7583 -17046 14276 -1384 -12331 17189 -9855 -4474 15565
1321 15565 -15613 4540 9798 -17250 12438 1357 -14320 17126 -7593 -7568 17466 -14786 1300
1334 1300 13320 -18363 10037 5755 -17434 16414 -3313 -12237 18855 -11608 -4071 16737 -17072
1347 -17072 4955 10649 -18304 12609 2139 -15089 16960 -6551 -8303 16993 -13347 278
1359 278 12784 -16500 8480 5463 -15321 14242 -3057 -10210 16181 -10614 -2469 13856 -15315
1372 -15315 5849 7913 -16047 12668 -59 -12691 16317 -8069 -6126 15926 -14149 1959
1384 1959 11691 -16782 9539 4662 -15418 14801 -3344 -10470 16483 -10395 -3172 14235 -14794
1397 -14794 4628 8651 -15472 11028 1229 -12362 14455 -6223 -6288 14114 -11860 1195 10179
1410 10179 -14253 8213 3631 -12899 13036 -3845 -8128 14423 -10417 -1135 12047 -14362
1422 -14362 6307 6469 -14710 12332 -867 -11345 15410 -8184 -5111 14766 -13587 2448
1434 2448 10532 -15745 9472 3749 -14108 14129 -3854 -9074 15335 -10378 -1916 12728 -14179
1447 -14179 5489 7001 -14307 11357 -375 -10747 14162 -7461 -4424 13147 -12537 2998
1459 2998 8704 -14211 9685 1881 -12170 13833 -5516 -6890 14451 -11595 239 11414 -14840
1472 -14840 7447 5484 -14475 12877 -1819 -10578 15223 -8660 -4226 13915 -13354 3018
1484 3018 9359 -14762 9347 2742 -12626 13185 -4254 -7575 13687 -9907 -875 10796 -12877
1497 -12877 5722 5316 -12459 10637 -1360 -8832 12665 -7530 -3015 11364 -11659 3576 7089
1510 7089 -12780 9282 986 -10653 12664 -5470 -5807 12921 -10666 524 10061 -13316 6787
1523 6787 4749 -12788 11433 -1682 -9256 13354 -7644 -3556 12072 -11669 2867 7914 -12785
1536 -12785 8414 1955 -10719 11719 -4334 -6000 11976 -9352 167 9090 -11857 6239 3811
1549 3811 -11170 10645 -2507 -7495 12249 -8260 -1704 10642 -12003 4676 6185 -12724 10061
1562 10061 3 -10211 13066 -6334 -5112 12899 -11251 1315 9603 -13476 7447 3986
1574 3986 -12440 11745 -2504 -8473 13126 -8246 -2525 11300 -11803 3834 6713 -12299 9015
1587 9015 616 -9677 11713 -5464 -4621 11321 -9985 1539 7969 -11821 7213 2525 -10537
1600 -10537 11019 -3591 -6537 11990 -8814 -838 9945 -11896 5114 5431 -12075 9860 -410
1613 -410 -9362 12239 -6115 -4459 11718 -10295 1372 8443 -11959 6721 3309 -10755 10294
1626 10294 -2387 -7033 11226 -7301 -1751 9393 -10178 3771 5231 -10371 8140 -141 -7863
1639 -7863 10305 -5409 -3298 9738 -9235 2155 6595 -10677 7153 1637 -9358 10390 -3868
1652 -3868 -5594 11119 -8563 -305 9064 -11245 5175 4757 -11230 9480 -749 -8508 11525
1665 11525 -6093 -3771 10785 -9913 1854 7431 -11250 6884 2337 -9767 10091 -3222
1677 -3222 -5858 10630 -7850 -502 8393 -10353 4911 3953 -10063 9007 -1555 -7091 10718
1690 10718 -6731 -2177 9588 -10206 3403 5958 -11127 8211 710 -9237 11080 -4814 -5053
1703 -5053 11232 -9187 374 8676 -11363 5697 4101 -10805 9545 -1334 -7704 11020 -6296
1716 -6296 -2888 9800 -9518 2434 6244 -10266 6920 1305 -8434 9473 -3770 -4496 9496
1729 9496 -7710 501 7062 -9565 5289 2806 -8888 8674 -2189 -5909 9843 -6628 -1385
1742 -1385 8557 -9505 3547 5121 -10039 7673 395 -8186 9990 -4442 -4331 9921 -8164
1755 -8164 461 7575 -9940 5083 3367 -9270 8397 -1406 -6411 9503 -5746 -2079 8269
1768 8269 -8497 2684 4965 -8980 6579 369 -7115 8747 -4279 -3336 8583 -7835 1368
1781 1368 6010 -9231 5865 1870 -8396 8971 -3027 -5254 9811 -7225 -673 8173 -9689
1794 -9689 4181 4511 -9929 8074 -275 -7747 9994 -5035 -3637 9530 -8423 1235 6748
1807 6748 -9747 5712 2400 -8635 8570 -2394 -5330 9188 -6504 -811 7524 -8723 3907
1820 3907 3718 -8590 7468 -857 -6216 9010 -5234 -2172 8329 -8382 2514 5300 -9283
1833 -9283 6517 1010 -7941 9088 -3544 -4609 9325 -7203 -145 7523 -9219 4219 3837
1846 3837 -9012 7590 -623 -6657 9050 -4707 -2853 8271 -7567 1486 5515 -8430 5291
1859 5291 1586 -7175 7577 -2622 -4106 7868 -6037 -57 6081 -7798 3950 2693 -7501
1872 -7501 6972 -1430 -5225 8161 -5263 -1533 7300 -7862 2632 4553 -8530 6241 620
1885 620 -7129 8389 -3530 -3980 8554 -6864 148 6634 -8543 4209 3139 -8122 7184
1898 7184 -1044 -5742 8316 -4895 -1947 7337 -7415 2262 4469 -7932 5795 453 -6335 7759
1912 7759 -3655 -3034 7651 -6836 1139 5473 -8222 5109 1783 -7451 7835 -2494 -4731
1925 -4731 8663 -6230 -737 7293 -8493 3512 4126 -8713 6946 -29 -6842 8706 -4150
1938 -4150 -3360 8371 -7187 822 6043 -8378 4673 2355 -7508 7220 -1754 -4808 7868 -5251
1952 -5251 -1010 6475 -7281 2918 3457 -7343 6009 -386 -5488 7466 -4112 -2191 6998 -6785
1966 -6785 1666 4723 -7743 5151 1209 -6798 7401 -2618 -4148 7870 -5853 -501 6461
1979 6461 -7677 3251 3531 -7686 6158 -176 -5862 7542 -3750 -2718 7107 -6298 982
1992 982 4931 -7217 4337 1595 -6284 6460 -2072 -3755 6873 -5138 -247 5453 -6823 3365
2006 3365 2534 -6683 6113 -1106 -4737 7323 -4607 -1498 6655 -7012 2272 4240 -7715 5605
2020 5605 703 -6511 7640 -3099 -3674 7837 -6192 55 6145 -7794 3784 2978 -7480 6529
2034 6529 -858 -5319 7628 -4381 -1907 6770 -6707 1934 4197 -7254 5166 598 -5867 6973
2048 6973 -3128 -2926 6942 -5978 788 5038 -7297 4337 1816 -6701 6808 -1944 -4386 7585
2062 7585 -5257 -939 6488 -7312 2762 3827 -7620 5796 284 -6108 7404 -3305 -3188
2075 -3188 7264 -5984 361 5390 -7164 3714 2311 -6561 6019 -1182 -4388 6711 -4244
2088 -4244 -1193 5704 -6098 2192 3244 -6339 4944 -35 -4906 6375 -3280 -2167 6155 -5725
2102 -5725 1167 4314 -6737 4288 1343 -6051 6415 -2045 -3852 6999 -4987 -668 5913 -6769
2116 -6769 2704 3396 -6932 5436 78 -5431 6839 -3214 -2657 6573 -5652 726 4676 -6649
2130 -6649 3872 1659 -5882 5938 -1754 -3626 6421 -4679 -386 5188 -6303 2971 2538 -6283
2144 -6283 5581 -867 -4555 6775 -4125 -1568 6219 -6412 1910 4042 -7132 5010 802
2157 802 -6114 6931 -2692 -3543 7173 -5544 -147 5687 -7044 3239 2865 -6833 5758 -582
2171 -582 -4964 6821 -3751 -1932 6150 -5887 1455 3935 -6451 4356 794 -5326 6060 -2470
2185 -2470 -2836 6117 -5060 361 4605 -6313 3484 1888 -5925 5728 -1343 -4054 6556 -4273
2199 -4273 -1154 5772 -6171 2052 3617 -6609 4762 612 -5472 6330 -2500 -3078 6387 -4937
2213 -4937 -31 4938 -6150 2928 2384 -5826 5096 -677 -4080 5875 -3458 -1350 5188 -5230
2227 -5230 1646 3159 -5666 4203 304 -4533 5632 -2677 -2192 5615 -4987 806 4083 -6049
2241 -6049 3674 1447 -5578 5708 -1649 -3687 6390 -4390 -840 5503 -6153 2286 3251 -6410
2255 -6410 4858 224 -5139 6248 -2844 -2609 6094 -5150 502 4425 -6141 3418 1675 -5540
2269 -5540 5399 -1453 -3510 5937 -4154 -569 4895 -5753 2509 2533 -5788 4937 -532 -4330
2283 -4330 6111 -3497 -1703 5715 -5608 1407 3875 -6385 4206 1068 -5576 6034 -2023 -3448
2297 -3448 6380 -4621 -516 5249 -6071 2458 2896 -6049 4784 -41 -4605 5861 -2858 -2098
2311 -2098 5482 -4843 788 3769 -5547 3384 1175 -4810 5015 -1653 -2839 5321 -4012 -165 4242
2326 4242 -5297 2577 2058 -5230 4688 -687 -3821 5627 -3325 -1430 5212 -5170 1356 3492 -5803
2341 -5803 3851 937 -5032 5431 -1857 -3074 5729 -4158 -395 4647 -5461 2321 2434 -5399 4409
2356 4409 -307 -3978 5351 -2939 -1571 4881 -4750 1209 3154 -5291 3685 533 -4424 5172 -2237
2371 -2237 -2365 5304 -4506 426 4041 -5652 3159 1659 -5362 5202 -1219 -3701 5977 -3865 -1098
2386 -1098 5289 -5613 1802 3330 -6020 4294 555 -4970 5722 -2282 -2722 5740 -4526 101
2400 101 4355 -5582 2815 1928 -5192 4755 -886 -3496 5416 -3409 -947 4658 -4986 1836 2688 -5252
2416 -5252 4102 22 -4129 5316 -2636 -1936 5209 -4674 763 3772 -5569 3309 1421 -5092 5057
2431 5057 -1300 -3416 5619 -3676 -962 4846 -5169 1697 2991 -5424 3877 446 -4385 5078 -2092
2446 -2092 -2315 5013 -4069 230 3695 -4945 2650 1494 -4533 4324 -1062 -2940 4859 -3339 -611
2461 -611 4115 -4744 1949 2281 -4918 4040 -224 -3827 5169 -2741 -1745 4997 -4662 886 3572 -5457
2477 -5457 3342 1265 -4938 5025 -1411 -3223 5501 -3748 -722 4643 -5134 1919 2655 -5243 4056
2492 4056 47 -4066 5137 -2506 -1841 4877 -4384 827 3331 -5088 3268 941 -4425 4827 -1747
2507 -1747 -2566 5130 -3992 2 4111 -5230 2616 1975 -5149 4624 -691 -3770 5529 -3217 -1436
2522 -1436 5100 -5005 1236 3442 -5561 3609 969 -4805 5089 -1655 -2916 5312 -3831 -414 4258
2537 4258 -4976 2104 2223 -4879 4020 -311 -3569 4834 -2669 -1396 4395 -4288 1107 2859 -4781
2552 -4781 3291 552 -4031 4632 -1884 -2259 4814 -3891 115 3755 -4964 2509 1796 -4828 4314
2567 4314 -649 -3531 5106 -2961 -1377 4683 -4534 1078 3149 -5055 3240 900 -4334 4592 -1530
2582 -1530 -2568 4789 -3527 -209 3771 -4573 2144 1813 -4444 3919 -620 -3109 4639 -2843 -945
2597 -945 4130 -4363 1506 2520 -4740 3629 180 -3881 4863 -2264 -1982 4887 -4235 493 3686
2612 3686 -5167 2877 1541 -4840 4634 -1003 -3340 5237 -3286 -1026 4576 -4755 1501 2815 -5029
2627 -5029 3605 410 -4061 4758 -2046 -2081 4682 -3917 364 3396 -4714 2661 1266 -4311 4256
2642 4256 -1195 -2752 4731 -3328 -495 3977 -4631 1911 2166 -4775 3859 -128 -3730 4875 -2458
2657 -2458 -1777 4709 -4213 556 3421 -4890 2779 1398 -4491 4236 -912 -3048 4755 -2962 -896
2672 -896 4093 -4262 1441 2489 -4398 3197 277 -3436 4226 -1920 -1634 4066 -3492 481 2898
2687 2898 -4254 2698 1050 -3847 3978 -1271 -2396 4226 -3121 -347 3669 -4330 1892 2005 -4444
2702 -4444 3677 -197 -3433 4613 -2343 -1608 4435 -3975 661 3167 -4622 2731 1144 -4143 4129
2717 4129 -1131 -2645 4489 -3070 -509 3685 -4190 1720 1974 -4216 3477 -270 -3121 4293 -2413
2732 -2413 -1204 3967 -3916 1071 2578 -4417 3099 493 -3773 4324 -1785 -2162 4525 -3645 51
2747 51 3563 -4636 2254 1730 -4512 3932 -510 -3309 4638 -2618 -1335 4237 -4035 885 2849 -4468
2763 -4468 2822 814 -3812 4026 -1338 -2239 4160 -3074 -167 3242 -3966 1882 1547 -3845 3398
2778 3398 -538 -2707 4028 -2442 -892 3613 -3744 1179 2295 -4099 2977 377 -3436 4037 -1639
2793 -1639 -1943 4137 -3275 39 3270 -4139 1995 1623 -4026 3466 -374 -2937 4114 -2250 -1192
2808 -1192 3749 -3531 810 2472 -3918 2579 625 -3312 3628 -1356 -1831 3736 -2958 115 2841
2823 2841 -3748 2012 1199 -3572 3419 -794 -2428 3963 -2633 -611 3465 -3853 1403 2067 -4105
2838 -4105 3116 119 -3333 4113 -1898 -1749 4099 -3438 279 3079 -4184 2202 1337 -3889 3608
2853 3608 -709 -2653 4053 -2530 -783 3486 -3666 1242 2039 -3836 2882 98 -3005 3755 -1828
2868 -1828 -1372 3616 -3282 589 2542 -3862 2408 807 -3446 3640 -1178 -2156 3973 -2853 -327
2883 -327 3313 -3860 1601 1864 -3954 3144 5 -3095 3923 -1850 -1523 3789 -3236 343 2760 -3788
2899 -3788 2087 1117 -3424 3268 -717 -2261 3609 -2329 -568 3021 -3304 1236 1705 -3395 2668
2914 2668 -54 -2610 3429 -1782 -1164 3278 -3059 637 2268 -3587 2284 669 -3199 3393 -1116
2929 -1116 -2007 3692 -2679 -323 3084 -3599 1470 1716 -3684 2901 -58 -2851 3621 -1777 -1340 3452
2945 3452 -3057 447 2422 -3561 2119 792 -3127 3195 -1004 -1891 3415 -2547 -155 2731 -3370
2960 -3370 1616 1303 -3323 2973 -484 -2372 3566 -2195 -782 3246 -3355 1059 2098 -3695 2664
2975 2664 365 -3111 3641 -1451 -1770 3732 -2905 -2 2935 -3649 1749 1458 -3532 3052 -321
2990 -321 -2564 3570 -1967 -972 3210 -3078 759 2085 -3357 2284 453 -2799 3164 -1247 -1518 3195
3006 3195 -2583 130 2449 -3290 1718 1056 -3122 2946 -593 -2169 3398 -2142 -680 3030 -3146
3021 -3146 980 1909 -3429 2397 407 -2912 3280 -1194 -1694 3306 -2548 -134 2615 -3228 1458
3036 1458 1342 -3117 2620 -281 -2250 3085 -1706 -877 2780 -2768 751 1753 -3025 2146 285
3051 285 -2455 2941 -1344 -1235 2961 -2523 279 2203 -3156 1787 854 -2946 2922 -821 -2015 3339
3067 3339 -2267 -550 2867 -3184 1231 1748 -3265 2516 159 -2702 3240 -1380 -1409 3207 -2619 209
3083 209 2390 -3179 1721 976 -2899 2800 -644 -1892 3111 -2065 -401 2645 -2971 1221 1386 -3015
3099 -3015 2489 -132 -2286 3106 -1666 -1031 2948 -2807 597 2069 -3212 2031 677 -2902 3001
3114 3001 -888 -1911 3268 -2213 -448 2737 -3012 1114 1618 -3113 2294 137 -2495 2949 -1314
3129 -1314 -1254 2834 -2380 204 2063 -2861 1559 799 -2566 2473 -666 -1658 2736 -1901 -309 2291
3145 2291 -2676 1111 1254 -2719 2243 -143 -2114 2840 -1499 -966 2739 -2546 469 1947 -2953
3160 -2953 1808 695 -2683 2691 -735 -1755 2964 -2004 -407 2507 -2739 1010 1478 -2809 2156
3175 2156 63 -2188 2733 -1308 -1009 2608 -2327 405 1811 -2697 1725 531 -2373 2571 -911
3190 -911 -1383 2726 -2111 -28 2189 -2778 1395 1048 -2757 2477 -387 -2004 2973 -1758 -761 2741
3206 2741 -2709 694 1825 -3000 1972 481 -2592 2773 -956 -1577 2876 -2116 -200 2292 -2741
3221 -2741 1170 1163 -2661 2201 -209 -1933 2638 -1501 -740 2382 -2360 628 1525 -2611 1802 276
3237 276 -2205 2515 -1040 -1208 2592 -2129 77 2039 -2671 1358 962 -2601 2317 -347 -1889 2746
3253 2746 -1565 -766 2516 -2423 547 1717 -2682 1706 515 -2332 2417 -771 -1421 2538 -1813
3268 -1813 -184 2034 -2381 1043 1034 -2347 1986 -216 -1678 2400 -1383 -591 2184 -2198 664 1369
3284 1369 -2446 1780 205 -2053 2458 -1062 -1094 2522 -2104 161 1939 -2615 1389 891 -2500 2309
3300 2309 -415 -1764 2666 -1604 -609 2369 -2383 677 1497 -2584 1791 273 -2127 2397 -1001
3315 -1001 -1131 2383 -1981 125 1763 -2430 1333 651 -2226 2174 -600 -1433 2433 -1721 -258 2049
3331 2049 -2401 1014 1136 -2492 2046 -79 -1947 2558 -1312 -911 2487 -2243 320 1804 -2600
3346 -2600 1498 700 -2369 2300 -521 -1595 2530 -1593 -449 2168 -2259 739 1309 -2344 1718
3361 1718 138 -1872 2247 -986 -918 2177 -1851 242 1563 -2221 1325 567 -2012 2055 -586 -1289
3377 -1289 2285 -1589 -223 1930 -2225 900 1092 -2310 1852 -7 -1825 2363 -1141 -898 2305
3392 2305 -1994 227 1708 -2353 1305 693 -2146 2045 -468 -1442 2298 -1490 -384 1933 -2092
3407 -2092 835 1049 -2080 1652 -29 -1655 2134 -1112 -691 1996 -1943 456 1308 -2211 1496 308
3423 308 -1945 2117 -750 -1147 2266 -1844 -64 1865 -2317 1081 904 -2285 2000 -243 -1661 2392
3439 2392 -1386 -658 2194 -2076 437 1416 -2347 1500 362 -1982 2072 -712 -1123 2209 -1686 -30
3455 -30 1680 -2105 1044 831 -2010 1883 -271 -1362 2096 -1302 -437 1870 -1985 635 1152 -2219
3471 -2219 1613 218 -1783 2171 -944 -981 2102 -1664 53 1655 -2194 1067 913 -2085 1848 -247
3487 -247 -1453 2232 -1104 -653 1947 -1832 433 1200 -1844 1328 326 -1646 1821 -574 -1026 1843
3503 1843 -1547 -32 1477 -1867 907 643 -1774 1692 -339 -1271 1976 -1296 -355 1725 -1971 674
3519 674 1071 -2091 1531 97 -1716 2048 -888 -918 2056 -1725 74 1583 -2114 1092 696 -1986
3535 -1986 1809 -334 -1368 2062 -1277 -421 1773 -1856 611 1044 -1956 1460 73 -1525 1905
3550 1905 -931 -707 1850 -1665 318 1307 -1981 1250 411 -1749 1895 -621 -1086 2044 -1487 -130
3566 -130 1695 -2018 883 934 -2044 1667 -38 -1589 2050 -1005 -773 1957 -1720 204 1415 -1977
3582 -1977 1125 547 -1792 1706 -411 -1159 1865 -1230 -268 1559 -1718 663 854 -1760 1369 -53
3598 -53 -1353 1750 -941 -606 1672 -1593 313 1172 -1839 1149 348 -1650 1726 -569 -1059 1894
3614 1894 -1355 -208 1577 -1838 688 910 -1890 1445 33 -1485 1829 -832 -742 1776 -1511 133
3630 133 1293 -1770 965 477 -1585 1557 -419 -1000 1723 -1170 -187 1410 -1608 773 708 -1671
3646 -1671 1464 -148 -1197 1819 -1023 -433 1609 -1621 445 1006 -1790 1282 281 -1597 1797
3661 1797 -613 -927 1872 -1397 1 1573 -1791 838 743 -1815 1513 -91 -1220 1821 -904 -535
3677 -535 1610 -1507 383 1075 -1697 1171 181 -1420 1600 -687 -816 1542 -1240 41 1206 -1670
3693 -1670 858 436 -1617 1526 -384 -1108 1689 -1177 -398 1490 -1652 468 951 -1831 1212 172
3709 172 -1505 1673 -636 -862 1713 -1309 -63 1341 -1664 733 679 -1604 1325 -124 -1174 1587
3725 1587 -868 -448 1437 -1373 334 923 -1524 1021 196 -1284 1445 -591 -691 1482 -1229 73
3741 73 1132 -1552 852 499 -1492 1410 -305 -1043 1640 -1043 -320 1474 -1532 486 933 -1630
3757 -1630 1190 183 -1367 1588 -635 -746 1586 -1248 49 1200 -1548 792 522 -1426 1332
3772 1332 -271 -964 1502 -973 -219 1260 -1423 581 691 -1474 1210 -51 -1140 1558 -894 -513
3788 -513 1490 -1396 307 1029 -1638 1038 322 -1471 1506 -509 -901 1578 -1216 -166 1354 -1519
3804 -1519 603 756 -1599 1217 25 -1241 1511 -709 -602 1497 -1221 153 1076 -1414 813 346
3820 346 -1345 1282 -375 -878 1374 -1022 -164 1173 -1297 551 622 -1378 1232 -109 -1066 1491
3836 1491 -822 -449 1361 -1258 375 956 -1486 899 350 -1343 1337 -361 -836 1417 -964 -172
3852 -172 1208 -1399 505 753 -1316 1082 17 -1116 1390 -647 -480 1243 -1160 136 937 -1332
3868 -1332 771 236 -1218 1275 -519 -707 1259 -1004 75 1056 -1369 728 586 -1389 1213 -302
3884 -302 -919 1407 -865 -418 1260 -1342 293 845 -1443 887 209 -1279 1235 -487 -779 1427
3900 1427 -1095 -20 1111 -1383 676 527 -1259 1126 -144 -895 1291 -758 -293 1246 -1267 349
3916 349 652 -1289 878 111 -1105 1332 -563 -599 1320 -1189 142 923 -1464 784 377 -1257 1231
3933 1231 -178 -884 1456 -851 -288 1179 -1244 324 738 -1354 973 269 -1089 1256 -489 -660
3949 -660 1286 -995 -49 976 -1128 600 426 -1167 1008 -110 -766 1216 -747 -195 1094 -1070
3965 -1070 344 699 -1184 894 117 -946 1212 -566 -551 1208 -1040 130 916 -1320 649 391
3981 391 -1156 1147 -221 -809 1323 -795 -293 1134 -1158 352 677 -1266 879 135 -1045 1213
3997 1213 -473 -505 1098 -936 37 828 -1167 696 323 -1090 1036 -375 -724 1182 -838 -142 998
4014 998 -1239 452 546 -1214 994 -74 -940 1248 -705 -407 1230 -1125 176 856 -1303 738
4030 738 337 -1168 1163 -295 -780 1253 -859 -164 1103 -1147 458 629 -1179 920 51 -887 1148
4047 1148 -588 -401 1111 -966 165 733 -1131 721 243 -1005 1068 -368 -616 1158 -868 -74
4063 -74 987 -1167 516 521 -1178 974 -37 -930 1211 -620 -487 1168 -1042 129 840 -1225 670
4080 670 359 -1132 1044 -238 -733 1160 -757 -234 973 -1047 363 579 -1092 812 21 -858 1047
4097 1047 -536 -394 1037 -950 183 669 -1113 689 179 -978 1056 -390 -602 1151 -903 -54
4113 -54 941 -1153 524 472 -1156 973 -83 -872 1171 -633 -399 1103 -1024 215 769 -1158 731
4130 731 238 -994 1063 -316 -595 1100 -811 -36 884 -1043 520 409 -1010 929 -146 -716 1098
4147 1098 -660 -207 971 -1012 332 606 -1113 825 72 -930 1117 -466 -514 1137 -911 24
4163 24 891 -1157 544 441 -1115 972 -105 -841 1124 -627 -349 1027 -973 182 695 -1080 675
4180 675 201 -928 956 -337 -545 1010 -771 -53 788 -1009 459 372 -985 842 -130 -699 1034
4197 1034 -629 -254 935 -980 269 618 -1081 753 115 -915 1039 -386 -545 1089 -840 -27
4213 -27 857 -1058 497 433 -1050 888 -92 -768 1032 -582 -284 932 -911 239 607 -996 688
4230 688 123 -816 954 -393 -409 967 -814 89 720 -1017 599 274 -917 942 -276 -594 1062
4247 1062 -732 -115 906 -1027 406 522 -1066 841 9 -848 1061 -506 -438 1053 -882 72 770
4264 770 -1049 563 324 -967 912 -202 -642 973 -658 -174 834 -919 332 483 -950 712
4280 712 -15 -753 934 -487 -352 910 -852 130 625 -1004 581 209 -909 914 -295 -587 1009
4297 1009 -711 -131 870 -985 346 503 -1028 744 36 -819 975 -419 -449 958 -784 47 701
4314 701 -959 502 302 -876 827 -153 -587 927 -569 -138 773 -841 386 425 -854 761 -41
4331 -41 -700 884 -511 -267 920 -776 154 672 -1008 550 259 -795 906 -348 -449 1146 -822
4348 -822 -69 838 -936 408 445 -1008 728 22 -747 944 -470 -375 875 -790 151 589 -909 563
4366 563 160 -780 841 -309 -456 857 -689 -12 662 -906 430 308 -870 770 -165 -614 912
4383 912 -602 -210 842 -884 252 540 -973 662 106 -828 910 -343 -485 935 -721 -70 738
4400 738 -917 386 381 -883 719 -53 -674 870 -470 -274 791 -772 177 521 -833 576 134
4417 134 -730 819 -287 -402 864 -659 17 658 -862 456 322 -826 759 -101 -613 918 -521
4434 -521 -215 846 -820 220 570 -923 611 165 -793 857 -286 -493 888 -648 -58 724 -847
4451 -847 369 361 -830 707 -72 -590 827 -483 -210 747 -760 220 450 -826 596 61 -682 798
4469 798 -379 -350 812 -728 77 602 -883 499 236 -822 799 -209 -556 912 -607 -159 784
4486 784 -853 267 457 -893 640 57 -727 843 -370 -384 834 -683 41 617 -826 446 248
4503 248 -751 722 -171 -503 819 -548 -109 686 -776 316 415 -813 638 -5 -631 832 -419
4520 -419 -305 828 -736 96 611 -868 503 268 -805 801 -161 -547 883 -539 -176 776 -796
4537 -796 232 490 -858 600 102 -701 790 -320 -383 800 -641 27 596 -786 417 251 -731
4554 -731 700 -165 -496 783 -522 -111 669 -773 290 384 -821 631 -31 -652 818 -413 -307
4571 -307 796 -740 89 590 -866 483 227 -798 748 -185 -532 828 -561 -145 704 -771 281
4588 281 418 -802 604 8 -624 787 -388 -284 734 -683 127 503 -774 509 132 -692 754
4605 754 -255 -400 796 -612 -11 659 -804 402 340 -791 703 -70 -614 853 -451 -257 810
4622 810 -729 161 583 -829 518 202 -741 758 -209 -470 808 -540 -88 672 -744 293 378 -742
4640 -742 620 -6 -583 756 -369 -256 714 -653 131 489 -777 482 139 -692 727 -250 -430 791
4658 791 -585 -53 645 -780 317 332 -793 644 -33 -613 798 -415 -296 753 -689 70 520
4675 520 -807 458 196 -712 700 -195 -463 740 -531 -89 617 -725 299 319 -722 590 -56
4692 -56 -545 735 -417 -195 697 -678 176 451 -764 528 103 -658 754 -291 -395 783 -601
4709 -601 -12 625 -776 388 330 -758 676 -61 -557 796 -434 -227 719 -680 162 484 -749 490
4727 490 133 -632 714 -244 -367 726 -537 -10 558 -693 363 269 -675 617 -117 -492 736 -452
4745 -452 -160 662 -697 210 430 -768 531 87 -647 742 -292 -379 737 -597 -37 598 -771 329
4763 329 306 -758 612 -50 -565 722 -405 -240 691 -639 99 469 -745 439 136 -631 645 -245
4781 -245 -391 702 -535 -24 564 -699 338 277 -695 602 -87 -509 736 -439 -188 673 -677 194
4799 194 449 -738 525 116 -642 722 -237 -383 745 -548 -13 605 -711 331 307 -673 606 -43
4817 -43 -507 729 -379 -192 655 -624 164 426 -690 480 77 -570 681 -280 -291 673 -570 39
4835 39 519 -689 400 210 -673 630 -138 -463 736 -464 -139 653 -688 218 405 -742 506 70
4853 70 -629 688 -291 -374 710 -564 -9 551 -720 328 247 -682 570 -96 -495 677 -414 -183
4871 -183 623 -641 175 373 -685 464 59 -579 667 -277 -313 692 -563 26 528 -723 368 247
4889 247 -692 638 -96 -494 745 -429 -191 680 -666 159 458 -740 494 131 -631 689 -232 -371
4907 -371 726 -511 -19 578 -680 325 281 -661 583 -61 -468 689 -394 -163 607 -635 199 384
4925 384 -699 512 41 -579 689 -292 -305 692 -593 56 533 -723 395 233 -691 653 -147 -492
4943 -492 748 -463 -169 642 -680 210 404 -726 508 68 -606 675 -277 -335 677 -572 25 492
4961 492 -703 371 196 -634 599 -164 -445 702 -469 -110 592 -670 231 333 -712 534 10
4978 10 -578 704 -336 -302 713 -613 51 531 -747 401 236 -697 652 -119 -495 757 -442 -158
4996 -158 682 -659 199 421 -704 514 86 -571 692 -269 -300 699 -540 53 523 -680 382 228
5014 228 -651 641 -137 -441 717 -480 -98 628 -688 265 375 -721 560 18 -598 722 -334
5031 -334 -314 725 -626 41 532 -764 397 213 -701 649 -157 -483 726 -472 -153 618 -666 215
5049 215 354 -726 522 12 -567 672 -341 -261 657 -604 84 468 -709 424 149 -650 663 -209
5067 -209 -403 729 -525 -75 616 -728 284 336 -729 591 -19 -561 720 -365 -268 711 -633 90
5085 90 515 -725 411 193 -658 649 -169 -419 730 -470 -93 604 -667 272 350 -668 545 -3
5103 -3 -513 693 -353 -220 673 -604 137 469 -718 469 163 -638 677 -218 -397 736 -517 -61
5121 -61 620 -707 296 339 -735 579 -7 -574 731 -351 -282 689 -624 78 495 -730 422 172
5139 172 -656 646 -186 -424 701 -507 -101 579 -690 279 322 -697 554 -44 -543 692 -388 -235
5157 -235 655 -636 143 455 -737 471 134 -652 671 -219 -400 720 -535 -53 593 -723 307
5174 307 322 -707 573 -30 -538 716 -367 -234 656 -607 125 440 -703 432 136 -603 647 -211
5192 -211 -348 671 -496 -8 529 -655 333 272 -643 598 -82 -463 694 -397 -156 654 -638 180
5210 180 443 -707 492 109 -607 677 -242 -381 710 -531 -42 576 -685 311 301 -684 579 -49
5228 -49 -515 687 -384 -214 636 -612 129 431 -689 435 103 -602 628 -250 -361 666 -532 -33
5246 -33 517 -702 313 260 -683 588 -96 -495 697 -420 -193 648 -636 150 428 -730 457 111
5264 111 -612 670 -234 -359 712 -528 -25 547 -668 323 275 -656 566 -65 -470 673 -371 -163
5282 -163 600 -594 181 389 -652 478 63 -533 640 -267 -277 655 -535 43 516 -668 361 220
5300 220 -635 606 -123 -448 689 -436 -144 615 -632 193 394 -684 492 68 -571 654 -269 -301
5318 -301 660 -529 21 492 -646 320 227 -619 564 -116 -428 641 -418 -124 550 -614 199 336
5336 336 -664 481 31 -540 629 -312 -305 626 -569 35 479 -703 359 190 -648 587 -120 -473
5354 -473 688 -420 -184 605 -635 165 379 -684 459 70 -557 617 -256 -326 632 -492 15 465
5372 465 -630 350 178 -597 594 -116 -416 677 -402 -92 542 -619 220 339 -661 505 -6 -565
5390 -565 672 -278 -216 639 -574 28 421 -575 402 165 -636 596 -107 -460 665 -407 -41 574 -716
5409 -716 318 237 -707 503 34 -529 623 -298 -241 600 -576 91 427 -619 356 147 -573 563 -187
5428 -187 -356 629 -465 -81 532 -628 249 273 -646 490 -34 -509 628 -342 -253 610 -557 69 426
5447 426 -662 373 148 -580 564 -156 -391 615 -441 -96 529 -608 206 288 -612 471 -5 -474
5465 -474 587 -301 -210 570 -529 88 426 -624 385 133 -547 575 -178 -347 631 -450 -39 523
5483 523 -606 265 307 -607 526 -13 -478 636 -302 -207 609 -531 102 431 -634 389 146 -547 569
5502 569 -165 -349 597 -432 -65 499 -576 246 262 -581 484 -39 -433 594 -311 -172 549 -543 121
5521 121 378 -633 380 96 -552 580 -220 -322 593 -472 -42 501 -600 260 240 -624 488 -61
5539 -61 -454 600 -341 -200 571 -526 103 379 -593 369 100 -534 555 -201 -318 560 -448 -26 475
5558 475 -578 257 235 -561 489 -75 -407 586 -359 -165 534 -523 151 367 -603 410 85 -514 580
5577 580 -198 -300 621 -449 -15 495 -578 282 263 -581 510 -38 -437 624 -302 -188 570 -517 134
5596 134 393 -587 400 106 -509 558 -172 -309 580 -449 -10 449 -574 273 229 -557 501 -69 -419
5615 -419 590 -347 -163 555 -560 131 367 -617 397 78 -533 547 -206 -329 571 -467 -37 474
5633 474 -601 255 228 -584 474 -54 -423 568 -345 -169 508 -512 128 345 -580 394 66 -490 551
5652 551 -224 -280 551 -453 26 443 -566 293 184 -555 495 -81 -388 593 -382 -129 530 -537 163
5671 163 340 -586 413 75 -498 577 -211 -269 586 -454 -9 456 -558 294 215 -552 491 -55 -396
5690 -396 570 -318 -136 515 -508 163 344 -573 411 55 -467 558 -211 -246 586 -461 34 429 -588
5709 -588 310 203 -564 513 -99 -419 604 -362 -148 527 -543 152 337 -612 396 56 -495 542
5727 542 -228 -297 566 -459 7 425 -559 267 187 -532 483 -97 -382 568 -352 -113 513 -539 162 291
5747 291 -579 426 29 -477 562 -253 -234 568 -473 55 415 -581 313 171 -516 524 -98 -388 590
5766 590 -358 -100 505 -515 194 318 -551 436 31 -455 565 -246 -203 554 -455 43 410 -540 310
5785 310 170 -505 510 -116 -333 553 -377 -80 493 -532 205 284 -566 446 16 -447 580 -271 -210
5804 -210 564 -490 70 403 -582 342 175 -532 532 -120 -350 569 -380 -106 483 -558 188 289 -564
5823 -564 408 1 -449 530 -262 -228 521 -474 60 366 -564 330 137 -510 506 -153 -324 550 -407 -61
5843 -61 486 -546 220 255 -566 462 -22 -441 558 -285 -196 557 -497 93 399 -554 345 133 -490 533
5863 533 -150 -306 558 -381 -43 485 -540 239 241 -523 456 -20 -401 545 -284 -160 525 -465 117 347
5883 347 -541 346 101 -475 527 -165 -288 554 -414 -21 452 -551 261 228 -532 472 -46 -399 565
5902 565 -304 -163 502 -485 102 350 -553 340 92 -496 503 -181 -289 537 -406 -40 413 -532 238 200
5922 200 -519 440 -63 -390 521 -317 -146 483 -501 123 297 -547 364 50 -472 511 -208 -267 543 -425
5942 -425 -9 423 -551 246 194 -528 453 -64 -386 540 -331 -152 481 -472 127 339 -530 371 70 -442
5962 -442 507 -188 -245 534 -409 29 411 -501 285 185 -490 460 -80 -348 538 -327 -107 478 -484 158
5982 158 300 -531 379 54 -438 516 -220 -234 524 -424 24 391 -527 259 168 -505 445 -97 -342 511 -326
6003 -326 -110 451 -500 146 261 -516 348 22 -418 489 -226 -216 483 -425 29 359 -506 294 128 -485
6023 -485 469 -127 -309 516 -352 -94 447 -495 157 270 -520 387 33 -434 504 -243 -223 498 -431 41
6043 41 368 -514 268 141 -488 445 -109 -326 509 -329 -83 435 -454 164 264 -499 378 4 -392 492
6063 492 -235 -180 493 -411 65 363 -495 316 139 -461 471 -129 -304 477 -375 -78 437 -483 187 237 -512
6084 -512 381 5 -385 500 -240 -195 470 -432 50 353 -508 273 116 -448 436 -145 -292 469 -360 -70
6104 -70 391 -483 172 212 -500 379 -42 -386 461 -257 -170 454 -443 73 317 -515 288 85 -459 444 -160
6125 -160 -283 470 -353 -64 405 -488 181 209 -492 401 -18 -391 490 -261 -146 444 -431 69 303 -484
6145 -484 303 97 -434 434 -145 -269 465 -350 -36 394 -473 209 208 -470 399 -33 -344 494 -256 -145 461
6166 461 -439 97 321 -495 325 105 -421 472 -141 -268 492 -344 -51 395 -477 201 226 -468 395 -19
6186 -19 -353 486 -250 -152 440 -432 83 310 -461 300 88 -421 436 -177 -274 446 -366 -35 357 -470 204
6207 204 177 -456 388 -78 -361 459 -291 -155 416 -449 104 268 -489 303 83 -434 453 -159 -252 457 -360
6228 -360 -25 375 -453 201 197 -451 386 -48 -339 461 -264 -113 426 -405 111 269 -453 314 68 -371 454
6249 454 -162 -219 456 -364 7 356 -452 244 178 -432 416 -47 -322 477 -274 -128 426 -411 111 290 -476
6270 -476 326 69 -391 443 -160 -209 466 -353 -16 345 -457 221 173 -438 377 -69 -312 451 -268 -107 406
6291 406 -424 126 242 -466 333 39 -384 432 -189 -213 443 -394 19 324 -487 226 143 -461 392 -100 -322
6312 -322 453 -302 -105 410 -431 121 254 -469 321 37 -381 418 -193 -238 440 -361 3 321 -438 220
6332 220 130 -418 391 -89 -270 458 -293 -83 402 -410 142 239 -476 339 17 -323 452 -208 -168 461 -365
6353 -365 57 362 -408 251 138 -398 442 -48 -298 434 -247 -57 373 -424 121 225 -479 358 25 -358
6373 -358 432 -172 -216 423 -399 20 353 -437 198 143 -453 362 -142 -276 435 -331 -83 363 -428 175 227
6394 227 -426 363 -20 -372 444 -151 -213 473 -382 -33 297 -486 204 127 -410 346 -76 -335 459 -290 -123
6415 -123 367 -415 86 244 -471 362 -15 -306 437 -230 -66 372 -332 58 305 -374 239 -18 -458 424
6435 424 -125 -208 465 -421 -28 371 -436 119 238 -469 327 4 -277 439 -170 -169 432 -375 78 297 -447
6456 -447 284 148 -391 408 -106 -232 444 -303 -33 370 -422 170 197 -422 348 -18 -315 417 -227 -145 406
6477 406 -382 72 274 -451 229 80 -404 399 -153 -259 431 -344 -37 360 -436 167 185 -456 343 -35
6497 -35 -343 440 -240 -148 417 -402 56 275 -464 266 92 -396 408 -136 -241 434 -330 -24 361 -444 216
6518 216 175 -426 358 -23 -338 436 -265 -133 395 -404 77 296 -476 280 78 -352 416 -118 -336 351
6538 351 -294 -47 389 -372 285 212 -384 439 2 -309 447 -223 -90 425 -387 99 313 -462 308 35
6558 35 -362 494 -207 -270 450 -311 1 324 -385 221 181 -497 408 -41 -368 468 -297 -106 375 -449 141
6579 141 257 -490 353 38 -323 418 -244 -242 440 -353 -31 279 -522 169 87 -378 279 -210 -345 545 -244
6600 -244 -57 404 -439 116 240 -430 305 10 -420 554 -216 -222 434 -346 38 361 -473 238 148 -404 424
6621 424 -71 -280 448 -294 -89 405 -407 140 258 -495 353 16 -373 505 -207 -190 460 -375 11 332
6641 332 -481 249 152 -410 414 -114 -268 469 -294 -76 374 -417 150 248 -437 363 -20 -331 451 -213 -166
6662 -166 457 -400 68 343 -462 272 129 -430 426 -127 -251 476 -323 -70 394 -455 153 199 -482 361
6682 361 -18 -376 429 -249 -196 428 -401 55 306 -468 252 81 -414 400 -148 -276 439 -339 -57 377
6702 377 -451 166 195 -450 362 -22 -359 455 -258 -165 432 -408 91 303 -471 285 94 -414 436 -138 -255
6723 -255 468 -327 -29 392 -459 203 209 -448 389 -26 -328 465 -247 -138 441 -412 88 296 -470 299 71
6744 71 -410 434 -150 -228 464 -348 -7 366 -448 227 191 -443 405 -55 -336 469 -279 -136 441 -424 115
6765 115 299 -461 316 68 -392 440 -139 -236 452 -365 -10 367 -465 197 143 -455 367 -75 -345 451 -297
6786 -297 -119 376 -436 78 246 -441 279 -27 -392 417 -213 -176 439 -392 -19 318 -522 252 94 -401
6806 -401 338 -113 -368 488 -232 -86 419 -499 141 257 -477 329 48 -390 457 -192 -200 464 -370 31 336
6827 336 -463 253 140 -416 402 -84 -296 476 -289 -73 410 -429 147 243 -461 367 15 -361 473 -223
6847 -223 -187 453 -399 39 346 -456 276 135 -439 426 -98 -280 465 -308 -69 404 -438 157 227 -459 359
6868 359 5 -379 460 -218 -178 430 -391 39 324 -468 274 108 -435 402 -128 -273 470 -343 -58 377
6888 377 -458 175 193 -476 361 -34 -359 462 -259 -168 445 -409 73 295 -487 291 95 -433 434 -126 -248
6909 -248 454 -327 -49 372 -442 174 202 -456 391 -37 -331 476 -245 -145 438 -400 99 289 -461 305
6929 305 94 -393 453 -147 -237 474 -341 5 377 -445 222 196 -443 399 -53 -321 473 -276 -121 420 -418
6950 -418 103 291 -471 319 62 -410 447 -166 -234 448 -370 -23 353 -478 209 164 -460 384 -85 -334 460
6971 460 -298 -140 403 -438 104 255 -485 326 40 -398 441 -196 -221 459 -378 6 338 -489 253 142
6991 142 -458 396 -96 -323 473 -302 -112 410 -446 128 260 -475 349 30 -390 441 -198 -215 457 -380
7011 -380 18 332 -464 261 138 -427 424 -105 -288 459 -302 -66 408 -440 174 254 -446 360 33 -363
7031 -363 496 -208 -174 483 -393 58 367 -460 286 135 -424 439 -102 -280 482 -302 -56 416 -451 165
7051 165 248 -449 359 11 -361 445 -221 -169 445 -401 54 326 -480 265 108 -424 410 -136 -275 458 -351
7072 -351 -59 378 -468 169 207 -483 362 -35 -371 461 -250 -175 446 -428 64 315 -493 290 104 -433 432
7093 432 -142 -276 465 -342 -33 387 -473 183 216 -458 364 -27 -350 471 -257 -138 436 -424 103 305
7113 305 -463 316 88 -462 470 -167 -230 491 -344 -20 379 -470 230 226 -474 410 -30 -338 477 -239 -121
7134 -121 452 -435 148 303 -481 247 51 -392 466 -30 -270 483 -354 -10 400 -494 228 180 -454 362
7154 362 -137 -315 452 -277 -102 404 -475 120 268 -491 318 42 -399 455 -201 -231 463 -390 -14 356
7174 356 -488 217 166 -479 396 -86 -337 465 -297 -115 413 -451 122 261 -485 316 56 -405 450 -200
7194 -200 -208 457 -376 18 362 -468 265 152 -449 424 -87 -289 479 -303 -95 417 -432 163 279 -464 366
7215 366 37 -391 479 -192 -210 463 -395 26 359 -475 262 152 -444 426 -75 -292 479 -306 -63 415
7235 415 -444 155 249 -462 367 35 -368 481 -214 -197 463 -393 37 336 -486 262 128 -450 442 -113 -297
7256 -297 476 -324 -78 412 -447 150 237 -477 355 -20 -384 470 -234 -206 449 -423 42 323 -501 274 122
7277 122 -451 430 -141 -293 467 -339 -66 384 -464 161 224 -480 379 -10 -372 472 -235 -191 459 -418 61
7298 61 334 -485 305 119 -425 453 -109 -269 506 -338 -29 420 -462 199 228 -450 397 16 -357 491 -230
7319 -230 -155 461 -394 92 331 -473 302 121 -414 442 -141 -250 487 -341 -41 414 -455 216 211 -463 392
7340 392 -25 -347 490 -255 -148 463 -430 89 308 -486 330 92 -429 465 -146 -263 468 -373 -31 380
7360 380 -492 205 184 -496 389 -42 -359 490 -276 -154 448 -441 102 287 -495 320 72 -427 459 -172
7380 -172 -254 470 -376 -3 374 -502 222 169 -481 409 -67 -356 497 -297 -124 451 -455 117 293 -494 343
7401 343 75 -429 483 -174 -241 494 -375 10 382 -478 243 188 -461 441 -70 -322 519 -294 -104 440 -436
7422 -436 135 279 -479 359 63 -392 484 -196 -219 475 -385 32 361 -497 261 142 -459 426 -108 -323
7442 -323 503 -310 -93 436 -466 158 280 -507 346 35 -424 454 -228 -220 470 -414 34 352 -505 287 150
7463 150 -470 427 -103 -303 491 -347 -88 421 -457 162 249 -491 369 15 -405 484 -224 -191 480 -413 51
7484 51 341 -500 282 119 -461 458 -127 -286 500 -337 -71 429 -471 205 250 -488 391 16 -379 504 -242
7505 -242 -155 485 -408 76 367 -493 317 129 -436 465 -120 -257 515 -341 -41 405 -480 216 234 -473 413
7526 413 -14 -369 505 -257 -138 463 -446 98 327 -511 311 102 -449 482 -152 -271 507 -362 -42 394
7546 394 -488 222 196 -501 402 -52 -378 486 -286 -164 448 -462 88 295 -507 312 91 -434 472 -186
7566 -186 -254 493 -386 -14 391 -493 225 189 -483 415 -59 -363 499 -306 -146 468 -459 123 288 -504 342
7587 342 61 -436 482 -168 -232 510 -370 0 390 -495 251 187 -469 444 -73 -335 506 -299 -104 462 -472
7608 -472 152 295 -494 361 48 -421 486 -208 -210 496 -393 28 382 -502 273 169 -469 456 -73 -337 497
7629 497 -315 -113 452 -482 152 273 -508 352 48 -401 467 -216 -219 470 -416 14 364 -504 276 144 -468
7650 -468 428 -102 -317 494 -329 -98 424 -464 162 254 -513 363 1 -404 487 -239 -199 478 -428 64 346
7671 346 -507 279 135 -460 444 -118 -314 503 -330 -70 436 -476 193 246 -490 396 13 -365 489 -221
7691 -221 -186 480 -429 66 344 -482 312 122 -447 459 -129 -279 495 -346 -46 418 -472 190 239 -476 404
7712 404 -4 -366 490 -253 -173 462 -432 77 328 -502 323 106 -424 459 -137 -282 488 -348 -28 404
7732 404 -464 211 219 -478 387 -36 -365 484 -261 -152 456 -427 79 305 -496 298 86 -443 454 -163 -262
7753 -262 465 -376 -51 379 -495 215 190 -491 389 -50 -386 483 -282 -154 441 -440 84 296 -493 312
7773 312 56 -432 452 -167 -264 472 -358 -24 389 -466 224 205 -457 411 -50 -335 482 -277 -118 443 -432
7794 -432 127 300 -472 333 75 -396 468 -188 -210 483 -367 7 363 -465 242 179 -449 425 -52 -322 476
7815 476 -279 -105 426 -447 125 281 -471 343 50 -387 456 -177 -223 460 -382 18 364 -472 246 162 -456
7836 -456 400 -88 -325 461 -314 -96 411 -441 141 248 -472 346 28 -397 437 -197 -223 446 -393 27
7856 27 327 -480 247 136 -448 396 -92 -322 468 -297 -89 415 -452 136 249 -468 335 19 -367 453
7876 453 -209 -186 444 -391 43 322 -456 266 130 -420 428 -104 -276 465 -308 -58 408 -428 176 236 -462
7897 -462 360 13 -354 461 -223 -165 441 -383 48 321 -467 275 124 -411 428 -116 -269 454 -318 -56
7917 -56 386 -436 163 210 -440 356 -13 -351 432 -242 -171 412 -411 66 294 -466 268 99 -414 401 -131
7938 -131 -280 456 -333 -55 379 -442 183 199 -452 358 -31 -351 444 -236 -150 422 -391 62 297 -457 277
7959 277 88 -410 416 -136 -258 450 -320 -40 366 -445 186 183 -452 362 -28 -326 452 -248 -137 417 -380
7980 -380 94 278 -445 295 85 -383 430 -121 -214 448 -334 -2 367 -418 211 197 -433 384 -39 -311 445
8001 445 -231 -119 401 -387 99 273 -434 297 86 -385 421 -151 -228 444 -329 0 334 -430 201 173 -421
8022 -421 364 -57 -314 433 -267 -112 392 -407 94 254 -462 291 43 -384 416 -171 -231 412 -349 -18
8042 -18 339 -445 195 164 -422 360 -69 -320 434 -271 -121 393 -399 108 255 -438 294 44 -369 429 -170
8063 -170 -208 423 -349 3 328 -446 232 155 -426 380 -67 -287 440 -268 -97 394 -406 122 243 -433 312
8084 312 48 -351 421 -167 -202 426 -342 32 336 -438 220 158 -405 379 -59 -281 446 -257 -83 390 -403
8105 -403 135 245 -432 326 31 -359 420 -182 -201 416 -347 27 321 -438 232 122 -397 379 -95 -284
8125 -284 438 -302 -88 375 -425 112 223 -446 325 25 -367 417 -192 -197 410 -361 27 313 -454 221 113
8146 113 -399 396 -76 -280 421 -297 -72 369 -416 162 220 -422 311 23 -341 413 -195 -166 416 -350 50
8167 50 296 -432 253 127 -399 388 -92 -247 441 -289 -50 395 -393 155 229 -433 337 20 -329 436 -192
8188 -192 -170 419 -360
8191c60
##END NTUPLES=NMR FID
##END=
