##TITLE=1H_CAM1303
 DMSO-d6
 8 sc, 
 14.3.2023
##JCAMPDX= 6.0         $$ Bruker NMR JCAMP-DX V2.0
##DATA TYPE= NMR FID
##DATA CLASS= NTUPLES
##ORIGIN= UXNMR, Bruker Analytische Messtechnik GmbH
##OWNER= root
$$ XWIN-NMR		Version 3.5
$$ Tue Mar 14 13:49:10 2023 Russian Standard Time (UT+4h)  she@DPX200
##.OBSERVE FREQUENCY= 200.13135
##.OBSERVE NUCLEUS= ^1H
##.DELAY= (6, 6)
##.ACQUISITION MODE= SIMULTANEOUS
##.ACQUISITION SCHEME= undefined
##.AVERAGES= 8
##.DIGITISER RES= 18
##SPECTROMETER/DATA SYSTEM= spect
##.PULSE SEQUENCE= zg30
##.SOLVENT NAME= DMSO
##.SHIFT REFERENCE= (INTERNAL, DMSO, 0, 15.7039)
##AUDIT TRAIL= $$ (NUMBER, WHEN, WHO, WHERE, WHAT)
$$ ##TITLE= Audit trail, XWIN-NMR		Version 3.5
$$ ##JCAMPDX= 5.01
$$ ##ORIGIN= Bruker BioSpin GmbH
$$ ##OWNER= she
$$ F:/spectra/data/she/nmr/H-F/1/audita.txt
$$ ##AUDIT TRAIL=  $$ (NUMBER, WHEN, WHO, WHERE, WHAT)
(   1,<2023-03-14 13:48:03.18 +0400>,<she>,<DPX200>,
      <created by zg, POWCHK disabled, PULCHK disabled
       configuration hash MD5:
       00 E9 B6 7A A2 85 ED C7 34 08 36 98 17 FE 4E 26
       data hash MD5: 16K
       4B 28 2F 5D 81 8A 55 9D 82 D2 FC 70 9A 97 42 4F>)
$$ ##END=
$$ 
$$ hash MD5
$$ 5F BD BD E5 70 83 B2 47 E3 CC 6C A5 20 58 D7 36
##$RELAX= 
##$RELAX= 
##$RELAX= 
##$RELAX= 
##$RELAX= 
##$RELAX= 
$$ Bruker specific parameters
$$ --------------------------
##$DU= <F:/spectra>
##$EXPNO= 1
##$NAME= <H-F>
##$PROCNO= 1
##$TYPE= <nmr>
##$USER= <she>
##$AMP= (0..31)
100 100 100 100 100 100 100 100 100 100 100 100 100 100 100 100 100 100 
100 100 100 100 100 100 100 100 100 100 100 100 100 100 
##$AQSEQ= 0
##$AQ_mod= 1
##$AUNM= <au_zg>
##$AUTOPOS= <>
##$BF1= 200.13
##$BF2= 200.13
##$BF3= 200.13
##$BF4= 200.13
##$BF5= 200.13
##$BF6= 200.13
##$BF7= 200.13
##$BF8= 200.13
##$BYTORDA= 1
##$CFDGTYP= 0
##$CFRGTYP= 5
##$CHEMSTR= <none>
##$CNST= (0..31)
1 1 145 1 1 1 1 1 1 1 1 1 1 1 1 1 1 1 1 1 1 1 1 1 1 1 1 1 1 1 1 1 
##$CPDPRG= <>
##$CPDPRG1= <>
##$CPDPRG2= <>
##$CPDPRG3= <>
##$CPDPRG4= <mlev>
##$CPDPRG5= <mlev>
##$CPDPRG6= <mlev>
##$CPDPRG7= <mlev>
##$CPDPRG8= <mlev>
##$CPDPRGB= <>
##$CPDPRGT= <>
##$D= (0..31)
0 1.2 0 0 0 0 0 0 0 0.06 0 0.03 0 0 0 0 0.0002 0 0 0 0 0 0 0 0 0 0 0 0 
0 0 0 
##$DATE= 1678787282
##$DBL= (0..7)
120 120 120 120 120 120 120 120 
##$DBP= (0..7)
150 150 150 150 150 150 150 150 
##$DBP07= 0
##$DBPNAM0= <>
##$DBPNAM1= <>
##$DBPNAM2= <>
##$DBPNAM3= <>
##$DBPNAM4= <>
##$DBPNAM5= <>
##$DBPNAM6= <>
##$DBPNAM7= <>
##$DBPOAL= (0..7)
0.5 0.5 0.5 0.5 0.5 0.5 0.5 0.5 
##$DBPOFFS= (0..7)
0 0 0 0 0 0 0 0 
##$DE= 6
##$DECBNUC= <off>
##$DECIM= 32
##$DECNUC= <off>
##$DECSTAT= 4
##$DIGMOD= 1
##$DIGTYP= 9
##$DL= (0..7)
0 120 120 120 120 120 120 120 
##$DP= (0..7)
150 150 150 150 150 150 150 150 
##$DP07= 0
##$DPNAME0= <>
##$DPNAME1= <>
##$DPNAME2= <>
##$DPNAME3= <>
##$DPNAME4= <>
##$DPNAME5= <>
##$DPNAME6= <>
##$DPNAME7= <>
##$DPOAL= (0..7)
0.5 0.5 0.5 0.5 0.5 0.5 0.5 0.5 
##$DPOFFS= (0..7)
0 0 0 0 0 0 0 0 
##$DQDMODE= 0
##$DR= 18
##$DS= 0
##$DSLIST= <SSSSSSSSSSSSSSS>
$$ [...]
##$SUBNAM2= <"">
##$SUBNAM3= <"">
##$SUBNAM4= <"">
##$SUBNAM5= <"">
##$SUBNAM6= <"">
##$SUBNAM7= <"">
##$SUBNAM8= <"">
##$SUBNAM9= <"">
##$SW= 18.05172834244
##$SWIBOX= (0..15)
0 0 2 0 0 0 0 0 0 0 0 0 0 0 0 0 
##$SW_h= 3612.71676300578
##$TD= 16384
##$TD0= 1
##$TE= 0
##$TE2= 300
##$TE3= 300
##$TEG= 300
##$TL= (0..7)
0 120 120 120 120 120 120 120 
##$TP= (0..7)
150 150 150 150 150 150 150 150 
##$TP07= 0
##$TPNAME0= <>
##$TPNAME1= <>
##$TPNAME2= <>
##$TPNAME3= <>
##$TPNAME4= <>
##$TPNAME5= <>
##$TPNAME6= <>
##$TPNAME7= <>
##$TPOAL= (0..7)
0.5 0.5 0.5 0.5 0.5 0.5 0.5 0.5 
##$TPOFFS= (0..7)
0 0 0 0 0 0 0 0 
##$TUNHIN= 0
##$TUNHOUT= 0
##$TUNXOUT= 0
##$USERA1= <user>
##$USERA2= <user>
##$USERA3= <user>
##$USERA4= <user>
##$USERA5= <user>
##$V9= 5
##$VALIST= <valist>
##$VCLIST= <CCCCCCCCCCCCCCC>
##$VD= 0
##$VDLIST= <DDDDDDDDDDDDDDD>
##$VPLIST= <PPPPPPPPPPPPPPP>
##$VTLIST= <TTTTTTTTTTTTTTT>
##$WBST= 1024
##$WBSW= 4
##$XGAIN= (0..3)
0 0 0 0 
##$XL= 0
##$YL= 0
##$YMAX_a= 212027
##$YMIN_a= -162147
##$ZGOPTNS= <>
##$ZL1= 120
##$ZL2= 120
##$ZL3= 120
##$ZL4= 120
##$ABSF1= 10
##$ABSF2= 0
##$ABSG= 5
##$ABSL= 3
##$ALPHA= 0
##$AQORDER= 0
##$ASSFAC= 0
##$ASSFACI= 0
##$ASSFACX= 0
##$ASSWID= 0
##$AUNMP= <proc_1d>
##$AZFE= 0.1
##$AZFW= 0.1
##$BCFW= 1
##$BC_mod= 2
##$BYTORDP= 1
##$COROFFS= 0
##$CY= 11.3945322036743
##$DATMOD= 1
##$DC= 2
##$DFILT= <>
##$DTYPP= 0
##$F1P= 2.36226072786647
##$F2P= -0.459571619588291
##$FCOR= 0.5
##$FTSIZE= 0
##$FT_mod= 4
##$GAMMA= 1
##$GB= 0.15
##$INTBC= 1
##$INTSCL= 1
##$ISEN= 128
##$LB= 0.24
##$LEV0= 0
##$LPBIN= 0
##$MAXI= 10000
##$MC2= 0
##$MEAN= 0
##$ME_mod= 0
##$MI= 1.114404
##$NCOEF= 0
##$NC_proc= 0
##$NLEV= 6
##$NOISF1= 3.799351
##$NOISF2= 2.8
##$NSP= 1
##$NTH_PI= 0
##$NZP= 0
##$OFFSET= 15.70392
##$PC= 1
##$PHC0= -19104.83
##$PHC1= 8.200742
##$PH_mod= 1
##$PKNL= yes
##$PPARMOD= 0
##$PSCAL= 0
##$PSIGN= 0
##$REVERSE= no
##$SF= 200.130013532006
##$SI= 16384
##$SIGF1= 3
##$SIGF2= 2
##$SINO= 400
##$SIOLD= 16384
##$SREGLST= <1H.CDCl3>
##$SSB= 0
##$STSI= 0
##$STSR= 0
##$SW_p= 3612.71676300578
##$SYMM= 0
##$S_DEV= 0
##$TDeff= 0
##$TDoff= 0
##$TI= <>
##$TILT= no
##$TM1= 0
##$TM2= 0
##$TOPLEV= 0
##$USERP1= <user>
##$USERP2= <user>
##$USERP3= <user>
##$USERP4= <user>
##$USERP5= <user>
##$WDW= 1
##$XDIM= 8192
##$YMAX_p= 0
##$YMIN_p= 0
$$ End of Bruker specific parameters
$$ ---------------------------------
##NTUPLES= NMR FID
##VAR_NAME=  TIME,          FID/REAL,        FID/IMAG
##SYMBOL=    X,             R,               I
##VAR_TYPE=  INDEPENDENT,   DEPENDENT,       DEPENDENT
##VAR_FORM=  AFFN,          ASDF,            ASDF
##VAR_DIM=   8192,          8192,            8192
##UNITS=     SECONDS,       ARBITRARY UNITS, ARBITRARY UNITS
##FACTOR=    0.0002768,     1,               1
##FIRST=     0,             0,               0
##LAST=      2.2672688,     0,               0
##MIN=       0,             -162147,         0
##MAX=       2.2672688,     212027,          0
$$ Real data points
##PAGE= N=1
##DATA TABLE= (X++(R..R)), XYDATA
$$ plain form
0 0 0 0 0 0 0 0 0 0 0 0 0 0 -8 8 -8 8 -14 16 -16 24 -24 32 -40 41 -49 60 -72 80 -94 105 -121 137 -158 177
34 177 -201 225 -255 287 -319 357 -397 440 -488 543 -600 662 -729 805 -887 977 -1077 1185
52 1185 -1307 1442 -1595 1766 -1958 2181 -2443 2748 -3117 3568 -4138 4884 -5906 7397 -9790
67 -9790 14273 -25629 120848 161748 -58823 -69302 8311 106474 71415 -29208 -136197 -138661
79 -138661 -62032 42476 60274 -10128 -93455 -71163 28827 101393 63029 -23889 -66556 -23401
91 -23401 37560 54621 18895 -22313 -39668 -13449 41628 78492 47678 -22737 -57032 -20133
103 -20133 26224 18170 -30270 -53937 -33564 -1205 14722 16819 8423 -8962 -19394 -3451 24387
116 24387 25741 -5045 -25723 -7014 24230 23636 -3348 -16017 -1934 13681 15418 15094 17502
$$ packed form
0@%%%%%%%%%%%%qJ6j6J6k2L0l2M0m8N6p2Q1r0J09j32J52j74J99k26K58k95L35
34A77l78M26m80N42o06O76p54Q37r28J031j143J262j391J534j692J864k054K262
52A185k492K749l037L361l724M139m624N191n865O685p706R022j0790J3303j7187
67i790K4063l9902J46477M0900k20571j0479P7613R8163l5059j00623j06989k464
79a38661P6629J04508J7798p0402q3327K2292R9990P2566l8364q6918m2667M3155
91b3401O0961J7061l5726m1208j7355K6219N5077L6864l0814p0415l4295L6899
103b0133M6357q054m8440k3667K0373L2359J5927K097q396j7385j0432J5943K7838
116B4387J354l0786k0678J8709L1244n94k6984j2669J4083J5615J737l24K408
$$ plain form
129 17502 8963 -9056 -12698 861 1805 -22414 -43268 -33637 -8579 200 -8405 -8747 6668 19226
143 19226 18963 19545 27992 29861 17227 4994 6528 7762 -9042 -32451 -31937 -12460 -5669 -15308
157 -15308 -14886 2962 13712 6777 872 6307 8277 -3121 -11108 -24 13390 8122 -3887 -896
171 -896 11378 12541 1292 -5155 -280 3443 -3422 -11945 -8571 -2156 -6435 -14083 -8016 6428 9882
186 9882 1205 658 12499 16683 3856 -7624 -3108 2601 -5116 -12352 -5270 5163 2035 -5818
200 -5818 -1911 8411 8817 -1017 -3356 5536 9645 1443 -6178 -2839 2260 -3600 -12546 -10057 -485
215 -485 392 -5376 -3103 8703 11968 3788 -553 6447 10581 3023 -5332 -2915 2729 -1093 -9465
230 -9465 -8334 -186 668 -5104 -5738 3028 7813 1990 -4247 248 6439 1735 -6309 -3317 6124 5999
$$ packed form
129A7502q539j8019l642J3559R44k4219k0854R631K5058Q779q605l42J5415J2558
143A9226k63N82Q447J869j2634j2233J534J234j6804k3409N14J9477O791r639
157a5308M22J7848J0750o935n905N435J970j1398p987J1084J3414n268j2009K991
171h96J2274J163j1249o447M875L723o865q523L374O415m279p648O067J4444L454
186I882q677n47J1841M184j2827j1480M516N709p717p236P082J0433l128p853
200e818L907J0322M06r834k339Q892M109q202p621L339N099n860q946K489R572
215d85Q77n768K273J1806L265q180m341P000M134p558q355K417N644l822q372
230i465J131Q148Q54n772o34Q766M785n823o237M495O191m704q044K992R441j25
$$ plain form
246 5999 -1266 -617 7129 7346 -2201 -6664 -1115 997 -6274 -10997 -5054 2070 382 -2973 813 7903
262 7903 8765 3112 1007 4749 5772 -1492 -7460 -4794 -993 -4311 -9250 -6073 2504 4730 -566
277 -566 -229 7751 9773 1959 -2240 3182 5173 -2133 -7216 -3301 1641 -2225 -7481 -4270 2022 1762
293 1762 -3152 -2741 3335 5354 1220 -679 3245 6380 3273 -1301 -132 3887 1741 -4354 -5297 -528
309 -528 -374 -5583 -7325 -2017 1900 -789 -3025 1609 6819 4579 228 1889 5468 4285 -1476 -3656
325 -3656 307 1046 -3425 -5481 -1466 2301 -306 -3943 -998 3572 1871 -2537 -1253 3565 3629 -1010
341 -1010 -1544 2690 3473 -1166 -3683 -1466 874 -1618 -4389 -2427 1136 1316 -614 113 4015 5614
357 5614 2935 622 1889 3899 224 -4928 -4848 -1599 -2948 -7003 -5431 538 2584 -346 155 5259
$$ packed form
246E999p265O49P746K17r547m463N549K112p271m723N943P124j688l355L786P090
262G903Q62n653k105L742J023p264n968K666L801l318m939L177Q577K226n296
277e66L37P980K022p814m199N422J991p306n083L915M942l866n256L211O292k60
293A762m914M11O076K019m134j899L924L135l107m574J169M019k146o095r43M769
309e28J54n209j742N308L917k689k236M634N210k240m351J661L579j183n761k180
325c656L963P39m471k056M015L767k607l637K945M570j701m408J284M818O4m639
341a010n34M234P83m639k517K217K340k492k771J962L563J80j930P27L902J599
357E614k679k313J267K010l675n152Q0L249j349m055J572N969K046k930N01N104
$$ plain form
373 5259 6659 2486 -119 2268 3967 344 -2525 -1064 1132 -754 -3827 -3477 -909 -797 -2471 -2807
389 -2807 234 2237 1062 -1027 477 2744 1896 -706 -558 2614 2788 -293 -1041 1368 2121 -973
405 -973 -2723 -785 1583 -724 -3013 -1396 1021 -87 -2638 -2001 984 2123 302 164 2715 3992
421 3992 867 -2079 -1016 -283 -2432 -4262 -2235 1242 2344 1465 2605 5369 5037 1932 -355 -219
437 -219 -1049 -4035 -6378 -5912 -4171 -3487 -3555 -1490 2813 5145 5228 4605 5787 6401 2813 -938 -1744 -559
455 -559 -2386 -4684 -3323 123 227 -1676 -838 713 392 -2281 -2934 -1220 -382 -1831 -1063 1197 2986
472 2986 2750 2868 3175 3466 2837 1806 504 -59 -185 -2053 -4156 -4019 -2562 -2567 -3214 -2111 720 1491
490 1491 488 339 2390 2721 523 32 1631 1926 38 -831 -377 10 -819 -1955 -809 1106 1806
$$ packed form
373E259J400m173k605K387J699l623k869J461K196j886l073L50K568J12j674l36
389b807L041K003j175k089J504K267q48k602J48L172J74l081p48K409P53l094
405i73j750J938K368k307k289J617K417j108k551O37K985J139j821j38K551J277
421C992l125k946J063P33k149j830K027L477J102q79J140K764l32l105k287J36
437b19q30k986k343M66J741O84o8K065M303K332Q3o23J182O14l588l751q06J185
455e59j827k298J361L446J04j903Q38J551l21k673o53J714Q38j449P68K260J789
472B986k36J18L07K91o29j031j302n63j26j868k103J37J457no47J103K831P71
490A491j003j49K051L31k198m91J599K95j888q69M54L87q29j136J146J915P00
$$ plain form
507 1806 1279 1648 2683 1920 -20 -2104 -3178 -3394 -4604 -5595 -4071 -1348 323 1197 2915 5084 5779
524 5779 4654 3593 3095 2064 -360 -2309 -2829 -2652 -3016 -3104 -2236 -413 608 219 131 585 447 -1441
542 -1441 -2819 -1924 -492 -375 -207 2166 4424 4668 3855 3791 3399 1786 -881 -2833 -3102 -4266 -5091 -4475
560 -4475 -2889 -1926 -820 703 1907 2713 3352 2920 2238 1551 1042 -5 -1326 -1542 -815 -1172 -1526 -881
578 -881 534 575 -158 -113 942 785 -59 -312 484 174 -803 -1320 -922 -1211 -1421 -1266 -269 735 944 1655
598 1655 2024 2158 1680 1147 197 -439 -852 -1544 -1709 -1482 -763 -273 -4 269 640 921 392 -51 -382 -445
618 -445 -657 -1172 -720 -91 545 1069 1601 1997 2397 1421 401 0 -1090 -2376 -3304 -3308 -2754 -2216 -1464 373
638 373 1833 2218 2554 2912 2987 1767 1064 236 -319 -1310 -1858 -1798 -2056 -1600 -1304 -337 -79 -32 442 879 425
$$ packed form
507A806n27L69J035p63j940k084j074k16j210r91J524K723J671Q74J718K169O95
524E779j125j061m98j031k424j949n20J77l64q8Q68J823J021l89q8M54j38j888
542a441j378Q95J432J17J68K373K258K44q13o4l92j613k667j952k69j164q25O16
560d475J586R63J106J523J204Q06O39m32o82o87n09j047j321k16P27l57l54O45
578h81J415M1p33M5J055j57q44k53P96l10r77n17L98k89k10J55R97J004K09P11
598A655L69J34m78n33r50o36m13o92j65K27P19M90K69K73L71K81n29m43l31o3
618d45k12n15M52O29O36N24N32L96M00r76j020m01j090j286r28mN54N38P52J837
638C73J460L85L36L58P5j220p03q28n55r91n48O0k58M56K96R67K58M7M74M37m54
$$ plain form
659 425 334 933 913 163 308 1042 551 116 488 374 -194 -866 -558 -386 -484 -897 -553 217 60 -267 -32
680 -32 278 7 -30 377 310 -110 76 255 66 -91 -145 130 218 -521 -149 146 319 178 362 841 477 149
702 149 61 -61 -220 -759 -1006 -1261 -1501 -1352 -1099 -682 -56 521 1182 1941 1810 1956 1605 1322 476 139 -390
723 -390 -874 -1388 -1415 -1660 -1195 -1075 -793 -554 54 292 430 694 789 554 779 967 995 703 244 537 366
744 366 -219 -685 -532 -739 -1409 -1073 -458 -751 -667 -289 474 331 638 949 1007 697 225 108 45 -194 -793
765 -793 -207 -247 -810 -567 57 15 -93 225 758 705 420 303 720 76 -255 -319 -23 -795 -848 -457 -123 -801
787 -801 -390 -243 54 296 354 634 788 885 665 744 669 61 -172 -152 -412 -1318 -937 -640 -1072 -665 -184 95
809 95 243 536 833 1212 1063 478 -34 324 153 -217 -507 -387 -524 -588 -153 -91 -130 -20 -39 159 229 -153
$$ packed form
659D25r1N99k0p50J45P34m91m35L72j14n68o72L08J72r8m13L44P70j57l27K35
680c2L10k71l7M07o7m20J86J79j89j57n4K75Q8p39L72K95J73j41J84M79l64l28
702A49q8j22j59n39k47k55k40J49K53M17O26N77O61P59j31J46l51k83q46l37n29
723c90m84n14k7k45M65J20K82K39O08K38J38K64R5k35K25J88K8k92m59K93j71
744C66n85m66J53k07o70L36O15k93Q4L78P63j43L07L11N8l10m72j17o3k39n99
765g93N86m0n63K43O24m2j08L18N33n3k85j17M17o44l31o4K96p72n3L91L34o78
787h01M11J47K97K42N8K80J54R7k20P9p5o08k33K0k60r06L81K97m32M07M81K79
809I5J48K93K97L79j49n85n12L58j71l70k90J20j37o4M35O2l9J10j9J98P0l82
$$ plain form
831 -153 18 51 349 24 312 332 251 -47 -1 -163 -765 -717 -674 -632 -542 -361 139 658 602 575 1077 1390 818 429
855 429 284 24 -729 -813 -671 -928 -930 -954 -481 -293 -107 187 584 652 509 795 1040 701 582 631 252 -173
877 -173 -295 -382 -605 -869 -829 -480 -517 -643 192 470 714 773 483 435 272 -188 -228 -258 -640 -466 -409 270 235
900 235 118 421 321 296 248 135 -223 -373 -25 -401 -209 -105 276 341 36 325 154 -311 -886 -875 -756 -721
922 -721 -513 -147 229 666 1116 1342 1135 1333 809 244 13 -557 -1003 -1504 -1628 -961 -881 -561 -440 402 477
943 477 544 639 743 495 392 431 304 163 27 270 -138 -410 -544 -309 -745 -615 -642 -129 -191 54 215 735
965 735 469 -40 321 549 20 -331 -140 72 -290 -151 -78 46 255 26 251 165 -80 -480 -322 -241 -158 -212
987 -212 97 416 62 546 320 354 -60 -379 -445 -880 -695 -333 -141 -117 89 736 1175 920 804 732 433 -111
$$ packed form
831a53J71L3K98l25K88K0q1k98M6j62o02M8M3M2R0J81N00N19n6k7N02L13n72l89
855D29j45k60p53q4J42k57kk4M73J88J86K94L97O8j43K86K45l39j19M9l79m25
877a73j22q7k23k64M0L49l7j26Q35K78K44N9k90m8j63m60m0l0l82J74N7O79l5
900B35j17L03j00k5m8j13l58j50L48l76J92J04L81O5l05K89j71m65n75J1J19L5
922g21K08L66L76M37M50K26k07J98n24n65k31n70m46n01j24O67Q0L20J21Q42P5
943D77O7R5J04k48j03L9j27j41j36K43m08k72j34K35m36J30k7N13o2K45J61N20
965G35k66n09L61K28n29l51J91K12l62J39P3J24K09k29K25q6k45m00J58Q1Q3n4
987b12L09L19l54M84k26L4m14l19o6m35J85L62J92K4K06O47M39k55j16p2k99n44
$$ plain form
1009 -111 -482 -623 -1097 -1008 -929 -755 -4 -86 312 760 980 1022 461 594 229 -189 -23 9 -259 -208 -466 -330
1031 -330 -426 -140 -387 -210 -386 -353 -105 -203 -81 429 642 866 505 305 515 389 -61 -432 -165 -145 -426
1052 -426 -661 -257 -175 -358 -331 132 459 -117 -241 293 276 110 308 610 642 158 176 496 -8 -453 -488 -287
1074 -287 -307 -330 -355 72 250 438 536 403 117 97 -21 -482 -553 -586 -285 -352 -710 -28 368 572 612 796 863
1097 863 572 514 9 84 -173 -228 -321 -153 -453 -251 -251 -292 -230 -469 -401 -248 -198 147 157 857 644 478 493 672
1121 672 776 21 203 -149 -510 -510 -726 -915 -712 -523 -258 -88 -178 226 242 230 316 90 374 392 68 247
1143 247 189 -30 -156 -49 53 -60 -284 -475 -68 161 -518 -171 190 222 214 78 258 -13 -68 -55 -81 -439
1165 -439 -116 -189 -142 23 143 495 534 562 483 545 655 104 -203 175 -246 -583 -361 -297 -325 -670 6 -101 -453
$$ packed form
1009a11l71j41m74Q9P9J74P51q2L98M48K20M2n61J33l65m18J66L2k68N1k58J36
1031c30r6K86k47J77j76L3K48r8J22N10K13K24l61k00K10j26m50l71K67K0k81
1052d26k35M04Q2j83K7M63L27n76j24N34j7j66J98L02L2m84J8L20n04m45l5K01
1074b87k0k3k5M27J78J88R8j33k86k0j18m61p1l3L01o7l58O82L96K04M0J84O7
1097H63k91n8n05P5k57n5r3J68l00K02%m1O2k39O8J53N0L45J0P00k13j66J5J79
1121F72J04p55J82l52l61%k16j89K03J89K65J70r0M04J6j2Q6k26K84J8l24J79
1143B47n8k19j26J07J02j13k24j91M07K29o79L47L61L2qj36J80k71n5J3k6l58
1165d39L23p3M7J65J20L52L9K8p9O2J10n51l07L78m21l37K22O4k8l45O76j07l52
$$ plain form
1188 -453 -119 228 433 138 278 532 152 247 407 545 170 -34 33 -60 -52 -538 -420 -231 -287 -308 -179 130
1210 130 -80 98 99 300 364 471 252 139 -15 -28 -306 -151 121 -370 -283 61 -201 -168 -124 165 87 100 69
1233 69 316 158 58 104 167 -205 85 91 -134 -289 -284 -128 -241 149 338 223 477 92 279 458 289 113
1255 113 128 100 -105 -225 -233 -115 -337 -499 -146 22 -43 -125 -253 -83 -78 187 206 140 76 190 330 91 -264 15
1279 15 50 28 -245 -148 -242 -185 -236 -241 285 167 53 234 312 76 -9 54 -25 -146 -461 -217 -321 -211 -370 237
1303 237 42 215 283 437 568 243 49 49 26 -38 -7 -258 -135 -525 -198 -92 -287 -212 -205 191 -123 25 547
1326 547 331 212 107 393 431 191 163 -219 -77 -379 -438 -274 -253 -541 -306 -267 111 75 84 195 107 418 116
1349 116 103 95 -283 271 -155 59 -174 -119 30 -144 -293 -94 -237 -332 -172 -113 276 109 146 180 83 23 -252
$$ packed form
1188d53L34L47K05k95J40K54l80R5J60J38l75k04O7r3Qm86J18J89n6k1J29L09
1210A30k10J78JK01O4J07k19j13j54j3k78J55K72m91Q7L44k62L3M4K89p8J3l1
1233F9K47j58j00M6O3l72K90Ok25j55NJ56j13L90J89j15K54l85J87J79j69j76
1255A13J5k8k05j20qJ18k22j62L53J68o5q2j28J70NK65J9o6o4J14J40k39l55K79
1279A5L5k2k73R7r4N7n1nN26j18j14J81P8k36q5O3p9j21l15K44j04J10j59O07
1303B37j95J73O8J54J31l25j94%k3o4L1k51J23l90L27J06j95P5PL96l14J48N22
1326E47k16j19j05K86L8k40k8l82J42l02n9J64K1k88K35L9L78l6RJ11q8L11l02
1349A16j3ql78N54m26K14k33N5J49j74j49J99j43r5J60N9L89j67L7L4r7o0k75
$$ plain form
1372 -252 -68 150 -330 -159 -136 -96 -306 -164 564 356 51 214 282 -18 135 -217 -12 -163 -126 -381 -366 -197
1394 -197 -168 -43 -61 -245 -280 243 67 57 18 157 365 185 291 128 259 88 -87 -107 -281 -169 -478 -253
1416 -253 -219 -434 -106 213 134 282 289 579 206 404 376 -13 222 124 -94 75 -179 -149 -226 14 -10 -199 -199 -258
1440 -258 -186 78 97 127 288 167 307 410 -258 -32 -88 -182 -398 -254 105 39 -85 78 140 389 110 40 223
1463 223 -18 -50 -202 -193 -158 -380 -28 5 -164 18 -24 90 250 -40 126 98 -116 24 24 12 -53 46 335 408
1487 408 -236 -307 -157 7 -364 -360 -240 80 129 91 568 246 117 454 44 -36 38 77 -246 -126 -366 -148 -244
1510 -244 -101 -225 -181 -104 -115 -138 -148 6 73 80 86 315 401 138 97 252 -43 -303 132 -313 -207 -291 118 -99
1534 -99 13 61 92 221 31 326 141 -26 -40 -283 78 144 -154 -105 15 130 134 216 -119 10 64 241 114
$$ packed form
1372b52J84K18m80J71K3M0k10J42P28k08l05J63O8l00J53l52K05j51L7k55J5J69
1394a97K9J25j8j84l5N23j76j0l9J39K08j80J06j63J31j71j75k0j74J12l09K25
1416b53L4k15L28L19p9J48PK90l73J98k8l89K35r8k18J69k54L0p7K40k4j89%n9
1440b58P2K64J9L0J61j21J40J03o68K26n6r4k16J44L59o6j24J63O2K49k79p0J83
1463B23k41l2j52RL5k22L52L3j69J82m2J14J60k90J66k8k14J40%j2o5R9K89P3
1487D08o44p1J50J64l71MJ20L20M9l8M77l22j29L37m10q0P4L9l23J20k40K18r6
1510b44J43j24M4P7j1k3j0J54O7POK29Q6k63m1J55k95k60M35m45J06q4M09k17
1534i9J12M8L1J29j90K95j85j67j4k43L61O6k98M9J20J15MQ2l35J29N4J77j27
$$ plain form
1557 114 29 130 55 0 -135 -8 -13 -174 -415 -192 204 -227 -244 139 153 70 -203 294 335 376 -116 -17 225 147
1581 147 -37 -187 -156 -367 -167 -320 -81 -72 -189 -144 166 221 37 217 300 367 -3 61 358 72 63 176 -96
1604 -96 -165 -93 31 -233 1 100 130 180 -94 207 246 -25 225 -196 145 206 16 153 -31 169 -251 57 213
1627 213 49 149 0 6 -164 70 -163 -36 45 123 -185 -107 -134 -302 19 -120 -192 -35 175 50 47 183 246
1650 246 188 -110 214 351 41 66 -71 -42 -29 -321 -100 35 -515 -200 -128 -51 150 -152 200 379 263 256 72
1673 72 142 24 -50 -48 -109 -120 96 -35 -143 22 76 -10 -173 10 83 132 132 -21 303 -70 -66 -215 39 -46 -289
1698 -289 -394 78 -97 -384 -10 163 -35 -201 -197 -13 398 -25 -14 42 197 69 -38 -127 19 -97 -112 -358
1720 -358 -70 138 -381 127 45 113 95 133 162 206 199 244 3 207 100 -184 53 90 131 -79 -69 -230 236 -74
$$ packed form
1557A14q5J01p5n5j35J27nj61k41K23L96m31j7L83J4q3k73M97M1M1m92R9K42p8
1581A47j84j50L1k11K00j53K39Rj17M5L10N5j84J80Q3O7l70O4K97k86rJ13k72
1604i6o9P2J24k64K34R9L0N0k74L01L9k71K50m21L41O1j90J37j84K00m20L08J56
1627B13j64J00j49Oj70K34k33J27Q1P8l08P8k7j68L21j39p2J57K10j25lJ36O3
1650B46n8k98L24J37l10K5j37K9J3k92K21J35n50L15P2P7K01l02L52J79j16pj84
1673G2P0j18p4Ko1j1K16j31j08J65N4q6j63J83P3M9%j53L24l73Mj49K54q5k43
1698b89j05M72j75k87L74J73j98j66MJ84M11m23J1N6J55j28j07q9J46j16j5k46
1720c58K88K08n19N08q2O8j8L8K9M4pM5k41K04j07k84K37L7M1k10J0j61M66l10
$$ plain form
1744 -74 -201 27 192 47 -132 -64 198 124 172 -294 -27 246 -49 -31 334 10 105 28 -96 -139 186 -122 46
1767 46 293 -8 78 98 101 67 -121 -285 -311 -28 225 -225 -304 146 218 27 -123 290 355 305 -141 63 61 112 -11
1792 -11 -425 -186 175 -161 -115 -223 265 -87 -49 174 242 248 -26 7 295 291 110 -84 205 175 -52 -176 -332
1815 -332 -76 -59 -322 -237 154 -24 -143 -154 343 100 -200 220 299 5 51 -225 -29 154 -8 -478 -162 70
1837 70 -16 -180 -175 40 245 60 -240 166 351 -34 -117 -50 64 243 -147 -45 4 222 60 58 144 212 21 132
1861 132 -199 272 109 33 23 -128 -80 -83 -391 135 151 -162 -154 143 180 244 45 93 541 -71 -54 -132 167 71 133
1886 133 -172 258 -98 -152 -186 -64 116 -118 -138 -4 93 -22 24 131 2 334 -48 -145 45 206 -80 26
1908 26 -204 7 53 -247 -220 -40 258 -191 -151 306 173 7 70 176 153 255 -111 27 90 157 -330 -272 -20
$$ packed form
1744g4j27K28J65j45j79O8K62p4M8m66K67K73k95J8L65l24R5p7j24m3L25l08J68
1767D6K47l01Q6K0Ll4j88j64k6K83K53m50p9M50P2j91j50M13O5n0m46K04kN1j23
1792a1m14K39L61l36M6j08M88l52L8K23O8Ok74L3K88mj81j94K89l0k27j24j56
1815c32K56J7k63Q5L91j78j19j1M97k43l00M20P9k94M6k76J96J83j62m70L16K32
1837G0q6j64NK15K05j85l00M06J85l85q3O7J14J79l90J02M9K18j62kQ6O8j91J11
1861A32l31M71j63p6j0j51M8ll08N26J6l13QK97L7O4j99M8M48o12J7p8K99r6O2
1886A33l05M30l56n4l4J22J80k34k0J34R7j15M6J07j29L32l82r7J90J61k86J06
1908B6k30K11M6l00K7J80K98m49M0M57j33j66O3J06k3J02l66J38O3O7m87N8K52
$$ plain form
1931 -20 -133 331 -12 -4 77 -195 -75 -94 73 73 -74 1 200 69 -314 -232 80 311 95 -262 0 -106 48
1954 48 274 112 429 66 -235 53 -19 113 -215 -211 68 118 56 -423 12 -213 -130 -61 -2 24 16 18 7 29 65 -57
1980 -57 144 -21 -85 -102 -275 25 311 -116 -328 -191 -157 53 -116 113 -22 222 -33 -231 -33 102 18 -146
2002 -146 -154 75 198 -134 -164 202 268 -208 -13 105 45 81 -246 -85 79 49 -28 -1 312 105 95 -65 19 128
2026 128 -89 37 70 115 -144 45 158 121 -1 -46 39 9 97 -39 -202 81 95 -190 -91 10 202 60 -164
2049 -164 -329 219 13 -27 -86 331 142 -100 -423 -107 157 -125 -128 -121 -12 -160 -127 -25 -13 190 334 -30 -54
2072 -54 262 -127 -158 -58 -67 -267 -98 227 294 68 -33 2 -127 247 -122 -172 197 124 186 -137 -27 -145 30
2095 30 5 -21 103 35 -202 -184 -175 -78 -53 -242 127 -37 50 65 68 -37 24 -117 240 -40 163 -72 168 -174 186
$$ packed form
1931b0j13M64l43QQ1k72J20j9J67%j47P5J99j31l83Q2L12K31k16l57K62j06J54
1954D8K26j62L17l63l01K88p2J32l28MK79N0o2m79M35k25Q3O9N9K6qKj1K2L6j22
1980e7K01j65o4j7j73L00K86m27k12J37L4K10j69K29j35K44k55j98J98J35q4j64
2002a46qK29J23l32l0L66O6m76J95J18o0L6l27J61J64l0p7K7L13k07j0j60Q4J09
2026A28k17J26L3M5k59J89J13l7j22m5Q5l0Q8j36j63K83J4k85R9J01J92j42k24
2049a64j65N48k06m0n9M17j89k42l23L16K64k82lPJ09j48L3J02J2K03J44l64k4
2072e4L16l89l1J00rk00J69L25O7k26j01L5j29L74l69n0L69p3O2l23J10j18J75
2095C0k5k6J24o8k37J8RR7K5j89L69j64Q7J5Lj05O1j41L57k80K03k35K40l42L60
$$ plain form
2120 186 96 -30 18 -93 -108 -118 117 -53 135 -140 104 294 74 183 -17 59 -214 -116 -194 149 -43 -88 -155
2143 -155 -124 -86 216 253 -137 84 136 -338 179 -259 109 55 -13 -74 -19 114 -221 -41 -167 -11 140 -76 120
2166 120 38 -8 21 153 132 42 -263 -102 290 14 -63 -135 104 43 204 100 291 -267 286 -28 45 395 239
2189 239 -35 167 288 252 15 -192 125 -44 149 -91 38 75 -62 -35 -17 -58 21 -79 222 -148 90 90 -83
2212 -83 -152 203 37 -181 197 -171 145 72 -256 72 -19 -218 -86 66 -135 -54 -53 10 -7 93 -61 -50 -78 -131
2236 -131 22 -51 30 -232 58 -45 164 -50 -47 201 -52 48 134 -16 -188 -180 -246 -15 104 60 -281 170 -70
2259 -70 58 -122 -61 150 198 177 5 -119 -188 422 1 49 -82 33 -266 118 -215 -81 0 10 91 44 69 -48
2283 -48 -32 62 11 -341 83 -141 -104 78 14 -48 -205 -263 192 -135 35 12 207 -139 -100 -55 22 -212 -76 29
$$ packed form
2120A86r0j26M8j11j5j0K35j70J88k75K44J90k20J09k00P6k73R8p8L43j92m5o7
2143a55L1L8L02L7l90K21N2m74N17m38L68n4o8o1N5J33l35J80j26J56J51k16J96
2166A20q2m6K9J32k1r0l05J61L92k76p7p2K39o1J61j04J91n58N53l14P3L50j56
2189B39k74K02J21l6k37k07L17j69J93k40J29L7j37K7J8m1P9j00L01l70K38%j73
2212h3o9L55j66k18L78l68L16p3l28L28r1j99J32J52k01Q1JO3j7J00j54J1k8n3
2236a31J53p3Q1k62K90j03K09k14LK48k53J00Q6j50j72Qo6K31J19m4l41M51k40
2259g0J28j80O1K11M8k1j72j24o9O10m21M8j31J15k99L84l33J34Q1J0Q1m7K5j17
2283d8J6R4n1l52M24k24L7J82o4o2j57n8M55l27J70k3J95l46L9M5P7k34J36J05
$$ plain form
2307 29 -89 95 -260 209 -133 -35 -2 -71 -15 -64 -102 154 113 -64 -5 45 229 -342 -110 -130 55 20 259 -91
2331 -91 -251 216 -2 -186 -127 -48 -30 176 349 -175 217 105 120 61 64 52 -186 -66 -143 -37 -6 139 -7 1
2355 1 72 -55 -255 -202 140 110 -150 -97 -114 -49 227 -142 -49 58 -183 -91 96 -25 -77 -156 -210 -173 77 -27 34
2380 34 236 94 -91 60 78 112 -225 35 -80 83 -3 -235 -23 -193 -103 99 68 234 78 65 -128 78
2402 78 -68 -29 2 172 -182 88 -108 21 184 85 234 -61 -106 -111 -114 -20 76 223 44 -21 76 -207 -32 -79 146
2427 146 -131 -51 302 -131 72 142 -40 158 -106 -118 -170 95 38 -95 -95 111 -23 17 102 -268 21 -18 326
2450 326 126 13 -216 78 -40 -79 -149 229 -133 105 14 -102 63 164 -148 181 236 -41 11 -108 -73 8
2472 8 153 50 251 215 -247 24 279 138 96 -280 -38 -224 70 68 163 -128 -75 87 2 99 56 26 107 65 26
$$ packed form
2307B9j18J84l55M69l42R8L3o9N6m9l8K56m1j77N9N0J84n71K32k0J85l5K39l50
2331i1j60M67k18j84N9P9J8K06J73n24L92j12J5n9Lj2k38J20p7J06L1J45j46Q
2355AP1j27k00N3L42l0k60N3j7O5K76l69R3J07k41R2J87j21n2p9n4L7K50j04O1
2380C4K02j42j85J51J8L4l37K60j15J63q6k32K12j70R0K02l1J66j56j3j93K06
2402G8j46L9L1J70l54K70j96J29J63r9J49k95m5nlR4R6J47j79o5R7k83J75m7K25
2427A46k77Q0L53m33K03P0j82J98k64j2n2K65n7j33%K06j34M0Q5l70K89l9L44
2450C26k00j13k29K94j18l9p0L78l62K38r1j16J65J01l12L29N5k77N2j19L5Q1
2472HJ45j03K01l6m62K71K55j41m2l76K42j86K94kR5k91N3J62q5R7m3l0Q1m2l9
$$ plain form
2497 26 -104 39 68 -136 -47 113 -137 -161 -128 -252 -112 42 16 -41 68 -109 -133 -178 -271 15 59 -20 52 63 228
2522 228 24 -52 98 -129 271 68 -85 216 -257 38 124 215 185 214 -65 114 -104 4 -60 12 40 73 45
2545 45 178 -153 -74 26 -203 -91 1 -84 -130 85 -5 -174 80 -19 33 -68 -24 -88 105 88 -107 98 177 243
2569 243 -146 -134 14 -358 213 -25 123 107 -178 209 -124 53 2 7 -241 35 86 -58 -215 -154 -17 -5 125
2592 125 -75 -112 169 12 -358 -333 -31 -155 -46 156 -112 235 -225 83 -104 -248 104 -175 278 -305 -167
2613 -167 3 111 86 122 -128 77 16 -109 29 91 -23 115 166 32 283 111 33 -32 120 -74 -51 189 -4
2636 -4 71 -58 1 -191 -147 3 144 293 -243 71 -92 -139 -104 -16 -97 216 145 121 222 -159 246 -297 -176 147
2660 147 30 46 -19 108 -4 71 -252 8 -86 46 -8 210 -89 -48 174 -147 210 296 -134 -78 136 -71 118
$$ packed form
2497B6j30J43K9k04Q9J60k50k4L3j24J40J54k6n7J09j77k4m5r3K86M4p9P2J1J65
2522B28k04p6J50k27M00k03j53L01m73K95Q6R1l0K9k79J79k18J08o4P2K8L3k8
2545D5J33l31P9J00k29J12R2q5m6K15r0j69K54r9N2j01M4o4J93j7j95K05P9O6
2569B43l89J2J48l72N71k38J48j6k85L87l33J77n1Nk48K76N1j44j57O1J37J2J30
2592A25k00l7K81j57l70K5L02j24J09K02k68L47m60L08j87j44L52k79M53n83J38
2613a67J70J08k5L6k50K05o1j25J38O2j14J38N1j34K51j72p8o5J52j94K3K40j93
2636dP5j29N9j92M4J50J41J49n36L14j63m7L5Q8q1L13p1k4J01l81M05n43J21L23
2660A47j17J6o5J27j12P5l23K60r4J32n4K18k99M1K22l21L57Q6m30N6K14k07J89
$$ plain form
2683 118 -26 108 -53 105 109 201 -109 -189 -194 -24 121 -74 241 -19 -129 -275 -59 -103 92 239 -152 360
2705 360 -49 -3 57 -253 -179 -40 -44 94 10 -78 27 133 183 254 -41 15 18 211 364 -75 147 -51 212 -10
2729 -10 -44 29 73 -287 -32 146 302 -15 84 83 230 111 174 66 -119 -163 41 93 -90 -30 38 -54 43 -25 262
2754 262 -75 -138 63 -121 254 109 -82 77 84 -157 92 -82 -140 -79 65 300 58 65 97 91 -4 266 -141 76
2778 76 -16 -57 -248 65 323 -263 -307 -40 19 149 0 183 -124 -70 -171 -52 303 89 -208 -128 343 20
2800 20 -54 -87 144 5 -3 -157 -390 -203 -29 -120 -80 -89 -194 -28 140 -81 -20 -147 8 -157 -148 0 -26 -170
2824 -170 -48 149 141 -3 -193 33 -92 -62 61 -27 119 -89 215 -98 70 -87 -3 -101 81 -173 3 -45
2846 -45 -80 -206 243 -83 14 -171 13 290 82 50 -81 146 -11 59 -5 -47 -227 24 -88 35 38 6 67 -178
$$ packed form
2683A18j44J34j61J58MR2l10q0nJ70J45j95L15k60j10j46K16m4J95J47l91N12
2705C60m09M6O0l10P4J39mJ38q4q8J05J06N0P1k95N6LJ93J53m39K22j98K63k22
2729a0l4P3M4l60K55J78J56l17R9jJ47j19O3j08j85m4K04N2j83O0O8r2R7o8K87
2754B62l37o3K01j84L75j45j91J59Pk41K49j74n8O1J44K35k42PL2or5K70m07K17
2778G6r2m1j91L13K58n86m4K67N9J30j49J83l07N4j01J19L55k14k97Q0M71l23
2800B0p4l3K31j39qj54k33J87J74r1M0rj05J66J68k21O1j27J55j65RJ48k6j44
2824a70J22J97qj44j90K26j25L0J23q8J46k08L04l13J68j57Q4r8J82k54J76m8
2846d5l5j26M49l26R7j85J84K77k08l2j31K27j57P0o4m2j80K51j12J23Ll2O1k45
$$ plain form
2870 -178 -207 67 19 -11 -96 31 -56 80 -282 187 -4 -155 -68 -117 -65 -59 -160 -96 -147 116 181 -151 133 -145
2894 -145 9 146 -26 -80 157 -244 -179 -80 58 110 -106 123 188 258 11 124 3 411 -102 127 191 -71
2916 -71 22 7 -70 -31 -6 -19 -94 -39 -230 -44 115 102 -134 -231 -27 -43 42 -89 200 34 -39 52 -28 2 45 68
2942 68 -151 -137 267 -157 -67 -59 49 -32 125 -276 90 7 152 -308 -35 187 -298 -18 -191 202 305 72
2964 72 -231 -16 -116 -169 -41 183 -9 57 -192 -61 -34 -51 40 -85 87 -229 32 -51 29 -37 203 -37 154
2987 154 -112 76 262 100 -255 63 40 -2 137 29 -20 58 60 59 -8 212 237 -94 35 -73 -48 -109 -260 -275
3011 -275 -207 37 -95 20 112 47 -153 135 139 -65 124 199 -128 356 65 -125 -188 -187 -93 -14 55 -7 -57 -117 -75
3036 -75 -181 33 135 -11 28 -25 117 -78 91 37 202 -26 -75 60 17 -139 36 191 -104 48 27 -166
$$ packed form
2870a78k9K74m8l0q5J27q7J36l62M69j91j51Q7m9N2Oj01O4n1K63O5l32K84k78
2894a45J54J37j72n4K37m01O5R9J38N2k16K29O5P0k47J13j21M08n13K29O4k62
2916g1R3j5p7L9K5j3p5N5j91J86J59j3k36r7K04j6Q5j31K89j66p3R1q0L0M3K3
2942F8k19J4M04m24R0QJ08q1J57m01L66q3J45m60K73K22m85K80j73L93J03k33
2964G2l03K15j00n3J28K24j92O6k49J31K7j7R1j25J72l16K61q3Q0o6K40k40J91
2987A54k66J88J86j62l55L18k3m2J39j08m9P8Kjo7K20K5l31J29j08K5o1j51j5
3011b75O8K44j32J15R2o5k00K88Mk04J89P5l27M84k91j90o3JR4P9O9o2n0o0M2
3036g5j06K14J02j46L9n3J42j95J69n4J65k28m9J35m3j56J75J55k95J52k1j93
$$ plain form
3058 -166 -2 6 -306 269 31 2 115 -130 120 -2 -305 -134 -127 -92 -363 -126 -31 -92 93 -190 -264 75 45
3081 45 290 -42 -64 172 67 -41 199 45 -47 -87 38 -96 193 153 -179 -29 40 -28 -17 -25 -9 143 -223 48
3105 48 191 -221 -87 -3 -252 -122 234 24 -143 -189 -13 -45 108 96 25 76 11 57 -228 -115 274 85 216
3128 216 93 4 78 -113 144 -246 193 173 -212 -113 -174 -62 101 -30 -125 151 -105 323 -69 -288 19 -269
3150 -269 293 130 -120 27 -63 109 98 129 -11 77 134 -132 59 -200 155 -31 -54 -23 -205 -29 237 -78
3172 -78 168 117 -113 -111 207 262 -63 -108 -269 64 -251 4 66 -72 2 19 211 15 155 9 98 45 102 208
3196 208 -48 251 -145 -153 69 177 209 66 -62 223 -10 -153 -212 57 22 2 -143 -55 91 -225 52 115 -12
3219 -12 89 -84 -115 44 -219 -314 72 -210 -164 -47 -10 -98 -87 159 32 237 78 -20 81 5 -50 17 -115 -150
$$ packed form
3058a66J64Ql12N75k38k9J13k45K50j22l03J71PL5k71K37R5o1J85k83p4L39l0
3081D5K45l32k2K36j05j08K40j54r2m0J25j34K89m0l32J50O9o8J1qJ6J52l66K71
3105D8J43m12J34Q4k49J30L56k10j67m6J76l2J53j2p1N1o5M6k85J13L89j89J31
3128B16j23q9P4j91K57l90M39k0l85R9o1J12J63j31r5K76k56M28l92k19L07k88
3150b69N62j63k50J47r0J72j1L1j40Q8N7k66J91k59L55j86k3L1j82J76K66l15
3172g8K46n1k30KL18N5l25m5j61L33l15K55O2j38P4J7J92j96J40j46Q9n3N7J06
3196B08k56K99l96qK22J08L2j43j28K85k33j43n9K69l5k0j45Q8J46l16K77O3j27
3219a2J01j73l1J59k63r5L86k82M6J17L7q8J1K46j27K05j59r8J01p6n5O7j32l5
$$ plain form
3243 -150 -44 133 -71 -94 -42 -139 -97 -198 -354 85 102 -128 128 -110 -164 45 -109 -186 75 -262 -106 247
3265 247 107 -10 -9 -279 69 -194 95 -254 62 39 -40 221 -169 -82 19 -43 19 107 71 -208 -97 50 168
3288 168 171 -9 58 -75 14 140 -80 24 -98 -41 56 140 -199 28 14 77 -109 -125 287 -74 122 -22 71 60
3312 60 141 128 -121 43 250 174 66 148 111 183 -67 124 3 144 91 257 -144 -289 23 199 89 -162 69
3335 69 96 42 101 207 191 82 112 105 50 228 103 94 -60 -126 -65 159 68 16 -148 -60 54 -117 -69 -163 111 -58
3361 -58 -229 32 -22 133 49 -125 88 119 11 183 -127 -136 -160 55 26 108 -56 272 11 -200 126 43 143
3384 143 -49 23 -34 178 227 295 120 185 -123 125 -18 35 -65 255 34 47 -17 -156 110 152 -262 196 -128
3407 -128 -139 184 135 72 -34 36 -172 -48 -95 -1 92 28 -131 208 -144 128 -119 -113 -5 57 5 73 258 190 164
$$ packed form
3243a50J06J77k04k3N2r7M2j01j56M39J7k30K56k38n4K09j54p7K61l37J56L53
3265B47j40j17Jk70L48k63K89l49L16k3p9K61l90Q7J01o2O2Q8l6k79J11J47J18
3288A68Lj80O7j33Q9J26k20J04j22N7R7Q4l39K27j4O3j86j6M12l61J96j44R3j1
3312F0Q1j3k49J64K07p6j08Q2l7P2k50J91j21J41n3J66m01j45L12J76j10k51K31
3335F9K7n4N9J06j6j09L0pn5J78j25rj54o6O1K24r1n2j64Q8J14j71M8r4K74j69
3361e8j71K61n4J55q4j74K13L1j08J72l10rk4K15k9Q2j64L28k61k11L26q3J00
3384A43j92P2n7K12M9O8j75O5l08K48j43N3j00L20k21J3o4j39K66M2m14M58l24
3407a28j1L23m9o3j06P0k08J24m7R4R3o4j59L39l52K72k47OJ08O2n2O8J85o8k6
$$ plain form
3432 164 -144 44 -78 -10 -102 7 -132 106 86 74 233 119 131 190 -127 -66 -231 -45 118 11 -64 -231 -132
3455 -132 91 -54 -109 17 142 -94 37 56 -143 62 280 155 99 -133 -135 148 210 -134 -2 -231 110 -173
3477 -173 61 -101 200 306 16 147 -270 143 41 124 -162 -2 116 -118 -90 -92 -17 395 91 -214 11 -113
3499 -113 18 -228 -166 82 33 36 4 -83 -24 72 42 131 -159 99 187 -158 176 1 13 -160 31 202 187 47
3523 47 49 -40 116 2 50 18 62 0 59 64 -105 -74 -36 151 -65 32 -162 47 183 -13 72 154 73 93 46 59 171
3550 171 159 -174 47 31 141 -97 6 -46 166 224 35 10 -201 -33 -56 187 63 51 -2 136 -217 -23 -168
3573 -168 92 -179 -52 -258 -26 -129 -94 34 18 -141 -28 -177 -78 205 105 27 82 167 226 -195 -69 -50 -65
3596 -65 142 -201 -37 140 -194 312 -186 38 -219 -148 49 97 135 -113 54 70 -8 -23 -88 -60 13 120 65 119
$$ packed form
3432A64l08J88j22O8r2J09j39K38k0j2J59j14J2N9l17O1j65J86J63j07p5j67R9
3455a32K23j45n5J26J25k36J31J9j99K05K18j25n6k32kK83O2l44J32k29L41k83
3477a73K34j62L01J06k90J31m17M13j02Q3k86J60J18k34K8kP5M12l04l05K25j24
3499a13J31k46O2K48m9Ll2q7N9R6l0Q9k90K58Q8l45L34j75J2j73J91J71j5j40
3523D7Kq9J56j14M8l2M4o2N9Nj69L1L8J87k16R7j94K09J36j96Q5Q2q1K0m7J3J12
3550A71j2l33K21j6J10k38J03n2K12N8j89k5k11J68k3K43j24j2n3J38l53J94j45
3573a68K60k71J27k06K32j03L5J28j6j59J13j49R9K83j00p8N5Q5N9m21J26J9j5
3596f5K07l43J64J77l34N06m98K24k57P1J97M8L8k48J67J6p8j5o5K8P3J07n5N4
$$ plain form
3620 119 186 189 -106 81 -123 -93 64 -107 -152 -23 39 278 151 50 156 -116 5 194 -50 -97 88 254
3642 254 -61 72 153 -195 -198 6 -23 -127 -155 220 -76 -22 52 71 -49 -89 125 -32 -88 -15 10 -96 45 -106
3666 -106 -51 97 -53 214 -115 -144 -83 -28 -220 166 35 131 -349 -159 192 230 253 -156 -61 82 -60 39 158
3689 158 -31 -91 -139 -1 111 -178 173 81 49 84 -86 -19 80 -99 12 -6 24 -42 69 255 9 113 3
3712 3 225 32 -33 -109 -139 -16 257 71 103 8 128 -99 4 -14 80 -131 -247 -87 173 171 -154 -125 -163 220
3736 220 141 -262 -23 -129 30 39 -42 -54 222 18 -119 254 -94 225 184 -61 -75 280 78 -24 -125 -144 -175
3759 -175 13 84 -67 40 18 24 25 125 -123 -9 -254 108 310 82 -115 -60 -48 183 -132 115 -5 -136 173
3782 173 202 -2 -61 12 248 89 111 -197 -35 83 -186 -26 10 -42 53 202 91 40 83 197 -238 59 208
$$ packed form
3620A19O7Lk95J87k04L0J57j71m5J29O2K39j27j01J06k72J21J89k44m7J85J66
3642B54l15J33Q1l48lK04k9j04k8L75k96N4P4J9j20m0K14j57n6P3K5j06J41j51
3666a06N5J48j50K67l29k9O1N5j92L86j31R6m80J90L51L8K3m09R5J43j42R9J19
3689A58j89o0m8J38J12k89L51r2l2L5j70O7R9j79J11j8L0o6J11J86k46J04j10
3712CK22j93o5p6l0J23K73j86L2r5J20k27J03j8R4k11j16J60K60kl25K9l8L83
3736B20p9m03K39j06J59Rq1j2K76k04j37L73l48L19m1k45j4L55k02j02j01j9l1
3759a75J88P1j51J07k2OJJ00k48J14k45L62K02k28j97N5J2K31l15K47j20j31L09
3782A73K9k04n9P3K36j59K2l08J62J18k69J60L6n2R5J49j11n1M3J14m35K97J49
$$ plain form
3805 208 -63 -154 87 60 -95 403 -82 -98 -177 142 -75 57 69 -5 -96 161 132 -119 291 -8 176 88 34
3828 34 16 146 45 101 58 -228 -293 -100 -118 -142 -9 449 137 130 10 -97 68 -187 -17 -79 97 59 -82 234
3852 234 241 57 107 273 -6 52 -275 69 142 79 95 248 55 30 139 -64 208 165 59 -197 -132 125 -64
3875 -64 82 -11 53 -114 61 -141 -54 43 67 46 -165 213 21 -223 15 -25 -235 -111 111 111 -2 246 -47
3898 -47 39 -28 -111 15 -115 -55 -6 -56 78 -1 -32 -133 -144 -165 -178 -297 -241 197 49 -10 -72 -3 80 8 -118 20
3924 20 55 111 -125 -65 36 88 180 14 74 160 4 -147 -104 52 -148 108 -61 -164 72 131 96 225 88 31
3948 31 63 8 -246 156 -115 147 41 82 88 -21 94 82 59 89 4 13 231 -96 349 -157 108 87 115 116 -224
3973 -224 -84 -22 -55 -196 -27 13 92 92 -131 66 -88 305 -186 -47 46 19 172 127 -16 35 36 -79 -367 -176
$$ packed form
3805B08k71r1K41k7j55M98m85j6p9L19k17J32J2p4r1K57k9k51M10k99J84q8n4
3828C4j8J30j01N6m3k86o5J93j8k4J33M58l12pj20j07J65k55J70o2J76l8j41L16
3852B34Pj84N0J66k79N8l27L44P3o3J6J53j93k5J09k03K72m3j06k56O5K57j89
3875f4J46r3O4j67J75k02Q7R7K4k1k11L78j92k44K38m0k10J24K22%j13K48k93
3898d7Q6o7q3J26j30O0M9n0J34p9l1j01j1k1j3j19N6M38j48n9o2O9Q3p2j26J38
3924B0L5N6k36O0J01N2R2j66O0Q6j56j51M3J56k00K56j69j03K36N9l5J29j37n7
3948C1L2n5k54M02k71K62j06M1Oj09J15j2k3L0q5RK18l27M45n06K65k1K8Jl40
3973b24J40O2l3j41J69M0P9%k23J97j54L93m91J39R3k7J53m5j43N1Jj15k88J91
$$ plain form
3997 -176 279 75 71 -101 -15 14 192 -250 -123 77 -212 140 189 -190 -131 -176 106 -57 32 -43 67 241 128
4020 128 -63 296 -96 -56 115 -33 13 109 3 -74 107 -62 22 42 -66 51 -50 36 20 210 -20 -109 -7
4043 -7 -194 -123 -14 60 77 152 -226 139 -255 -89 94 4 -112 -166 -212 -210 137 54 146 90 -7 134 -240 44 41 -123
4069 -123 -226 45 235 -22 -8 -46 -146 -152 247 30 -240 84 285 8 91 62 -160 -79 165 16 -151 241
4091 241 -21 -75 -96 -39 -54 -105 136 262 -56 -211 241 -250 42 148 -119 94 0 -149 97 -10 -14 -61 73
4114 73 -155 -230 98 55 -86 133 -80 -262 71 -83 144 86 -14 96 -2 -29 -230 1 -16 -34 -2 19 -249
4137 -249 -232 185 -135 -316 50 -33 -102 18 35 -21 -8 -48 80 200 -55 130 5 52 161 261 -52 16 -48
4160 -48 -219 -37 17 -134 332 65 3 -174 -173 44 2 46 103 19 62 67 82 84 30 -21 176 -19 382 -9 32 -136
$$ packed form
3997a76M55k04mj72Q6K9J78m42J27K00k89L52M9l79N9m5K82j63Q9p5J10J74j13
4020A28j91L59l92M0J71j48M6R6j06p7J81j69Q4K0j08J17j01Q6j6J90k30q9J02
4043gj87P1J09P4J7P5l78L65l94J66J83r0j16n4m6KL47q3R2n6r7J41l74K84lj64
4069a23j03K71J90k57J4l8j00oL99k17k70L24K01k77Q3k9k22Q1K44j49j67L92
4091B41k62n4k1N7j5n1K41J26l18j55M52m91K92J06k67K13r4j49K46j07mm7J34
4114G3k28p5L28m3j41K19k13j82L33j54K27n8j00J10r8k7k01K31j7j8L2K1k68
4137b49J7M17l20j81L66q3o9J20J7n6J3m0J28J20k55J85j25M7J09J00l13O8o4
4160d8j71J82N4j51M66k67o2j77JK17m2M4N7q4M3NJ5Kn4n1J97j95M01l91M1j68
$$ plain form
4186 -136 -23 50 212 -43 -177 -113 -198 -97 -219 24 343 -16 59 -34 32 -16 35 89 -10 -106 -17 59 -5 -293 -130
4211 -130 -66 -89 140 87 129 68 -212 67 118 -168 -88 -318 -8 223 21 -74 -95 105 108 -115 39 80 -59 24
4235 24 -75 30 -133 -239 67 -66 42 19 -55 229 10 -36 -29 -132 -16 -2 -32 -24 -97 65 -111 23 31 23 -26 71
4261 71 7 -166 -89 2 -10 -26 -56 188 123 -79 80 184 20 -34 57 -161 -130 7 -35 -15 99 184 -40 -193 24
4286 24 162 133 47 -98 -56 269 -243 -119 -102 122 -243 4 -130 63 37 -23 -36 10 -127 -260 74 186 145
4309 145 -152 150 63 -55 161 -20 195 -78 -45 7 -5 -30 -131 79 152 -279 -143 94 54 -19 -65 73 120
4332 120 -194 -446 -144 -103 271 177 204 -150 -161 -22 -30 68 -16 -15 217 212 294 -414 49 44 -232 26 206 139 87 -208
4358 -208 -75 -114 127 97 23 120 171 -71 -152 23 -124 344 -9 134 4 -47 104 22 -163 173 123 111 -67
$$ packed form
4186a36J13P3J62k55j34O4q5J01j22K43L19l59P5r3O6m8N1N4r9r6Q9P6o4k88J63
4211a30O4k3K29n3M2o1k80K79N1k86Q0k30L10K31k02r5k1K00Lk23J54M1j39Q3
4235B4r9J05j63j06L06j33J08k3p4K84k19m6Pj03J16J4l0Qp3J62j76J34Qqm9R7
4261G1o4j73P7R1j2j6l0K44o5k02J59J04j64n4R1k18L1J37m2K0J14Q5k24j53K17
4286B4J38k9q6j45M2L25n12J24J7K24l65K47j34J93k6o0j3M6j37j33L34J12m1
4309A45k97L02q7j18K16j81K15k73L3N2j2k5j01K10P3m31J36K37m0p3m6J38M7
4332A20l14k52L02M1L74r4K7l54j1J39qR8q4JK32nQ2p08M63nk76K58J80o7n2k95
4358b08J33l9K41l0p4R7N1k42q1J75j47M68l53J43j30n1J51q2j85L36n0j2j78
$$ plain form
4381 -67 83 42 -89 -23 45 -57 -136 -16 71 -77 89 237 0 -9 -48 78 -45 -61 235 -71 164 27 -27 177
4405 177 -92 -32 -110 -68 194 181 264 149 -190 43 51 -219 84 -170 -65 -32 82 158 56 2 -115 129 -111
4428 -111 25 221 -263 90 -149 -173 -163 -177 151 -281 -42 -61 156 23 -289 96 -30 -61 -22 194 97 43 252
4451 252 -118 -194 46 232 -161 -180 -84 -108 115 243 89 83 5 -127 171 222 166 21 130 -129 -151 46 -314
4474 -314 -21 136 -66 54 39 63 -233 55 -49 -20 5 85 -86 -116 40 -98 176 -59 -199 7 202 151
4496 151 -80 75 47 -243 93 -53 -5 236 94 -270 -237 40 -139 75 74 155 206 157 -156 173 -187 88 207
4519 207 46 -120 -20 78 -5 -67 -150 144 -136 3 -202 -31 -39 -53 -152 -122 -367 238 174 69 31 58 59 -129 45
4544 45 -56 -22 -16 -117 31 37 69 119 35 78 22 -217 -177 54 19 -29 -2 -91 73 -86 -51 -87 -85 -56 72 186 8
$$ packed form
4381f7J50m1j31O6O8j02p9J20Q7j48J66J48k37rl9J26j23j6K96l06K35j37n4K04
4405A77k69O0p8M2K62j3Q3j15l39K33Qk70L03k54J05L3J14P6j02n4j17K44k40
4428a11J36J96m84L53k39k4J0j4L28m32K39j9K17j33l12L85j26l1L9K16r7n4K09
4451B52l70p6K40J86l93j9R6k4K23J28j54op8j32K98N1n6j45J09k59k2J97l60
4474c14K93J57k02J20j5K4k96K88j04K9K5Q0j71l0J56j38K74k35j40K06J95n1
4496A51k31J55k8k90L36j46M8K41j42l64L3K77j79K14jQ1N1m9l13L29l60K75J19
4519B07j61j66J00R8q3o2q3K94k80J39k05J71qj4r9L0k45O05o4j05l8K7Jj88J74
4544D5j01L4Oj01J48OL2N0q4M3n6k39M0K31l5m8K7q9J64j59L5l6KK9J28J14j78
$$ plain form
4571 8 -2 -62 -120 -105 -211 -176 14 90 245 -158 -201 -43 -49 112 73 -212 100 -78 -42 -125 -145 -5 59 124 133 98 49
4598 49 29 -2 -4 2 -149 161 -104 -144 3 228 27 -256 60 -55 19 78 56 -47 -221 -260 151 154 -38 -31 -46 -46
4624 -46 -144 -6 8 83 199 -244 217 -132 -67 102 78 -137 -245 25 -96 6 235 108 -176 84 55 -154
4646 -154 64 -66 240 -57 72 -16 -17 2 -135 82 23 -28 -16 115 13 137 0 57 17 97 -80 -31 -107 245
4670 245 137 -40 22 -7 21 20 132 -183 -58 32 126 31 12 98 -115 5 -32 -93 30 -151 45 -121 -79 44
4694 44 -78 45 60 -90 -177 -192 -60 -6 -33 286 -104 103 7 -92 -14 -195 103 111 -130 259 4 -153 7 -27
4718 -27 41 1 147 -235 39 19 -96 155 -28 -70 -82 -163 -158 279 96 97 -274 -125 -71 131 168 104 -102 -8 44
4743 44 -130 2 161 51 16 67 16 -260 -4 51 -167 4 -127 -411 163 99 52 -113 182 -55 -15 110 -34
$$ packed form
4571Hj0o0n8J5j06L5J90P6J55m03m3J58oJ61l9k85L12j78L6q3k0J40O4O5Rl5m9
4598D9k0l1kOj51L10k65m0J47K25k01k83L16j15P4N9k2j03j74l9M11Lj92Pj5%
4624d6r8J38J4P5J16m43M61l49O5J69k4k15j08K70j21J02K29j27k84K60k9k09
4646a54K18j30L06k97J29q8jJ9j37K17n9n1J2J31j02J24j37N7m0Q0j77M9p6L52
4670B45j08j77O2k9K8jJ12l15J25R0R4r5j9Q6k13J20l7o1J23j81J96j66M2J23
4694D4j22J23J5j50q7j5J32N4k7L19l90K07r6r9P8j81K98Qk41L89k55j57J60l4
4718b7O8m0J46l82K74k0j15K51j83m2j2q1NM37j83Jl71J49N4K02L7o4k06R4N2
4743D4j74J32J59j10l5N1n1k76K56N5k18J71j31k84N74o4m7j65K95k37M0J25j44
$$ plain form
4766 -34 174 48 85 110 -9 -65 -91 -79 -230 -124 191 -75 -3 -117 -179 89 44 31 -21 -11 25 28 -70 -72 56 -174
4792 -174 67 121 43 83 111 95 -203 38 41 39 -63 14 -202 -51 88 -104 -153 -24 -11 -143 164 227 -107 -172 19
4817 19 -140 -137 18 247 -74 7 -118 182 15 -65 -20 -143 -97 258 -58 180 111 -186 73 -5 -189 123 -121
4840 -121 -27 -184 86 99 -61 -154 87 -74 -284 71 97 -85 202 144 -151 -67 -111 -224 182 44 77 240 -101
4863 -101 16 115 39 159 -103 -105 99 -152 152 -158 60 95 235 216 125 -133 187 51 -231 85 -51 -236
4885 -236 55 179 -141 171 68 -45 62 168 -144 -90 38 -298 27 -145 1 -119 52 -30 -11 -64 -47 -237
4907 -237 -4 200 -14 226 -313 15 -74 -73 -46 13 -275 -19 -234 115 40 68 -105 21 -55 122 146 63 -207
4930 -207 150 9 -16 -147 38 92 -151 64 -114 -173 24 -199 -136 -14 -32 -140 -214 39 270 121 -213 -134
$$ packed form
4766c4K08j26L7K5j19n6k6J2j51J06L15k66P2j14o2K68m5j3n2J0L6Lr8kJ28k30
4792a74K41N4p8M0K8j6k98K41Lkj02P7k16J51J39j92m9J29J3j32L07O3l34o5J91
4817A9j59LJ55K29l21Q1j25L00j67q0M5j23M6L55l16K38o9k97K59p8j84L12k44
4840a21R4j57K70J3j60r3K41j61k10L55K6j82K87n8k95Q4m4j13M06j38L3J63l41
4863a01J17R9p6J20k62kK04k51L04l10K18L5J40j9r1k58L20j36k82L16j36j85
4885b36K91J24l20L12j03j13J07J06l12N4J28l36L25j72J46j20J71q2J9n3J7j90
4907b37K33K04k14K40n39L28q9JK7N9k88K56k15L49p5K8j73J26p6J77K4q3k70
4930b07L57j41k5j31J85N4k43K15j78n9J97k23O3J22j8j08p4K53K31j49l34P9
$$ plain form
4952 -134 49 -92 198 -79 -176 38 256 118 -88 -157 -344 0 -231 12 129 -148 -74 1 357 -34 -98 -141
4974 -141 98 223 -21 -9 29 -152 38 272 -215 -144 4 150 9 223 -155 -80 224 16 244 -115 29
4995 29 -169 -163 349 89 -68 219 -21 -106 -137 -130 174 -86 -167 -6 107 -56 -31 3 -53 -42 -53 -197 168 -6
5019 -6 -304 -112 0 67 -10 34 141 188 -90 -29 -49 -106 -26 -137 -78 36 217 2 30 -243 -40 -50 -206 85
5043 85 248 113 -61 -94 -68 -183 -17 145 56 48 -148 -74 -41 247 5 -167 -18 56 -56 26 -146 -69 39 24
5067 24 -182 94 -97 -108 281 -241 -112 -170 12 -23 103 55 88 -7 -19 33 -247 -72 -84 21 172 209 -107 128
5091 128 16 76 -73 104 -55 -117 260 -82 52 -111 52 -155 156 -68 -56 307 -68 -26 76 85 -94 12
5113 12 169 -142 139 -194 -77 77 -59 62 -10 159 -97 130 198 -91 -166 -49 20 -43 50 67 134 -121 7
$$ packed form
4952a34J83j41K90k77r7K14K18j38k06o9j87L44k31K43J17k77P4P5L56l91o4m3
4974a41K39J25k44J2L8j81J90K34m87P1J48J46j41K14l78P5L04k08K28l59J44
4995B9j98ON12k60j57K87k40q5l1PL04k60q1J61J13j63K5L4n6J1j1j44L65j74
5019fk98J92J12O7p7M4J07M7k78O1k0n7Q0j11N9J14J81k15K8k73K03j0j56K91
5043H5J63j35j74l3K6j15J66J62q9qj96P4L3K88k42j72J49P4j12Q2j72P7J08j5
5067B4k06K76j91j1L89n22J29n8J82l5J26m8L3r5j2N2k80J75j2J05J51L7l16K35
5091A28j12O0j49J77j59o2L77l42J34j63J63k07L11k24J2L63l75M2J02Rj79J06
5113A2J57l11K81l33J17J54j36J21p2J69k56K27O8k89p5J17O9o3R3J7O7k55J28
$$ plain form
5136 7 -109 -92 189 211 -171 -71 -113 182 21 -189 116 -37 183 128 -132 45 -32 -63 199 -132 39 -139 5
5159 5 126 231 66 127 21 -32 67 32 126 -219 180 157 59 -119 -256 -130 -31 159 -206 -52 -114 -5 -22 -4
5183 -4 -139 96 165 -12 26 213 49 -51 -65 121 -59 -193 34 -169 33 -14 -132 11 -64 261 4 208
5205 208 72 -186 -98 -29 65 51 -321 -38 130 -167 63 129 83 -17 135 215 -98 75 108 133 -179 25 -39
5228 -39 -236 88 -132 -320 1 172 -101 61 181 145 -205 -162 -57 -86 40 86 142 -33 -22 -21 213 -65 166
5251 166 92 -56 -27 -138 137 -113 69 13 -236 128 59 -74 -191 241 103 -249 -154 -36 189 3 205 147
5273 147 -99 -122 27 242 -10 97 17 -77 156 -100 26 -257 -37 -55 -284 9 194 -31 123 -69 -134 27
5295 27 -265 21 -104 111 160 31 113 137 -35 147 185 -97 -220 -70 151 176 -46 21 -77 301 7 102 213
$$ packed form
5136Gj16J7K81K2l82J00m2K95j61k10L05j53K20n5k60J77p7l1K62l31J71j78J44
5159EJ21J05j65O1j06n3R9l5R4l45L99k3r8j78j37J26R9J90l65J54o2J09j7J8
5183dj35K35O9j77L8J87j64j00j4J86j80j34K27k03K02m7j18J43p5L25k57K04
5205B08j36k58Q8O9R4j4l72K83J68k97K30O6m6j00J52Q0l13J73L3K5l12K04o4
5228c9j97L24k20j88L21J71k73J62J20l6l50M3J05k9J26M6N6j75J1JK34k78K31
5251A66p4j48K9j11K75k50J82n6k49L64o9j33j17M32j38l52R5J18K25j86K02n8
5273A47k46k3J49K15k52J07q0r4K33k56J26k83K20j8k29K93J85k25J54j92o5J61
5295B7k92K86j25K15M9j29Q2K4j72J82L8k82j23J50K21K5k22O7r8L78k94R5J11
$$ plain form
5318 213 -21 13 55 -94 -31 -76 -133 -68 137 -13 -193 327 -306 13 66 131 111 52 112 -38 -31 -19 -100 63 19
5343 19 -56 -359 -96 146 42 -67 164 29 -110 -17 2 -92 100 3 -259 -56 34 -35 215 -51 -26 75 -168
5366 -168 -48 -65 -20 -159 -106 167 153 13 305 -5 27 35 162 -189 -142 69 -37 105 273 -19 38 -154 -73
5389 -73 -69 18 -103 24 -62 -64 -105 103 -69 250 12 64 152 -37 96 -208 88 -144 -64 -103 126 -95 -91 -259 57
5414 57 114 -36 -100 -159 -154 224 -112 151 109 159 -24 -104 -159 -3 -203 -94 33 -53 204 -113 -99 -50 195 175 181
5439 181 -136 -45 -22 118 200 60 197 144 -13 -23 91 64 -104 -71 -1 -161 89 -100 70 66 55 -91 -291 -149
5463 -149 -43 101 30 205 -114 127 -15 -19 469 -102 65 -58 -243 -157 72 132 215 95 63 -95 -55 29 -242
5486 -242 503 149 -239 -108 -123 -93 44 326 152 -76 41 -26 -74 150 -162 1 -23 -3 169 -116 106 -269
$$ packed form
5318B13k34L4M2j49O3m5n7O5K05j50j80N20o33L19N3O5k0n9O0j50PJ2q1J63m4
5343A9p5l03K63K42j04j09K31j35j39R3J9r4J92r7k62K03R0o9K50k66K5J01k43
5366a68J20j7M5j39N3K73j4j40K92l10L2QJ27l51M7K11j06J42J68k92N7j92Q1
5389g3MQ7j21J27q6km1K08j72L19k38N2Q8j89J33l04K96k32Q0l9K29k21Mj68L16
5414E7N7j50o4n9NL78l36K63m2N0j83q0n5J56k00J09J27q6K57l17J4M9K45k0O
5439A81l17R1K3J40Q2j40J37n3j57j0J14k7j68L3P0j60K50j89J70mj1j46k00J42
5463a49J06J44p1J75l19K41j42mM88n71J67j23j85Q6K29O0Q3j20l2j58M0Q4k71
5486b42P45l54l88J31j5L0J37K82j74k28J17o7m8K24l12J63k4K0J72k85K22l75
$$ plain form
5508 -269 -150 34 -48 53 58 66 164 140 42 -13 -139 -254 83 -5 -144 132 63 -44 199 -124 130 194 -63 -242
5532 -242 91 89 82 -54 -1 -385 49 -81 -124 -204 42 54 156 -51 202 -308 57 106 -153 -189 -8 -68 -174 211
5556 211 224 211 117 -210 142 150 80 16 104 -164 -102 -276 -115 -265 -114 -41 57 -202 -81 -235 -205 -154 -14 347
5580 347 -93 25 184 155 -228 63 -109 25 65 200 166 114 132 118 -67 -113 1 -158 94 -205 -32 -97 52
5603 52 90 55 152 -147 251 -7 255 28 131 -2 162 -4 -70 -88 105 141 -168 133 -193 -24 -213 -172 -115
5626 -115 135 -88 -72 254 145 117 -50 -236 96 -185 -69 171 51 -371 -133 -163 57 -99 -53 -86 -72 -145
5648 -145 -179 -112 41 -2 59 12 134 78 30 -45 248 124 276 187 -183 -168 118 295 67 69 23 19 335 -50 -34
5673 -34 96 225 -77 91 -24 -26 -96 -50 162 319 227 68 -136 158 -227 23 92 -102 -5 83 145 -127 111
$$ packed form
5508b69J19J84q2J01NQR8k4r8n5j26j15L37q8j39K76o9j07K43l23K54O4k57j79
5532b42L33kpj36N3l84M34j30m3q0K46J2J02k07K53n10L65M9k59l6J81o0j06L85
5556B11J3j3r4l27L52Qp0o4Q8k68O2j74J61j50J51P3R8k59J21j54L0N1J40L61
5580C47m40J18J59k9l83K91j72J34M0J35l4n2J8j4j85m6J14j59K52k99J73o5J49
5603E2L8l5R7k99L98k58K62k27J03j33J64j66o6j8J93L6l09L01l26J69j89M1N7
5626a15K50k23J6L26j09k8j67j86L32k81J16K40j20m22K38l0K20j56M6l3J4p3
5648a45l4O7J53m3O1m7J22n6m8p5K93j24J52q9l70J5K86J77k28Km6mL16l85J6
5673c4J30J29l02J68j15kp0M6K12J57r2j59k04K94l85K50O9j94R7Q8O2k72K38
$$ plain form
5696 111 -114 -114 50 142 105 93 -106 96 -47 -21 103 -97 14 -13 84 -109 88 -171 -105 38 -59 -4 28 44
5720 44 40 -102 -350 75 77 -264 -274 -128 31 155 157 254 -127 111 63 93 -255 -93 61 -69 59 34 22 255
5744 255 78 63 -41 -20 386 8 -75 -244 -17 38 147 -50 -206 -131 98 -203 86 -175 85 97 -227 200
5766 200 174 -59 -359 106 83 -61 -116 19 -191 -84 -47 -132 112 -22 -123 265 203 73 -58 -127 37 59 -117
5789 -117 -110 -174 -51 63 -235 -11 -245 -80 -66 -83 -86 -135 -44 27 131 -63 -119 -60 -39 -110 156 109 39 -57 -10 -66
5815 -66 210 39 -53 85 -79 -37 -67 32 -91 -66 51 176 -114 61 -93 -8 63 -134 -93 -122 -32 -49 -143 -88 -122
5840 -122 -125 -124 -44 254 -133 8 180 -132 57 -57 64 -24 253 146 -8 150 3 -187 -117 17 183 308
5862 308 -218 9 -19 -208 -71 61 -88 -64 258 -33 116 -28 -18 48 65 -53 -4 186 -217 -89 -73 -58 143
$$ packed form
5696A11k25%J64R2l7j2j99K02j43K6J24k00J11k7R7j93J97k59O6J43r7N5L2J6
5720D4mj42k48M25Kl41j0J46J59J24KR7l81K38m8L0l48J62J54j30J28k5j2K33
5744B55j77j5j04K1M06l78q3j69K27N5J09j97j56P5K29l01K89k61K60J2l24M27
5766B00k6k33l00M65k3j44n5J35k10J07L7q5K44j34j01L88o2j30j31o9J64K2j76
5789a17Po4J23J14k98K24k34J65J4j7lm9R1P1J04j94n6N9K1p1K66m7p0r6M7n6
5815f6K76j71r2J38j64M2l0R9j23K5J17J25k90J75j54Q5P1j97M1k9R0j7r4N5l4
5840a22lJQ0K98l87J41J72l12J89j14J21q8K77j07j54J58j47j90P0J34J66J25
5862C08n26K27k8j89J37J32j49K4L22k91J49j44J0O6J7j18M9J90m03J28J6J5K01
$$ plain form
5885 143 105 -6 -157 36 -109 30 22 -46 -150 -206 35 -129 38 -87 5 70 -224 232 -133 -96 -86 -40 72
5908 72 -30 3 242 22 61 207 -132 -140 1 100 65 9 119 -73 188 99 -71 -156 -17 -11 -194 34 48 170
5932 170 33 -24 -105 115 505 -87 209 -24 20 -126 -149 -138 326 -55 -124 -113 -80 128 44 69 237 -60 50
5955 50 -47 -24 80 288 -76 -74 -41 4 -358 -93 -151 187 -169 -21 106 -273 99 -1 112 112 49 -108 139 17
5979 17 155 76 -27 16 -122 121 -280 -157 -27 151 99 -237 -56 -164 -147 67 200 -66 96 3 133 -19
6001 -19 214 -16 42 -208 -159 75 250 25 -41 35 -2 21 -324 -75 -94 86 40 64 -68 -62 -64 238 44 49 -103
6026 -103 -74 0 59 -37 73 -83 239 -158 86 -35 -68 -83 74 -251 -97 -56 -27 -230 108 -12 70 -163 -105
6049 -105 -163 122 62 -110 356 -170 130 35 -148 -65 10 -183 104 101 58 -6 -89 143 -318 143 -32 -146 -7
$$ packed form
5885A43l8j11j51J93j45J39qo8j04n6K41j64J67j25R2O5k94M56l65L7J0M6J12
5908G2j02L3K39k20L9J46l39qJ41R9l5n6J10j92K61q9j70q5J39Oj83K28J4J22
5932A70j37n7q1K20L90n92K96k33M4j46k3J1M64l81o9J1L3K08q4K5J68k97J10
5955E0r7K3J04K08l64KL3M5l62K65n8L38l56J48J27l79L72j00J13%o3j57K47j22
5979A7J38p9j03M3j38K43m01J23J30J78n2l36J81j08J7K14J33k66J62r3J30j52
6001a9K33k30N8k50M9K34J75k25o6P6l7K3l45K49j9J80m6K4j32OkL02j94Nj52
6026a03K9P4N9r6J10j56L22l97K44j21l3j5J57l25J54M1K9k03L38j20Q2k33N8
6049a05n8K85o0j72M66n26L00r5j83Q3P5j93K87lm3o4q3K32m61M61j75j14J39
$$ plain form
6072 -7 -116 149 81 -12 -105 11 21 -164 -59 216 229 -30 134 -68 -7 124 -90 258 -215 -201 -63 -77 80
6095 80 -129 189 147 185 223 -144 160 -35 111 -70 -61 70 384 -38 -45 28 47 264 -61 -13 -65 -55 -38 -39 74
6120 74 -6 86 86 -15 194 106 75 283 46 85 -195 113 26 103 22 -4 133 -43 108 -171 -57 248 91 163
6144 163 -102 -42 -41 -147 -83 -109 -14 180 -103 -114 -95 -86 156 -28 -139 113 -119 -73 -5 -21 143 -70 103 -57
6168 -57 52 127 -116 29 -125 283 42 -82 23 -133 69 87 100 -74 -74 18 -99 41 -8 -46 -31 -180 125
6191 125 130 156 86 143 -269 5 -14 -131 33 -83 164 57 -95 -12 -219 80 -59 -160 76 -37 46 71 -7
6214 -7 149 -223 -163 -155 89 306 -145 -64 -67 208 -100 -60 -51 74 136 -121 322 -190 -81 37 -94 111 -46 -2
6238 -2 172 -97 50 -67 -31 -37 170 41 -42 -107 -77 -31 66 48 164 -166 -75 -50 92 5 86 140 -34 128 19
$$ packed form
6072gj09K65o8r3r3J16J0j85J05K75J3k59J64k02O1J31k14L48m73J4J38j4J57
6095H0k09L18m2L8L8l67L04j95J46j81RJ31L14m22pP3J9K17l25M8n2J0J7jJ13
6120G4q0R2%j01K09q8l1K08k37L9k80L08q7P7q1k6J37j76J51k79J14L05j57P2
6144A63k65O0Jj06O4k6R5J94k83j1J9RK42j84j11K52k32M6O8j6J64k13J73j60
6168e7J09P5k43J45j54M08k41j24J05j56K02J8J3j74%R2j17J40m9l8J5j49L05
6191A25NK6p0N7m12K74j9j17J64j16K47j07j52Q3k07K99j39j01K36j13Q3K5p8
6214gJ56l72O0QK44K17m51Q1lK75l08M0RJ25O2k57M43n12J09J18j31K05j57M4
6238bJ74k69J47j17L6oK07j29q3o5L0M6R7j8J16l30R1K5J42q7Q1N4j74J62j09
$$ plain form
6263 19 92 19 -169 301 -191 332 165 -47 19 -219 -258 -149 11 -96 80 109 -265 100 -59 -87 -92 -210 31
6286 31 -147 -179 -141 142 -359 -41 -44 19 11 -11 -39 121 17 -89 183 -66 -69 26 158 72 40 -141 -164 -307 53
6311 53 176 -59 -146 -221 -53 -71 -14 177 -237 14 -104 114 -116 -12 119 -126 186 -76 112 -174 202 -233
6333 -233 -133 151 132 -103 16 186 -220 -163 -225 -188 123 58 -82 91 70 -182 -33 -1 21 216 -151 -81 45
6356 45 -73 -39 -10 -47 -161 -72 123 -72 -118 -37 114 -78 22 143 66 221 -176 142 43 -124 -237 -245 -163 41
6380 41 -72 8 -105 0 50 0 -279 -24 -38 -70 129 11 -409 193 15 -182 74 144 -146 -74 62 124 -97
6403 -97 18 140 -106 99 -71 -91 -16 -212 42 56 38 228 -21 -175 -124 95 -53 -82 21 -30 -25 -95 229 248
6427 248 17 6 -48 79 203 91 13 346 -110 -41 -42 28 42 8 77 -48 -70 -21 84 26 267 82 142 167 -137
$$ packed form
6263A9P3p3j88M70m92N23j67k12O6k38l9J09J60j07J76K9l74L65j59k8nj18K41
6286C1j78l2L8K83n01L18lO3qk2k8J60j04j06K72k49lR5J32q6l2j81k3j43L60
6311E3J23k35q7p5J68j8N7J91m14K51j18K18k30J04J31k45L12k62J88k86L76m35
6333b33J00K84j9k35J19J70m06N7o2L7L11o5j40J73k1k52J49L2K2J95l67P0J26
6356D5j18L4K9l7j14Q9J95j95m6Q1J51j92J00J21p7J55l97L18r9j67j13qQ2K04
6380D1j13Q0j13J05N0n0k79K55j4l2J99j18m20O02j78j97K56P0k90P2J36O2k21
6403i7J15J22k46K05j70k0P5j96K54J4j8J90k49j54N1K19j48k9J03n1Np0L24J9
6427B48k31j1n4J27J24j12p8L33m56O9jP0J4l4O9j25k2M9J05n8K41j85O0K5l04
$$ plain form
6452 -137 -30 20 -48 -51 35 249 -111 -15 102 214 41 -80 -25 127 -259 -88 109 226 196 -114 -16 68 -258
6475 -258 126 -34 -29 -54 -5 32 226 -12 134 56 -12 -168 -75 47 70 219 -32 -123 -16 -199 -45 22 -181 7
6499 7 -32 55 -199 -95 244 218 235 -58 63 191 -268 12 52 -13 -143 103 -74 291 -80 100 -55 131 45
6522 45 35 24 -175 -185 -13 67 156 90 74 -67 -181 -114 59 -212 -109 -132 -160 -1 -108 -98 84 253 100 24
6546 24 39 -61 -262 180 -204 -83 -65 -129 339 -69 -91 -4 -155 166 -60 35 124 -18 -84 -61 132 150 -184 10
6570 10 -87 75 48 -59 85 43 36 105 73 61 57 56 -31 -96 188 -114 -112 -46 -73 -47 -38 158 110 50 58 221 -213 -189 -65
6599 -65 -128 104 -95 -56 268 -199 29 -121 142 26 -190 -117 -49 -100 182 208 118 190 67 -35 101 219 -299
6622 -299 -180 54 -17 29 -162 27 -88 -31 -88 34 129 -170 -84 106 -278 -28 233 279 105 199 -262 -30 52
$$ packed form
6452a37J07N0o8lQ6K14l60R6J17J12j73j21N5J52l86J71J97J17l0l10R8Q4l26
6475b58L84j60Nk5M9L7J94k38J46p8o8j56R3J22K3J49k51r1J07j83J54O7k03J88
6499Gl9Q7k54J04L39k6J7k93J21J28m59K80M0o5j30K46j77L65l71J80j55J86q6
6522D5j0j1j99j0J72Q0Q9o6j6j41j14O7J73k71J03k3k8J59j07J0J82J69j53p6
6546B4J5j00k01M42l84J21J8o4M68m08k2Q7j51L21k26R5Q9j42o6K3J93J8l34J94
6570A0r7J62k7j07J44m2pO9l2j2mjq7o5K84l02KO6k7K6RJ96m8o0QJ63m34K4J24
6599f5o3K32j99L9L24m67K28j50K63j16k16P3O8n1K82K6r0P2j23j02J36J18n18
6622b99J19K34p1M6j91J89j15N7n7J22R5k99Q6J90l84K50K61M6j74R4m61K32Q2
$$ plain form
6645 52 -49 104 -130 2 -27 -71 -135 -58 -152 -45 -7 -302 40 -262 87 131 -1 -137 -56 73 -42 -142 86
6668 86 -127 -9 103 -177 26 -47 7 27 -193 14 60 147 151 -67 -102 121 94 -69 154 -15 17 -111 -28 265
6692 265 211 -13 -211 82 77 -163 -85 -29 5 -72 28 156 -93 -180 269 -210 86 -45 98 -281 -270 178 76
6715 76 162 -37 183 -127 136 157 -133 20 20 -97 45 -109 -150 46 -53 -316 -187 -40 38 14 35 281 195 236
6739 236 30 -42 -40 18 10 64 258 115 -84 93 121 229 7 53 125 7 448 265 -170 165 -178 63 67 -50
6763 -50 96 26 246 98 -86 2 66 -47 75 -162 -43 -15 -145 24 -78 -192 -153 -85 -45 258 -53 -127 -7
6786 -7 -42 0 253 -114 105 223 -158 31 49 98 -88 22 -52 -160 158 -3 26 112 -104 -57 178 52 185
6809 185 -186 56 -101 -39 116 74 -24 -120 238 -147 -162 -225 -56 22 36 -216 -19 118 114 63 -80 99 -35 -65
$$ packed form
6645E2j01J53k34J32k9m4o4P7r4J07L8k95L42l02L49M4j32j36Q1J29j15j00K28
6668H6k13J18J12k80K03p3N4K0k20K07M6Q7Mk18l5K23k7j63K23j69L2j28Q3K93
6692B65n4k24j98K93nk40P8N6L4p7J00J28k49q7M49m79K96j31J43l79J1M48j02
6715G6Q6j99K20l10K63K1k90J53%j17J42j54m1J96r9k63J29J47P8k4K1K46q6M1
6739B36k06p2KN8qN4J94j43j99J77K8J08k22M6P2j18M41j83m35L35l43K41Mj17
6763e0J46p0K20j48j84Q8O4j13J22k37J19K8j30J69j02j14L9O8M0L03l11p4J20
6786gl5M2K53l67K19J18l81J89J8M9j86J10p4j08L18j61K9Q6k16M7K35j26J33
6809A85l71K42j57O2J55m2r8r6L58l85j5o3J69P8J4k52J97J37mn1j43J79j34l0
$$ plain form
6833 -65 174 148 -34 -48 -131 -105 -119 66 -174 43 120 90 -107 222 -70 104 151 -104 108 -9 -107 -72 57 24
6857 24 8 -248 -21 205 -140 -58 -15 -9 6 -143 105 -66 -103 41 -107 -49 -123 -213 -254 -84 -136 111 306 -32
6881 -32 -14 -19 205 -208 -168 -30 261 -225 -190 -48 -30 104 -179 -8 -184 -90 -242 -113 82 96 -34 -102 -112 103
6905 103 20 75 48 -160 185 -162 -45 -42 66 -145 298 128 232 -284 199 25 -176 58 -132 -18 -15 -76 70
6928 70 -150 115 -127 -9 -83 -183 -121 173 -29 -151 17 -162 99 58 185 -156 -15 -31 15 -225 -97 80
6950 80 -232 217 24 -37 155 15 -14 224 -53 16 7 95 -84 -31 24 -41 132 -104 116 -84 -57 -29 2 98 97
6975 97 -17 72 -75 137 -120 -4 -140 58 177 -53 18 -170 -215 -2 177 -159 285 -60 -15 -302 -59 240
6997 240 178 196 20 43 -161 158 -64 -222 40 -217 -22 202 -166 102 84 -80 -62 -10 -263 142 -82 59
$$ packed form
6833f5K39k6j82j4q3K6j4J85k40K17P7l0j97L29k92J74M7k55K12j17r8L5J29l3
6857B4j6k56K27K26l45Q2M3OJ5j49K48j71l7J44j48N8p4r0m1J70n2K47J95l38
6881c2J8nK24m13M0J38K91m86L5J42J8J34k83J71j76R4j52J29J95J4j30o8j0K15
6905A03q3N5k7k08L45l47J17LJ08k11M43j70J04n16M83j74k01K34j90J14Lo1J46
6928G0k20K65k42J18p4j00O2K94k02j22J68j79K61m1J27l41J41j6M6k40J28J77
6950H0l12M49j93o1J92j40k9K38k77O9rQ8j79N3N5o5J73k36K20k00K7K8L1R6j
6975I7j14Q9j47K12k57J16j36J98J19k30P1j88m5K13J79l36M44l45M5k87K43K99
6997B40o2J8j76K3k04L19k22j58K62k57J95K24l68K68j8j64J8N2k53M05k24J41
$$ plain form
7019 59 100 -66 -130 124 -236 -203 -74 -4 -95 -141 -360 -122 130 223 -56 52 119 -170 183 25 -103 -39 117
7042 117 137 -47 45 -217 -94 145 106 65 173 32 122 -48 7 -42 -68 229 -172 85 32 -137 -77 14 60 61 -15
7067 -15 -87 283 -321 -5 28 76 29 -90 -129 119 -53 -18 -18 149 132 90 -15 196 16 -146 -93 161 61 -110
7091 -110 2 96 -36 -106 221 -12 43 -163 86 -101 72 -55 -111 37 -101 10 -217 29 31 -61 -4 121 -59
7114 -59 -207 85 162 -94 -93 -1 20 -243 -61 -103 144 154 199 -99 115 188 -195 -46 59 -55 -159 100 168 -38
7138 -38 96 -41 -257 -49 445 -94 238 -198 -29 223 -22 -98 87 274 -37 105 2 -94 175 129 120 84
7160 84 114 -88 -118 32 15 -123 47 163 -11 -5 -50 -297 191 -37 -155 20 -123 30 -158 13 -13 74 -113
7183 -113 -149 119 42 241 98 80 -83 -88 -317 30 -16 -68 -27 25 -9 -10 -178 85 -39 -134 2 69 92 -186 146
$$ packed form
7019E9M1j66o4K54l60L3J29P0r1m6k19K38K52R3k79J08O7k89L53j58j28O4J56
7042A17K0j84R2k62J23K39l9m1J08j41R0j70N5m9k6K97m01K57n3j69O0R1M6Jp6
7067a5p2L70o04L16L3M8m7j19l9K48j72L5%J67j7m2j05K11j80j62N3K54j00j71
7091a10J12R4j32p0L27k33N5k06K49j87J73j27n6J48j38J11k27K46Kr2N7J25j80
7114e9j48K92P7k56JR2K1k63J82m2K47J0M5k98K14P3l83J49J05j14j04K59O8k06
7138c8J34j37k16K08M94n39L32m36J69K52k45p6J85J87l11J42j03r6K69m6rl6
7160H4L0k02l0J50j7j38J70J16j74Om5k47M88k28j18J75j43J53j88J71k6Q7j87
7183a13l6K68p7J99j43j8j63nk29L47m6n2M1N2l4jj68K63j24r5J36O7K3k78L32
$$ plain form
7208 146 187 -67 71 -175 243 -54 227 -150 36 -27 96 -54 252 81 -10 -12 -189 37 -210 -173 27 -54
7230 -54 -170 -16 237 -57 105 -235 93 -60 -93 -63 -96 148 57 33 -56 88 139 200 -143 -140 -88 -128 196 26
7254 26 -89 -7 182 -398 -193 -109 -33 52 -64 99 119 -198 201 84 -52 -267 -199 144 -182 -147 12 -106 351
7277 351 -107 -153 -134 -302 57 -56 -14 -90 349 118 -159 -324 -17 26 -53 -170 13 -120 111 -81 40 -26
7299 -26 -42 8 22 -285 -126 -128 143 19 321 -120 43 80 68 228 7 5 255 -261 -205 -169 56 174 -308 63
7323 63 -143 -37 -146 -34 102 -3 -212 22 -213 -46 148 -219 39 -46 -34 117 -9 57 -81 -78 -38 -31 -12
7346 -12 -122 19 -167 153 -5 8 -154 -153 76 -47 -96 25 78 83 106 -15 89 -55 -69 -229 260 -132 60
7369 60 22 -259 235 103 -136 -257 105 323 -15 94 71 -14 -37 -175 -319 -121 283 -121 -101 26 74 -211
$$ packed form
7208A46M1k54J38k46M18k97K81l77J86o3J23j50L06j71r1kj77K26k47L7K00q1
7230e4j16J54K53k94J62l40L28j53l3L0l3K44r1k4q9J44N1O1l43LN2m0L24j70
7254B6j15Q2J89n80K05Q4P6Q5j16J63K0l17L99j17j36k15O8L43l26L5J59j18M57
7277C51m58m6J9j68L59j13M2p6M39k31k77j65L07M3p9j17J83j33K31j92J21o6
7299b6j6N0J4l07J59kK71j24L02m41J63L7j2J60k21kK50n16N6L6K25J18m82L71
7323F3k06J06j09J12J36j05k09K34k35J67J94l67K58q5J2J51j26O6j38LM0PJ9
7346a2j10J41j86L20j58J3j62JK29j23m9J21N3NK3j21J04j44j4j60M89l92J92
7369F0l8k81M94j32k39j21L62K18l38J09k3q5k3j38j44J98M04m04K0J27M8k85
$$ plain form
7391 -211 -109 -18 25 49 10 156 -154 -126 44 -46 -254 70 32 -44 -62 72 12 294 -122 -102 217 255 -117 2
7415 2 73 21 -44 -39 -160 -86 -53 -44 -19 -60 88 32 69 31 120 260 239 23 -111 -25 56 19 87 -81 29 167 -82
7442 -82 -80 -177 -47 64 123 178 -121 -259 25 91 91 6 116 -132 -130 53 -328 -9 111 120 -2 -64 138 25 -119
7467 -119 211 44 181 21 -31 -176 -246 12 -23 -184 149 -59 -82 -285 -106 100 -104 -56 -23 -27 61 51 77 -331
7491 -331 87 106 -27 148 34 206 29 -23 -81 476 -251 81 -76 98 141 -113 3 -19 -128 156 -114 -20
7513 -20 -98 84 161 103 18 72 40 -287 16 -74 -135 55 143 77 -39 -47 91 156 114 -175 -129 276 149 256 -186
7538 -186 160 192 68 246 50 -10 23 -154 10 -89 -347 -173 -76 -185 -80 78 -63 -54 95 -79 -157 63 -130
7561 -130 47 -21 160 -163 -137 67 103 81 -93 -177 -187 95 -11 -242 144 220 54 -222 -9 27 -294 214 -68
$$ packed form
7391b11J02R1M3K4l9J46l10K8J70r0k08L24l8p6j8J34o0K82m16K0L19L8l72J19
7415BP1n2o5Nj21P4L3RK5m1J48n6L7l8Q9J40k1k16j34Q6Q1l7O8j68J10J38k49
7442h2Kr7J30J11N9N5k99j38K84O6%q5J10k48KJ83l81L19J20Rj22o2K02j13j44
7467a19L30j67J37j60n2j45p0K58l5j61L33k08k3k03J79K06k04M8L3mQ8j0K6m08
7491c31M18J9j33J75j14J72j77n2n8N57p27L32j57J74M3k54J16k2j09K84k70R4
7513b0p8J82P7n8q5N4l2l27L03r0o1J90Q8o6j16qJ38O5m2k89M6M05j27J07m42
7538a86L46L2j24J78j96o0L3j77J64r9k58J74R7j09J05J58j41RJ49j74p8K20j93
7561a30J77o8J81l23K6K04L6k2j74q4j0K82j06k31L86P6j66k76K13L6l21N08k82
$$ plain form
7584 -68 -77 -95 36 67 127 95 172 -347 -130 -162 -20 186 33 -51 -179 -196 136 4 44 -96 -94 -6 -11 83 -96 136
7610 136 183 15 48 -37 70 -34 278 -183 28 1 -157 -9 92 126 39 -389 132 172 -133 -161 -201 -136 133
7633 133 -123 115 -155 -212 32 35 96 -40 1 130 -135 -45 59 -275 -98 91 -213 -245 -38 -174 7 51 -170
7656 -170 19 -22 19 -268 -204 -50 -213 227 -227 -123 291 82 181 -71 236 109 202 -64 116 84 17 222
7678 222 109 46 45 278 0 -16 -242 94 -146 -27 -13 -9 -77 86 205 47 -127 78 31 -75 205 9 -64
7701 -64 -37 143 255 -48 -123 44 -3 128 -83 -41 -167 -262 117 -105 73 -149 333 -28 81 -14 -24 10 144
7724 144 31 -111 51 61 -164 -47 -6 -78 -62 -72 125 -11 -60 -21 359 -89 110 -166 7 107 15 284 -64
7747 -64 92 -225 -145 73 -183 99 -222 -124 -202 287 -100 -74 226 35 83 47 256 163 -9 261 -138 76 -54
$$ packed form
7584f8rj8J31L1O0l2P7n19K17l2J42K06j53q4j28j7L32j32M0j40KQ8nR4j79K32
7610A36M7j68L3q5J07j04L12m61K11k7j58J48J01L4q7m28N21M0l05k8m0O5K69
7633A33k56K38k70n7K44LO1j36M1J29k65R0J04l34J77J89l04l2K07j36J81M4k21
7656a70J89m1M1k87O4J54j63M40m54J04M14k09R9k52L07j27R3k66J80l2o7K05
7678B22j13o3jK33k78j6k26L36k40J19J4Mo8J63J19j58j74K05m7j06K80j96p3
7701f4K7J80J12l03p5J67m7J31k11M2j26r5L79k22J78k22M82l61J09r5j0L4J34
7724A44j13j42J62J0k25J17M1p2J6j0J97j36m9L9L80m48J99k76J73J00r2K69l48
7747f4J56l17Q0K18k56K82l21R8p8M89l87K6L00j91M8l6K09r3j72K70l99K14j30
$$ plain form
7770 -54 135 -273 166 -76 11 -184 -378 28 99 74 -37 -45 32 71 -123 186 -142 108 -24 60 148 0 182
7793 182 -160 265 -73 -96 -77 -78 -133 82 -38 -43 234 -40 62 36 -57 285 33 9 113 36 428 -70 -285 -348
7817 -348 -217 -15 -187 90 -265 -23 -156 49 -185 148 7 -58 211 46 106 148 186 148 48 -158 -37 29
7839 29 121 -111 318 64 17 2 -140 -41 262 -96 51 -123 -22 -128 -128 -10 57 12 9 -56 -95 -59 61 87 -96
7864 -96 127 27 -18 -112 109 23 -151 -96 271 150 21 -36 135 25 55 127 99 -88 -4 -29 61 25 -33 -366 -147
7889 -147 25 14 -147 189 43 62 6 -216 -314 47 220 -248 -203 -75 19 225 174 37 43 -96 104 -78 15
7912 15 390 76 67 -3 -274 233 67 32 -246 -100 -14 124 60 115 22 -144 -93 -116 -281 -3 91 -63 80 44
7936 44 -289 54 -154 231 111 -123 -152 -208 75 -89 173 -59 181 47 -18 196 -32 48 191 -120 172 109
$$ packed form
7770e4J89m08M39k42Q7j95j94M06P1k5j11qP7L9j94L09l28K50j32Q4Q8j48J82
7793A82l42M25l38k3J9jn5K15j20nK77k74J02k6r3L42k52k4J04p7L92m98k15o3
7817c48J31K02j72K77l55K42j33K05k34L33j41o5K69j65O0M2L8l8j00k06J21O6
7839B9R2k32M29k54m7j5j42R9L03l58J47j74J01j06%J18O7m5lo5l9L6J20K6j83
7864i6K23j00m5r4K21q6j74N5L67j21j29n7J71j10L0P2k8j87Q4k5R0l6n8l33K19
7889a47J72j1j61L36j46J9n6k22r8L61J73m68M5J28R4K06n1j37Oj39K00j82R3
7912A5L75l14rp0k71N07j66l5k78J46Q6J38o4N5r3j66N1k3j65K78R4j54J43l6
7936D4l33L43k08L85j20k34k9n6K83j64K62k32K40j34o5K14k28Q0J43l11K92o3
$$ plain form
7958 109 -43 -51 167 96 49 56 -188 -19 79 195 -244 169 147 112 50 210 98 -292 6 -66 52 -9 35 -22 -9
7983 -9 91 -7 76 15 113 21 108 -159 62 -71 -106 -117 -82 66 -68 -36 -110 -51 -12 286 -50 -129 119 168 89 26
8009 26 4 -108 74 6 91 56 191 31 32 47 124 48 247 -131 197 -147 -57 -41 185 109 229 93 47 -192 36
8034 36 74 0 -203 58 27 -5 -50 -172 64 -14 174 2 44 177 -78 -94 -19 -55 99 -24 47 -259 -151 -65
8058 -65 89 -142 155 187 -112 -17 57 227 -154 -237 310 -158 -117 81 286 82 -165 -382 102 -352 83 -18
8080 -18 -68 28 -151 -130 -104 -64 -30 -168 -161 193 -125 16 75 -66 48 176 26 62 83 120 174 143 48 -94 133
8105 133 -75 -115 105 206 35 -87 87 94 38 -47 115 -75 -237 147 169 -121 -135 -269 92 404 -25 -158
8127 -158 -66 -2 232 289 -7 -1 -113 -362 -61 -91 43 221 116 -68 -68 -72 126 -23 -105 136 43 -184 -101 -72 -105
$$ packed form
7958A09j52qK18p1m7Pk44J69R8J16m39M13k2l5o2J60j12l90K98p2J18o1M4n7J3
7983iJ00r8Q3o1R8r2Q7k67K21j33l5j1L5J48j34L2p4N9L9K98l36p9K48M9p9o3
8009B6k2j12J82o8Q5l5J35j60JJ5P7p6J99l78L28l44R0J6K26p6J20j36m6k39K28
8034C6L8p4k03K61l1l2m5j22K36p8J88j72M2J33k55j6P5l6J54j23P1l06J08Q6
8058f5J54k31K97L2k99R5P4J70l81q3N47m68M1J98K05k04k47k17M84m54M35j01
8080a8n0R6j79K1K6M0L4j38PL54l18J41N9j41J14J28j50L6K1L7N4l1r5j42K27
8105A33k08m0K20J01j71j22J74Pn6q5J62j90j62L84K2k90j4j34L61L12m29j33
8127a58R2O4K34N7k96Oj12k49L01l0J34J78j05j84%mJ98j49q2K41r3k27Q3K9l3
$$ plain form
8152 -105 114 -136 -111 -82 -341 -195 -254 222 9 35 -231 186 187 198 189 37 126 202 97 27 -118 -213 -207 177 2
8177 2 177 108 215 75 -207 196 249 -115 144 80 186 3 8 105
$$ packed form
8152a05K19k50K5K9k59J46n9M76k13K6k66M17JJ1rj52Q9P6j05p0j45r5OL84j75
8177BJ75o9J07j40k82M03N3l64K59o4J06j83NR7
8191A05
$$ Imaginary data points
##PAGE= N=2
##DATA TABLE= (X++(I..I)), XYDATA
$$ plain form
0 0 0 0 0 0 0 0 0 0 0 0 0 0 0 0 0 0 0 -8 8 -8 8 -8 10 -16 16 -17 24 -24 31 -32 39 -42 49 -55 63 -71 80 -88 98
39 98 -112 121 -137 152 -168 186 -204 225 -248 273 -302 333 -367 404 -445 495 -548 608 -680 761
59 761 -859 978 -1126 1314 -1565 1914 -2440 3316 -5051 9801 -50601 -162147 -46678 129413
73 129413 212027 135175 8174 -61931 -25345 55270 95666 37118 -75630 -137410 -75644 39578
85 39578 81093 10701 -75860 -80720 -3831 61869 54758 -2012 -46588 -50576 -18733 25003 43440
98 43440 12949 -29042 -20765 38863 77102 44492 -17942 -38573 -12160 12299 6919 -10251 -21692
111 -21692 -25952 -18112 5823 25454 12652 -22697 -35440 -6158 26884 20500 -10488 -22183 -6329
124 -6329 6221 2191 -731 5279 7695 4298 12898 31947 33681 9824 -9646 -3305 7740 -3641
$$ packed form
0@%%%%%%%%%%%%%%%%%qJ6j6J6j6J8k6L2l3M1m8N5o3P1q1R1j04J18j34J51j68J86
39I8k10K33k58K89l20L54l90M29m73N21n75O35p00P71q49R40j043J156j288J441
59G61j620J837k104K440k879L479m354N756q367J4852o0402j11546J15469J76091
73A29413Q2614p6852j27001p0105L6586Q0615M0396n8548j12748o1780O1766J15222
85C9578M1515p0392q6561m860P6889O5700p111n6770m4576l988L1843M3736J8437
98D3440l0491m1991Q277N9628L8239l2610o2434k0631K6413K4459n380j7170j1441
111b1692m260P840K3935J9631j2802l5349j2743K9282L3042o384l0988j1695J5854
124f329J2550m030k922O010K416l397Q600J9049J734k3857j9470O341J1045j1381
$$ plain form
138 -3641 -28386 -36630 -23428 -12829 -16588 -17800 -7560 1913 3189 9163 26387 38249 27118
151 27118 7958 6746 16884 8926 -15458 -25482 -13438 -5176 -10919 -11398 996 8454 -498 -8487
165 -8487 -485 6969 -2318 -13525 -6409 8656 10311 482 -2473 7053 13389 7628 510 3859 8313
180 8313 841 -10154 -8798 -1081 -4574 -15789 -14564 944 9700 2582 -1877 8273 14964 5233
194 5233 -5675 -2534 3776 -2197 -10804 -6297 3897 2929 -6209 -6363 4055 8779 1927 -2563 4609
209 4609 11393 6125 -2649 -1786 3208 -1349 -11897 -12201 -2429 430 -7035 -7667 2757 9099 3929
224 3929 -1350 4272 11085 7053 -1904 -1344 4790 2623 -6366 -8450 -1573 2104 -3655 -7266 -373
239 -373 6875 2241 -5842 -3136 3974 1462 -6416 -4722 4597 7263 781 -244 7397 9885 1444
$$ packed form
138c641k4745q244J3202J0599l759j212J0240R473J276N974J7224J1862j1131
151B7118j9160j212J0138p958k4384j0024J2044Q262n743m79J2394P458q952p989
165h487Q002P454r287j1207P116J5065J655r829k955R526O336n761p118L349M454
180H313p472j0995J356P717l493j1215J225J5508Q756p118m459J0150O691r731
194E233j0908L141O310n973q607M507J0194r68r138j54J0418M724o852m490P172
209D609O784n268q774Q63M994m557j0548l04R772K859p465o32J0424O342n170
224C929n279N622O813m032q957N60O134k167q989k084O877L677n759l611O893
239c73P248m634q083K706P110k512p878J694R319K666o482j025P641K488q441
$$ plain form
254 1444 -4905 -1113 2150 -3941 -10419 -7441 -873 -327 -4001 -2820 4770 8619 4421 1315 4941
269 4941 7936 2267 -5352 -4846 -169 -2168 -9194 -8617 331 3421 -1894 -2661 5615 9282 2814 -1174
285 -1174 3384 6901 1695 -4458 -2570 2271 30 -6110 -5491 -488 554 -3882 -5267 -315 3319
300 3319 753 -2262 1206 6501 5371 144 674 5524 5008 -1545 -4063 -235 818 -4390 -7810 -3799
316 -3799 498 -1589 -4990 -1446 4305 4354 138 593 5118 5633 128 -2736 534 2743 -891 -4746
332 -4746 -1990 2512 639 -4047 -2582 2153 1784 -2865 -2456 2577 4138 297 -1359 2044 3839 801
348 801 -2660 -1593 806 -1062 -4453 -4214 -549 816 -1318 -1782 2216 5874 4233 1322 2846 5715
364 5715 2960 -3134 -4068 -1324 -2018 -7044 -6961 -1441 982 -1783 -2017 2574 4991 2065 -225 2302
$$ packed form
254A444o349L792L263o091o478K978O568N46l674J181P590L849m198l106L626
269D941K995n669p619N06M677j999p026N77Q948L090n315p67Q276L667o468l988
285a174M558L517n206o153J888M841k241o140O19N003J042m436j385M952L634
300C319k566l015L468N295j130n227N30M850n16o553k518L828J053n208l420M011
316c799M297k087l401L544N751M9m216M55M525N15n505k864L270K209l634l855
332d746K756M502j873m686J465M735l69m649M09N033J561l841j656L403J795l038
348H01l461J067K399j868l391K39L665J365k134m64L998L658j641k911J524K869
364E715k755o094r34K744o94n026Q3N520K423k765k34M591K417k926k290K527
$$ plain form
380 2302 4616 2651 -401 -126 2232 803 -2059 -3509 -1194 -41 -2007 -3390 -1322 1562 450
395 450 -2384 -1668 1564 1896 -948 -1100 2433 3463 480 -1176 1401 2883 299 -1996 -29 1944
411 1944 552 -2398 -1924 205 -610 -2954 -3102 162 1804 744 241 2452 4191 1663 -1600 -2067
427 -2067 -887 -2407 -4669 -3637 34 1865 1176 2429 5208 6510 4321 2157 1588 961 -1899 -5068
443 -5068 -6398 -5347 -4749 -5125 -4320 -578 3013 3374 3258 4678 6216 3912 311 -156 1022 -448 -2738
460 -2738 -1804 1232 1532 -776 -514 796 209 -2730 -3691 -2815 -1973 -2655 -2624 -1083 807 1464 1798 2104
478 2104 3667 4737 3605 1945 1812 2015 4 -2532 -3044 -1896 -2156 -3421 -3026 -499 386 -1097 -1111
495 -1111 995 1616 272 95 1383 2144 706 -715 -708 -443 -962 -1901 -971 1192 2238 2417 3089 3952
$$ packed form
380B302K314j965l052K75K358j429k862j450K315J153j966j383K068K884j112
395D50k834P16L232L32k844j52L533J030k983j656K577J482k584k295J967J973
411A944j392k950M74K129q15k344j48L264J642j060n03K211J739k528l263m67
427b067J180j520k262J032L671J831o89J253K779J302k189k164n69o27k860l169
443e068j330J051N98l76Q05L742L591L61j16J420J538k304l601m67J178j470k290
460b738R34L036L00k308K62J310n87k939r61Q76Q42o82L1J541J890O57L34L06
478B104J563J070j132j660j33K03k011k536n12J148k60j265L95K527Q85j483j4
495a111K106O21j344j77J288P61j438j421PK65n19r39R30K163J046J79O72Q63
$$ plain form
513 3952 3632 1560 -650 -2378 -2865 -4527 -6052 -5465 -3421 -2065 -1334 460 2853 4546 4107 3912 3627
530 3627 3331 1676 -646 -1366 -1133 -1414 -1766 -1414 148 1193 849 -231 -169 -340 -2057 -4341 -3854 -2682
548 -2682 -2311 -1560 512 3482 4429 3960 4567 4746 3460 1144 -67 -938 -2715 -3548 -3948 -3605 -2902 -1917
566 -1917 -888 116 1129 2247 2084 1676 1313 1584 669 -994 -1064 -176 -252 -1206 -1033 237 602 -171 196
585 196 978 940 337 -124 898 800 -539 -1193 -970 -1284 -1975 -1850 -1289 -380 406 1567 1581 1906 1884 1592 766
606 766 161 -261 -782 -1249 -1237 -532 -259 -307 -36 538 538 158 -152 -542 -653 -1299 -1369 -1417 -584 111 815 1550
628 1550 2619 2932 2454 1764 1148 155 -1457 -2710 -2960 -3065 -3050 -2375 -969 430 1150 1630 2479 3009 2204
647 2204 1793 1357 708 -399 -684 -937 -1547 -1309 -1206 -731 -606 -738 -29 -221 -435 -356 416 361 -162 340
$$ packed form
513C952l20k072k210j728m87j662j525N87K044J356P31J794K393J693m39j95k85
530C627k96j655k322p20K33k81l52L52J562J045l44j080O2j71j717k284M87J172
548b682L71P51K072K970R47m69O07J79j286k316j211q71j777q33m00L43P03R85
566a917J029J004J013J118j63m08l63K71r15j663p0Q88p6r54J73J270L65p73L67
585A96P82l8o03m61J022r8j339o54K23l14o91J25N61R09P86J161J4L25k2k92q26
606G66o05m22n21m67J2P05K73m8K71N74%l80l10l90j11o46p0m8Q33O95P04P35
628A550J069L13m78o90o16r93j612j253k50j05J5O75J406J399P20M80Q49N30q05
647B204m11m36o49j107k85k53o10K38J03M75J25j32P09j92k14P9P72n5n23N02
$$ plain form
667 340 873 846 141 692 852 413 -189 -463 -75 -366 -881 -552 310 -391 -512 224 30 16 -14 233 237 -24
689 -24 112 265 125 14 125 125 -379 -635 -162 282 -98 2 698 1185 902 486 942 716 215 -100 -433
710 -433 -1070 -1514 -2132 -1631 -1110 -978 -480 424 1129 1046 1776 1939 1796 1119 821 218 -45 -349 -1131 -1012 -1052
731 -1052 -1059 -1414 -1068 -513 -382 -422 -3 77 304 308 868 1075 708 612 910 699 251 -329 -15 -317 -1001 -847
753 -847 -456 -685 -998 -527 131 230 224 260 1054 901 216 815 340 -203 -366 -103 -214 -614 -457 -18 -130 -279
775 -279 81 658 574 543 604 1037 400 -166 345 222 -465 -582 -770 -503 -632 -935 -455 -185 -371 57 179
796 179 828 648 799 1048 1013 653 396 415 -188 -715 -768 -596 -995 -1060 -620 -400 -307 417 324 654 577 457 244
819 244 473 75 -177 -90 -27 -77 -175 -518 -147 -69 -132 -54 -85 177 -47 -194 -40 181 248 450 603 440 292
$$ packed form
667C40N33k7p05N51J60m39o02k74L88k91n15L29Q62p01j21P36j94j4l0K47Mk61
689b4J36J53j40j11J11%n04k56M73M44l80J00O96M87k83m16M56k26n01l15l33
710d33o37m44o18N01N21J32M98R04P05q3P30J63j43o77k98o03k63l04p82J19m0
731a052pl55L46N55J31m0M19Q0K27MN60K07l67r6K98k11m48n80L14l02o84J54
753h47L91k29l13M71O58R9oL6P94j53o85N99m75n43j63K63j11m00J57M39j12j49
775b79L60N77q4l1O1M33o37n66N11j23o87j17j88K67j29l03M80K70j86M28J22
796A79O49j80J51K49l5l60k57J9o03n27n3J72l99o5M40K20R3P24r3L30p7j20k13
819B44K29l98k52Q7O3n0r8l43L71P8o3P8l1K62k24j47J54K21O7K02J53j63j48
$$ plain form
842 292 218 -104 -413 -684 -528 -797 -727 -1091 -203 571 156 557 874 1362 769 816 956 470 30 -233 11
863 11 -774 -824 -962 -614 -534 -836 -295 -19 -125 78 646 794 599 594 893 662 172 327 65 -452 -850 -982
885 -982 -248 -512 -714 -394 484 302 234 467 497 172 80 -57 -318 -400 -137 -184 -205 -41 144 314 266 75 141
908 141 221 35 -267 -28 75 36 368 580 435 300 595 173 -112 -455 -962 -1234 -958 -751 -721 -248 225
929 225 857 1242 1360 1712 1489 883 301 217 -396 -1186 -1275 -933 -794 -864 -650 -202 -9 -60 281 413 479 293
951 293 653 826 555 237 546 281 -170 65 -269 -588 -627 -623 8 -356 -457 167 452 241 38 432 480 -43
973 -43 -372 25 53 -250 -269 186 182 -31 207 54 177 -145 -356 -175 -336 -387 -108 340 369 376 646 550 226 62
997 62 186 -509 -1039 -871 -658 -756 -264 -71 759 873 898 1007 827 738 238 -243 -376 -579 -1026 -1214 -743 -227
$$ packed form
842B92p4l22l09k71J56k69P0l64Q88P74m15M01L17M88n93M7J40m86m40k63K44
863A1p85n0j38L48Q0l02N41K76j06K03N68J48j95nK99k31m90J55k62n17l98j32
885i82P34k64k02L20Q78j82o8K33L0l25r2j37k61q2K63m7k1J64J85J70m8j91O6
908A41Q0j86l02K39J03l9L32K12j45j35K95m22k85l43n07k72K76K07L0M73M73
929B25O32L85J18L52k23o06n82q4o13p90q9L42J39p0K14M48J93n1L41J32O6j86
951B93L60J73k71l18L09k65m51K35l34l19l9MO31l64j01O24K85k11k03L94M8n23
973d3l29L97K8l03j9M55mk13K38j53J23l22k11J81j61n1K79M48K9PK70r6l24j64
997F2J24o95n30J68K13r8M92J93Q30J14K5J09j80q9n00m81j33k03m47j88M71N16
$$ plain form
1019 -227 -440 -281 344 501 371 493 586 524 403 265 124 113 -117 -25 -206 82 -49 -463 -349 -601 -752
1040 -752 -281 -461 -125 137 429 785 229 415 548 276 144 285 -8 54 -321 -556 35 -32 -637 -352 -322
1061 -322 -227 -323 -334 -205 410 173 49 392 607 196 357 351 50 -76 -411 -60 -701 -461 -214 82 326 187
1083 187 685 524 271 471 258 -519 -583 -669 -668 -644 -804 -449 207 166 205 508 750 589 256 576 588 168 8
1106 8 -87 2 91 -177 -382 -254 -246 -413 -582 -548 -649 -428 -71 240 151 489 882 538 720 727 638 370 -110 -172
1130 -172 -248 -578 -661 -372 -285 -336 -555 -344 -30 143 12 313 368 1 132 485 557 168 376 339 42 62 -376
1153 -376 -326 -255 -253 -208 -283 165 -29 60 204 159 108 -58 -84 -102 -278 -593 -371 -315 -409 -240 139 167 205 134 689
1178 689 209 96 279 268 84 -240 -94 -153 -236 -493 -95 -193 -509 -270 -256 97 -110 76 411 196 461 172
$$ packed form
1019b27k13J59O25J57j30J22R3o2j21j38j41j1k30R2j81K88j31m14J14k52j51
1040g52M71j80L36K62K92L56n56J86J33k72j32J41k93O2l75k35N91o7o05K85L0
1061c22R5r6j1J29O15k37j24L43K15m11J61ol01j26l35L51o41K40K47K96K44j39
1083A87M98j61k53K00k13p77o4q6JK4j60L55O56m1L9L03K42j61l33L20J2m20j60
1106Hr5Q9Q9k68k05J28Qj67j69L4j01K21L57L11q9L38L93l44J82Pq9k68m80o2
1130a72p6l30q3K89Q7n1k19K11L14J73j31L01N5l67J31L53P2l89K08l7k97K0m38
1153c76N0P1KM5p5M48j94Q9J44m5n1j66k6j8j76l15K22N6r4J69L79K8L8p1N55
1178F89m80j13J83j1j84l24J46n9q3k57L98r8l16K39J4L53k07J86L35k15K65k89
$$ plain form
1200 172 365 622 323 471 303 208 -224 -484 -156 -366 -372 -285 -81 -192 -284 59 61 106 153 86 212 216 3 24
1224 24 33 -48 -85 -145 -125 -287 -466 -90 -52 -193 222 25 247 351 149 -59 237 240 -38 -146 -177 -378 -400 -373
1248 -373 -209 -431 -189 -78 181 -118 144 74 227 20 293 326 182 78 45 122 -154 -464 -110 -210 -136 -318
1270 -318 0 -97 4 9 -134 219 214 160 230 258 31 379 -75 13 -206 -236 -92 29 -57 84 -11 -54 -87 367 387
1295 387 292 85 41 -9 -220 -519 -162 -193 -323 -175 3 -259 -58 -59 198 347 45 133 409 370 -124 -96 259
1318 259 -101 -437 -284 -355 -202 -264 -506 -50 -223 -121 -64 199 183 -126 434 372 171 287 144 54 -84 -182
1340 -182 -364 -145 -504 -564 -373 -362 -70 103 -29 125 222 79 45 201 52 186 246 105 9 369 -28 59
1362 59 -344 -234 -21 -127 -292 12 -211 -61 -26 274 178 -115 -9 -97 -14 -308 -335 -174 -236 -381 139 249
$$ packed form
1200A72J93K57k99J48j68r5m32k60L28k10oQ7K04j11r2L43KM5M7o7J26Mk13K1
1224B4Rq1l7o0K0j62j79L76L8j41M15j97K22J04k02k08K96Lk78j08l1k01k2K7
1248c73J64k22K42J11K59k99K62p0J53k07K73L3j44j04l3P7k76l10L54j00P4j82
1270c18L18r7J01Nj43L53nn4P0K8k27L48m54Q8k19l0J44J21q6J41r5m3l3M54K0
1295C87r5k07m4n0k11k99L57l1j30J48J78k62K01jK57J49l02Q8K76l9m94K8L55
1318B59l60l36J53p1J53o2k42M56j73J02N7K63j6l09N60o2k01J16j43r0j38r8
1340a82j82K19l59o0J91J1K92J73j32J54R7j43l4J56j49J34O0j41r6L60l97Q7
1362E9m03J10K13j06j65L04k23J50L5L00r6k93J06q8Q3k94k7J61o2j45N20J10
$$ plain form
1384 249 202 -15 135 481 110 -5 147 -127 -17 -282 19 -130 -416 -72 -195 137 -112 -122 70 -97 -234
1405 -234 76 128 362 62 408 475 179 240 302 112 -264 -299 -267 -329 -228 -236 -307 -75 -101 20 38 71 59 90 374
1430 374 532 152 230 49 250 56 -59 47 109 -128 -238 123 -26 -195 -171 -49 310 145 303 323 130
1451 130 197 132 147 -28 -192 -254 -228 36 -12 -16 75 333 175 200 120 287 -168 -31 10 -305 -183 101 -278 124
1475 124 57 195 -102 -49 -30 -121 -36 -200 -58 120 234 164 -95 179 141 -51 -330 -107 -105 -519 -461 -64 -97 -43
1499 -43 11 201 184 218 -85 266 224 316 173 438 5 -87 -57 -250 -388 -200 -92 20 -198 -15 -87 -34 -244
1522 -244 60 94 316 554 117 234 241 133 -403 158 -57 -375 96 -52 75 3 58 138 31 183 3 -24
1544 -24 -141 -139 -341 -232 -11 -64 134 154 250 -77 71 222 -9 0 209 54 -138 325 7 -58 -193 -155 150
$$ packed form
1384B49m7k17J50L46l71j15J52k74J10k65L01j49k86L44j23L32k49j0J92j67j37
1405b34L10N2K34l00L46O7k96O1O2j90l76l5L2o2J01qp1K32k6J21J8L3j2L1K84
1430C74J58l80P8j81K01j94j15J06O2k37j10L61j49j69K4J22L59j65J58K0j93
1451A30O7o5J5j75j64o2K6K64m8mR1K58j58K5q0J67m55J37M1l15J22K84l79M02
1475A24o7J38k97N3J9r1Q5j64J42J78J14p0k59K74l8j92k79K23Km14N8L97l3N4
1499d3N4J90j7L4l03L51m2R2j43K65m33r2L0j93j38J88J08J12k18J83p2N3k10
1522b44L04L4K22K38m37J17Pj08n36N61k15l18M71j48J27p2N5Q0j07J52j80k7
1544b4j17Kk02J09K21n3J98K0R6l27J48J51k31RK09j55j92M63l18o5j35L8L05
$$ plain form
1567 150 -70 -66 -126 -313 -251 -269 -231 -64 134 -200 192 485 348 217 212 384 196 151 33 -65 -170 -214 -134 -493
1591 -493 -285 -262 32 -123 -93 -23 109 111 -288 277 273 285 364 32 -11 -23 -225 132 -123 -338 -238 -33 -54 -8
1615 -8 67 39 184 -29 -71 -144 -44 -89 21 -68 114 331 -35 133 244 220 -39 -106 22 6 34 84 -36 64
1639 64 -125 -120 -203 41 -82 -207 -276 -286 -259 -121 -206 45 -109 79 143 28 261 108 124 -222 96 121 -96 -227
1663 -227 -467 -136 -262 -483 -304 -150 46 -127 -18 18 -194 218 339 118 216 99 102 15 167 123 111 -172
1685 -172 -25 102 -125 52 -281 125 -223 8 120 54 205 -50 18 101 87 -82 -36 94 139 -115 -249 -148
1707 -148 -10 -174 -296 98 223 13 28 120 25 -84 -20 105 146 36 -85 -181 -94 -52 207 179 34 33 47 160
1731 160 31 -7 59 406 -89 -134 -61 34 -219 68 -39 130 -143 -11 99 224 -209 65 248 74 -80 -145
$$ packed form
1567A50k20Mo0j87O2j8L8J67J98l34L92K93j37j31nJ72j88m5j18r8j05m4Q0l59
1591d93K08K3K94j55L0P0J32Kl99N65mJ2P9l32m3j2k02L57k55k15J00K05k1M6
1615hP5k8J45k13m2p3J00m5J10q9J82K17l66J68J11k4k59o7J28j6K8N0j20J00
1639F4j89Nq3K44j23j25o9j0K7J38q5K51j54J88O4j15K33j53J6l46L18K5k17j31
1663b27k40L31j26k21J79J54J96j73J09L6k12M12J21k21R8j17Lq7J52m4j2k83
1685a72J47J27k27J77l33M06l48K31J12o6J51k55O8Q3j4j69M6J30M5k54j34J01
1707a48J38j64j22L94J25k10J5R2r5j09O4J25M1j10j21r6Q7M2K59k8j45jJ4J13
1731A60j29l8O6L47m95m5P3R5k53K87j07J69k73J32J10J25m33K74J83j74j54o5
$$ plain form
1753 -145 -1 155 234 -126 455 154 126 -103 203 33 177 -228 205 -79 92 53 -166 38 72 171 -170 121
1775 121 114 108 -180 -291 187 80 -493 -312 84 221 93 -247 243 428 330 298 -25 403 105 -153 -179 94
1797 94 -51 -324 -358 45 68 -209 -94 -40 140 -117 98 35 228 316 187 -154 -46 136 263 -79 -219 -45
1819 -45 -234 -117 -229 -12 -56 10 -322 193 289 -14 -125 297 272 130 -230 54 220 -2 -293 -99 -179 -46
1841 -46 -36 -218 277 238 144 -171 -169 32 -285 -393 309 264 -45 -205 -381 66 140 -87 -316 17 240 35 34
1864 34 291 178 367 -85 78 157 92 -237 -275 137 -177 -96 -61 234 127 59 235 66 170 130 -143 11 322
1887 322 324 -231 66 229 168 154 -93 -284 19 41 -189 138 -149 16 164 272 41 94 208 -71 99 295
1909 295 21 -150 -163 201 176 -366 -237 -43 92 -28 -77 254 4 -110 -266 25 105 116 -255 40 121 264
$$ packed form
1753a45J44J56P9l60N81l01k8k29L06j70J44m05M33k84J71l9k19K04L4R9l41K91
1775A21pok88j11M78j07n73J81L96J37j28l40M90J85r8l2l23M28k98k58k6K73
1797I4j45k73l4M03K3k77J15N4J80k57K15o3J93Q8j29l41J08J82J27l42j40J74
1819d5j89J17j12K17m4O6l32N15R6l03j11M22k5j42l60K84J66k22k91J94q0J33
1841d6J0j82M95l9r4l15KK01l17j08P02m5l09j60j76M47P4k27k29L33K23k05j
1864C4K57j13J89m52J63P9o5l29l8M12l14Q1L5K95j07o8J76j69J04m0k73J54L11
1887C22Kn55K97J63o1j4k47j91L03K2k30L27k87J65J48J08k31N3J14k79J70J96
1909B95k74j71j3L64k5n42J29J94J35j20m9L31k50j14j56K91Q0J1l71K95Q1J43
$$ plain form
1931 264 -128 -117 53 -223 -315 -47 32 95 40 173 -33 203 162 -163 -68 106 63 -29 -76 -11 74 -56 -258 -132
1955 -132 -87 230 -210 121 193 118 66 -135 252 211 -115 -130 7 166 -90 -125 -182 -209 -79 -271 -193 -199 279 -39
1979 -39 -63 44 151 -75 231 77 -24 69 -426 -217 114 24 -65 -133 -98 37 -43 -183 164 152 -173 -239 -32
2002 -32 -3 -70 -276 -116 41 277 -412 -235 204 -8 -217 135 160 -200 -50 -214 57 -30 247 118 -158 -57
2024 -57 -19 -94 -50 -114 116 5 -191 7 -1 -26 -84 -164 170 100 114 -155 212 159 253 -221 -231 -75 -182 -149 -220 107
2050 107 -116 -182 -63 85 -15 -290 -76 151 82 100 -66 115 9 -22 -166 11 137 94 -17 -269 13 49
2072 49 -90 -98 -255 247 66 -245 -22 151 119 -135 13 65 225 -152 -128 -206 116 54 -228 76 -50 -24 126
2095 126 7 -63 -153 -16 52 80 251 -93 -217 -123 -179 187 -36 -210 -63 -102 -247 -126 166 -6 122 116 132
$$ packed form
1931B64l92J1J70k76r2K68P9O3n5J33k06K36m1l25R5J74m3r2m7O5Q5j30k02J26
1955a32M5L17m40L31P2p5n2k01L87m1l26j5J37J59k56l5n7k7J30j92P8oM78l18
1979c9k4J07J07k26L06j54j01R3m95K09L31r0q9o8L5J35q0j40L47j2l25o6K07
2002c2K9o7k06J60J57K36o89J77M39k12k09L52K5l60J50j64K71q7K77j29k76J01
2024e7L8p5M4o4K30j11j96J98qk5n8q0L34p0J4k69L67n3R4m74j0J56j07L3p1L27
2050A07k23o6J19J48j00k75K14K27o9J8j66J81j06l1j44J77J26m3j11k52K82L6
2072D9j39qj57N02j81l11K23J73l2k54J48N2J60l77K4p8L22o2k82L04j26K6J50
2095A26j19p0r0J37O8K8J71l44j24R4n6L66k23j74J47l9j45J21K92j72J28oJ6
$$ plain form
2118 132 217 -147 -194 -116 341 217 28 106 82 -122 -224 -19 117 110 168 63 1 -65 -211 -56 278 233 280 -273
2142 -273 -132 184 -51 -15 -129 28 -85 50 68 -78 53 23 -70 -80 109 -215 -209 20 18 -45 -80 73 -152 38
2166 38 71 9 -40 248 -65 -120 -29 96 83 -79 82 52 -51 -123 -183 115 43 -37 53 -127 -24 -334 -53 -80 -25
2191 -25 -6 125 -83 -196 -30 -36 -150 -19 -154 77 -72 -250 30 -61 87 -116 171 123 23 147 183 105 51
2214 51 -259 158 187 -37 -162 127 245 113 5 9 105 144 -42 -71 168 -165 -88 64 4 -108 -116 -102 99 183
2238 183 107 -234 -108 73 131 185 -76 63 203 43 -44 53 121 -8 100 -138 -82 146 -46 -231 46 202
2260 202 -53 24 -134 124 117 122 -213 276 23 6 180 276 -59 -179 46 39 -109 -104 -7 -114 101 -47 75 183
2284 183 142 109 169 -149 240 -21 47 -190 24 -41 -176 -41 -120 166 68 -277 -318 211 -37 -21 49 110 -77 -142
$$ packed form
2118A32Q5l64m7P8M57j24j89P8k4k04j02K05J36pN8j05o2o6j46J55L34m5M7n53
2142b73J41L16k35L6j14J57j13J35J8j46J31l0r3j0J89l24OK29ko3l5J53k25J90
2166C8L3o2m9K88l13n5R1J25j3j62J61l0j03p2o0K98p2q0R0j80J03l10K81k7N5
2191b5J9J31k08j13J66oj14J31j35K31j49j78K80r1J48k03K87m8j00J24L6p8n4
2214E1l10M17K9k24j25K89J18j32j08MR6L9j86k9K39l33P7J52o0j12qJ4K01Q4
2238A83p6l41J26J81N8N4k61J39J40j60q7R7O8j29J08k38N6K28j92j85K77J56
2260B02k55P7j58K58pNl35M89k53j7J74R6l35j20K25pj48NR7j07K15j48J22J08
2284A83m1l3O0l18L89k61O8k37K14o5j35J35p9K86r8l45m1N29k48J6P0O1j87o5
$$ plain form
2308 -142 -160 -67 62 -134 -285 53 268 96 -263 -37 -114 -133 111 -36 -294 190 162 55 -43 -17 2 -126 -72
2331 -72 -194 -3 -73 -53 -82 -108 46 183 60 39 34 -86 182 480 295 -54 129 93 -44 3 22 -285 -136 -196
2355 -196 -8 -212 69 -69 -26 -50 -74 -30 405 -59 48 13 -51 446 -201 -206 -75 -32 -111 68 162 -75 -220 -104
2379 -104 -43 83 76 -253 108 220 -167 138 -129 -60 195 -64 44 49 -345 -30 -6 149 12 135 -86 79
2401 79 86 18 133 108 -136 96 -191 -23 -106 -125 126 71 -57 -146 206 105 35 -48 26 -117 -162 86 -19 185
2425 185 44 -173 -140 3 -164 -1 33 61 -180 150 9 21 -15 -63 203 64 -304 -14 27 -155 -39 -26 -240
2448 -240 114 226 -44 -258 255 -18 -226 -221 81 141 -14 -50 256 343 3 -73 -154 -69 46 -32 77 231 -47
2471 -47 6 -11 -131 -23 -111 -84 168 -40 -62 -80 -60 3 -209 138 -71 70 77 100 -28 64 135 -148 -15 -175 -121
$$ packed form
2308a42j8R3J29j96j51L38K15j72l59K26p7j9K44j47k58M84k8j07r8K6J9j28N4
2331g2j22J91p0K0k9k6J54J37j23k1nj20K68K98j85l49J83l6j37M7J9l07J49o0
2355a96J88k04K81j38M3k4k4M4M35m64J07l5o4M97o47nJ31M3p9J79R4k37j45J16
2379a04O1J26pl29L61J12l87L05k67O9K55k59J08Nl94L15K4J55j37J23k21J65
2401G9Po8J15k5k44K32k87J68q3j9K51n5j28q9L52j01p0q3P4j43m5K48j05K04
2425A85j41k17L3J43j67J63L4K8k41L30j41J2l6m8K66j39l68K90M1j82J16J3k14
2448b40L54J12k70k14N13k73k08NL02O0j55l6L06Q7l40p6q1Q5J15p8J09J54k78
2471d7N3j7j20J08q8K7K52k08k2j8K0O3k12L47k09J41PK3j28R2P1k83J33j60N4
$$ plain form
2496 -121 -79 151 -254 -154 -8 149 84 63 -39 -42 -230 -152 -92 6 26 -197 187 -90 -49 151 102 -109 3 240
2520 240 101 -452 237 -7 -29 -104 -164 314 68 -110 -124 -56 139 62 328 -46 -186 -169 -67 83 31 -356 -237
2543 -237 134 36 -169 -216 -205 12 24 -104 34 98 227 117 376 -188 36 126 -130 53 -401 -90 20 106
2565 106 -78 -224 -36 -173 0 -221 243 296 133 136 -161 -79 -66 -42 106 45 -187 -102 -106 122 -77 3 -129 -18
2589 -18 -79 101 -62 209 250 -92 -11 190 203 -44 80 -175 24 -83 155 -16 -24 77 -92 -97 -63 142 -129
2612 -129 153 93 113 -196 -120 -86 93 58 -69 -151 45 96 -103 -234 -171 130 -242 -166 -70 -174 12 84 -63 52
2636 52 155 -61 -135 -99 -4 50 139 -104 -16 81 -22 -77 181 79 -89 -18 178 -211 -142 -23 17 3 -210 -77
2660 -77 -30 85 -27 -55 80 57 -188 -11 22 20 -17 11 98 91 -17 -96 81 -70 -48 -92 -209 -92 -173 57 -46
$$ packed form
2496a21M2K30m05J00J46J57o5k1j02lj88P8O0R8K0k23L84k77M1K00m9k11J12K37
2520B40j39n53O89k44k2p5o0M78k46j78j4O8J95p7K66l74j40J7J02J50n2l87J19
2543b37L71r8k05m7J1K17J2j28J38O4J29j10K59n64K24R0k56J83m54L11J10Q6
2565A06j84j46J88j37J73k21M64N3j63Lk97Q2J3K4J48o1k32Q5mK28j99Q0j32J11
2589a8o1J80j63K71M1l42Q1K01J3k47J24k55J99j07K38j71qJ01j69nL4K05k71
2612a29K82o0K0l09P6L4J79l5j27q2J96N1j99j31O3L01l72P6R6j04J86P2j47J15
2636E2J03k16p4L6R5N4Q9k43Q8R7j03n5K58j02j68P1J96l89O9J19M0j4k13J33
2660g7M7J15j12k8J35k3k45J77L3kl7K8Q7pj08p9J77j51K2m4j17J17q1K30j03
$$ plain form
2685 -46 -40 3 86 91 -285 188 83 -263 -183 -45 238 -5 -96 162 -90 -99 -30 17 120 53 -86 192 182 -34 -32 -256
2711 -256 -35 -118 32 216 -5 -40 352 -215 18 -158 3 48 78 -70 -88 250 76 -5 -126 -209 -162 138 64
2734 64 116 -151 27 73 -71 57 -38 -29 -13 22 149 186 -118 46 38 -10 -146 88 74 -23 -18 -45 34 237 -178 -244
2760 -244 -205 -122 12 256 -246 -102 -282 2 207 48 196 -150 12 -197 -14 -27 135 230 51 81 -138 -121
2782 -121 133 -88 203 198 -45 -147 28 -176 -106 139 -130 48 224 -17 154 127 201 -136 330 143 149 8
2804 8 193 -172 -211 -17 -41 -57 276 43 103 24 -180 -153 -148 -10 105 -56 -111 25 155 -30 20 41 -77 111
2828 111 219 16 -69 -44 179 -81 -32 -161 137 -18 -87 97 134 17 110 -245 220 86 -64 -3 88 -389 11
2851 11 81 57 13 -204 96 71 76 -71 -151 -43 -51 -149 -85 -80 -152 -108 202 -60 97 79 -98 88 -46 47 28 227
$$ packed form
2685d6OM3Q3Nl76M73j05l46Q0J38K83k43r1K58k52rO9M7J03o7j39K78j0k16Kk24
2711b56K21q3J50J84k21l5L92n67K33j76J61M5L0j48j8L38j74q1j21q3M7L00p4
2734F4N2k67J78M6j44J28r5RJ6L5J27L7l04J64qm8j36K34j4r7Nk7P9K03m15o6
2760b44L9Q3J34K44n02J44j80K84K05j59J48l46J62k09J83j3J62R5j79L0k19J7
2782a21K54k21K91nk43j02J75k04P0K45k69J78J76k41J71k7P4l37M66j87Oj41
2804HJ85l65l9J94k4j6L33k33O0p9k04K7NJ38J15j61n5J36J30j85N0K1j18J88
2828A11J08k03q5K5K23k60M9j29K98j55o9J84L7j17R3l55M65j34j50O1R1m77M00
2851A1P0k4m4k17L00k5Nj47q0J08qr8O4Np2M4L10k62J57j8j77J86j34R3j9J99
$$ plain form
2877 227 106 -42 51 -156 142 36 -162 110 207 -46 -10 -111 -107 63 -151 238 -66 104 -34 201 -94 -127
2899 -127 -225 127 55 -125 20 15 6 -5 -201 -204 -125 17 -43 -4 -20 -192 29 8 -64 1 -143 -52 -56 23 112 -16 -120
2926 -120 -247 -305 75 240 119 172 82 -15 134 52 -249 2 34 103 67 -29 -258 12 221 -40 90 -98 70
2949 70 -12 -187 22 -111 71 -25 -145 -54 -91 -143 21 227 -59 -322 84 10 -71 151 -104 160 -56 11 -300
2972 -300 -40 -131 -65 -198 26 16 75 3 -194 -195 -24 71 111 -130 146 88 129 -175 50 -167 -62 105 130 -90
2996 -90 -168 -297 -79 127 -156 33 11 87 89 8 -136 -110 -90 -168 251 1 -19 213 -29 -82 36 -152 -140 -130 -353
3021 -353 -57 295 46 -152 27 161 -175 75 -47 -217 213 215 24 347 -37 -91 15 101 120 133 -106 87
3043 87 -289 -5 -32 78 87 -189 9 -131 45 -86 65 177 7 86 -108 204 170 -41 -22 156 15 150
$$ packed form
2877B27j21j48R3k07K98j06j98K72R7k53L6j01MJ70k14L89l04J70j38K35k95l3
2899a27r8L52p2j80J45nrj1j96lP9J42o0L9j6j72K21k1p2O5j44R1mP9Q9j28j04
2926a20j27n8L80J65j21N3r0r7J49q2l01K51L2O9l6r6k29K70K09k61J30j88J68
2949G0q2j75K09j33J82r6j20R1l7n2J64K06k86k63M06p4q1K22k55K64k16O7l11
2972c00K60r1O6j33K24j0N9p2j97jJ71R5M0k41K76n8M1l04K25k17J05J67K5k20
2996i0p8j29K18K06k83J89k2P6Kq1j44K6K0p8M19k50k0K32k42n3J18j88J2J0k23
3021c53K96L52k49j98J79J34l36K50j22j70M30Kj91L23l84n4J06Q6J9J3k39J93
3043H7l76K84k7J10Rk76J98j40J76j31J51J12j70P9j94L12l4k11J9J78j41J35
$$ plain form
3065 150 -243 -22 60 -178 194 -49 -148 130 -73 62 60 -176 84 85 19 28 214 -101 19 -12 222 -90 -72 86
3089 86 -143 70 -166 -57 25 245 107 -62 -105 -129 108 -148 138 151 204 -45 116 167 -19 99 55 -44 -88
3112 -88 205 2 119 -209 75 -58 -218 191 140 130 -91 50 168 214 148 229 -177 -177 199 1 25 -234 156
3135 156 -81 -69 63 -46 106 -78 -129 20 -66 79 34 -87 33 68 132 -415 -118 -359 132 -13 -175 99
3157 99 -45 19 8 -121 -32 211 -57 81 15 -10 117 -71 -119 -20 -4 -15 128 -161 -30 -36 64 -260 -331 249
3181 249 185 311 -55 -235 160 -9 84 15 -288 -228 -56 179 -193 116 41 82 -99 -163 -115 -87 -23 -142 -102 -72
3205 -72 182 169 -248 -18 61 257 -4 -31 46 -88 -135 -201 148 20 230 6 -110 137 54 164 -26 -27 79
3228 79 -373 -97 -167 -77 123 -80 113 204 66 2 -148 17 135 82 -73 29 151 -217 -129 68 -136 -41 168
$$ packed form
3065A50l93K21Q2k38L72k43r9K78k03J35kk36K60Jo6RJ86l15J20l1K34l12J8J58
3089H6k29K13k36J09Q2K20j38j69m3k4K37k56K86J3N3k49J61N1j86J18m4r9m4
3112h8K93k03J17l28K84j33j60M09n1j0k21J41J18M6o6Q1m06%L76j98K4k59L90
3135A56k37J2J32j09J52j84n1J49q6J45m5j21J20L5O4n47K97k41M91j45j62K74
3157I9j44O4j1j29Q9K43k68J38o6k5J27j88m8R9J6j1J43k89J31oJ00l24p1N80
3181B49o4J26l66j80L95j69R3o9l03O0J72K35l72L09p5M1j81o4M8K8O4j19M0L0
3205g2K54j3m17K30P9J96k61k7P7j34m7o6L49j28K10k24j16K47q3J10j90jJ06
3228G9m52K76p0R0K00k03J93R1j38o4j50J65J18n3j55J02J22l68Q8J97k04R5K09
$$ plain form
3251 168 101 59 -22 266 -65 0 127 -271 48 -12 -1 23 32 -78 -59 247 -160 -125 -223 346 294 105 -191 95
3275 95 68 -100 -67 -105 -32 -78 -161 42 78 18 -123 -10 31 -157 104 45 104 196 -9 -75 -199 86 200 -70 -116
3300 -116 -32 -37 23 119 -57 100 0 114 -33 -67 -5 -97 -14 116 -150 -201 99 105 -67 -106 81 -158 -13 222
3324 222 -15 -117 -61 28 71 -24 66 297 -105 98 103 159 107 119 -161 -232 141 173 -243 -95 119 17 15 -204 99
3349 99 -33 -86 -280 -20 -2 21 88 -29 -80 -72 -221 -192 -2 -168 -11 -20 -109 56 18 -247 -115 252 -102 -40 38
3374 38 -12 149 -10 146 -188 143 29 -58 -84 -89 -162 -10 31 -192 -116 -26 -137 -71 268 56 -52 -11 -38 -153
3398 -153 -274 99 -93 -37 -322 -162 180 -104 -79 84 36 -263 188 -283 61 -129 -100 -109 43 -41 288 -259
3420 -259 11 281 395 80 369 -144 159 43 41 -168 -136 -135 -310 77 -204 117 -116 -315 -4 161 132 -278
$$ packed form
3251A68o7m2q1K88l31O5J27l98L19o0J1K4Rj10J9L06m07L5r8N69n2j89k96K86
3275I5k7j68L3l8P3m6q3K03L6o0j41J13M1j88K61n9N9R2k05o6j24K85J14k70m6
3300a16Q4nO0R6j76J57j00J14j47l4O2r2Q3J30k66n1L00Oj72l9J87k39J45K35
3324B22k37j02N6Q9M3r5R0K31m02K03NN6n2J2k80p1L73L2m16J48K14j02kk19L03
3349I9j32n3j94K60J8K3O7j17n1Qj49K9J90j66J57rq9J65l8k65J32L67l54O2P8
3374C8n0J61j59J56l34L31j14q7k6np3J52M1k23P6R0j11O6L39k12j08M1k7j15
3398a53j21L73j92N6k85J60L42k84K5J63m8k99M51m71L44j90K9rJ52q4L29n47
3420b59K70K70J14l15K89n13L03j16kk09L2Jj75L87k81L21k33j99L11J65k9m10
$$ plain form
3442 -278 177 -63 -51 -6 20 102 64 -103 -116 192 -190 -35 123 -67 -55 136 99 187 -71 34 203 -243 171
3465 171 94 8 -91 -105 -74 -191 140 38 -80 41 52 -5 -261 98 62 -29 84 -11 -122 75 195 -295 36
3488 36 241 18 -45 31 6 115 -235 -5 19 -185 75 -56 319 -206 17 60 32 49 160 38 38 58 -24 99
3512 99 -96 -35 -171 46 -155 14 -249 -22 140 62 87 -19 54 115 191 130 34 282 213 7 -38 189 53 44
3536 44 -167 87 -217 32 68 -77 96 127 138 -100 -104 91 46 37 123 -146 59 -43 -68 138 -53 -114 -50 178
3560 178 -136 -67 -52 -52 166 -285 -91 100 -34 -121 -138 72 -140 14 176 -36 154 -254 -107 230 5 97
3582 97 -26 -134 146 -109 -243 141 -72 43 125 -119 4 -17 7 55 -164 11 256 -104 -68 30 -23 53 -119
3605 -119 55 158 23 52 -47 -61 142 -70 20 104 -135 74 27 -32 125 -149 40 -99 -237 -88 155 184 90
$$ packed form
3442b78M55k40J2M5K6Q2l8j67j3L08l82J55J58j90J2J91l7Q8k58J05J69m46M14
3465A71p7q6r9j4L1j17L31j02j18J21J1n7k56L59l6r1J13r5j11J97J20m90L31
3488C6K05k23o3P6k5J09l50K30K4k04K60j31L75n25K23M3k8J7J11j22%K0q2J23
3512I9j95O1j36K17k01J69k63K27J62p8K5j06P3O1P6o1r6K48o9k06m5K27j36r
3536D4k11K54l04K49L6j45J73L1J1k38mJ95m5rQ6k69K05j02k5K06j91o1O4K28
3560A78l14O9J5%K18m51J94J91j34q7j7K10k12J54J62k12J90m08J47L37k25R2
3582I7j23j08K80k55j34L84k13J15Q2k44J23k1K4M8k19J75K45l60L6R8n3P6j72
3605a19J74J03j35K9r9j4K03k12R0Q4k39K09m7n9J57k74J89j39j38J49K43K9r4
$$ plain form
3628 90 -126 122 27 -168 10 -54 -59 37 93 47 58 56 -51 -87 10 -36 233 -41 -269 334 207 -79 73 -198 82
3653 82 68 -134 -337 273 74 -74 340 136 -75 268 -295 -5 69 -180 281 31 -116 -59 -177 -80 29 131
3675 131 -63 -6 -26 17 346 122 82 -341 -144 73 218 -92 -70 259 89 -206 34 138 27 -21 -19 5 14 33
3699 33 185 -38 -196 172 -321 -104 -40 25 228 78 -169 8 47 -157 -87 -257 114 -232 -175 165 144 113 -211
3722 -211 -43 -16 52 -60 -49 -4 -13 69 -93 96 -15 144 -130 52 45 20 107 -114 201 44 86 25 -33 -106 167
3747 167 44 35 149 166 48 142 -145 53 -78 -151 -99 -147 -37 -27 19 -60 -7 81 159 -102 -147 -43 107 58 -275
3772 -275 -73 -140 135 137 -73 38 -1 -230 -15 177 -34 -235 33 -127 -9 -66 121 -120 -83 5 -55 -98 -69
3795 -69 -76 -45 -147 23 -196 34 -14 -132 -113 -8 20 172 -165 -19 -115 -16 149 -71 -105 -8 3 -252 -2 153
$$ packed form
3628I0k16K48r5j95J78o4nR6N6m6J1kj07l6R7m6K69k74k28O03j27k86J52k71K80
3653H2j4k02k03O10j99j48M14k04k11L43n63K90P4k49M61k50j47N7j18R7J09J02
3675A31j94N7k0M3L29k24m0m23J97K17J45l10K2L29j70k95K40J04j11m8KK4RJ9
3699C3J52k23j58L68m93K17O4O5K03j50k47J77L9k04P0j70L71l46N7L40k1l1l24
3722b11J68K7O8j12J1M5rQ2j62J89j11J59k74J82pk5Q7k21L15j57M2o1n8p3K73
3747A67j23rJ14J7j18R4k87J98j31p3N2m8J10J0M6p9N3Q8P8k61m5J04J50m9l33
3772b75K02o7K75Kk10J11l9k29K15J92k11k01K68j60J18n7J87k41L7Q8o0m3K9
3795f9pL1j02J70k19K30m8j18J9J05K8J52l37J46r6R9J65k20l4R7J1k55K50J55
$$ plain form
3819 153 261 -99 -124 194 -219 -37 86 -122 264 -1 -54 181 -162 13 50 152 -85 116 55 -177 -122 183
3841 183 -225 -148 2 6 -66 324 -31 107 142 48 217 -252 -254 238 39 3 -110 32 -84 -129 -123 -117 160 120 -233
3866 -233 -229 -34 -17 -83 103 31 -81 -126 -88 209 145 -86 -32 -66 -81 424 -211 33 49 -151 103 17 -75 161 102
3891 102 229 -131 109 -40 -125 -58 -4 178 -103 -63 -32 92 261 21 60 -355 214 22 -129 64 -21 -21 -83
3914 -83 -111 -74 154 -45 -200 -66 -182 166 -89 -28 237 -43 32 -228 -76 -75 -80 -230 276 163 -97 110 107 -159
3938 -159 224 -23 -116 156 149 150 -64 141 94 119 2 -5 -3 -86 -158 192 230 -162 163 -46 215 -118 -180 -82 90
3963 90 -64 24 -24 53 271 5 -9 -112 54 85 14 74 -73 -120 -229 52 -70 94 40 -271 128 91 203 54
3987 54 226 -89 105 -102 -47 84 -21 125 366 -117 -39 -158 -16 -38 64 -164 10 33 47 -9 48 12 1
$$ packed form
3819A53J08l60k5L18m13J82J23k08L86k65n3K35l43J75L7J02k37K01o1k32N5L05
3841A83m08P7J50Mp2L90l55J38L5r4J69m69kM92j99l6j13J42j16m5OOK77m0l53
3866b33MJ95J7o6J86p2j12m5L8K97o4k31N4l4j5N05o35K44J6k00K54q6r2K36n9
3891A02J27l60K40j49q5O7N4J82k81M0L1J24J69k40L9m15N69j92j51J93q5%o2
3914h3k8L7K28j99j55J34j16L48k55O1K65k80P5k60J52Jnj50N06j13k60K07lk66
3938a59L83k47r3K72pJk14K05m7K5j17pKq3p2L50L8l92L25k09K61l33o2R8J72
3963I0j54Q8m8P7K18k66j4j03J66L1p1O0j47m7j09K81j22J64n4l11L99l7J12j49
3987E4J72l15J94k07N5J31j05J46K41m83P8j19J42k2J02k28J74K3J4n6N7l6j1
$$ plain form
4010 1 155 254 74 -19 83 -144 -123 143 209 61 182 -105 -121 95 43 -153 270 -9 6 -100 -77 274 -32
4033 -32 -99 81 235 -31 -120 -53 -273 -3 95 -45 130 5 -36 -46 -62 -87 -128 -51 33 56 251 -123 -83 -254 -214
4058 -214 -55 63 36 20 -109 213 -122 15 157 -130 212 -222 -22 -7 -58 -201 43 -104 -79 288 64 -113
4080 -113 43 77 291 52 14 35 103 -32 -136 134 101 154 116 116 -225 -103 103 304 -151 51 35 -275 76
4103 76 -28 -7 123 264 8 -148 86 -26 -51 18 -91 -17 44 152 -69 23 -103 -95 37 -112 278 52 53 -84
4127 -84 -115 -8 -141 -93 76 -31 62 -200 100 323 -55 57 -114 -210 -59 -129 30 -140 -121 -226 -77 -56 -55
4150 -55 103 45 -19 -14 -23 -107 -56 -181 131 70 -17 245 -31 -280 4 114 -5 222 287 -97 77 -126 -15 156
4174 156 -99 -34 -55 67 92 42 104 30 -108 -234 54 61 -43 192 33 -60 114 45 -60 46 132 -239 68 -181
$$ packed form
4010AJ54R9j80r3J02k27K1K66O6j48J21k87j6K16n2j96M23k79J5j06K3L51l06
4033c2o7J80J54k66q9O7k20K70R8j40J75j25m1j0j6k5m1P7Q4K3J95l74M0j71M0
4058b14J59J18k7j6j29L22l35J37J42k87L42m34K00J5n1j43K44j47K5L67k24j77
4080a13J56L4K14k39l8K1O8j35j04K70l3N3l8%l41J22K06K01m55K02j6l10L51
4103G6j04K1J30J41k56j56K34j12k5O9j09P4O1J08k21R2j26QJ32j49L90k26Jj37
4127h4l1J07j33M8J69j07R3k62L00K23l78J12j71r6J51p0J59j70J9j05J49K1J
4150e5J58n8o4Nrq4N1j25L12o1q7K62k76k49K84J10j19K27O5l84J74k03J11J71
4174A56k55O5k1J22K5n0O2p4j38j26K88Pj04K35j59r3J74o9j05J06Q6l71L07k49
$$ plain form
4198 -181 -68 -161 167 36 180 34 137 50 -138 -123 -94 107 -61 -81 -141 246 -63 169 61 137 215 -63 161
4221 161 39 -144 -15 -99 61 -21 10 46 51 -237 84 66 278 -256 80 77 -7 -250 16 -164 -258 -78 -29 57
$$ packed form
4198a81J13r3L28j31J44j46J03q7j88J5K9K01j68k0o0L87l09K32j08P6P8k78K24
4221A61j22j83J29q4J60q2L1L6Nk88L21j8K12n34L36lq4k43K66j80r4J80M9Q6
$$ [...]
8191G2
##END NTUPLES=NMR FID
##END=
