##TITLE=1H_Ac 2209
 CDCl3
 108 sc, 
 23.09.2022
##JCAMPDX= 6.0         $$ Bruker NMR JCAMP-DX V2.0
##DATA TYPE= NMR FID
##DATA CLASS= NTUPLES
##ORIGIN= UXNMR, Bruker Analytische Messtechnik GmbH
##OWNER= root
$$ XWIN-NMR		Version 3.5
$$ Fri Sep 23 12:56:20 2022 Russian Standard Time (UT+4h)  she@DPX200
##.OBSERVE FREQUENCY= 200.1313499994
##.OBSERVE NUCLEUS= ^1H
##.DELAY= (6, 6)
##.ACQUISITION MODE= SIMULTANEOUS
##.ACQUISITION SCHEME= undefined
##.AVERAGES= 108
##.DIGITISER RES= 18
##SPECTROMETER/DATA SYSTEM= spect
##.PULSE SEQUENCE= zg30
##.SOLVENT NAME= CDCl3
##.SHIFT REFERENCE= (INTERNAL, CDCl3, 0, 15.7039)
##AUDIT TRAIL= $$ (NUMBER, WHEN, WHO, WHERE, WHAT)
$$ ##TITLE= Audit trail, XWIN-NMR		Version 3.5
$$ ##JCAMPDX= 5.01
$$ ##ORIGIN= Bruker BioSpin GmbH
$$ ##OWNER= she
$$ F:/spectra/data/she/nmr/H-F/1/audita.txt
$$ ##AUDIT TRAIL=  $$ (NUMBER, WHEN, WHO, WHERE, WHAT)
(   1,<2022-09-23 12:54:57.87 +0400>,<she>,<DPX200>,
      <continue with go, POWCHK disabled, PULCHK disabled
       configuration hash MD5:
       00 E9 B6 7A A2 85 ED C7 34 08 36 98 17 FE 4E 26
       data hash MD5: 16K
       44 74 C8 1F 0D F0 81 AC 39 33 2F 2E 4C AE EF E3>)
$$ ##END=
$$ 
$$ hash MD5
$$ B1 3F B3 C1 87 99 51 43 EC 0A E6 5A C6 0F 2E AB
##$RELAX= 
##$RELAX= 
##$RELAX= 
##$RELAX= 
##$RELAX= 
##$RELAX= 
$$ Bruker specific parameters
$$ --------------------------
##$DU= <F:/spectra>
##$EXPNO= 1
##$NAME= <H-F>
##$PROCNO= 1
##$TYPE= <nmr>
##$USER= <she>
##$AMP= (0..31)
100 100 100 100 100 100 100 100 100 100 100 100 100 100 100 100 100 100 
100 100 100 100 100 100 100 100 100 100 100 100 100 100 
##$AQSEQ= 0
##$AQ_mod= 1
##$AUNM= <au_zg>
##$AUTOPOS= <>
##$BF1= 200.13
##$BF2= 200.13
##$BF3= 200.13
##$BF4= 200.13
##$BF5= 200.13
##$BF6= 200.13
##$BF7= 200.13
##$BF8= 200.13
##$BYTORDA= 1
##$CFDGTYP= 0
##$CFRGTYP= 5
##$CHEMSTR= <none>
##$CNST= (0..31)
1 1 145 1 1 1 1 1 1 1 1 1 1 1 1 1 1 1 1 1 1 1 1 1 1 1 1 1 1 1 1 1 
##$CPDPRG= <>
##$CPDPRG1= <>
##$CPDPRG2= <>
##$CPDPRG3= <>
##$CPDPRG4= <mlev>
##$CPDPRG5= <mlev>
##$CPDPRG6= <mlev>
##$CPDPRG7= <mlev>
##$CPDPRG8= <mlev>
##$CPDPRGB= <>
##$CPDPRGT= <>
##$D= (0..31)
0 1.2 0 0 0 0 0 0 0 0.06 0 0.03 0 0 0 0 0.0002 0 0 0 0 0 0 0 0 0 0 0 0 
0 0 0 
##$DATE= 1663922926
##$DBL= (0..7)
120 120 120 120 120 120 120 120 
##$DBP= (0..7)
150 150 150 150 150 150 150 150 
##$DBP07= 0
##$DBPNAM0= <>
##$DBPNAM1= <>
##$DBPNAM2= <>
##$DBPNAM3= <>
##$DBPNAM4= <>
##$DBPNAM5= <>
##$DBPNAM6= <>
##$DBPNAM7= <>
##$DBPOAL= (0..7)
0.5 0.5 0.5 0.5 0.5 0.5 0.5 0.5 
##$DBPOFFS= (0..7)
0 0 0 0 0 0 0 0 
##$DE= 6
##$DECBNUC= <off>
##$DECIM= 32
##$DECNUC= <off>
##$DECSTAT= 4
##$DIGMOD= 1
##$DIGTYP= 9
##$DL= (0..7)
0 120 120 120 120 120 120 120 
##$DP= (0..7)
150 150 150 150 150 150 150 150 
##$DP07= 0
##$DPNAME0= <>
##$DPNAME1= <>
##$DPNAME2= <>
##$DPNAME3= <>
##$DPNAME4= <>
##$DPNAME5= <>
##$DPNAME6= <>
##$DPNAME7= <>
##$DPOAL= (0..7)
0.5 0.5 0.5 0.5 0.5 0.5 0.5 0.5 
##$DPOFFS= (0..7)
0 0 0 0 0 0 0 0 
##$DQDMODE= 0
##$DR= 18
##$DS= 0
$$ [...]
##$SUBNAM2= <"">
##$SUBNAM3= <"">
##$SUBNAM4= <"">
##$SUBNAM5= <"">
##$SUBNAM6= <"">
##$SUBNAM7= <"">
##$SUBNAM8= <"">
##$SUBNAM9= <"">
##$SW= 18.0517283424941
##$SWIBOX= (0..15)
0 0 2 0 0 0 0 0 0 0 0 0 0 0 0 0 
##$SW_h= 3612.71676300578
##$TD= 16384
##$TD0= 1
##$TE= 0
##$TE2= 300
##$TE3= 300
##$TEG= 300
##$TL= (0..7)
0 120 120 120 120 120 120 120 
##$TP= (0..7)
150 150 150 150 150 150 150 150 
##$TP07= 0
##$TPNAME0= <>
##$TPNAME1= <>
##$TPNAME2= <>
##$TPNAME3= <>
##$TPNAME4= <>
##$TPNAME5= <>
##$TPNAME6= <>
##$TPNAME7= <>
##$TPOAL= (0..7)
0.5 0.5 0.5 0.5 0.5 0.5 0.5 0.5 
##$TPOFFS= (0..7)
0 0 0 0 0 0 0 0 
##$TUNHIN= 0
##$TUNHOUT= 0
##$TUNXOUT= 0
##$USERA1= <user>
##$USERA2= <user>
##$USERA3= <user>
##$USERA4= <user>
##$USERA5= <user>
##$V9= 5
##$VALIST= <valist>
##$VCLIST= <CCCCCCCCCCCCCCC>
##$VD= 0
##$VDLIST= <DDDDDDDDDDDDDDD>
##$VPLIST= <PPPPPPPPPPPPPPP>
##$VTLIST= <TTTTTTTTTTTTTTT>
##$WBST= 1024
##$WBSW= 4
##$XGAIN= (0..3)
0 0 0 0 
##$XL= 0
##$YL= 0
##$YMAX_a= 234669
##$YMIN_a= -215374
##$ZGOPTNS= <>
##$ZL1= 120
##$ZL2= 120
##$ZL3= 120
##$ZL4= 120
##$ABSF1= 10
##$ABSF2= 0
##$ABSG= 5
##$ABSL= 3
##$ALPHA= 0
##$AQORDER= 0
##$ASSFAC= 0
##$ASSFACI= 0
##$ASSFACX= 0
##$ASSWID= 0
##$AUNMP= <proc_1d>
##$AZFE= 0.1
##$AZFW= 0.1
##$BCFW= 1
##$BC_mod= 2
##$BYTORDP= 1
##$COROFFS= 0
##$CY= 11.3945322036743
##$DATMOD= 1
##$DC= 2
##$DFILT= <>
##$DTYPP= 0
##$F1P= 2.36226072786647
##$F2P= -0.459571619588291
##$FCOR= 0.5
##$FTSIZE= 0
##$FT_mod= 4
##$GAMMA= 1
##$GB= 0.15
##$INTBC= 1
##$INTSCL= 1
##$ISEN= 128
##$LB= 0.24
##$LEV0= 0
##$LPBIN= 0
##$MAXI= 10000
##$MC2= 0
##$MEAN= 0
##$ME_mod= 0
##$MI= 1.114404
##$NCOEF= 0
##$NC_proc= 0
##$NLEV= 6
##$NOISF1= 3.799351
##$NOISF2= 2.8
##$NSP= 1
##$NTH_PI= 0
##$NZP= 0
##$OFFSET= 15.70392
##$PC= 1
##$PHC0= -18044.41
##$PHC1= 30.20069
##$PH_mod= 1
##$PKNL= yes
##$PPARMOD= 0
##$PSCAL= 0
##$PSIGN= 0
##$REVERSE= no
##$SF= 200.130013532006
##$SI= 16384
##$SIGF1= 3
##$SIGF2= 2
##$SINO= 400
##$SIOLD= 16384
##$SREGLST= <1H.CDCl3>
##$SSB= 0
##$STSI= 0
##$STSR= 0
##$SW_p= 3612.71676300578
##$SYMM= 0
##$S_DEV= 0
##$TDeff= 0
##$TDoff= 0
##$TI= <>
##$TILT= no
##$TM1= 0
##$TM2= 0
##$TOPLEV= 0
##$USERP1= <user>
##$USERP2= <user>
##$USERP3= <user>
##$USERP4= <user>
##$USERP5= <user>
##$WDW= 1
##$XDIM= 8192
##$YMAX_p= 0
##$YMIN_p= 0
$$ End of Bruker specific parameters
$$ ---------------------------------
##NTUPLES= NMR FID
##VAR_NAME=  TIME,          FID/REAL,        FID/IMAG
##SYMBOL=    X,             R,               I
##VAR_TYPE=  INDEPENDENT,   DEPENDENT,       DEPENDENT
##VAR_FORM=  AFFN,          ASDF,            ASDF
##VAR_DIM=   8192,          8192,            8192
##UNITS=     SECONDS,       ARBITRARY UNITS, ARBITRARY UNITS
##FACTOR=    0.0002768,     1,               1
##FIRST=     0,             0,               0
##LAST=      2.2672688,     0,               0
##MIN=       0,             -215374,         0
##MAX=       2.2672688,     234669,          0
$$ Real data points
##PAGE= N=1
##DATA TABLE= (X++(R..R)), XYDATA
0@%%%%%%%%%%%%%%%%%%%%%M8j56K16k16K16k16K16k59L67m32M32m96O04o53P37
$$ 0 0 0 0 0 0 0 0 0 0 0 0 0 0 0 0 0 0 0 0 0 0 48 -108 108 -108 108 -108 108 -151 216 -216 216 -280 324 -329 408
36D08q43R36j051J173j310J454j620J794j982K189k415K664k941L241l566L932
$$ 408 -435 501 -550 623 -687 767 -853 941 -1041 1148 -1267 1397 -1544 1697 -1869 2063
52B063m337M782n277N828o459P182q015Q989j0144J1544j3276J5495j8458K2633
$$ 2063 -2274 2508 -2769 3059 -3400 3782 -4233 4756 -5388 6156 -7120 8375 -10083 12550
66A2550k8969L9950o4625K75763j99202j54715K79323n6419j53785L0558J20493
$$ 12550 -16419 23531 -41094 234669 35467 -119248 160075 103656 -50129 -19571 100922
77A00922r1243o4439L5550N1966m3110m1958K623N6082j8431n1864K2765N5319
$$ 100922 9679 -54760 -19210 32756 -10354 -52312 -49689 6393 -12038 -63902 -41137 14182
89A4182m1930k9129N0255L0567m5427p461N4320J1982m7873J4618L5819k6561
$$ 14182 -27748 -56877 -6622 23945 -21482 -28943 25377 37359 -10514 4104 39923 13362
101A3362k1535L3611M508k2016R816R684j3815R037l20k4756J2326J2316l9787
$$ 13362 -8173 25438 29946 7930 17746 27430 13615 22652 22332 -2424 9902 22218 -17569
114a7569j383L0155l1467k5438L7522k108l5400J9361K3543k2709j214K4720j0229
$$ -17569 -18952 11203 -20264 -45702 -8180 -10288 -45688 -26327 -2784 -25493 -26707 -1987 -12216
127a2216q790K2500L424n900J6769P427o696P459J0208p964o616Q798k32j5540
$$ -12216 -21006 1494 4918 -982 15787 23214 16518 23977 34185 26221 19605 28403 28171 12631
141A2631K289K111j8879n498R939j2321j4505J0418k178j7205Q435R981j7955
$$ 12631 14920 17031 -1848 -7346 2593 -9728 -24233 -13815 -15993 -33198 -24763 -14782 -32737
154c2737K644K1264j0392j645K4268j177r858K0868P897j4215J0929J2383j5076
$$ -32737 -30093 -8829 -19221 -20866 3402 2225 -7633 13235 21132 6917 17846 30229 15153
167A5153p16J7029j1148j3849J4026l406j6229O178K653j5378k266P888r019j0165
$$ 15153 14437 31466 20318 6469 20495 17089 860 7038 9691 -5687 -7953 -65 -9084 -19249
181a9249P169m13j0989M053P413r464N55J1736j517l637J2116N546p414Q485J0974
$$ -19249 -12080 -12493 -23482 -19429 -12016 -21480 -20925 -9189 -10706 -14343 -2227 3319 -4095 4390 15364
196A5364p628K886J3048q516l604J2843l400j1977P848K299j5090J307M737j3496
$$ 15364 7736 10622 23670 15154 11550 24393 20993 9016 16864 19163 4073 5380 10117 -3379
210c379p637Q916p768j3288Q424K29r986N578N854p026J533J1070o93m347J2091
$$ -3379 -11016 -2100 -9868 -23156 -14732 -14503 -24489 -18911 -13057 -20083 -18550 -7480 -8173 -12520 -429
225d29M579m660Q376J0580p022J814J0914m312l558N594K36j1871J70K343j0999
$$ -429 4150 -510 7866 18446 11424 13238 24152 19840 16282 21876 22112 10241 10411 12754 1755
240A755n369N586q858p871O922m426p210M346K120q130M371P476m958j455J2307
$$ 1755 -3614 1972 -6886 -14757 -7835 -12261 -19471 -15125 -13005 -21135 -16764 -9288 -14246 -15701 -3394
255c394R64n915J2704L325o004P577P525n241m40P196j776n874N489J051r999
$$ -3394 -2430 -8345 4359 7684 1680 9257 16782 11541 11101 18297 16521 10647 16136 17187 7188
270G188J554L555j0475l759M341q560p251M755k768r222J553O270o652K48R801
$$ 7188 8742 12297 1822 -1937 2404 -6156 -13407 -8652 -11420 -20642 -19089 -12819 -19471 -19223 -9422
285i422k239j815J0598J727j918O809N111k772K422Q627l455k781P688J91q153
$$ -9422 -11661 -13476 -2878 -1151 -3069 3740 8851 6079 8501 17128 13673 10892 18580 18771 10618
300A0618M658P89j0346j158K877q650m762L244m624o460K032J088p150O35O249
$$ 10618 15276 16065 5719 4561 7438 -1212 -5974 -2730 -7354 -13814 -11782 -10694 -17844 -17209 -10960
315a0960n319j04Q336j870j477Q683L835k890N529Q512l074N24Q045k055m518
$$ -10960 -16279 -16383 -8047 -9917 -11394 -2711 1124 -1766 3763 12275 9201 9725 17770 15715 11197
330A1197N663m91p253K216P78o794k577J568n683o528K903j388q382J461J702
$$ 11197 16860 16369 9116 11332 12110 5316 2739 4307 -1376 -7904 -5001 -6389 -14771 -13310 -11608
345a1608n428L31M863j677j82P474J495k986P458L848k858M555N960k702P25O731
$$ -11608 -17036 -16705 -11842 -13519 -13701 -6227 -4732 -7718 -260 3588 730 5285 11245 8543 9268 15999
361A5999q55n368M779K40o510J96K314o505n094M017n216o965K500j455p571L016
$$ 15999 15144 9776 14555 14795 8285 8481 10795 4290 -804 3213 -2003 -8968 -6468 -7923 -15494 -12478
377a2478J097m847M65O081j958k289P613L614k549N945O244k521K951N977k693
$$ -12478 -11381 -16228 -15763 -9682 -11640 -13929 -6316 -2702 -5251 694 6938 4417 7368 13345 10652
392A0652n90M809j10l357J468J042p215j224K743o995m029K484m652n490K177
$$ 10652 10062 14871 14761 11404 12872 13914 6699 5475 8218 1223 -2806 -322 -4974 -10464 -8287
407h287N3p052P86N213l567k127O462O75k733O488K346j316M539N334j690J924
$$ -8287 -8234 -15286 -14500 -9287 -12854 -14981 -8519 -7844 -10577 -4089 -1743 -3059 1480 6814 5124 7048
423G048O891j861k057L435P02n159J534J873o782l58J114n887l458R18k226m770
$$ 7048 13939 12078 10021 13456 14158 8999 10533 12406 5624 5266 6380 493 -2965 -2047 -4273 -9043
439i043l23J327m673j479L907k934k290P462K5o54N917L354j484K315N899k91
$$ -9043 -9366 -8039 -12712 -14191 -10284 -13218 -15508 -8046 -8021 -8675 -2758 596 -888 1427 7326 7035
455G035n19P090m4l040L188N22n342O70J068n884k784J882l954n469q2j526n101
$$ 7035 6516 13606 13562 10522 13710 14232 8890 9560 10628 4744 1960 3842 -112 -5581 -5663 -7189 -12290
472a2290Q32K554m284p34N629j769j215N043K324j480L931N627j042K46N688n31
$$ -12290 -11458 -8904 -13188 -13922 -8293 -10062 -11277 -6234 -3910 -5390 -1459 4168 3126 3372 9060 8529
488H529j764M157P84k429K296L95m208j623J622l981m409L016l383o549L407k53
$$ 8529 6765 10922 11706 9277 11573 11968 7760 6137 7759 3778 -631 2385 -998 -7547 -4140 -4393
504d393o913q33L444l932j199L901J266k201M409K806j419L471N920j518K017
$$ -4393 -11306 -12139 -8695 -12627 -13826 -9925 -8659 -10860 -6451 -3645 -5064 -1593 4327 2809 4826
519D826N780j056l94L817L5k784N23Q38k949l165K062m730m621M81k213m744l28
$$ 4826 10606 9550 9156 12973 13008 10224 10747 11585 8636 5471 7533 2803 -1818 -1337 -3550 -8294 -8622
536h622J310l808j729L242k151k143N377K205k040M221M122j069J468N341m69
$$ -8622 -7312 -11120 -12849 -9607 -11758 -13901 -8524 -6319 -8359 -4138 -16 -1085 383 5724 5255
551E255k83N305J101k488L111Q74m550k28J053m290j915N95l171m388K017k075
$$ 5255 4972 10277 11378 8890 12001 12875 8325 8097 9150 4860 2945 3540 369 -4019 -2002 -4077
567d077n279j18K468l431j583M032q66j647L170J422j039L248L223M95J879L246
$$ -4077 -9356 -9474 -7006 -10437 -12020 -7988 -8854 -10501 -7331 -5909 -6948 -3700 -477 18 1897 5143
583E143R00L86K430J343j848K297J222k957q90R44l180l911R29l27n421o97L06
$$ 5143 6043 6429 8859 10202 8354 10651 11873 8916 8026 8970 5790 1879 2808 2481 -2940 -3637 -3331
600c331n468n34J030k474k137M494k092n3M354J483j59K919M445k024J824O396
$$ -3331 -8799 -9333 -8303 -10777 -12914 -8420 -10512 -10565 -6211 -4728 -4887 -1968 2477 453 2277 8673
616H673k71j242K954M54j636J115J271k874k69l34l686l925j373n33m708m49J714
$$ 8673 8402 7160 10114 10568 8932 10047 11318 8444 8175 7841 4155 230 -1143 -1676 -6384 -6833 -5119
633e119m132l93J589j047j821L316J517j090J890L093j649K147N356r78R12N236
$$ -5119 -9251 -9644 -8055 -9102 -10923 -7607 -6090 -7180 -5290 -2197 -3846 -1699 3657 2679 3591 8827
649H827J32j834L193M85k577p09J678l752j028J709k562l550O06q39l685j048
$$ 8827 8959 7125 10318 10803 8226 7517 9195 5443 4415 6124 3562 12 618 -221 -3906 -4954
665d954r44k776q34N28r62j273K785J042l39L292L295p93J884M017L82M89K499
$$ -4954 -5898 -8674 -9508 -8980 -9942 -11215 -8430 -7388 -7727 -4435 -1140 -1933 -49 3968 4350 4839 7338
682G338R87p24P91J888q09j150J961l342l652L96j795l945j675M19m127j405J638
$$ 7338 8325 7601 8392 10280 9471 8321 10282 6940 3288 3684 1889 -2056 -3731 -3312 -7439 -8844 -7206
699g206k196q97J793J139k509L245K540j954L262J638J112J863L870K74p37K560
$$ -7206 -9402 -10299 -8506 -7367 -9876 -6631 -4091 -6045 -2783 -1145 -33 1830 5700 5974 5237 7797
715G797J545j368J756pk421j430J179k812j609j232k14l095j283p35k998j830
$$ 7797 9342 7974 9730 9723 7302 5872 7051 4239 2630 1398 1184 -1911 -3194 -3929 -6927 -8757
731h757K403k216j271J657L21n62K187L463j947K322M475O01j045L364K426j617
$$ -8757 -6354 -8570 -9841 -8184 -7863 -8425 -6238 -2775 -4722 -2400 2075 2676 1631 4995 7421 5804
747E804J75K391j014J023N57j949j761P70j258m222k7r49l503j004M29l454j614
$$ 5804 5979 8370 7356 8379 8936 6987 5226 5996 4738 516 489 -460 -3963 -4967 -4538 -7992 -9606
764i606K211q04j507J667J098l00J815L367l41K77L727J275L55L010J723m96R79
$$ -9606 -7395 -8199 -9706 -8039 -6941 -7241 -5426 -2059 -2400 -2123 1604 2879 3234 6244 7967 7471 8450
781H450M67l85j346j26p54k950R74q60l881n52j227l579Q6N14k967j745K555m47
$$ 8450 8917 8532 7186 7060 6306 3356 4330 3470 -411 -963 -2190 -5769 -5683 -5169 -8136 -9881 -7326 -7773
799g773n65O85K077J34J376L584l09Q05L111N99R63J097J391N68n84J563k181
$$ -7773 -8338 -7653 -5576 -5442 -4066 -482 -791 14 3125 3724 4687 5784 7175 7743 7159 8722 6541
816F541j630K084k013l008J091j773k638q15p2j896k387J95m18j141J00Q69j806
$$ 6541 4911 6995 4982 1974 3065 1292 -1346 -2161 -2233 -4129 -6516 -6321 -6739 -7880 -7780 -6911 -8717
833h717K315K284k196K389L658R00k45L189J113m15J550K700j636O85O04j121
$$ -8717 -6402 -4118 -6314 -3925 -267 633 388 3577 4690 4275 5825 8525 6889 7574 8178 7057
849G057m56kk566k203R12l149j345j233m75k694k101Q63L44k582K279J158p31
$$ 7057 6601 6599 4033 1830 2742 -407 -1752 -2985 -3460 -6154 -8255 -7392 -7048 -9630 -7351 -6193 -6924
866f924K368J882l57P00K088J448J064J032K442l32M13K521j391j36O99j437j575
$$ -6924 -4556 -2674 -3031 -2331 -243 1205 2269 3301 5743 5411 5824 8345 6954 6818 7517 6080 4505
883D505q01N52l239j427R69l350m68q83p00j658j10J00j766J869N78o16J653K487
$$ 4505 3704 4256 1017 -410 559 -2791 -3259 -4142 -4842 -6500 -6610 -6510 -8276 -6407 -5829 -6445 -4792 -2305
901b305m30J596L472L87n95K548J628k48L98J109j450k53L56n3j183p79j092j822
$$ -2305 -2735 -1139 2333 2720 2125 4673 6301 6053 6451 7560 6110 5857 6213 6160 4977 4198 3106 1284
919A284j093j294l691L70q89J69k456J984k323J162l88K020N3O8L517l16J307
$$ 1284 191 -1103 -4794 -4424 -5313 -5144 -7600 -5616 -7939 -6777 -7165 -5145 -5092 -5024 -1507 -1823 -516
936e16K374N71l31L014J412K93j063K948j622j897J313j833l005O99j598j643
$$ -516 1858 2429 2098 5112 6524 6817 5754 8702 7080 5183 6496 4663 1658 2357 759 -884
952h84o36j334j354j509j07O34j832Q02J010j322M96R96P84R99J866J017J495
$$ -884 -1520 -2854 -4208 -5717 -5824 -5190 -7022 -6220 -5210 -6532 -6036 -5040 -4256 -3257 -1391 -374 1121
969A121J910jJ784M47J414m66q85J628j93k046Q51j040j456j543n88j548k238
$$ 1121 3031 3030 4814 5261 6675 6209 5324 6952 6759 4713 5564 4524 3068 1525 937 -611 -2849
986b849M02j845j348j058J015j508J199L73j69R40N30R39O84K308Q80P13J375
$$ -2849 -2447 -4292 -5640 -6698 -5683 -7191 -5992 -5619 -5788 -4848 -4318 -3379 -2695 -387 493 1206 2581
1003B581K063l23J409J987j724J019m34j250j009k70p86j830j564n96j108j864
$$ 2581 4644 4321 5730 7717 5993 7012 6578 5328 4319 4049 3263 1433 -131 -727 -1835 -3699
1019c699N80j523j361J269K26k184J613K05l07J273J171J040N04K161J341l69
$$ -3699 -3119 -4642 -6003 -4734 -4508 -6692 -5079 -4874 -5181 -3908 -2737 -1697 -1193 968 2309 1940
1035A940J809O06P84LJ976j044j143J061q49k104m07J47k294j262m33j807j141
$$ 1940 3749 4355 5139 5142 7118 6074 4931 5992 5143 3039 2632 2779 485 -777 -1210 -3017 -4158
1052d158M51j721p18O58L4j263P60R22l7J312K052K62L56K547J233Q04j0K244
$$ -4158 -3707 -5428 -6146 -5488 -5454 -6717 -5957 -5035 -5072 -3760 -1708 -1446 -1090 1457 2690 3494 3484 5728
1070E728q88J084m24J366k160L50j49j739n60n80k675r95L55j659j729Q09k149
$$ 5728 4840 5924 5500 6866 4706 5056 4907 3168 2608 2028 -647 -1642 -1287 -2946 -4675 -3866 -6015
1087f015n94Q90M35j326J123J403Q41p2J820J336J157R90O30J220K18J940J7j039
$$ -6015 -6609 -5719 -5284 -6610 -5487 -4084 -3243 -3315 -1495 -159 998 1988 2618 3838 4056 5996 6013 4974
1105D974R03n46n55R56k372j659j229N13k276j205k29r05n51p75L73q56kk61J715
$$ 4974 5877 5331 4776 5732 3360 1701 472 985 -1291 -2496 -2725 -3630 -4181 -4956 -4583 -5439 -5441 -5702 -3987
1124c987k6m2M85J429J716J036O25J037K543o51O48J280q07n49J084q39j360j091
$$ -3987 -4013 -4055 -3570 -2141 -425 611 1236 2273 4816 4165 4813 6093 5286 4737 5821 4982 3622 2531
1142B531l0j116j624P84j430K89j912n97k381l67j2o88K031l40n9K021k97J480
$$ 2531 2501 1385 -239 545 -885 -596 -2508 -3105 -5486 -5853 -5865 -6553 -4522 -4862 -4921 -2900 -3197 -1717
1160a717L28J571J356Q42p87J830J549p30R59m38m34N39Q29k010n24k36k180j173
$$ -1717 -1389 182 1538 2380 1593 3423 4972 4242 5201 4763 4329 4868 5697 3687 3163 2927 747 -426
1178d26j73j032j880j3q61j380L65O56k14P93R00p83J255R05J292l25K211Q88
$$ -426 -599 -1631 -3511 -3524 -4385 -5765 -5400 -4744 -4958 -4165 -3265 -4048 -2793 -1888 -596 -921 1290 2178
1196B178o19J084K415k41L14M18M24j379m15N20k361j5j347n73j211j68j489l60
$$ 2178 1559 2643 5058 4817 5131 5549 5973 4594 4179 4699 2338 2323 976 403 -808 -976 -2465 -2825
1214b825o52p30r21N95M99j120J5J562J019p9K084J149J44P05J108P13Q69J054
$$ -2825 -3477 -4207 -5128 -4533 -4034 -5154 -5139 -3577 -2558 -2637 -553 596 740 1445 2553 3266 4135 5189
1232E189j367Q06N63n48p59J72k94j942k6p78j160p49o32j614j252J19J01j785
$$ 5189 3822 4628 5191 4643 3884 4056 3762 1820 1794 1016 -144 -893 -1525 -3139 -4391 -4272 -4171 -5956
1250e956P32M38q5J648O19l57J283K137Q85p42Q55J591J090q89J175N73o81O85
$$ -5956 -5224 -4786 -4871 -3223 -2604 -2961 -1678 459 1344 602 1457 3048 4138 3249 4424 4997 4316 5001
1268E001m34o20N6j087j095p76q75j386q42n94j079j33l29k89J93l32L42N81Q0
$$ 5001 4567 3947 4003 2916 1821 1045 170 -1216 -2058 -2652 -3731 -3864 -4193 -4482 -4289 -4621 -4279 -3698 -3618
1287c618J331M31l26L183N92l98M76J568N2J266K15l18O3p56L89j070o46p50r29
$$ -3618 -2287 -1856 -2182 1001 1593 1195 1671 3239 3291 4557 4772 4454 4517 3761 4150 3080 2434 1684 755
1306G55o24L38k045j311P05j017q57M4n63m20oO91R17O3J360N69J502P40N79M84
$$ 755 131 469 -1576 -2887 -2182 -3199 -4056 -4012 -4575 -4995 -5001 -4310 -3393 -3330 -1970 -1401 101 841 1420 1904
1326A904M93O31Q59L21R73j181p62J600j478P5j130m19j688j084r88l0j382K41
$$ 1904 2397 3028 3887 4208 5181 4000 3238 4838 3360 3435 2305 1886 198 -886 -1874 -1904 -3286 -3045
1344c045q86K80K25k18Op54J873L62l30J275Q49K23O5K520M47n96K143O15j076
$$ -3045 -3931 -3651 -3426 -3644 -3638 -4392 -2519 -2157 -2487 -1212 -363 -140 -75 2445 2892 2296 4439 5054 3978
1363C978O46N01j706j05J44j961m80l56r51j501o95K14q82j26M07k452J252j41
$$ 3978 4624 5125 3419 3314 3458 1497 1017 661 -290 -1791 -2486 -2272 -3154 -3280 -2873 -5325 -4073 -4214
1381d214P32j107J275P50N52R26J434J314L83P16L40L7J091j33r8j168L20p18
$$ -4214 -3482 -4589 -3314 -2564 -2012 -1086 348 1662 2045 2761 3101 3138 4229 4096 3998 2830 3150 2432
1399B432N40k23j446J24j219k10j686n34j17j637J45m47n10K22M17P31K19R72
$$ 2432 2972 2749 1303 1427 208 -2 -1688 -2222 -2339 -3976 -3831 -4278 -4788 -4566 -4149 -3418 -3199 -2227
1417b227L0J203P80P94J533n59J109R59o76L30J040R6o24L35j213j38q42n55j071
$$ -2227 -2197 -994 -214 580 2113 1554 2663 3622 2946 3276 4316 4412 3788 4123 2910 2772 1930 1375 304
1436C04j422O97l99k227l01m30p39P89m49J014K00O08l46Q90l12Q02J157R10m91
$$ 304 -1118 -421 -820 -3047 -3348 -3778 -4517 -3728 -4177 -3163 -2963 -2355 -2701 -1811 -2123 -1321 -164 746 255
1455B55K734L43r2j5M4K2j3j76P71j350j704J374j953m82j62l92k026J6q80m18
$$ 255 2989 3332 3240 3225 3269 3291 3278 3102 3873 2523 819 2193 240 -242 -404 -796 -2822 -2806 -3686 -4104
1475d104J98N81p79J87O05m8J029O50J569M94M06J698o99J290M33m8q8N01l79
$$ -4104 -3906 -3325 -4104 -3917 -3312 -3360 -2331 -1681 -112 382 788 2486 1787 3077 3510 3462 3374 3875 3496
1494C496j28Q72j660j188K72q27j944O99o35j329r49p36J416L17k329J757j48
$$ 3496 3368 4240 2580 1392 1664 837 -1107 -408 -1043 -2372 -3321 -4057 -2641 -2324 -4653 -2896 -3044
1511c044M61N21K88P19l9M06J293L98R97j043J149J096j36j38Q74l95p63M98k67
$$ -3044 -2583 -2062 -1774 -1055 -1094 -688 605 1003 2000 957 2106 3202 3066 2928 3802 3407 2644 3142 2875
1530B875p75q32j278m94j883O50K56k020J68o3l71k21M4M4M50N98J504P3J571
$$ 2875 2100 1268 -10 -504 -2387 -1737 -1481 -3501 -3333 -3396 -3767 -3988 -3944 -3900 -3450 -2852 -1348 -1275 296
1549B96l1R42J12j77J469K40K40R14K32P8j361j29j5r66p23j628K86n66j022j598
$$ 296 265 1207 1319 1142 2611 2851 3091 4005 4237 4315 2954 2825 2810 1844 1121 -507 -221 -787 -1809 -3407
1569c407J400n55j339p4N69j88m84K057r47J005J701k63L51J180N37N99N21J3
$$ -3407 -2007 -2562 -3901 -3975 -3406 -3594 -4078 -2021 -2968 -1963 -262 -525 -174 1006 1543 2142 2663 2676
1587B676M01L86J90j045J80k14k63P4j395l67l89j698K57l01j57L3j545o13L53
$$ 2676 3077 3463 3653 2608 2788 2574 2311 2385 990 623 234 -1464 -1207 -1508 -1665 -1632 -3177 -3790 -3437
1606c437O06n5q41K161p90M77K288n52j00J659j99J393q2Q81j26L67m08l23p12
$$ -3437 -2831 -2886 -3727 -1566 -2356 -1879 409 -143 -243 1416 1217 2610 2528 3409 3283 3650 3242 2919 2207
1625B207K38p13k88j09l52j608r6p37n44m81j216L47P5P01p08l61Q57M04R55J159
$$ 2207 2445 1732 1444 1335 983 -625 -721 -1458 -2002 -2483 -3699 -3352 -3277 -2576 -3284 -3645 -2788 -2384 -1429 -270
1645b70k54P96Q20M9J131k11O78J376j845J369J93k051P55o42j617M75m67j063
$$ -270 -524 272 1092 1141 2272 2061 2739 4115 2270 3639 3832 1781 2536 1894 277 752 285 -778
1663g78l38K67j973K69m40L79p75k17O68J170j318J506N55N41m02L47J271N1O05
$$ -778 -1116 -849 -2822 -2553 -2993 -2614 -3389 -3606 -2938 -1768 -3086 -1580 -1025 -484 -886 -539 732 783 1388
1682A388M26L77J552j89o68P81j910J742q14q71j537m07R66q73j074m31n90p18
$$ 1388 1814 2191 3743 3554 2886 3667 1757 3499 2685 1814 277 -130 836 -37 -1111 -1542 -2132 -2850
1700b850R0n89m40R86n17N68M83K49R32j8J046J322q45R55Q29N82k29L57M58l91
$$ -2850 -2760 -3349 -3789 -2803 -3320 -2752 -2269 -2020 -1088 -1106 -60 1262 417 1372 2201 2783 2554 2911 3369 2978
1720B978l17k94o24P13r48L31j643j017m64j00N06j383o58j63K12J268j662M23
$$ 2978 2661 2367 1743 2456 1508 1839 196 -821 -1285 -1385 -879 -2262 -2920 -3083 -2871 -1603 -3265 -2842
1738b842J207r48R34R16J377n91J571j97K1J17J130r21J9R34m70k30J13j92r92
$$ -2842 -1635 -2583 -1649 -733 644 53 1624 1427 1448 1565 2695 1774 1793 2727 2257 2027 2140 1948 956
1757I56o58K08j605J490k294P02m37q35m14K08l70M69kn7K85L78J030P01J303
$$ 956 298 506 -1099 391 -1903 -1201 -1638 -2473 -2887 -2679 -3049 -2580 -2582 -2639 -2354 -1976 -946 -245 1058
1776A058j95N88O27N22q26J086L99q87R51q43m03Q5j142n07k72J16r66j548J598
$$ 1058 863 1451 2078 2600 1774 2860 3259 2372 3323 2480 2077 2162 1020 513 241 357 -609 -2157 -559
1795e59j645p44M7n86J8Q98N07n92J93P52J82J139l04J879l88K286j052o27Q04
$$ -559 -2204 -2948 -2901 -3487 -3469 -2571 -2064 -2656 -2463 -1711 -1529 -390 -694 1185 797 3083 2031 1404 2208
1814B208q6j38K98P87j570P9M36j038j394L51j344J27p69m18R89j083m67R04j23
$$ 2208 2122 1984 2282 3069 1499 1578 2014 976 -418 -67 -1411 -1284 -2053 -2471 -1482 -2565 -3032 -2128 -2251
1833b251k62k99P57P21O92J93n38J910j83n4Q09K02M84J361N2j175L05q32n97
$$ -2251 -2513 -2812 -2055 -1334 -642 -449 -987 923 740 686 1495 1697 2181 3542 3594 2419 2724 1892 1295
1852A295K88L26p13j627L51M4j769J527j119m80r55QO71l81J067r22J71J338m25
$$ 1295 1583 1909 1196 -431 -80 -36 -1805 -278 -1397 -1877 -2832 -2824 -2153 -2534 -1467 -2389 -2218 -880 -1305
1871a305J89K043l26R18k42n3J427%l32l88P16o20J38r50l13Q25q80j094n43O94
$$ -1305 -1116 927 601 1519 1277 1224 2651 2651 2319 1931 2647 2027 2165 1215 902 1727 847 -247 -790 -96
1891i6j269R3q60n67J6j07j42O71P24O48l67k87J837n44L07N89L89J027o6O13
$$ -96 -1365 -1272 -2132 -2699 -2683 -2790 -2932 -2261 -1537 -889 -1256 -1543 294 -250 57 646 1035 2062 1996 2609
1911B609l83L16p83K52k58J78n28n36J58j756n01k17P68N35k193R05q81k66K24
$$ 2609 2226 2542 1759 2011 1753 1931 1403 867 1025 -731 -1232 -1449 -681 -146 -2339 -1434 -2315 -2581 -2357
1930b357R96r99M4J259o37O64q4J034J358L02jM61j22O96j371Q29k09K59j90o09
$$ -2357 -1361 -2360 -2316 -1057 -1694 -1030 -1114 -80 1278 1580 1579 2040 1918 2614 1243 2072 1863 2122 1932 1323
1950A323j221J340o62j052l61p69p82M88m36r64k46J523p83J018j0N10k34Q18
$$ 1323 102 1442 780 -272 -633 -1402 -2184 -1696 -2132 -3096 -3342 -1819 -2602 -1584 -1594 -1084 -1318 -500
1968e00M59N15o01J500N92n51P88m98O7Q26K04m41j3J68m19j125n46k47j13q18
$$ -500 -41 474 -127 1373 1965 1414 2202 1704 1771 2597 2801 2360 2347 2515 2096 971 425 178 65 -753
1988g53p70J94o26j45j15q7P44m36n76O98Q69J309j056N81j166K055J068j057
$$ -753 -1523 -1329 -1955 -2100 -2215 -2302 -1558 -1994 -2570 -1872 -1003 306 -750 -169 -1335 720 1788 731
2006G31J523L06o93P98j97k5m08m50j068k53P09j952L22j043J98O6K37j563O34
$$ 731 2254 2560 1867 2665 2468 2443 2035 1585 517 264 973 -979 -657 -1700 -1502 -1436 -1199 -2762 -2128
2025b128J17N57n94K4J064j591J221J705m08M09K28N67J180o60J303j333l29J849
$$ -2128 -2011 -1454 -2048 -2024 -960 -2551 -1330 375 -33 376 604 1171 2351 1691 2994 1661 1332 3181
2043C181j592L23J83j004M35J01k019n05p19R01j320N35j287J09J375n99J36K68
$$ 3181 1589 1912 2095 1091 1526 1627 -392 -897 -1616 -715 -2035 -1500 -2787 -2678 -1303 -1902 -1766 -1498
2061a498j28k88P15N00J76J462k26m7L16N47Q3N68N5N93j008N61m23j434R50o11
$$ -1498 -1626 -1914 -1199 -699 -523 939 713 666 982 1529 1612 2180 2235 2828 1820 2381 1958 524 1474 863
2081H63q84J89q52p39k36j23l16k6K36l8j42O89M80L55p4O09K29M7Q6O27N39l96
$$ 863 -21 168 -684 -1423 -1659 -1782 -2098 -2124 -1888 -1926 -2068 -1379 -899 -544 -618 -9 220 267 353 980 1519 1123
2103A123J060o33L06R5l97K46l14j32r13L96m62j058k1o09l12O40p76L90R0o61
$$ 1123 2183 1550 1856 1951 1554 1800 1486 1354 441 837 375 -683 -704 -1313 -1625 -985 -1761 -1371 -1281 -1942
2123a942j055J969k66m08J676j160O03O19p3J121q92J838n5j301J117j007J062
$$ -1942 -2997 -1028 -1294 -1702 -26 -1186 -583 36 -37 1084 192 2030 1975 674 1791 784 1846
2140A846N9M97l21q17k73J31j294r4o74l43K42r19j91k35jJ050o84J18K78J14
$$ 1846 1905 2402 2081 1264 991 1122 -172 -266 -940 -1283 -1041 -1960 -2151 -2386 -2387 -1337 -2021 -1903 -1625 -1511
2160a511M64J267p38J809n15J0Q53q62J132n50J87O81l23p31M91n40j478J137
$$ -1511 -1047 220 -518 1291 776 786 1639 777 1909 1359 1546 2227 1904 1173 1664 1124 -354 783
2178G83j097m74m14O17q63M46j478L69j61J614q84k5L1Q77K95m01M84J077m67
$$ 783 -314 -788 -1202 -585 -1448 -1002 -2480 -2111 -2272 -658 -1542 -1567 -1536 -659 -364 -765 -281 796 329
2197C29K68K93P48k49k54j44P20n42N96j51o40K14j541O83K35j128j311N42m02
$$ 329 597 890 1638 1389 1135 991 1711 1169 1765 1614 974 1188 -353 330 565 -563 -1874 -1332 -1734
2216a734l57K49N56r2m9J39p02P70k55o3J170P53l2j57J426l40R6kJ770j248k32
$$ -1734 -2091 -1842 -1286 -1378 -1427 -1288 -1990 -1220 -1475 -1538 -368 385 353 196 1622 1282 1378 1376 3146 1898 1666
2237A666Q39j299p55J497j767J520j127q32k55j92J84q42N67q91J02%Q7k00N11
$$ 1666 2505 1206 451 1948 181 1701 574 -258 -513 -705 -521 -1363 -796 -1687 -1585 -1585 -1498 -1698 -1187
2256a187l78J545o32O08Q08q46J704J51j007R47j02O41m52n31K73q69N94j30j290
$$ -1187 -1565 -20 -652 -44 764 -82 1622 1773 766 1713 1611 2252 1800 1269 1542 673 1267 1137 -153
2275a53m24M54M63j392Q7q27P97o40oK01m23J265L56n81J26N63j93O31M17L67
$$ -153 -577 -123 340 -1052 -965 -1792 -995 -1635 -1641 -1440 -1863 -598 -242 -823 -697 -134 -327 304 721 1088
2295A088j113R94J28K89J72n66J060q72k27J91l81Nj304J085m01l92r00K70l20
$$ 1088 -25 969 1097 1386 1558 992 2052 1180 953 1144 763 768 -536 549 148 -244 -1144 -874 -1194
2314a194L70p01J73N65j559J220n51N55K77J426p91J048k79k02L72R35p05R91
$$ -1194 -824 -1525 -1352 -787 -2346 -1126 -1677 -1122 -845 581 -210 838 559 357 729 1664 959 1950
2332A950q37Q28j02j205J43O9L26j384J95q5k90mm44p65M44k74p03N91j82K23
$$ 1950 1113 1941 1839 634 777 846 1172 -212 -17 -102 -392 -396 -840 -1605 -1161 -1435 -2138 -1547 -1729 -1506
2352a506L50O8M12N41o78J428o83R02M16K42n52O57l82Q88K54o10m69o56m95l75
$$ -1506 -1156 -1088 -676 -135 -813 615 -68 834 1250 1492 940 1597 1215 2103 2357 1747 1278 622 127 -248
2372b48L18j718J742k89j506J118j293N79J68j4k45j025J561J07N76j8j2R40O
$$ -248 70 -1648 94 -195 -1701 -583 -1876 -1297 -1129 -1143 -1388 -2413 -852 -745 -169 -187 -199 741 747
2391G47l86RJ81J196n34r23J184q75Q2K37r07O27o38O28n83l58o71R57j015r32
$$ 747 361 370 551 1747 1213 290 1474 599 681 918 11 638 0 628 45 -313 -984 -27 -1042 -1974
2411a974M02j26L68J54q0k25N27M28k50Q86O5l83L43J179q86R66K54mn57O3K38
$$ -1974 -1572 -1698 -1330 -1176 -1256 -1481 -954 -526 -776 110 175 -208 135 1314 428 1394 1648 1644 1087 1150 1388
2432A388pk72j307P93q68J0Q46o36r75l41K07J73l86k40K63q0J361j686K25J335
$$ 1388 1381 1109 -198 595 -273 -263 583 -53 -1028 -1369 -1162 -989 -1375 -1615 -1352 -1432 -71 -1757 -1532 -197
2452a97Q24j345R03L68J51k45R00q32Q75n31J65L0N8k55m10n78K19jn89K03J57
$$ -197 627 -718 185 553 704 459 1359 527 1402 871 1036 1066 1124 869 459 -119 100 99 -490 -287 -130
2473a30j469J027J90j495J143p18K18N44o2m97J35J137j76K44J18J17J102k26
$$ -130 -1599 -572 -382 -1877 -734 -1452 -1234 -690 -752 -1249 -1114 23 -153 91 209 326 1428 1202
2491A202j15m8Q21j624P53J62p1j44o07L50k93j171J030n78L86j061j98m56J042
$$ 1202 1087 1039 1860 236 989 1151 1080 936 329 679 386 -785 245 -333 53 -1008 -1206 -1662 -620
2510f20O47m48q14o8j15J590n99j25N46O21l74M60K62l3K1J92P23j486Q11j65
$$ -620 27 -421 -1235 -1303 -1418 172 -427 -552 -6 615 241 701 963 930 951 1143 1866 380 1191 1026
2530A026n34l31P51p85j561N74N72p05j48l26J135q85M12j18l0J43m36K68P11
$$ 1026 492 161 912 127 -1434 -860 -288 -993 -1141 -1467 -332 -1217 -805 -923 -953 -810 -1246 -978 -267
2549b67l87Q42R2J25N31p20J000l89k87O15O46l48j299L52K69k46l57L58q81m36
$$ -267 -654 188 280 405 936 216 1216 827 540 1155 1801 1453 154 506 775 529 172 530 -351 -787
2569g87m63O97n89k53M21j92j07J047o85M63n81j49M5J081N51l69J085L18j284
$$ -787 -1250 -553 -1142 -1395 -974 -1166 -1273 -226 -911 -448 -1029 -1178 -1133 -52 499 130 1215 1533 249
2588B49l09J567r40K43m90M59P9j057J253n59n85L12j177K42l19L24n28J652o90
$$ 249 -60 1507 567 810 320 779 858 -199 1054 495 -90 222 -955 -713 -1032 -708 -1236 416 -274
2607b74q12l09K76P68P38m48j039M59P05J332j400L24J64Q92o12R39n96K25m03
$$ -274 -1086 -1395 -1119 -351 387 -61 -1100 -641 64 1396 -4 320 484 1376 764 1703 1107 1332 929
2626I29J17R7n36K39j320l34M44m10q7K61j47n14N36Q9m85P88o40j35M40l10P79
$$ 929 1046 1143 607 846 -474 -808 -364 -774 -861 -600 -747 -1261 -725 -636 -1121 -333 -973 -1108 -668 -978 -199
2647a99Q02j097J247N54J32j188R37o84q2K56M89m81n67L1J385j326m20J571k045
$$ -199 603 -494 753 1307 1439 251 1188 504 422 678 1167 686 119 150 1535 209 -211 1360 -685
2666f85M6J34j010O63O77j316M10Q38q14R91j156J080n19J139L0j199J309M37
$$ -685 -639 -505 -1515 -852 -175 -1491 -1081 -243 -1057 -66 -1222 -142 -661 478 508 -691 618 1055
2684A055o09J063r89P3P70q12Nl44M29j487J627j222J105j136j6L00j001n8Q49
$$ 1055 446 1509 520 593 1363 551 556 212 641 -846 781 -441 664 -472 -488 -188 -1189 -1247 -398
2703c98n4N64q76K10n30J306p40P63N8L32p24J1R48o78M67L0L53l41k17L77N25
$$ -398 -452 112 -764 -554 -1084 222 -518 245 303 635 -89 -78 870 192 659 689 1042 701 484 861 1386
2724A386j034R96j030k07o83J330p38J1q4m77J16j83k34K91p26k90P71O18o80
$$ 1386 352 1348 318 111 -572 758 20 31 -53 -530 -414 -597 -831 -540 -1266 -1556 -785 -167 -847
2743h47N06Q02o79p58O58J343k71j10J23L67N73o75m27J06p34L86l6q16Q11j433
$$ -847 -341 461 -218 -976 -318 1025 754 644 767 1134 1707 1032 605 711 -23 363 327 -489 322 -1111
2763a111O33R90j967Q32R5k82N98o10J141l70K6o93K27J16N66R9M03q6j81O77
$$ -1111 -478 512 -1455 -623 -528 -810 -212 -822 319 -51 -25 -718 -491 -375 191 290 693 607 426 1103
2783A103j65m8o80R42m22N73o59k14r5M89j491J270r33J47l95K04l12l42J159
$$ 1103 938 890 210 1152 730 1303 644 430 335 824 -667 603 -330 -183 -578 -374 -686 -1028 131
2802A31j342J050o34M00j16J5M00M36K88l84L64k97P39o50M10J36R4j509J298
$$ 131 -1211 -161 -795 -395 -511 -496 -96 340 628 244 608 311 1050 400 810 946 1040 -469 829
2821H29J92j45k21p40n74J83J40p27Q55o38o41P56o84J545j316K124j072q54J95
$$ 829 1021 876 655 -85 -659 -476 -336 -1063 -208 -846 -1487 -731 -1415 130 -1186 938 -134 -988 -793
2840g93J510m12K43P32j377J705k57o38n21Q22P37j013p92J280q45LL82l36m76
$$ -793 717 305 548 1280 -97 1608 1351 713 192 1014 1751 738 -54 1226 381 384 766 430 -46
2859d6p1o77M43J57o32K93M6L06kp77J159o84J201j320O35O73j91J77p08J164
$$ -46 -117 -794 -351 -194 -826 -533 -487 -181 -183 -960 199 -485 716 -604 31 704 513 690 -18 1146
2879A146k47K88k56l69k32N51r00N15n28q1n24P46Q65j537kK18n8K28l92l39K34
$$ 1146 899 1187 931 562 330 881 -19 496 -32 -113 -637 109 974 -563 -565 -347 -405 -177 -569 -908 -674
2900f74m84R80Q53j184k86L18Q66q42J432j064N83o3L94O9n39O25n55l92J132
$$ -674 -1158 -178 675 -509 -795 -477 389 -453 979 -85 498 435 829 898 359 984 429 37 1169
2919A169J56j170J027j473L2O5Q79n51o83L13l11k02N73Qr06N92L97j05l00M85
$$ 1169 1325 155 1182 -291 -259 -194 685 134 -549 -236 -547 -749 -176 -168 -1074 -482 -85 -190 -490 -5
2939en0M77J08j76L16p36K33J101j058O03j89k58L48L32q28K25j516P68q25J041
$$ -5 -55 422 530 354 670 -66 167 1268 210 813 624 366 714 1046 218 443 -1073 -305 -1130 -89
2959h9o43N31q84N81m41L55j36R09j160J527L9k91k63O7m71N41j60P8N14M7j46
$$ -89 -732 -201 -1085 -504 -945 -590 -726 183 -977 550 589 298 35 102 -369 172 12 90 604 651 505
2980E05J68K95m89L63j439R05o42R55l97M3l57K03j034L39n81N97M70L2o28R94
$$ 505 673 968 479 842 -597 308 -334 621 224 267 -90 113 -921 -582 -1163 -566 -96 -64 -692 302
3000C02k17p45k16j32R60O96k80O72l67K01o65N99L66r06n11N82M94N52j604R2
$$ 302 85 -660 -876 -1008 -48 648 368 1040 673 874 209 808 1174 268 -243 339 833 1385 -219 -127
3020a27kP3j094J292j73n91k10L15O0m77R12n61L25o65J106j146J381p05N2P4
$$ -127 -129 -56 -1150 142 -31 -622 -832 -517 -457 -934 -22 -583 -258 -923 183 -963 418 -287 -235 -161
3040a61R08j16p63N36j4J5R31m75O00n47j617K86N06l09N79j081J065r98R87r97
$$ -161 747 631 -132 404 390 405 1336 861 1461 914 -703 -417 89 -220 359 -722 343 -655 332 -665
3060f65P68n68o28J059m81K6N73m25k56K99O63J040j009k43J178j844J059J25
$$ -665 103 -465 -1093 -34 -515 -489 84 -341 -597 -298 365 1405 396 153 1331 -513 546 671
3078F71m06l80J639j068l1o30J166m25j767J049l86R03k74r02N55k48Q88p93j77
$$ 671 265 -115 1524 456 425 -205 961 536 -1231 -182 -568 335 61 -841 -286 -534 354 -439 -616
3097f16J101j202M51JR34k332J774N43q49J184p29l7L19J04J87j06k39l63M12
$$ -616 485 -717 -266 -265 669 -1663 111 654 -195 989 260 223 542 646 833 727 488 125 537
3116E37n17k6M05n66j172KJ070k89j149J312k09R81j096oJ88L05J72Q8L01K8q14
$$ 537 20 -6 399 -167 -1339 -1337 -267 -556 -1705 -393 -602 379 -717 -723 -535 -230 -58 30 331 359 -455
3137d55J053M46j96J42r2k61m61K2K7N05k57m91J58m24J107j524L96m10K45o9
$$ -455 598 1044 848 990 898 637 176 198 225 730 473 -18 140 -284 823 -701 -305 -715 -470 -539
3157e39Kj71Q49k17o15M49o86O07L75N9j540K228n62L84m81l8L68n09j86O97l52
$$ -539 -537 -708 141 -76 -691 -242 -928 -321 54 113 -1427 801 239 623 142 104 472 -37 -223 474 122
3178A22p29N82q00J145o13K10P0j34m22J45O64l59k5k36O68m19o64J110p91M12
$$ 122 -607 -25 -825 320 -293 -83 -13 -147 -569 -424 240 -119 -144 -380 288 -131 -795 315 -476 -64
3198f4M14o9L8l87O3p3J39p9N54l82M3O1j50P58k107J389j59O81j351J194j111
$$ -64 350 281 319 -68 -5 -78 61 -18 536 154 197 258 108 866 -1241 148 -11 670 -681 513 -598
3219e98K47n61K8L39M47N38q60M96n79j37N10k46L49q67P0J790p53N22j095R52
$$ -598 -351 -912 -884 -545 -98 440 -420 76 -503 -640 -130 -376 -27 -894 -824 966 213 735 -360 592
3239E92o26L26O60n38k13l51O56r06N91O78j212M76m23R91j455P52o31N31o14
$$ 592 -34 292 952 414 201 -150 506 -400 191 869 -343 133 -290 701 -754 -2 -633 -102 -716
3258g16P09o46P24o38j47J218L15j33m4j30N9K3j83r05J813m68p3n41l15k45N92
$$ -716 -7 -653 71 -567 -714 504 819 686 642 512 571 594 411 -494 1319 851 778 237 -78 -323 269
3279B69p91L90r44J989k166J220m65l89M33p15qJ371K68j460J083K24p54K59j47
$$ 269 -522 -132 -1076 913 -1253 -33 -498 -887 -454 -1169 -1177 194 462 -998 85 309 -445 -186 -333
3298c33O34j58n35J360j268Q86p93P26n58N84q95O82J43j005J006m81j07J44n53
$$ -333 301 143 -392 968 -300 586 -207 519 -39 545 -350 332 475 -530 476 -5 -112 32 -521
3317e21Q70K27k72j525R24l4j12l34O81L46p24j226J440m4n02L61R74L44J0p47
$$ -521 349 576 304 -1221 -297 -331 -443 -777 -96 250 -474 -1700 -260 -304 -806 -445 529 873 883 136
3337A36l12k54OJ757j179J21J01j94r49J132p9q93O45n05J26j15P11n33m36N83
$$ 136 -176 -430 -424 1333 154 275 376 182 -767 365 286 -607 38 -467 -341 -456 255 -278 -714 -131
3357a31n00N80o74P31J2k24O26N8k72p20M61K95O35n76k11J4J12l47k73K61k89
$$ -131 -631 -51 -725 6 18 -206 420 478 206 -514 -53 242 877 301 90 104 216 -131 -404 -143 -432
3378d32M59L97n83o63N87N34j477J647j176PO04J89p70J20Q35M17j533O54J163
$$ -432 27 424 -159 -822 -235 299 -1178 469 -707 -700 -96 93 -677 -557 278 695 -838 -184 979
3397I79r64N20j006P5o2J23M12K51R1q71J032N53l26j063L23p9m08K85j53n65
$$ 979 15 535 -471 -396 -458 -335 77 328 419 -452 580 1133 807 -256 67 -12 -420 -135 -288 -853
3417h53J343p50J79n56K42L85O0k3P86n06N38m93P42m50m92N3n51M12j25P41p25
$$ -853 490 -260 -81 -637 -395 -10 50 27 813 307 845 352 1094 644 152 205 -346 66 -59 682 -43
3438d3O03q79J884k184n8k0M39N96j155K90O7L57n58m0K5j5o3P5J45R19j207R13
$$ -43 560 -319 1565 -619 -677 -697 -258 338 -817 -527 -460 -103 -661 -701 -676 -691 -754 -679 -534 385 -822 91
3460I1J56j09q03R80K95o45R29n45k22j84J23j66R64n77l84L42N29j063J550j344
$$ 91 247 138 -665 315 610 -35 894 349 127 -57 66 -100 864 287 -97 245 774 -289 1261 -83
3480h3j93K4k02M87N09m97o83J680j355j55N52M30o33K45L02j080P26k8P69p29
$$ -83 -276 -252 -454 33 542 45 -638 1042 -313 -468 84 514 -119 126 428 -652 74 46 815 86
3500H6O17J2j855J514j003Q55L6L1J09j03r69L28Q15q24N49j166Q87k4M88n3k52
$$ 86 703 715 -1140 374 -629 226 262 293 402 299 -670 -342 473 -351 198 -968 -81 -105 383 330 78
3521G8m80M27J67q84J407j354J000o6j07J30M89p18k18N00j46k29O33m54J043
$$ 78 -402 25 192 -692 715 -639 361 295 188 318 807 89 -129 371 225 -4 629 175 1218
3540A218j870J530o45n99K50m33Q18r32m48J46R52j47ko12J180L1o95K60L34p73
$$ 1218 -652 878 233 -366 -116 -549 269 -663 -1111 -965 -13 -160 -162 -774 406 437 -258 2 336 -437
3560d37Q15o64J79L07P48j206J379p53L99k12j089N61o67L96M88j116L22N3O5
$$ -437 378 -286 -107 200 948 -258 1121 368 767 555 -534 27 -640 -244 244 -872 -550 -497 -432
3579d32l36K6R80l26j97l72M41R79n36o12r9O23R9M7O77l8o14J2k11J09J52L05
$$ -432 -768 -742 238 -88 -285 -657 -216 763 227 -385 -484 139 238 285 962 924 310 322 111 220 372 677
3601F77K54j097O53p61M63l78J67l04l32J281r80M79n20p9J09K77L93k91n00K12
$$ 677 931 -166 487 -274 189 -189 -22 -326 -658 623 -357 122 -398 -477 -368 -91 302 11 -489 -277
3621b77n11J278k77j57n76Q16J74j70l94J04j0J21j34k8J39j4L25L6o88n4J261
$$ -277 -788 490 213 56 -520 296 470 300 -94 10 0 121 -13 -41 98 84 409 445 -243 -297 964
3642I64p86j059J077p23j776K347mj099J99J021r57J80J27L54L3M94n65O05N2
$$ 964 178 -881 196 -527 -2303 44 40 -1059 -860 161 -796 -616 -489 -135 -102 392 -173 432 484
3661D84n24O38N03n90q05R98j021R28j078N06N93n62N20p95r21Q81J41n83o04
$$ 484 -40 598 1101 511 -294 704 -317 611 -467 39 632 70 590 -205 -1126 -245 -104 -687 -1291
3680a291J501m12K78m51r2J135j560J84R47k39j98R60j168L05K78J31K47m24M23
$$ -1291 210 -202 76 -375 -467 668 -892 -708 239 0 -198 762 -406 -101 177 308 555 131 554
3699E54J034j157L24j483O11L5p24K08R93j47p22Q48r09J68K02l63K49j77R95
$$ 554 1588 431 755 -728 -117 -82 -806 -598 395 248 -474 374 -535 -367 -165 -528 -279 -456 539
3718E39j5q31n95P61O67l24L16j5j09K21q94m7j9J339q19l12P64n18J48m66M57
$$ 539 524 -307 -902 -141 526 202 518 503 394 615 -279 -326 -345 994 175 -137 627 109 257 -209 248
3739B48j399J466m74M70J9o61n40L06J40J6K77l97L81K28M60j612J325k64J30
$$ 248 -1151 315 -159 311 330 -331 -871 -565 -425 -409 -132 -529 -148 80 540 -1072 253 -11 119
3758A19J40M12q18j46oO36j30L85Oj14l74M73n68N13j235J253p64j12r56J995
$$ 119 259 671 -147 -293 -299 337 207 592 598 484 110 583 15 528 -707 546 -218 -330 -1286 709
3778G09q79K32L5j8L18K2r13K89K97o49P3N52J257j926P80N2O48n14j62n43M24
$$ 709 -170 62 97 79 397 419 -494 -205 92 -557 -484 68 1325 -601 179 231 879 365 203 -340 84
3799H4j263J288K72m13K2m63n93R20L27N3k21L25l30N96n52M8M47n92J121j348
$$ 84 -1179 109 381 -32 -10 -473 -1066 -146 181 234 13 338 8 604 52 100 547 -45 1076 -272
3819b72J046o97O33o81J056j81j088R3P59J3l6r76L09l65j59l8K74j40k60J157
$$ -272 774 77 710 29 1085 904 -184 -91 668 681 645 -331 -22 -387 -546 -584 -310 -450 -710 447
3839D47n07m74R7j145J212O09M43j39n77Q06k02o99M12J9m20M02L86n80M39K52
$$ 447 -60 -534 -437 -1582 -370 239 682 543 -34 772 570 -129 283 302 -118 284 670 90 529 781
3859G81p60j41K14J13M62o41J84j053P05M30l03j13O4j644O93M46Q39j35J77p68
$$ 781 21 -120 94 207 669 28 212 -841 -136 294 -9 -122 -58 -1702 -1009 -563 276 141 318 -450
3879d50M05n18J60L68L81o72k97J390j504J669q55K97m6L93m09N35q19l95L47
$$ -450 -45 -563 -403 -35 346 -326 -623 767 -737 932 77 374 328 721 312 847 28 -367 -20
3898b0N54j005K01n55N11jj5N90J4J8l63P41o82m5M9K06o6O07q39J02N91j81M0
$$ -20 534 -471 -270 -825 -314 -315 -330 260 274 292 -71 670 -12 -57 -8 198 132 739 -100 2 593 412 452
3921D52j15l2M19l92o25J244m97l93m11K53p89j20M29N36l48O50K16n62n69J96
$$ 452 337 305 724 332 -293 951 454 61 -350 -97 -886 -1006 -577 -41 -389 261 477 -85 -654 -458
3941d58Q2Q18j410o7J551j015j05K149j556k56O56N28j303O51r7q81R20K98n57
$$ -458 -376 442 -968 -1035 516 -499 -604 1545 -11 -267 389 917 -386 265 168 -713 207 505 -52
3960e2J085q00j060J226m50Q76q62l78k57n44Q01R6L00m38l48J040n51K37P5m7
$$ -52 1033 233 -827 399 -51 825 -37 -415 -672 -1216 -415 -319 -19 -457 -805 235 -316 -79 -4 -51
3980e1K04k26J028j363j39R4N08P34M51j809J030o25J5M7j256J143J090j46l76
$$ -51 153 -73 955 -408 -547 -453 55 789 1240 -569 461 -164 -149 -102 -1358 -215 875 729 353
3999C53o79J06j52l66O96L0o36J68n59N03J314p68J86l86N43m8m37P33o4P14j065
$$ 353 -326 -220 -372 -738 -42 -12 -648 -480 -1039 -536 778 10 196 -190 353 305 -132 601 537 1251 186
4020A86K5P46q40j32k02n24Q92r1K33m27M44q04L67q24o1J391j037K16O15o31
$$ 186 211 957 117 -15 -217 -741 151 60 293 -134 310 -494 -127 -951 -1012 379 -658 -442 173 -458
4040d58O69k46q39J033n12q95J847M7o21L48k31o40O45R52o88O61j476l36J041
$$ -458 211 -35 -874 159 -353 -1248 599 646 25 373 142 -498 147 1099 411 1072 -404 -740 301
4059C01k77K12m84n00N56Q90Qm15p26K66l09K6j34K80J057O71q62K3j207Q66N26
$$ 301 24 236 -248 -748 -192 698 706 291 -435 -169 -478 -452 -586 -306 751 1422 560 583 -624 242 768
4080G68j130L74p7m19M21L83P3n01j80O85r10k77M78J58Q96n50q11L90J41K10
$$ 768 -362 12 -65 -484 -63 320 393 -108 -288 397 -513 -790 -312 -154 742 192 -619 -229 -88 122
4100A22j092J117q75M2J412j624Q97n10l51P36M17j38n05q0j1N51l04J82M96O40
$$ 122 -970 147 -728 -686 726 -898 -1 -511 -862 -126 291 153 -352 -432 -443 108 -196 -14 482 1122
4120A122j683J366j010J68lM9J23l60kJ566j691L93l03l01J08N2N72p17N40M20
$$ 1122 -561 805 -205 -37 -40 9 132 -228 -230 1336 -355 38 -265 -566 -458 -406 166 -551 -11 409
4140D09M53j186J51R10k08r5R18q42q9J31J73r93L48P06m77%k40O24p92k13J071
$$ 409 862 -324 -173 737 529 434 1352 510 421 552 725 -268 80 786 309 309 69 693 -99 -312 759
4161G59m20j115Q71l46k11K10j5l42R78Q2o23p92M78L30J256r87n18N70j81J44
$$ 759 339 -776 95 -251 -462 -252 -267 -609 369 451 -172 -964 -486 -156 1100 113 -405 165 -16 128
4181A28n23Q71N61j272j1k22Q30p85k65O99q6l67K18l83M71L32j5m74R20k008
$$ 128 -395 476 1037 -235 -246 -468 362 -423 -688 11 -75 -442 -224 -607 -136 196 181 -293 627 -1381
4201a381J456j261J056j99q48K495n88j780J204K67j108J259J24m75Q93j740J184
$$ -1381 75 -1186 -130 -329 -1177 1318 730 -1050 154 421 -687 572 696 221 1114 -626 558
4218E58N10j704J540p08k67Q52o30j76P8m82q41Q50M18n47O88k79j015J489L4
$$ 558 1068 -636 904 196 -71 781 151 -25 53 -429 -1270 -420 -2 -549 139 -140 -1155 334 368
4237C68n98O02j076P49L11p25J085q62J698q20r96N87l00J72M76r5j346Q41m89
$$ 368 -230 372 -704 45 356 -369 716 -146 1552 732 -264 323 23 195 671 576 -770 71 -418
4256d18K65M6N6n06O73l47N22j688J704o52p76J846r58j39J71P07l35L67J08L69
$$ -418 -153 -107 -51 -557 116 -231 291 -1397 307 -345 -1121 725 -233 -372 -201 506 171 538 646 1015
4276A015k51o42O82j39M27m43j030N44n50Q39k14O50p8n75L11l12n66j01R7K45
$$ 1015 764 122 804 665 1092 649 -381 163 -387 452 238 888 810 235 546 234 -332 -433 -336 -91
4296i1R6l82M06n10J44n93J257k8L8m76l90J432k50o25N61k78q26R32p92M62O38
$$ -91 5 -377 29 -481 -337 -930 327 299 337 -139 -529 903 653 28 589 311 -515 417 -375 87 725
4317G25j234j5n73J785K58l42N4K62p20k60O14m67j16j89k47Q25O01j121k78q00
$$ 725 -509 -524 -1097 688 946 604 658 920 200 -60 554 87 -29 -218 -465 360 961 -160 -438 -1238
4337a238K783j359N63n91p52K97L31l98K77Q8J078j498O23L46p45k24L92M35j17
$$ -1238 1545 186 749 158 -594 -297 34 -364 -87 1 1079 -419 204 550 -195 -419 -27 408 291
4356B91n56n37jO29K95L7j422J272j31l2l64n36J407q13J35O61%m20O04P3k06
$$ 291 -265 -802 -803 -174 121 158 -1264 8 -123 -155 -519 -1055 352 -461 -326 335 335 -85 519 592 386
4377C86L1L31r61N85M68k16M8k76q29N91n67L08O8M29k49j07j69k37q4P05N43
$$ 386 417 748 -213 372 840 624 672 396 -433 158 -409 -101 -33 396 147 40 -129 -366 -450 255 798
4398G98k054K603p40o46P6R33r45J72K62M09m61l26J67r1k00j96K26p23J214o82
$$ 798 -1256 1347 607 -39 37 970 25 197 459 868 407 81 248 157 -43 -239 -13 -736 478 -204
4418b04K50r88Q62k18P22j156K39J37p09R17m68RP71M31q96N64n77J968k512P37
$$ -204 46 -942 -80 -298 424 -732 -493 -356 -1065 -148 -616 -607 164 595 -301 263 -314 1654 -858 -121
4438a21L18M6O56m74m14O91J82j830J217j22m90R04n64q74K53Q7j0M15m86K7j45
$$ -121 197 243 899 425 11 702 884 -946 271 149 -341 563 -1 -875 -622 -535 -545 -130 -616 -589 -734
4459g34O37J094j256k10J26J07P4n11J391o27k55l51O23N6K11J144j411N25r5
$$ -734 -97 997 -259 -469 -343 -236 -162 -673 718 91 -164 -515 108 164 375 1519 108 633 538
4478E38K5j10PJ11m18J8j40l7l12j44J35L83O3K04K62j361R56p48j12J122j105
$$ 538 563 453 460 571 153 171 31 -6 -318 -462 -327 56 119 323 585 -776 180 -568 -680 442 -663
4499f63K07J101r39Q4N69Q4n21R46m63K31m55K19O32j227N61o9k11L0l35j32k67
$$ -663 -456 645 -294 -210 359 443 -78 868 405 636 181 400 1032 -195 366 297 86 116 -219 -351 -618
4520f18k6J158j864Q20J056n46P6o07q5R34j65k31P83r44Q36J38qj23q05J682
$$ -618 -644 514 -1350 -530 526 -20 56 -551 -636 298 133 -98 685 -259 577 715 707 584 -221 1461
4540A461j171l79M10l50j74L73r22J19O00p06L15k2L0o8L90l77k84J05P97Kj150
$$ 1461 290 -89 321 -29 -203 170 -752 -633 -33 -739 -424 -446 -416 -484 -94 -471 -755 -650 147 149 -1001
4561a001Q37N67k17M45o65m66L17O10m3j012J319l13Q4l8J66p74N4O46k71K56
$$ -1001 -164 403 186 631 -34 -500 -183 427 384 -628 691 378 462 424 590 -184 -130 516 245 501
4581E01m17j303P81R09l56k87K09N31l6M9m70M28R4p6k286J657L36k24J78L37
$$ 501 84 -1219 -438 471 115 -172 37 568 532 581 111 539 633 557 -1729 -72 264 40 218 555
4601E55K05m28j09K08r42Q90M58j057J047q69j10M57p59R56k16q35O54K37j22
$$ 555 760 332 223 431 -511 379 837 -220 827 -42 -152 305 -454 502 286 -549 105 342 220
4620B20q10N35k07R67o22j028O7J296o04Q96q00n35J315j561J743m24j73n89P66
$$ 220 -590 -55 -262 705 83 -945 -878 418 -186 710 -90 -625 690 -871 872 448 275 -314 452
4639D52O47j643J196j097j75P58k66J185r10m23J2L2l88Q39n44M44q88K86k80
$$ 452 1099 -544 652 -445 -620 138 -128 1057 147 -276 -264 -232 -620 219 -325 119 -769 -483 -763
4658g63K47L64J76N15k96O20p81O65j010Q49k22oN36r46N44k06n1L43j112J779
$$ -763 -516 -152 24 539 243 863 82 747 -263 586 364 358 894 -52 492 286 235 578 -534 1245
4678A245j340M3k2p61K59k72L29M45P40j572J458r36r6K94Q21k66L36r65O65l33
$$ 1245 -95 -52 -74 -835 -576 -848 -519 -74 666 -906 552 -384 -480 -186 635 369 705 -260 405 72
4698G2N09o02q0J290r45J014j578J72M8J128j477R18j036P77p4l26l74R88o99
$$ 72 581 -21 -101 1189 244 1258 -320 -148 -100 1028 -449 469 -567 210 136 -190 -564 424 -275
4717b75j67O31m73L05lo83m2J056p4p31O22o58J12J27J015j34m92q7j316K177
$$ -275 -442 189 -284 21 18 -665 -707 349 275 -456 166 -492 -380 -253 762 628 136 49 -1267 910
4737I10K52o68q24K18L07l30n65R3k2p02R97n9m4k88J033L74p68J43N13l01N05
$$ 910 1162 494 -330 -112 195 -135 -700 -607 -629 -1331 -334 -393 -437 -725 308 682 -86 57 570 269 774
4758G74j055K06J079M3q68O80N86m93j41k02j180N49K05n63M06M19j340L16k88
$$ 774 -281 -75 1004 1047 179 859 1445 952 811 609 -571 -22 183 -380 26 445 -895 -579 -867
4777h67J067K58m75j180R14l69L92M04o31q23J877N48j030P97j634O34K37L74
$$ -867 200 458 -17 -1197 -283 -652 -260 144 -487 -1310 567 1115 85 882 -752 -118 119 493
4795D93K15p49m14R33k23j97O71m47k01M81l35n91P31n95J0K18n41K44O23m49
$$ 493 708 -41 -455 478 255 58 729 282 81 562 227 -364 367 -228 -218 0 -541 -297 326 -123
4815a23R8k37p52Q91o2P69j097M6O81j289J145P55m16n53M98J88l0o83k90M39
$$ -123 -25 -262 -1014 -123 -185 584 -513 -467 214 -1075 70 825 409 -144 354 542 512 -171 -461 -22
4835b2j68M77m76M64j09PR0j13n64J00J27k64P4Q0L60o13K13k31k58P08m70K65
$$ -22 -190 287 -189 275 166 173 263 150 -414 -314 -187 -451 -377 -297 63 -550 -337 -568 -826 -118 -588 -323
4857c23R44j349J030q96J539j133O87k17j07l6k42m82K11K28P13m34p71M58o23
$$ -323 621 -728 302 -594 945 -188 499 282 175 139 -103 -585 -374 -146 567 133 -638 -180 -803
4876h03M00j91M53q59J048j19o1p1O93K67o20K69l64m64O96K60P64j299R69r1
$$ -803 -403 -594 -141 -1000 48 -71 -132 -203 490 757 137 406 42 -422 274 534 1298 -1 968 877
4896H77r75K18O19k126J611K62k92l10N65j55k91q41O20j46r17J929r61j92N49
$$ 877 -98 120 739 -1387 224 486 194 -116 449 294 3 -838 -218 -364 -1281 648 -313 -505 44
4915D4q89M63O97l28J095l81j018R02l01Q4m87k93J271j175P31J084j959J153
$$ 44 -845 -382 315 -13 1082 701 -317 585 284 368 -119 -412 859 -316 415 1499 -460 693
4933F93l27rk63p21J108l84r5m51J37k7L11j032O89k19K45k37P10k49m85N01L37
$$ 693 366 357 94 -627 481 97 2 -449 -312 -339 -28 -1060 -371 -590 -345 -582 128 -121 -606 -105 232
4954B32o53K21L58O86k012M49J744m26K3m81j48J91p26R5K69J18j41M01l00j141
$$ 232 -421 -200 158 844 -1168 -719 1025 599 622 141 -7 184 -542 -447 -178 -60 -201 200 -100 -1241
4974a241J193l13L82j28J4q96J009l43N59P9j58j29N17j071J743q69J14L91j265
$$ -1241 -48 -361 21 -107 -93 -989 20 -323 236 315 157 28 545 -526 1217 348 462 853 -412
4993d12P08o1L77q83P57j163M6M10O33p36l27O78o39K97J89k78L45j88l41L58
$$ -412 296 235 612 -271 486 -677 -631 -221 412 -324 -651 27 -612 -315 -126 -404 -59 -247 -588 -230
5013b30k22j01R95j30m74j102J308M74O4m43L61j41k59K80P0q34J51km70P33L48
$$ -230 -452 -553 442 312 -162 -1264 44 518 582 139 500 359 100 380 450 -384 -233 -235 -705 28 376
5034C76j468N94K89N72j034P61j0p30P2N82J36j211J232Q96m88p77k0M07m29N23
$$ 376 -1092 -498 -209 363 -671 90 80 -650 -578 4 140 -1071 161 1057 569 -208 -228 179 -250 273
5054B73r86K56M73j52N63p9j180J89N94j4M77Q1j664J170k01K34j390R74N1J39
$$ 273 -713 -457 16 -136 427 348 -832 -643 -49 -63 414 495 -1169 1 -200 34 -1356 -382 -331 -192
5074a92J9n95Q17m73J091o06n7M74k48N11k19j136J037O0j43J463j290p1l75O47
$$ -192 -173 -768 49 -424 667 61 4 478 230 741 522 -614 423 483 340 1803 513 442 67 714
5094G14q22K53j59m36k53O47k99Q21K70j132K72l0L91p90R8j17N70l0j01J008
$$ 714 -108 145 -14 -450 -703 -56 -355 466 736 -396 -124 -154 237 -553 -455 -572 -2 -32 -133 875
5114H75M40j258k70K84M31J15o71Q5M16L08j203Q55p37Q2P38p35P25K4n97O87
$$ 875 1315 57 -213 71 502 617 -54 31 447 755 -448 407 -330 -248 490 -245 480 504 -93 594
5134E94j211Q90L0p55n07J80J259n80l94L89P97j410J479n7j0m92l59P22K9j535
$$ 594 -617 273 303 -452 -959 -779 480 -100 -494 -105 692 -718 761 704 694 202 -157 565 594 -941
5154i41R97N85k9n49l37J448k010J013p30M18R1R50j547O19M95M7q57l8n16O02
$$ -941 56 641 612 63 -274 1174 -836 177 -553 -135 -44 906 -641 -22 473 520 -337 -375 -891 -289
5174b89Q02j104L94%P31k36O71n51q4m07M18l2K28j25r47P20j8K5L55j426O54
$$ -289 513 -591 -197 -197 534 298 969 418 334 -73 345 313 541 416 -531 189 171 196 551 -875 -221
5195b21L37J009j358j16O33j587L01J090rK73m70m58J34L81J94Q4P98p83L14L90
$$ -221 116 1125 -233 -349 284 -1303 -1002 88 79 352 -118 -576 -442 -61 133 217 1015 232 546 936
5215I36r26P5o8N61L86l48o86j66j1N83n9r68J287j826J327j87N7O47q31p60J184
$$ 936 10 85 17 578 964 616 -70 -236 -247 336 277 -691 596 -1230 97 -90 -33 614 -217 -977 207
5236B07O32J41j486K47N62J04p10O47l76k2N25m26Km08N76p7l23Q88j76p58k97
$$ 207 839 980 -506 -259 303 407 -303 344 -32 -54 471 45 47 -361 215 138 -185 703 527 -231 -528
5257e28j80K99M86P99q40k95p80L81L74o03L03l20O93L22n6J23k25N13m09R34
$$ -528 -708 -409 77 876 36 -259 -1039 -658 -284 -887 -584 -904 -211 111 55 178 -47 466 57 991
5277I91j526P91p6j30N90K16j15J91k94l83m9k37k06K56J46r2l95n98J58P89m31
$$ 991 -535 256 180 50 640 856 741 932 638 255 206 -31 -237 19 165 73 -322 -920 -762 27 -404
5298d04m47M45N82K83o81p00J522j530R89k9M55n95n04J135J3J53k32R09p10p26
$$ -404 -851 -406 176 459 -222 -922 600 -930 59 30 485 -110 -614 521 534 687 455 1364 654 -72
5318g2l33o99J996q31n62N08J53m60J85k73K04l12O91k11o07M18M85q8m38J06
$$ -72 -405 -1104 892 61 -501 7 160 -300 -115 -388 -184 -496 195 -16 -623 -205 280 192 -246 -140
5338a40l06J394j232J036p50K5l44J262m75K70K84j305J183j310K19K20P73j287
$$ -140 -446 948 -284 752 2 27 -317 945 470 740 1024 -281 902 -408 -189 31 804 -483
5356d83O28N20o06p1K33n45k59PM07M08j02r87O56M6O1K38n5j9O7p6o64Q58P97
$$ -483 145 665 59 -12 221 -324 -583 -576 -169 239 137 -850 -194 -148 -87 151 96 77 144 68 -596 262 1059
5379A059j51l82n70N31k05k65R3m45p64J067n47L93J64L31K64o80N28m62l15o05
$$ 1059 908 526 -44 487 282 17 110 -335 -1099 -32 -579 -186 -22 309 573 -107 421 -41 -356 -961
5399i61J783j211Q87j82j428J243k09M33m69K06q32J11O79o58j74J689j059j0
$$ -961 822 -389 498 316 -1112 131 -78 355 -114 92 -740 -629 50 -608 -782 907 -152 -162
5417a62O20J81o54K91N65j097R1j61j094J683l66M59j416R64m05J081K34j644
$$ -162 458 639 -15 276 841 -256 -165 -326 -1420 263 -103 356 -1060 -96 -501 580 814 -830
5435h30N22L18j040O79M32k29M89J72m63j23L40P5J432o53q62k84m39n55R03o77
$$ -830 -308 10 -1030 -351 81 -148 341 513 50 -73 267 342 1774 1121 259 -25 -464 -1019 -116 -793
5455g93J356j385l48J290l62K01k41p77L60Q12ml89k22J08L50p7P95n92R2J30
$$ -793 563 -822 -1170 120 -242 -41 -282 -1059 -699 113 109 -280 -502 -394 -44 -121 674 82 174 304
5475C04p64P34m83M95J16m09j08N03l26K11j38Q3K2n03r6k99n12L71K68J198n57
$$ 304 -460 274 -209 286 402 -7 -115 388 62 273 135 218 240 -263 -359 -658 -1170 -799 -531 667 110
5496A10j007K17N90j83N07R01j561N36M31j848J172K85Q8j84n40O12M6K66p9j64
$$ 110 -897 -680 -90 -273 234 1135 -426 110 541 -1307 -135 150 238 54 -486 126 172 438 359 195
5516A95n58J14L68L39q1r75O87m43J31K75K82o82m32R51l73M39l04P0K17R8q43
$$ 195 -363 -249 119 458 377 -598 89 -354 -223 52 334 -348 -780 171 -202 237 -67 3 220 318 -525
5537e25J035J49j54n35P95l42O0N94j396k96J032m21q44q7J196n2k66o60l6K11
$$ -525 510 659 505 -30 765 423 483 1077 -319 -615 417 -4 -848 -935 261 209 -57 -717 -753 -542
5557e42l54P69n8p1O27j47n23P20m36O00K6m76n30J036r94P78l49Q46n85o6m44
$$ -542 -896 -127 -185 -256 371 224 -299 421 -15 585 611 135 -395 641 -353 425 76 922 337 271 -173
5578a73P18n54J75R42j369k45k75R47j396J276k00J66p24M11R69m28K30p02L03
$$ -173 545 -9 166 1108 -261 -506 -781 166 -1230 46 -154 12 -712 -301 668 240 470 -232 71
5597G1O91j134j30R16l80N51Q45n01nk60J95m03M20j484J226m11j71ro67J523
$$ 71 762 -372 -502 414 34 585 1430 929 924 664 859 456 876 -608 618 207 36 27 -640 883
5617H83K37j089j43m06J46L70k6o55lO59n24M95q62J311j513J339J62Q13j019
$$ 883 1120 31 -112 -518 -372 -2 -28 -683 -686 -27 -551 -56 -918 393 -1120 219 381 1194 175
5636A75o80M21J49L85o15R67r71MR21n64j587J034R33r87K05l39R11n61n21j25
$$ 175 -505 -84 65 450 -165 802 -169 -165 756 192 -1395 -361 572 -415 -210 -549 362 -199 -720 -845
5656h45M72l35m12J049N04n28L13m55j96Q41q07N47Q55l79L02q13L62L9P49o77
$$ -845 -373 -708 -1120 -71 433 -95 218 -237 -433 408 -399 148 1003 624 926 113 475 514 1263 586
5676E86j55m74m28j77O46k67j30K44J31p77m0J325q47O47P06j090l08J191r92
$$ 586 431 -43 -471 -648 -2 -269 -399 -155 -24 -801 -841 484 -363 284 990 -100 -408 783 -209
5695b09J98P38r98j02N75K76p42Q36q20K63K3o49O31M93n74R4l76o72J167p35
$$ -209 -11 727 -271 -373 202 478 -264 572 -248 15 38 -611 20 513 -61 33 -343 -1015 152 -583
5715e83l03q4O12M97j86L4o58K11J98j92P46p82O85Q91o97j33m73Q16Q6o76Q45
$$ -583 -886 -970 -358 139 -47 -13 -671 -460 -262 -454 292 -490 195 1086 389 256 -217 599 685 9 854
5736H54j374J235q55L17m40N34o96r7L57o50O82l09K04K17o81L77K51j99j52R
$$ 854 -520 715 -140 177 -263 271 -425 -522 -165 -815 -133 -442 -238 -21 -702 -325 -74 -273 -425 -416
5756d16P71n65o97J782k09j189P89k51L94n76K36R39j037j70k6M33j42L67j070
$$ -416 355 -210 -907 875 666 -523 266 15 409 -167 69 1008 -29 -199 -225 208 66 433 -637
5775f37J73M85M99m94k19p27L03N61oq64Q9K81m06N77R99l24K85n81qJ6l82N93
$$ -637 -464 21 520 26 -193 -920 -617 -56 -62 -926 -837 -556 -962 -385 614 290 575 -6 -14 2 -380 213
5797B13m16Q92J91n24m02j5Q15j612J483o12J46r56O99M88l62j062J208K05j319
$$ 213 -203 689 880 356 -46 -61 754 -858 625 13 159 -797 -98 390 28 -1034 174 379 -940
5816i40O64j01O29j013R03j482J036K38K37K66M48r41M99J15q94O02L35p7l09
$$ -940 -276 -377 252 -761 142 -1340 -304 -66 171 437 885 -56 443 558 -336 266 601 524 215
5835B15L45j72J66j57j084K77O90l37P74j283J27N43l6n51k25P8Q49J1o25k59
$$ 215 560 388 554 397 -687 -410 280 -57 717 -566 -439 104 68 -483 -708 -630 219 230 -395 -654
5855f54R05N52n04N12n99l63R40r69k04J369j084L18J60q69Q77o0o4l14N54j032
$$ -654 251 803 299 811 212 -151 789 -180 -384 985 -99 219 379 -490 387 327 263 -51 503 -529
5875e29N40k48o48j75P94J026o64o69k3J925k576J371j10m16M28L54o61K82Q7
$$ -529 11 -237 -885 -1060 -266 760 96 -573 -596 1329 -1247 124 14 -402 26 380 -281 1 88
5894H8N22j039N06L58n41q53J597l60l36J50K06N51j434K25n07P16L56p01n9L59
$$ 88 610 -429 77 435 -106 -959 638 278 -58 92 298 849 -585 -360 -867 -151 205 -496 -555 -196
5914a96j76J147o54j098M57N45L08p44n74J297k58K38J1k29J8O07m59j91N42r60
$$ -196 -372 775 121 -977 -520 25 333 -411 -985 312 54 292 303 74 92 699 240 49 591 -369
5934c69Q83L34j951J076J10K08n43l55Q71M93j432j25J67N13n52O15j282J733
$$ -369 514 848 -1103 -27 83 291 -252 -607 264 757 -675 -800 -633 -120 -672 -57 -1339 394
5952C94m12n07N80J32L78j16l91k86J39M84J66L0r40n46L31K63J25N69p42o24
$$ 394 -18 -525 55 187 565 449 58 -228 -89 395 561 591 -349 -895 -564 -301 -176 393 -349 -973
5972i73J320o74l72K81L98m46m88N83J005m60l56N94K30j528J039k43N85m50N50
$$ -973 347 -327 -699 -418 -20 -466 -954 -371 634 174 -182 412 642 -886 153 -90 495 45 595
5991E95N9n66J039o85j92j7Q51o63j226R90K28p42N63n89N44r55K8M30k11Q46
$$ 595 654 88 1127 442 250 233 1084 421 -805 185 413 -329 234 -355 189 -766 -738 -308 -519 327
6011C27p77J255j514K79R80q84O45J3o1J81m92k1m21J043l12j91P68j90m81J38
$$ 327 -450 805 -709 -430 550 -334 311 324 263 444 -48 -69 -490 553 241 50 818 628 147 285
6031B85K62p28L98N0m81j46J80n98O10o2K28P5J51m88M51m47K78O73j221Q71Q0
$$ 285 547 -181 217 267 -214 -360 -180 -778 -168 -230 -2 73 224 -264 187 -260 18 691 -530 341 421
6052D21n59R86l37k48j66L35k02L19q63J194j443K57M26K67J3p12N47j56n00J44
$$ 421 -138 848 511 263 97 432 230 549 -314 880 -563 -306 120 387 400 -312 235 79 -421 -277
6072b77l89O53rl16K69M52K8j008J100k79m63l7J01L34K79p93J2J349j332N78
$$ -277 -666 -13 -22 -338 -69 383 411 -597 503 224 -239 -276 -175 159 438 -355 -343 1006 -326 252
6092B52m72L40J49n62J236j038P39o16J80m84o2j76P21m22R53q13m62k33J93J054
$$ 252 -220 120 269 -293 943 -95 644 28 208 -276 -338 -514 207 -215 738 -75 -537 -770 -577 477
6112D77n38q31P33N26P7o49N50O7q34K45O83l47J08Op1k31J049j153l66J15J001
$$ 477 -61 -892 -159 367 444 -205 345 412 -422 -177 506 159 267 273 202 -29 1020 -133 -499 -384 617
6133F17m81k21J515j127m44o20K000j642P01m87K31J043j615P37j65O5r8k16M88
$$ 617 136 -85 1430 303 -141 -761 1239 -403 298 -189 42 1085 -530 207 42 107 9 -207 281
6152B81j027J314p2j397J432p33M83J82j17K75q07o20P70L49p54L88M04j215J069
$$ 281 -746 568 496 -901 531 -202 281 463 346 621 -186 -806 -36 313 -441 -53 351 -864 205
6171B05q32k30J379n74J44k18K36M3P8pj94mo75P46K67n08j79l94O24N43j190
$$ 205 -627 -857 522 -52 92 -126 110 153 231 224 30 26 -649 97 364 -144 -323 -717 -93 450 -740
6192g40J381m00N23j027M9o03J412n22m56M38k87k54K87L44r92Q62r51J15N56
$$ -740 641 241 764 -263 -214 -817 595 73 -383 55 -232 -486 -199 145 -847 15 -936 -821 -265
6211b65M14K08k49J001o50M96Qj035J028q82kj88k9J430j813P82j0o19O84r71
$$ -265 149 357 108 1109 459 955 963 -72 956 74 72 -116 -145 1285 -528 254 244 -375 309 -662
6231f62pO11Q1r97J15M73K61l39N77J09P66j019l81QQ37m77l95L57O76o51j72
$$ -662 -669 -58 23 -974 -859 -386 -125 -464 113 222 988 -31 -412 -404 433 -44 -439 -82 594 -57 -229
6252b29O74Q6Q86j102j64k04J17P35q52n46Q8R02n37Q98j254m78l27J339l88l47
$$ -229 445 531 1417 315 151 -53 64 799 -53 -599 -511 391 -146 752 -502 -980 -1307 32 -356 -703
6272g03R12l35J365j711M1M42L53N07l01l14n2O76j077J076r47L60J63m5m41P82
$$ -703 209 -126 1239 -472 -431 11 364 871 570 256 204 880 -197 879 -68 292 455 410 -31 751
6292G51n45l06L99l43o76Q24l66L6J68j9k24M79r43J111l32k78N35Q0p23L95K63
$$ 751 206 -100 299 -44 -720 104 -262 -226 -58 -77 -301 178 -765 346 14 -264 271 351 -372 23 286
6313B86n6J34j26m44Q85l83p61J149k78q74J104k41p55j70O11j22N62j003J79
$$ 286 230 364 238 -206 679 296 -465 684 406 -468 636 395 -360 -530 81 -41 521 -482 -303
6332c03oO32q47m9N18J042q57R6M42n72J42M45P74p03M46m40j499O88J53o48J13
$$ -303 -309 323 -524 -573 -55 987 130 226 668 96 238 683 1457 754 1200 760 -739 -51 102 -546 -433
6353d33K26K47M25j079j53P42R32j291J76O6m7J16Q22r25l37k51J376j372J254
$$ -433 -207 40 465 -614 -767 -25 907 -384 -208 -142 -189 -73 749 -176 -513 -764 612 -760 494
6372D94jJ11j53o92M61k76O21j02j89m6N73m98q32J087k41m96M37j85o92K06j97
$$ 494 493 604 451 -241 220 -56 565 463 274 228 801 303 -529 558 317 -179 258 73 -619 -413 -610
6393f10K7M80N33r54L14j51Q68p42R60m51l94K74K61l59J15j204R88m5K11L72
$$ -610 -583 -103 430 -524 -210 -361 507 -235 725 274 -120 154 415 56 171 -1033 -45 -90 121 493
6413D93q50L55p24R67J07n43M04m36K82K87p56Q06j519J284r61R47o86N39j29
$$ 493 -357 -2 -726 241 348 -195 209 -227 55 342 -414 392 -1127 157 -804 143 -543 -4 -133
6432a33p64J171j29m57L80n68N2P76n88O22q91R89k58j02k66l44J368l8j094P00
$$ -133 -897 274 145 -312 68 -500 -448 328 -260 362 -529 460 202 100 -166 -510 858 820 -274 426
6452D26j320K13R58j076Q43P49j234r96R90R42r78P30o85k99M55J031j199M27
$$ 426 -894 -681 277 -799 44 793 -441 -1437 -447 495 -483 247 -438 -737 -282 749 -450 -23
6470b3J99P5n05N19j91M73m64K46l11p2J018j637O07nL32M96m51o14M24r5O03
$$ -23 176 251 -254 265 74 547 83 329 18 -54 964 -673 -66 -71 261 757 306 -308 116 21 624
6491F24n77q18Q72o45N89p57J125j31m75P9L60Qp79RJ00J71L61l31N23M24p99
$$ 624 47 -771 101 -544 45 -712 413 282 -193 -114 246 254 -525 -516 -416 -245 116 -215 308 732 -67
6512f7J40Q64k72q01O2n21N61p1j98k93q99J767j89p91R83q70j06R6K50n54J443
$$ -67 73 937 665 -136 -74 -595 -34 -105 -303 -596 -1495 272 83 -708 275 -595 -701 -605 -355 -909 534
6533E34k59o7p85L61K66K40l40K81K19j94m6j110J035o15J69l04J44J569j963
$$ 534 275 208 -577 -216 50 290 -50 231 450 256 210 -900 135 -480 -311 -615 -471 1098 -865
6552h65Q59j087J148K89j190J22O4L73L88l09j74j0L30m14L22o0K5R23n24K46
$$ -865 -6 -1093 55 344 -846 -724 -660 -287 101 -208 -382 -392 -62 -476 -154 -214 -189 734 210 456
6572D56l90j373J660L40l26o09p63R18L31Q16j518N47o48O31k44j4n01J05L4R25
$$ 456 66 -1307 353 693 367 -242 -1005 -87 244 1060 -458 89 -559 72 -172 -186 -687 -582 -548 377
6592C77j082J147r10K33j40K49k51N99L89p80r49Q14R53l22N24j339Q09P71j007
$$ 377 -705 442 -468 -235 -375 -126 -377 222 611 -169 -1118 -304 649 327 851 -488 321 1092 85
6611H5J26J25p09Q05m88j179J915r01r0P16j603J509j300J075K4j154L75J093
$$ 85 211 336 -373 432 -56 -1235 680 -221 -311 405 -1198 311 -989 86 110 -1044 -669 424
6629D24j282J512K8o47pP3k24J59j16L85n42N56j32k65k43M32n91J025j655J945
$$ 424 -858 654 682 35 28 101 -123 36 -80 305 -237 319 187 -78 -321 111 -480 545 -1110 835
6649H35j771N22K06l21L0o5j86j38J298j102Q91K00k69r72J374l62l45Q25k64
$$ 835 -936 -414 -208 -529 -499 -564 -750 -888 410 -692 199 399 130 -842 532 170 -175 650 386
6668C86r11R50o92l14J460j239Q13j13n87M32O5m47m28J208j66o53O11N0q49N19
$$ 386 -525 425 -267 -581 879 -360 453 340 -247 185 250 -197 -625 583 417 -236 375 425 -424 95
6688I5k90l37O02M5q91N87M50n50J38N07p33J713j399O37j152J012J67n91q41
$$ 95 -195 -532 70 115 -776 -189 261 -289 -151 356 -377 1336 -63 574 -578 434 601 10 -831
6707h31Q46o7O8K9j264J986P0p72l58m55K32m6P51n41k00j30K02N3J73L44j106
$$ -831 15 -52 16 45 -1219 767 837 65 -293 -748 -516 -562 189 -352 -552 -682 -480 -427 -254 90 -1016
6728a016N00k82N06Q84R8p01K98j60j63L7Q16p79O6Lk26l69k9L98K66j2o52J08
$$ -1016 -516 -798 -292 592 690 -11 287 127 -36 1 817 38 104 107 -119 -488 -517 -119 147 135 -517 -409
6750d09j99l89L51J052p98j84P14M22o31m7P28j706K181q14n64J360p96K29j9
$$ -409 -608 -997 -646 406 -392 -576 138 560 -71 -118 610 -1096 1085 271 -293 1067 271 500 481
6769D81q48M5P93P1j65J81m94Pm44k43J076n3j24j584K031n56K27k82p11J153
$$ 481 -367 -322 471 542 377 558 64 71 -373 -616 460 407 283 -1301 730 174 401 119 -592 561
6789E61q08K09l05Q21q97N57m81J357j63q78P34l49j79j192P65M64m94L11O05
$$ 561 -247 -38 -343 478 -419 138 -343 1014 851 -27 707 358 179 -1013 -248 216 -278 33 638
6808F38j087L24M88n04l02O5M10l10J12l99L74J11k61M12r08M5J025j79PM39p82
$$ 638 -449 -125 363 -141 -443 -378 32 -278 -166 -565 -191 -80 -341 71 -837 -792 233 54 61 500 -282
6829b82P53k69k0k54j3L15K82j314o7P81k40j57L6N47l36K00K46P8o51K22p12
$$ -282 471 202 182 -72 -85 230 512 -802 -869 -88 -328 -485 -449 98 -238 -38 208 286 -365 -143 -855
6850h55L8N35Q19j207M57L44j22L39L15l71p75L43Q09L40r1j98n15r67R85L40
$$ -855 -817 -282 537 -670 -213 131 9 348 663 292 -483 -140 669 1009 918 720 205 -762 223 563
6870E63l92K09o40O15k31q4n34J294p11N4k63M57j566K497j060r35Q49J05l91
$$ 563 171 380 -260 355 124 40 -494 800 89 143 -120 337 -1229 1268 208 -727 122 227 -164
6889a64N26Qj6KM3k75m06J473p87l18m25N90o46J276r35P14m03q70M13M29M3q65
$$ -164 362 370 354 356 399 124 -282 1191 404 86 -339 251 -395 881 -54 660 257 -613 -200 229 272 -593
6911e93P61L69n36O91m93J51J26o83N81l54p57J412r69r80J511m14m69L22J018
$$ -593 168 537 1 692 199 350 476 -207 374 20 -737 675 -294 -1274 237 -177 -646 -324 694
6930F94J67j97j331R07j95O63n87L47J19k61j353O49J096j032Q20q73N78l04K5
$$ 694 861 664 -667 240 45 708 121 468 587 326 -1027 -378 718 -314 506 -367 211 -93 -68
6949f8k32P4J18R24j156M45P54j36n89j18R88r45P1m12O53p5K48j311Q35J043
$$ -68 -300 -226 -108 816 -340 105 859 723 134 16 1004 59 130 -282 371 296 544 -767 68 1111
6969A111j678J290p99N25j090J064l24l02Q91j023N48n06P02n89JP38l23J77P4
$$ 1111 -567 723 -76 449 -641 423 99 -203 688 -335 213 -293 409 -180 -179 559 236 413 487
6988D87j08L43j214k13K011j689J265j38r69P34m50O58j423J411r29o84J397l79
$$ 487 379 722 -492 -705 1306 -383 882 744 -225 509 59 717 -706 705 -224 -908 489 110
7006A10L89j99j06o25J263j663O25R04p15m94N74O22q89K80j68J31L22l03M97
$$ 110 499 300 194 -431 832 -831 -206 698 -17 -511 63 685 -204 76 -92 39 361 58 555
7025E55j169J822j768Q93M63j104J036k28J80n46n90O44j08J71q58j88r4R69o36
$$ 555 -614 1208 -560 333 796 -308 728 500 680 134 -456 188 80 251 -607 -795 -889 80 -556
7044e56J015j82J53M58m47l75K01l5K24K94r5l06N27j586J137m47l41P90j89K08
$$ -556 459 277 430 888 441 66 267 232 456 750 655 349 876 -710 427 -20 -361 429 240 448
7064D48j403J606r8m81o28L28j74N32J8K10n01l3l17N7J99l21j2M36K86N04j75
$$ 448 -955 651 553 72 -556 -228 -402 130 148 358 -143 -176 -493 -436 -237 -558 -570 -134 152 656 481
7085D81j22M78k46m26n18M99O47l1J4j252k48R98M37p53K9m82K62L25L86j365
$$ 481 359 837 591 165 -353 146 793 762 776 -476 -724 274 711 -42 -13 -495 -233 92 478 -887
7105h87J270j033L15J42l96Q20m27l28L80p7l8Jm97M11K57N63n60m19l35N16P57
$$ -887 383 -650 -335 -193 -589 231 -196 -524 -144 -221 -259 -258 -755 -344 -87 476 -84 -503 -838 -322 435
7126D35j55j41L18k60L18q12O04K28j489Q32j29M94k00k63Q34q36n0P9K09J17
$$ 435 280 139 457 197 515 -297 307 535 -954 -122 -251 243 43 -220 614 -222 -272 -193 16 133
7146A33m37j53L9P32M77L30p60n00L46n69J75K21K37m53p87J105p39p6J245j064
$$ 133 -304 -457 -418 314 791 1121 361 -139 207 -362 -187 34 271 -182 -969 136 -603 -679 566 -498
7166d98N92n12l89K78l05R68l93J17n6k53k90R14j464J395j20Q3j58P91j371J764
$$ -498 94 -418 -807 -529 -834 134 -259 -142 -198 -451 -741 173 -1291 104 -16 67 -91 700 -671 1093
7186A093j256L04P66j567J402P1r2m30p13K73o13R54N4m16p31R91m07R88n48j013
$$ 1093 -163 141 907 -660 742 813 721 291 -422 -149 -762 192 246 -170 -901 90 -317 671 123 -890
7206h90K083r34l1N0J25r98J35l77Q89q26J086m62L85N95l15L40l73j02J68j46
$$ -890 1193 259 228 278 403 -595 -460 -837 52 -774 312 -150 235 830 515 855 482 380 548 402
7226D02o55K30N72j50l96K98l01p96L28K76k5l0k21j17L5M89j127J112M37j254
$$ 402 -253 -23 549 399 3 301 0 -796 -468 -192 -217 -247 -468 -585 -550 -61 -1188 -76 361 -893
7246h93P42j61M96Q45j301P98O14p44o08M29K99m30Q3J88m71P86r9n22M27m33
$$ -893 -151 -312 184 1029 -272 526 1140 396 -212 217 516 86 169 357 -114 672 573 51 478 45
7266D5L64q13K74p32Q63j132O51N38k22p17J68J236J59o22P7p82N05N68p07J933
$$ 45 409 -404 -130 -862 1 -1131 -480 58 -164 -881 -713 523 682 60 137 -645 -140 428 -279 1654
7286A654k326R02q0j523J280K0R56m46qj139J47J24J106K14q36o18N04J077j978
$$ 1654 -672 230 150 -1373 -93 -73 883 437 429 -710 -563 -439 667 881 45 -573 -69 1008 -970
7305i70K169k16p69j435R45K5M92J3j74m71J31N86j68R75q99j56N0N7l66P31K94
$$ -970 1199 983 214 -1221 -276 -251 241 254 80 -391 -260 326 158 1133 234 78 128 185 -181 550 844
7326H44o12Q51p65k76q70O43l00j48J86J43J306r84K47l61J377q48j019J155n91
$$ 844 232 1083 318 42 -828 -185 -485 -633 -447 -304 1002 18 265 -96 1281 433 -586 569 -22
7345b2p0J53M2K65L7m16l51J122j133M63P16n38j633J283K39k3n20J86Q33j216
$$ -22 -92 61 103 368 405 -11 -362 760 -373 90 806 268 -1365 -82 157 134 -386 -200 633 -583
7365e83L62n5J64K32M35j052O55N56j092M74k50L37l1j68O54r92P92m71L46o85
$$ -583 -221 -276 -112 120 555 -497 158 714 -378 96 -154 183 152 -16 638 -354 438 -33 313 -372
7385c72J41K31J44L61j471R78R1m09J33j68j72L82q04N64J463q68m0j435M05P77
$$ -372 -231 0 144 505 -966 12 103 -306 -173 -341 -513 -131 -935 -371 1092 224 184 -1251 -846 -69
7405f9P6o04P84L09J83k24R82q45o24J96k50K00j64r0M9m65L13M77O4J2n29K92
$$ -69 7 -597 187 496 679 455 1437 592 -32 164 -86 114 -50 -140 -91 -556 -243 234 298 310 -219 73
7427G3J95j23n48m03k29L76m29R15O06j036M59K47n2j116P34R21J34m18K42k61
$$ 73 268 145 -403 -806 -1035 -659 -1088 -173 433 -603 -144 103 51 -1065 -331 590 724 306 548 287
7447B87q92L00M58N75q73J09q35J295j11o78R00r92K22o16R01j71J037j386O16
$$ 287 -605 -305 153 728 -145 -36 -871 424 313 -365 535 -457 -235 -851 50 -121 916 -470 146
7466A46O74j322P99o41J274j392J625j007L32J97n2m86K68R0o88l06L79K44M52
$$ 146 820 -502 297 -344 930 -462 1163 156 488 685 633 147 415 505 -183 -489 -110 134 586
7485E86m10L64n27N43n83k004J814P8N75j597J277M46m19r40J34J110n29M19M99
$$ 586 176 540 13 556 -27 -2031 -217 -139 436 -1161 116 562 143 -797 -663 447 -82 337 836
7504H36N6o99L21j038O89N6k04j72k65l2J059o05P63j626P03M50l43j098J316
$$ 836 892 193 514 -524 165 221 17 -155 -420 -452 607 2 765 -861 -158 292 -51 -1149 167
7523A67j319J552l46N6m10l07J647j446l38j65p5l5K079j476r56J615l54J32O47
$$ 167 -1152 400 54 110 -300 -607 1040 -406 -744 -909 -984 -1019 1060 -416 -1372 243 -111 21 668
7542F68n20J015j665L46M71n26J17J77p70O70K00L32P40j507K50l08j33K89J84
$$ 668 148 1163 -502 -156 315 -211 -94 83 -687 -17 183 515 1255 -252 -2 -310 -443 -154 30
7561C0j105J02J155M60o76j291J155K25J039p66o23j86J106m48q11Q01p0L31m17
$$ 30 -1075 -973 182 642 -34 -1325 -170 55 1094 328 -295 -481 625 177 -634 167 97 428 11
7580A1J98l82r6N5L31l63m26Q32K91m22p10m0l32J950j193j10K23O95q01Q36k09
$$ 11 209 -173 -269 -214 117 -246 -672 160 451 29 -681 -721 -1053 897 -296 -406 -183 512 -289 547 338
7601C38j303J812M45n96p99Q83m63k36O64O8J69p64L55k73O3l25m40N33m03j69
$$ 338 -965 847 1292 696 -103 780 317 81 745 813 982 218 573 300 363 38 -402 131 -272 -441
7621d41K34K31l27M00l30l18J250j785Q01k91M67J7l59O92o41J62p2J017p19l09
$$ -441 -207 24 -303 97 -233 -551 699 -1086 -285 -576 -109 -92 -451 241 -400 -238 -310 707 -12 -321
7641c21L62P64p79L70k024K356m18m74k40PP85j141K67M62m21J730j940J655j051
$$ -321 41 805 26 396 -1628 728 310 -164 -404 -397 388 -753 -486 -24 -445 1285 -655 1000 -51
7660e1j22J29L68l28j99J17O88r43k12K44J126j034m03K89O99q68K48J005j359
$$ -51 -173 -44 324 -4 -203 -86 602 -341 -553 -309 817 -217 -620 -331 368 -500 -252 753 -606
7679f06M12O6L06l53p83J708j940J599o58J47M67k64p42N22j028J470P1j031j8
$$ -606 -194 -128 178 -175 -958 750 -1190 409 -249 -102 365 101 -641 -119 -1147 323 394 -637 -655
7698f55K32N95j50N6M8m6N04k51K45j159J446o91L38l93l12l2J03J59p00P45j093
$$ -655 -423 172 22 78 126 80 584 333 578 -581 865 174 512 119 -193 -225 -122 37 -663 82 -1011
7719a011P92K93K54o18M83p66k70R03j045N41P61o35M29o94J365P16j732J142
$$ -1011 -219 74 328 -290 193 -573 -843 60 -985 -444 317 -318 111 -583 782 1498 -234 908
7737I08p50m08L72k20N01j217P11o74K073j523O96n53j34O64J97j579Q38J015
$$ 908 158 -250 122 -98 403 -814 -103 -777 1296 -227 469 -84 -218 446 643 -936 -98 917
7755I17r02M60r47J253p27o6k33j68J29J88l63N94K75j013J420r34L3P04n84L00
$$ 917 15 475 -472 781 54 -12 -245 -413 -284 -96 -459 135 410 -603 817 -117 -84 620 36 336
7775C36q1K76P7J6j541J440l28q56Q02k26P08p83j8m54P15m20J53k61jL40K49
$$ 336 255 531 608 624 -917 523 195 -661 141 -85 623 -160 -178 -632 83 -337 -184 -445 -446 -106 143
7796A43l59J58j014N69N87K88m63O30j00N5o56k43Q24o09L84r96J300o91L62j80
$$ 143 -216 -58 -1072 -503 84 372 -91 539 439 494 -162 -405 419 -190 194 -802 498 -193 169 -11
7816a1k64m69K05J005o7j176N51M40m02J93q78P34j32J62l35J189j265N98O08
$$ -11 -275 -744 -539 466 399 -777 -226 214 -188 5 -873 -139 -271 -109 -444 745 -520 78 686
7835F86r95P26l83m0j057P28l74P59m25l11J368n22r0K15r08K59J79r24P99k51
$$ 686 -309 417 34 -6 -1063 -335 -709 50 -375 -686 682 160 70 285 -623 -364 -185 -1109 -310 -561
7855e61K16O54J04p93L1J296j155k65J253p10l3j50J27k59R17K3n36M28L13j228
$$ -561 -345 309 413 -380 -349 947 -208 -473 780 70 37 -113 14 -245 672 695 159 587 900 -328
7875c28J22j35O73k46n26K02L73k93L48o7p90J013q3j056R44k30k7L88K87O28
$$ -328 -206 -341 332 86 -440 -238 135 -158 190 123 -667 346 263 -793 151 -79 -106 282 569 1197
7895A197j597N80q2L06o89J029l42q81O23j34J10Q8o7l76J97q41J38j54m94P83
$$ 1197 -400 180 98 404 -285 744 402 -479 144 10 120 208 141 -235 -38 -879 -741 -895 -1389 -606
7915f06J117n11l32R89m27p70N16L29o06K15op11O87M57k71J8M70k0o71j86Q79
$$ -606 511 0 -332 657 230 -540 -24 305 -301 -86 -92 -803 -116 341 70 88 558 538 -133 -319 560
7936E60l67p8n44J61l3M64j177N4N04Q48j009N89K76o33O24j110J082l11l34J84
$$ 560 193 115 -429 -268 -301 163 -1014 -960 -456 392 -617 -28 248 -385 239 -871 211 -100 -434 -250
7956b50k3K44q13J382r36k10R66p01M47p2K31J80k21m2P7O88o17p72O1l73J265
$$ -250 -273 -29 -842 540 -396 -606 360 -341 106 34 265 445 224 182 259 947 330 -442 -381 -754 511
7977E11l0m98Q7J24K64j87j49j36N2L76j20m16J49L09m87P08q09Q64p98P93j27
$$ 511 481 -17 70 194 458 271 122 -14 38 414 294 -122 27 336 -151 557 -252 612 -186 607 480
7998D80k28K64J27L99j677R29K79q00j87K44l0k84J040j187R33K85j301O52n47
$$ 480 252 516 643 1042 -635 294 573 -227 -414 -170 -200 -484 556 -631 302 587 -714 -62 -609
8017f09K42J575k20q24N32k68J72q10Q70q60O52l53P70j03o78K41r08K82m03L48
$$ -609 -367 1208 988 164 696 428 600 -210 660 -200 452 99 869 766 88 329 -579 -297 -700 -352
8037c52L21L20n78J38r85R07J84j43q34R10k53M20N9P4j038Q46q91j75l74J469
$$ -352 -31 289 -289 -151 -1136 -229 -45 -188 -1022 -112 -365 55 114 188 -850 -4 -895 -1070 -1444 25
8057B5Q12q46r8l15O81l08k58P71N63o95n77P1K97N06l86l26m40N22M16n89o26
$$ 25 837 -9 -107 -422 259 -49 -307 464 1027 332 -245 -174 123 629 243 -83 -523 -1 415 -174 -800
8078h00N9j1Q23j007P70o40R45l1m13R5O92j216P37K07j133J081K71J83o87k29
$$ -800 -741 -752 71 -936 -166 -806 139 108 -305 -210 482 -734 3 210 -923 158 429 612 -75 -304
8098c04J39O92m82J21j81k16m94J012k47j188Q56L76O39p20r0r1O69j225J778
$$ -304 -165 527 45 166 -15 -231 -725 287 40 -1148 -292 84 723 3 -87 -178 491 -734 1044
8117A044m36j84n06Q0o5k74O17q67J271p20n52J276n12k79j96J40j31K17K15K06
$$ 1044 608 424 -82 -2 -67 -341 276 -591 680 -40 -592 684 172 -107 -303 -163 -294 -77 138 344
8137C44p63M90n42o0J25J87K87j114J065J17m64l88K137j228l99M52n8p01N66
$$ 344 -419 71 -471 -531 -406 -219 68 -1046 19 136 -328 -716 1421 193 -206 246 188 -513 53
8156E3N94q05N60p92J471q61q09J001J9n58O27j65r67J569j009J67o64M32r66
$$ 53 647 -158 402 -390 1081 220 -589 412 431 -127 500 335 -632 937 -72 95 -569 -137 -1103
8175a103R08j8j6o8M07N40r02l65R24J43k3j30j74m90P60n46
$$ -1103 -195 -213 -229 -297 110 650 -252 -617 307 450 427 297 123 -367 393 -153
8191a53
$$ Imaginary data points
##PAGE= N=2
##DATA TABLE= (X++(I..I)), XYDATA
0@%%%%%%%%%%%%%%%%%%%%%%%%JqO2j51K04k16K16k16K17k23K61l37M00m28M58
$$ 0 0 0 0 0 0 0 0 0 0 0 0 0 0 0 0 0 0 0 0 0 0 0 0 0 1 -7 55 -96 108 -108 108 -108 109 -114 147 -190 210 -218 240
39B40n13N82o44P07p89Q77r63J063j173J293j426J567j731J908k100K321k568
$$ 240 -273 309 -335 372 -417 460 -503 560 -613 680 -746 821 -910 998 -1102 1219 -1349
56a349K855l181L558m010M544n195O022p095Q554j0674J4019k0124L4758j19908
$$ -1349 1506 -1675 1883 -2127 2417 -2778 3244 -3851 4703 -5971 8048 -12076 22682 -97226
70i7226j18148L15059J9673j84036M1532J49728p3428q1755N6767N9345m7508
$$ -97226 -215374 99685 119358 -64678 -23146 126582 53154 -28601 28166 87511 40003
81D0003m6128J1718M3499j8498o0411J2800N2883m1199m5671L9073K5149n3866
$$ 40003 -6125 5593 49092 30594 -29817 -17017 35866 -5333 -51004 -11931 13218 -40648
93d0648k0890N1130J4804m7738Q424M6991j5873k8618L2006J2500k7937N737K0331
$$ -40648 -61538 -10408 4396 -43342 -34918 12073 -3800 -32418 -412 12088 -15849 -10112 10219
106A0219o871N441J2276j2680Q809K4979k5829q033L6903j7680l1921L0490M347
$$ 10219 3348 8789 21065 8385 17194 42173 16344 8311 45214 27534 -4387 26103 30450
119C0450m5244N131K5568k7270j4952K2511q095k1160J4364J218j7391O885R561
$$ 30450 -14794 -9663 15905 -11365 -26317 -3806 -11901 -33061 -18697 -17479 -34870 -27985 -18424
132a8424q848P512J4431l14l520J5421R514o628Q475J4303q643k924J3883m716
$$ -18424 -27272 -19760 -5329 -5643 -9163 6258 15772 9144 17619 31922 23279 20355 34238 29522
146B9522j5732P206L517j8533q06J0620k0618j0897J4644j3516j5640J3288j456
$$ 29522 13790 20996 24513 5980 5174 15794 -4824 -15721 -1077 -14593 -30233 -16945 -18401
159a8401j6929J3172J0954j5869N667J8797p998l868K4227k398j0446J6396Q433
$$ -18401 -35330 -22158 -11204 -27073 -21406 -2609 -10607 -14475 9752 7354 -3092 13304 21737
172B1737j4546Q375R626r505l084J0195l042j0811N739K801j4130j795O662j2745
$$ 21737 7191 15566 25192 15687 12603 22798 19756 8945 14684 17485 3355 1560 8222 -4523
186d523p280P296n015j1404M771L114r652K101J0629p456k947J4778k344n256
$$ -4523 -11803 -4507 -9522 -20926 -16155 -13041 -22693 -20592 -9963 -17419 -20366 -5588 -7932 -13188
200a3188J5577L804p523P928J1313p724J860J2345n508n549J1387k251j4655M912
$$ -13188 2389 6193 -1330 6598 17911 10187 12047 24392 18884 13335 24722 22471 7816 12728
214A2728L357j5925l92M580j0924n768N580m676r895M387K418r747K632R573n310
$$ 12728 16085 160 -232 4348 -6576 -12344 -6764 -11440 -21335 -16948 -14530 -24277 -21645 -12072 -17382
229a7382j569J1723K522j170Q872O403j955M731Q437k829l427P969k496r521O596
$$ -17382 -18951 -7228 -4706 -5876 2996 9399 7444 12175 20612 17783 14356 22325 19829 10308 16904
244A6904K42j1733J626J267j0196l700N478p447q622O986j226j1957P224M632
$$ 16904 17146 5413 7039 8306 -1890 -5590 -112 -7559 -16181 -9195 -10421 -22378 -15154 -10522
258a0522r351L333R294l818o56R625J863m677Q303P372o567M621R362n755j674
$$ -10522 -19873 -16540 -7246 -11064 -11720 -2095 -232 -4909 3394 10766 4199 8820 18182 12427 10753
273A0753J0073k907p414N841L94j0181j880L715q550o840M365n136q522M661p98
$$ 10753 20826 17919 10505 16346 16740 6559 4679 8394 -156 -6996 -2631 -7767 -16289 -11628 -12426
288a2426o965L310L959l916o9Q151j252j908Q006P169o992Q390Q475o178L445
$$ -12426 -19391 -16081 -12122 -16038 -16107 -7956 -9208 -11116 -3110 4059 -2933 5457 13932 7754 11199
303A1199Q555k842m861M999q3p347J640J079q089k578L905q006p006O623n531
$$ 11199 19754 16912 12051 17050 16967 9620 11260 12339 4250 1672 5577 -2429 -9435 -2812 -8343
318h343p753L289J781o617N8O820k110k039Q132K846m173Q184N451m352N026O484
$$ -8343 -16096 -12807 -11026 -17643 -17585 -10765 -12875 -14914 -6782 -3936 -8109 75 5526 1174 6200 12684
334A2684k719k42P186k090l846M160J436q326K08L890r675l847L447n929o296
$$ 12684 9965 9723 16909 14819 10973 15133 16569 8243 8451 12341 2666 -1181 2266 -3663 -9959
349i959J967k082n302J406K999m328l63O344r28k929Q431K150l048O227N515k683
$$ -9959 -7992 -10074 -15376 -13970 -10971 -15299 -15662 -9318 -10246 -13175 -4744 -2594 -5642 585 6100 3417
365C417L248N811j344k097O984o53n547L309L37o845o67K393o976m188J021l217
$$ 3417 6665 12476 11132 9035 16019 15366 9819 13128 13465 6620 5953 8346 1370 -2818 -1797 -5014
381e014n985Q72R63o766P37M242l698q44O806l14j074O437M041k444L303N655
$$ -5014 -10999 -10127 -9164 -15930 -15193 -10951 -14649 -15493 -8687 -9001 -10075 -3638 403 -2041 1262 6917
397F917n49L16P731r74l979O572q09o169L058l64o080k737J938l596o966K721
$$ 6917 6368 6684 14415 13441 9462 16034 15225 9056 12114 11750 5670 2933 4871 1275 -5691 -2970
413b970k078o941J711K400o366Q66L423k895L96M895J225j411N362N314l562M143
$$ -2970 -5048 -11989 -10278 -7878 -14244 -13378 -9955 -12850 -12454 -7559 -6334 -7745 -2383 2931 -631 3512
429C512M696r91p13O174q31j959K363R8l479j285K629m593l552K526m136o891
$$ 3512 8208 7217 6504 12678 11847 9888 12251 12349 8870 7585 10214 5621 2069 4595 459 -6432
445f432J732j567o536Q05J947l774m41M413j420k453O528K854l159O126N102k741
$$ -6432 -4700 -6267 -12803 -11998 -10051 -13825 -14266 -9853 -11273 -13726 -7198 -4344 -7503 -1377 3725 984
461I84M059N871o33r25L740J249l045J408R77o071o44J531o137l621O20k397m842
$$ 984 5043 10914 10281 9356 13096 14345 11300 12708 13685 7614 6970 8501 2364 -1257 -637 -3034 -7876
478g876J37J064n002j366M547k619k575N038J284k256M700L282k107L337M959
$$ -7876 -7739 -6675 -11677 -13043 -8496 -11115 -13690 -8652 -7368 -9624 -4924 -1642 -3749 -412 4547
493D547n69R35M879J385l780M272J784o329K996K816n712j290J994n183m034J79
$$ 4547 3978 4913 9792 11177 7397 11669 13453 7124 10120 12936 7224 5934 7928 2745 -1289 -1110
509a110j911n325o0Q13m425P9L584m332M55N099j371q01M957L042j171K607N365
$$ -1110 -3021 -8346 -8406 -7593 -12018 -11939 -8355 -12687 -12232 -7133 -8504 -9305 -4348 -1306 -2477 130 5495
526E495l96K26M665K683l918L891N17l626j355J711l507l847K331l689n575J28
$$ 5495 5099 5325 9990 12673 8755 12646 13163 9537 8182 9893 6386 2539 4870 1181 -4394 -4266
542d266J34o166N96J966m368j054L557l66j861L101L271j341L783N457r89J506
$$ -4266 -4132 -10298 -9702 -7736 -12104 -13158 -9601 -9967 -11828 -8727 -5456 -6797 -3014 2443 1454 2960
558B960N597q39n15M246m41l134L476M66m075j650K923n116l318K174j216n331
$$ 2960 8557 7718 7203 11449 11008 7874 11350 11816 7741 6091 9014 3898 580 2754 1538 -3793
574c793j10j73m446j065J623j753k112L416J77j497K635L064r65J986N215j697
$$ -3793 -3903 -4076 -8522 -9587 -7964 -9717 -11829 -8413 -8236 -9733 -7098 -4034 -4999 -3013 2202 505
590E05J698N137L01p19L170K283k723m04K268k784k326K130l593m272K79k077
$$ 505 2203 7340 7641 6922 10092 12375 9652 9248 11516 8732 6406 8536 4943 671 950 -1127
606a127n245N50l18l653j082K396k073k651M148K368l005L660L764r65M76M927
$$ -1127 -6372 -5822 -6140 -9793 -10875 -8479 -10552 -13203 -9055 -6687 -9692 -6032 -2268 -3233 -2757 2170
622B170K564L89L511J62K54J904J343l442m13J470m706k208L32j175m644M67p62
$$ 2170 4734 5123 8634 8796 9050 10954 12297 8855 8442 9912 5206 2998 3330 2155 -2489 -2022 -2784
639b784k849k720J973j894k646L795j456k115L163P44M89K916K575M6J741L774
$$ -2784 -5633 -8353 -6380 -8274 -10920 -7125 -8581 -10696 -7533 -6789 -6300 -3384 -809 -763 978 4752
655D752K67j208L943M22j290J334K354l290M73J779k980j709p54k464l072m74
$$ 4752 5019 3811 7754 8176 6886 8220 10574 7284 7757 9536 6556 4847 4093 1629 -1443 -1917
671a917o41m617l55L11l243p90K302O50j908J904K742J54R08L713J632J36L335
$$ -1917 -2558 -7175 -7530 -7219 -10462 -11252 -8950 -8300 -10208 -8304 -5562 -5408 -4500 -787 845 981 4316
688D316K950j397L704J214j748P73K210l974k230J946l599l167L34n23m572q23
$$ 4316 7266 5869 9573 10787 9039 9812 12022 8048 5818 7764 4165 998 1332 809 -3763 -4586
704d586K68l846l02O81o26j650J807N40j58J281L303K77M79M606N2J532K298J543
$$ -4586 -4318 -8164 -8466 -7785 -8411 -10061 -8254 -7714 -7872 -6591 -3288 -3011 -2532 2074 2126 3658 5956 7499
722G499k31J230P90r91j351R39n04k434K90r04m210Q9j89l759q03j44k488j471
$$ 7499 7268 8498 9288 8297 6946 7885 7381 4947 5237 4333 123 212 23 -3736 -4539 -4683 -7171 -8642
740h642R43j273o05J657J603O61P93L017q00J802L357q9J046K534J657r05J212
$$ -8642 -7699 -8972 -9577 -7920 -6317 -5656 -4863 -1846 -2646 -844 2513 2424 3470 6004 7661 6756 7968
757G968J017j168K34J026l027j163Mk081k441j651m70l323j501J06m02l412K159
$$ 7968 8985 7817 8051 9077 6050 4887 4891 2810 369 -1282 -1752 -5075 -6576 -6470 -6872 -10284 -8125
774h125l10p08K331J423n68J425L174Q98m64L309K457K03K192J357j619J564J428
$$ -8125 -8435 -9143 -6812 -5389 -5957 -4532 -1358 -460 -924 2385 4842 5045 7237 8594 6975 8539 9967
791I967k181j406P32k466j778J49j285l442j472j15j632j794P82j490k094K694
$$ 9967 7786 6380 7112 4646 2868 3017 1732 -1710 -3182 -3297 -4929 -6723 -5941 -7431 -9525 -6831
807f831q03p2K483J082l10J572L123nJ341L030J368j178K477Q27k146J008L21
$$ -6831 -7634 -7706 -5223 -4141 -4451 -2879 244 239 1580 4610 5978 4800 7277 8104 5958 6966 7287
824G287M03j530j48q79j974k275L31k939k554J031k348k221K468k627q23Q66K152
$$ 7287 7690 6160 6012 5133 3159 884 1215 -1724 -4278 -3247 -5595 -7816 -5348 -7975 -8798 -7932 -5780
841e780j342m26L661J561q34L525N11J77L883J576j010K068K65j1L34K38j070
$$ -5780 -7122 -7548 -3887 -2326 -3160 365 876 1053 4936 6512 5502 7570 7835 7824 8158 8396 7326
858G326l427J245r60l944n10l50l579J09q01j409j113L41M3p01K18J645l11P92
$$ 7326 3899 5144 4184 240 -270 -620 -4199 -4090 -4891 -6300 -7413 -7072 -7029 -7730 -7512 -5867 -6178 -5386
876e386L965M40J22L798M11n58K080J338m49L22K193j522k373K905j250k621K70
$$ -5386 -1421 -981 -859 2939 3350 2792 4872 6210 5761 6083 8276 6754 4381 7286 6036 3415 3685
893C685m10k829k070p97j832q31k66j155j019R78N41k424K482J552n32J139J968
$$ 3685 3275 446 -1624 -2421 -4253 -5084 -5350 -6505 -7524 -6546 -6005 -8429 -5947 -4395 -4927 -3788 -1820
910a820J087P17R66K289K44J588J794r46L75J697l65j987Q6m89k879L84m38k673
$$ -1820 -733 -16 950 3239 3483 5071 6865 5919 6294 7991 7626 5639 5725 5236 2357 2741 2303 -370
928c70p96j081r34k366j3q21k214K165P68j917N43K515J000k80L116J809J48J809
$$ -370 -1166 -2247 -3181 -5547 -5560 -6381 -8595 -6430 -5662 -7579 -7036 -4521 -3521 -3801 -685 1124 1272 3081
946C081K177j483K035J894m72j154J689j416j657P51j662j616j297q5k132k053
$$ 3081 5258 3775 5810 7704 7232 6078 7767 6351 4694 5445 3783 2167 870 785 -1347 -3400
962c400l01k99j432n63r63j06L61K264o48k69K248Q94l07K499J558o65K409N69
$$ -3400 -3701 -4000 -5432 -5995 -6958 -7064 -6703 -4439 -5087 -5356 -3108 -2214 -2521 -22 1536 871 3280 3849
980C849K78J323J589j419J269o40m81j109o03j94k566j315k77k152j026m78j055
$$ 3849 4127 5450 7039 5620 6889 6249 5768 4659 4056 3862 1296 -19 -296 -2448 -3474 -3952 -5007
997e007j094k5J53j016R10R7L93O60K318j63J265L098Q57j94K985K36P29K46o19
$$ -5007 -6101 -6126 -5973 -6989 -6079 -5982 -5589 -4929 -2611 -2774 -1509 1589 2446 2252 5237 5473 6202 6448 5829
1016E829l46K30m20n85o05n64r52j950j614o90r53k046q16o8j65q93K228j253
$$ 5829 5483 5713 5293 4708 4103 3539 2587 637 -977 -1667 -2620 -4666 -5482 -5550 -5715 -6608 -4380 -5633
1034e633p34J594n48J531K091Q30J070J495J305L84R70K151p39j15R48j264p80
$$ -5633 -6367 -4773 -5321 -3790 -1699 -869 201 1696 3001 3385 4355 6506 5767 5652 6600 5336 4556
1051D556l72L69q73j364l72k859j3j130l60k365n79Mj064M50J132p27N99J469
$$ 4556 4184 4553 3680 2316 1944 -915 -928 -2058 -2418 -4783 -5362 -5358 -6422 -5972 -4840 -5567 -4968 -3499
1069c499m32J502J033J774L60J346J875mQ57P47j15N4N90o95j362J250j449k165
$$ -3499 -3931 -2429 -1396 378 738 2084 3959 3955 4812 5559 5444 5498 6088 5393 4031 5281 3832 1667
1087A667m15r68j946j266J1j336q76N52q0j806R67J560j857K291N45r52J732J942
$$ 1667 1252 284 -1662 -2928 -2917 -4253 -5129 -4577 -4657 -6463 -5496 -3936 -5793 -3502 -2957 -3909 -2177 -235
1105b35Q96P03K555Q06m90J285j44K76n69N8j95r67j085m5j362j405k22j187j520
$$ -235 661 1364 3919 4725 4235 5520 5376 5652 5083 5141 4946 3979 2894 2849 1487 82 -140 -1327 -2847
1124b847p44k55j694M5j52k96M47J704n52M35J878J801j335K396J157n74K968
$$ -2847 -3591 -3846 -5540 -5495 -5647 -5943 -5496 -3792 -4344 -3909 -2031 -230 -1565 831 1988 1414 4382
1141D382m56p85J627R29j140K40M74l80k060M39j093q08j518j196j618k67m98
$$ 4382 3926 3141 4768 5697 4557 4797 5271 4891 2831 3270 2177 1369 -149 -1345 -2963 -3230 -3728
1158c728m22m60o89K20j22R24%K80N23J272N72J58K168K096O48k5Q74J384j782
$$ -3728 -4150 -4610 -5299 -5079 -5201 -4277 -4277 -3997 -3474 -2202 -1630 -1472 696 2792 3440 3415 4289 5673 3891
1177C891K527j360p12N50j556o45r99j131r64p97j061q22j38p17q74L64l86L20
$$ 3891 6418 5058 4346 4896 3340 2695 1696 565 -399 -1196 -2257 -3079 -3217 -3934 -4808 -4444 -4830 -4510
1195d510r31J510n5R14O94J208Q30R30O85K151l90k2J574k61L88k05m55m8K3j115
$$ -4510 -5441 -3931 -3986 -3072 -2378 -1170 -340 590 1275 3426 3036 3014 4588 4327 4715 4510 4055 4007 4030 2915
1215B915n8j576j071q11j055L9j724j795P01L07n67j260J565K60J36J224j52R22
$$ 2915 2857 1281 210 -601 -1656 -1617 -3341 -5136 -4435 -4128 -4695 -5955 -4390 -4130 -3994 -2770 -2922 -2000
1233b000R03J136p2K568J484j175J016J097l45j209K279j035k88q21n01j694L18
$$ -2000 -1097 39 -33 2535 4019 2844 3860 4957 4612 3403 5682 4647 4359 3538 3037 1343 1661
1250A661j468k313r13j67q92j8K61j196j70J07Q11O6N77N74J061l2K937O92K31
$$ 1661 193 -2120 -3033 -3200 -4092 -4110 -3849 -5045 -5215 -5108 -4297 -4231 -3654 -3080 -2019 -2051 886 1578 1809
1269A809J135R55j16P06J57P80q61o45J49r82j135m81j231R66j492j652m8j613
$$ 1809 2944 3899 3783 4489 4646 5426 4565 3920 4069 3087 1952 1471 240 1206 -286 -1938 -1986 -3599
1287c599j2p95N9o8J20l10M86J315m39J475J767j185J713K148J38J4R80j81k9
$$ -3599 -3611 -4406 -4347 -4415 -4295 -4605 -4119 -2804 -3243 -1768 -1 -1186 527 2675 2813 2827 3807 3626 3597
1306C597J278k36o94K89J76j248m51j008j269j134j194P67l173M65M07j710K0
$$ 3597 4875 4639 3945 4234 4410 3162 2711 1703 434 -700 -1894 -1127 -4300 -3835 -3428 -5138 -5118
1323e118J262j440O31J448O75M63K94J767L76L98J385m7J467J232Nr36J780k021
$$ -5118 -3856 -5296 -4665 -3217 -2542 -2079 -1785 -18 358 756 2141 2094 3561 4793 4798 3862 5642 3621
1341C621L75M61j581j163j056o06q07l76j199N6l95q03J17j400Q80L96J11j94
$$ 3621 3996 4457 2876 1713 657 51 -756 -1132 -2331 -2275 -2670 -3473 -3356 -4756 -3876 -3480 -3369 -3563
1359c563m40K809o19J054J871M79L58J711n61P63j101J399N81r0o66k020K100
$$ -3563 -4003 -1194 -1813 -759 1112 1591 1949 3660 3099 3862 2761 4160 4741 4651 3985 1965 4065
1376D065j564j967J06m47n53j257o30m78o96k62r0M37m44j346K322P62k30J219
$$ 4065 2501 534 640 193 -360 -1617 -2247 -2725 -3421 -3683 -3773 -3336 -3780 -5126 -2804 -2042 -2272 -1053
1394a053J233k26J145J72P89J295k97n8L02J541q06n12J106r73o02m64j224k174
$$ -1053 180 -46 1099 1271 2060 3355 3058 3000 3302 4843 4037 3525 4631 3658 3056 2592 1368 -806
1412h06O63j187k48r16j172l26J29m68L42QN63J066j415K024Q62n9J601N63Q95
$$ -806 -143 -1330 -1578 -2494 -3666 -3992 -3863 -4331 -3989 -3981 -3418 -2352 -3767 -1743 -881 -940 661 1224 2119
1431B119J087K52N81m73J148j675O57N5k04j128j033m17l7r98k08j322r85k71
$$ 2119 3206 3458 4039 3566 4714 3039 3696 3751 3547 2419 1386 969 932 -66 -274 -1596 -2581 -2852
1449b852j1m58k36l39j89L11J017N80j41O96J204Q77j466K570N83O5J921r43R51
$$ -2852 -2863 -3321 -3557 -3896 -4085 -3774 -2757 -2177 -2318 -1622 -418 459 -1007 1563 2146 2211 4132 3189 4140
1468D140l11P87j97n20o36q44r60j33j913m00j57j177m37n57q07o07R31j20m21
$$ 4140 3829 4616 4419 3899 3263 2419 1459 1326 -587 -987 -1144 -2321 -2758 -3315 -4122 -4729 -3798 -3918 -4339
1487d339M54K264k63k92J310J721R3J9M80J740p40J380K85o83j10j76J33o32q55
$$ -4339 -3885 -1621 -1884 -2176 -866 855 948 967 1447 3187 2447 3827 4112 3429 3319 3143 3276 2644 1789
1506A789r82q20N28n26q18n78k03j349j2l99n51j6k11J282K5K80J041J007p01
$$ 1789 807 -13 515 -11 -829 -1407 -1610 -2959 -2971 -3370 -3921 -3937 -4148 -2866 -2841 -2561 -1520 -513 -1214
1525a214K144L20J072r14J821p51J021L64K12j161J196k135K75j037J66q45j377
$$ -1214 930 1250 2322 1408 3229 2478 3499 3863 4075 2914 4110 1975 2250 1213 1379 534 -843
1542h43k19j048l67k81j71o28L72M86j634J206J83j76J008P22P47P28J366J093
$$ -843 -1062 -2110 -2477 -2758 -2929 -3557 -3185 -2699 -4333 -3127 -2944 -3120 -2112 -1390 -643 85 1451 2544
1560B544J80J032j255J544K23j363p03J365K08j598o51j076Q26k066l28l59p12
$$ 2544 2724 3756 2501 4045 4268 2905 2202 3567 3775 2177 1526 450 1276 -790 -1118 -1477 -2189
1577b189n86p27P11o95N7k79J156jL21k0J150N97Q1J589l4K77M15J251k45K66
$$ -2189 -2775 -3502 -2791 -3486 -3429 -3708 -2552 -2553 -2232 -2252 -1102 -505 -424 1165 1131 1408 1823 3074 2829 3095
1597C095l89J133o81j198l4K03p39k93j369M63j561R43k614n7O36N17j326J2M00
$$ 3095 2706 3839 3158 1960 1926 2129 1390 1097 -272 191 -1370 -427 -3041 -3098 -2462 -1945 -3271 -3259 -2859
1616b859k68M25j10J887q16O81J172J408P01r99R82K66M40k05K67M89n87j133
$$ -2859 -3127 -2702 -2812 -925 -1741 -1060 112 1520 2221 1222 2204 2470 2910 2705 2972 3461 2874 1741
1634A741J20j24o85r08l40n80p81q86o26k80M15j076J262n35J171n62O26J062
$$ 1741 1861 1737 1052 144 -196 -776 -1557 -2443 -3069 -3349 -2934 -4010 -2748 -3283 -2112 -2674 -2048 -986
1652i86j8L70J203J172o51J577Q5M51J43r0j024K88l16o42P19l37j213m28j842
$$ -986 -1004 -634 569 1741 1090 2667 2752 3203 3346 3256 2232 2520 2204 1562 2281 1944 731 303 -1539
1671a539J113j046L05o19j502J51L67O50q79j004J504P23N7L29J632q64J408J10
$$ -1539 -426 -1472 -1167 -1786 -3288 -3137 -2770 -2120 -2999 -4003 -2499 -1776 -1719 -1390 242 -622 786 896
1689H96m7J628r94J396K13j9o25M45q79L10J22l56o15k25j909j58J30k031R3k16
$$ 896 849 2477 1483 2879 3092 3073 2448 2893 2014 2324 2446 2090 1475 1250 -659 -817 -687 -2718 -2625 -2841
1709b841j42L03n78J31R61O37K24M06l33K81J683n6J053N89P5O27J32J3L43q52
$$ -2841 -2983 -2680 -3258 -3127 -2166 -1529 -1305 -899 -1232 -951 732 676 1729 2318 2393 3020 3152 3165 3508 2656
1729B656n0O90p10m73r31k283O85l00k80j117j2p24K73p70J246j265K47P84M11
$$ 2656 2606 3296 2586 2113 1182 -1101 -416 -716 -996 -2113 -2125 -2849 -2576 -3346 -2100 -3365 -3118 -2334 -1923
1748a923J006L24K26J320p4J037k1O73j0j188P23K58K60l55l35L99l79q63j088
$$ -1923 -917 -593 -367 953 879 1916 1895 2568 2558 1370 2093 2351 2611 2256 1921 2320 1941 1078 -10
1767a0l0n26l19j195J205j643k88Q6P84j111J098M71m46Q10N2P92Q33j83N62Q
$$ -10 -40 -566 -885 -2080 -875 -2518 -2806 -2720 -1936 -3047 -1949 -1478 -1924 -1114 -1062 -270 563 380 942 950
1787I50L52J122J230k70j224L71Q0K9n37k64j55j463J098k289P0r99q53L71N31
$$ 950 1302 2424 3654 3384 2160 2531 2611 2640 2103 1839 1684 221 1319 -970 -900 -1899 -2752 -2381 -1850
1806a850j048m34N5J251N28j098N14J393R03k30J135r01N71J855m01j36Q46p24
$$ -1850 -2898 -3332 -3277 -2026 -1498 -2596 -2082 -689 214 -16 1119 218 789 2644 2243 2107 2953 2229
1824B229L10K3P19j283j388Q56p39j386M33j380l74j76K16m29p29J222j233K015
$$ 2229 2539 2562 3281 1998 610 1466 727 -659 -226 -1606 -1980 -2156 -1940 -2369 -3098 -1876 -3109 -1094
1842a094j428Q28k07J58J038L39N16P8J206p64J011N61J051j323Q68j272N73K84
$$ -1094 -2522 -1694 -1901 -1743 -705 -366 150 228 1434 670 1681 2242 3293 1970 2838 1566 2139 2423
1860B423o51r06L05o34k88o48o5j212m46o0M23j543J675r82p91J279P81M01J89
$$ 2423 1772 866 1171 537 249 -399 -464 -1676 -2122 -2182 -1759 -3302 -1627 -2609 -3400 -2121 -1340 -939 -750
1879g50M18m7J820m23R89P94p36k97L63R09n82j11p89o4J45n75p19m78j84k05
$$ -750 -332 -379 1441 1018 2007 2801 2065 1768 2131 3040 2458 2347 1558 1494 1639 1064 345 -133 -317 -522
1899e22j003k55n88Q32m36q41J418q91J578p02J023j27K21l12J086N80o74K327
$$ -522 -1525 -1780 -2368 -1536 -1972 -2813 -1395 -2286 -708 -1410 -387 -514 -293 -605 481 1061 387 2714
1917B714l91M4k97Q11l65M78j197K76m08r57r44L50l35J92o85o65j89m95L21L91
$$ 2714 2323 2367 2070 2881 2516 2994 1797 2073 1665 708 -236 114 -221 -29 -714 -1379 -1568 -2063 -1742 -1351
1937a351j317J062M04n25Q31J001q18K34L87R80R36r12J011M41n48j85N41k1M31
$$ -1351 -2668 -1606 -1202 -1727 -896 105 -713 -479 -92 888 1824 912 1923 2364 1816 1631 2172 2151 2582
1956B582n25k81N59k464L98k70k98j163M69j332J255j853K63J080j210J458N20
$$ 2582 2057 1776 2335 -129 269 -1 -299 -1462 -993 -2325 -1070 -2923 -2660 -1580 -2790 -1332 -812
1973h12n41P70M98K12n33P56J339j11J003p60j77J227N60j682J47M0n29p36N28
$$ -812 -1353 -583 -85 127 -406 350 1689 1578 2581 1821 1644 2871 3431 1749 1896 1936 1407 671 1199
1992A199n67q50j013l9l67q18J293r32J59J91r87P64M69l10q3Q72P4J093Q62l40
$$ 1199 632 -218 -1231 -1270 -1637 -2455 -1162 -2094 -1935 -1744 -2731 -1967 -1498 -1808 -1891 -1019 -945 148 1010 670
2012F70J051k35O04O07k33n52O89j097j69j74M13k056J650o84o73p40k00l37m49
$$ 670 1721 1486 2090 2697 2464 1912 2601 1504 1335 1161 1574 -482 1168 484 -189 -929 -1129 -1466 -1915
2031a915L33m33q04M86O15mO38k09J187j04J258o98K24L98J263q27M74L89k51
$$ -1915 -1582 -2015 -2819 -2333 -1718 -1722 -1084 -1293 -106 -210 1048 350 574 972 2235 1408 1882 2271 2020
2050B020L88J4o53J35l99m78j91l07j535J77q96l58N57K21n75k26O88l83l82M20
$$ 2020 2408 2422 1769 1904 1505 1027 836 529 -1006 -829 -1725 -2083 -1526 -1305 -1880 -2106 -1418 -1801 -2183 -1763
2070a763L16P86M11k92R67o09M72J273k01K71L22r6O93j449J51k12M26j250J064
$$ -1763 -1447 -661 -250 -542 425 -184 288 1561 1360 1631 1953 1857 2550 1101 1252 1040 1466 216 1280
2089A280j300l70L85r15L9o57m78K50j82J38R10j220N77J147o06L9L74J169m38
$$ 1280 -20 -390 -5 -920 -881 -1538 -2016 -1766 -1948 -1810 -900 -2120 -1543 -396 -1002 -963 -589 580 142
2108A42J633n40M06J30K3J53N91L58p49o27o52P85q82j80j311O15j004K50n71
$$ 142 1775 1235 1641 1771 1794 1947 2538 2896 2147 1520 868 1653 771 591 -720 -105 -1109 -859 -1430
2127a430k72Q60k02j275K77N50J00N93m37J362l37P6O8M24j7J56N92J59K09p73
$$ -1430 -1702 -842 -1044 -2319 -2042 -1492 -1392 -799 -1236 126 -211 -135 -67 357 340 496 1088 1247 1456 683
2147F83K183p93j031N45r17Q0m0j031K21j670R21J93j161P60k17m08j64j40j20
$$ 683 2866 2073 1042 1587 670 750 710 -321 -100 -1770 -849 -656 -1817 -1057 -1274 -1682 -1846 -1986 -2106
2166b106J120m97R6R98L76J095m80K34M10p37K650j829N6M37o94N60J96j118k16
$$ -2106 -986 -1483 -1387 -389 -13 1082 602 836 1246 509 3159 1330 1386 1823 1129 1689 1885 767 551
2185E51L53j403N7M27p20K46j518J25P83j19r86K25P8P22j50qJ432k59N31mQ56
$$ 551 904 -499 -442 -15 -735 -489 -2007 -1882 -1099 -1218 -2204 -1979 -1901 -1179 -1329 -1337 95 -164 367 363 1219
2206A219M00K79j46n81Q27m20o8o84j39J066r82O0j116L61o95j57k43n78k99J3
$$ 1219 1619 1898 1752 1171 1998 1578 1510 826 687 1753 771 831 -285 76 -619 -776 -1019 -1597 -1896 -1883
$$ [...]
##END NTUPLES=NMR FID
##END=
