##TITLE=1H_AT-57
 DMSO-d6
 128 sc, 
 16.2.2023
##JCAMPDX= 6.0         $$ Bruker NMR JCAMP-DX V2.0
##DATA TYPE= NMR FID
##DATA CLASS= NTUPLES
##ORIGIN= UXNMR, Bruker Analytische Messtechnik GmbH
##OWNER= root
$$ XWIN-NMR		Version 3.5
$$ Thu Feb 16 15:54:51 2023 Russian Standard Time (UT+4h)  she@DPX200
##.OBSERVE FREQUENCY= 200.1316
##.OBSERVE NUCLEUS= ^1H
##.DELAY= (6, 6)
##.ACQUISITION MODE= SIMULTANEOUS
##.ACQUISITION SCHEME= undefined
##.AVERAGES= 128
##.DIGITISER RES= 18
##SPECTROMETER/DATA SYSTEM= spect
##.PULSE SEQUENCE= zg30
##.SOLVENT NAME= DMSO
##.SHIFT REFERENCE= (INTERNAL, DMSO, 0, 15.7039)
##AUDIT TRAIL= $$ (NUMBER, WHEN, WHO, WHERE, WHAT)
$$ ##TITLE= Audit trail, XWIN-NMR		Version 3.5
$$ ##JCAMPDX= 5.01
$$ ##ORIGIN= Bruker BioSpin GmbH
$$ ##OWNER= she
$$ F:/spectra/data/she/nmr/H-F/1/audita.txt
$$ ##AUDIT TRAIL=  $$ (NUMBER, WHEN, WHO, WHERE, WHAT)
(   1,<2023-02-16 15:53:15.71 +0400>,<she>,<DPX200>,
      <continue with go, POWCHK disabled, PULCHK disabled
       configuration hash MD5:
       00 E9 B6 7A A2 85 ED C7 34 08 36 98 17 FE 4E 26
       data hash MD5: 16K
       C0 6B 38 58 7F EE BC C6 ED 2E B9 66 69 D3 63 7D>)
$$ ##END=
$$ 
$$ hash MD5
$$ 8F AE C3 5E A1 EF E6 D3 D9 52 FD 64 2E F1 FC 33
##$RELAX= 
##$RELAX= 
##$RELAX= 
##$RELAX= 
##$RELAX= 
##$RELAX= 
$$ Bruker specific parameters
$$ --------------------------
##$DU= <F:/spectra>
##$EXPNO= 1
##$NAME= <H-F>
##$PROCNO= 1
##$TYPE= <nmr>
##$USER= <she>
##$AMP= (0..31)
100 100 100 100 100 100 100 100 100 100 100 100 100 100 100 100 100 100 
100 100 100 100 100 100 100 100 100 100 100 100 100 100 
##$AQSEQ= 0
##$AQ_mod= 1
##$AUNM= <au_zg>
##$AUTOPOS= <>
##$BF1= 200.13
##$BF2= 200.13
##$BF3= 200.13
##$BF4= 200.13
##$BF5= 200.13
##$BF6= 200.13
##$BF7= 200.13
##$BF8= 200.13
##$BYTORDA= 1
##$CFDGTYP= 0
##$CFRGTYP= 5
##$CHEMSTR= <none>
##$CNST= (0..31)
1 1 145 1 1 1 1 1 1 1 1 1 1 1 1 1 1 1 1 1 1 1 1 1 1 1 1 1 1 1 1 1 
##$CPDPRG= <>
##$CPDPRG1= <>
##$CPDPRG2= <>
##$CPDPRG3= <>
##$CPDPRG4= <mlev>
##$CPDPRG5= <mlev>
##$CPDPRG6= <mlev>
##$CPDPRG7= <mlev>
##$CPDPRG8= <mlev>
##$CPDPRGB= <>
##$CPDPRGT= <>
##$D= (0..31)
0 1.2 0 0 0 0 0 0 0 0.06 0 0.03 0 0 0 0 0.0002 0 0 0 0 0 0 0 0 0 0 0 0 
0 0 0 
##$DATE= 1676547901
##$DBL= (0..7)
120 120 120 120 120 120 120 120 
##$DBP= (0..7)
150 150 150 150 150 150 150 150 
##$DBP07= 0
##$DBPNAM0= <>
##$DBPNAM1= <>
##$DBPNAM2= <>
##$DBPNAM3= <>
##$DBPNAM4= <>
##$DBPNAM5= <>
##$DBPNAM6= <>
##$DBPNAM7= <>
##$DBPOAL= (0..7)
0.5 0.5 0.5 0.5 0.5 0.5 0.5 0.5 
##$DBPOFFS= (0..7)
0 0 0 0 0 0 0 0 
##$DE= 6
##$DECBNUC= <off>
##$DECIM= 32
##$DECNUC= <off>
##$DECSTAT= 4
##$DIGMOD= 1
##$DIGTYP= 9
##$DL= (0..7)
0 120 120 120 120 120 120 120 
##$DP= (0..7)
150 150 150 150 150 150 150 150 
##$DP07= 0
##$DPNAME0= <>
##$DPNAME1= <>
##$DPNAME2= <>
##$DPNAME3= <>
##$DPNAME4= <>
##$DPNAME5= <>
##$DPNAME6= <>
##$DPNAME7= <>
##$DPOAL= (0..7)
0.5 0.5 0.5 0.5 0.5 0.5 0.5 0.5 
##$DPOFFS= (0..7)
0 0 0 0 0 0 0 0 
##$DQDMODE= 0
##$DR= 18
##$DS= 0
##$DSLIST= <SSSSSSSSSSSSSSS>
$$ [...]
##$SUBNAM2= <"">
##$SUBNAM3= <"">
##$SUBNAM4= <"">
##$SUBNAM5= <"">
##$SUBNAM6= <"">
##$SUBNAM7= <"">
##$SUBNAM8= <"">
##$SUBNAM9= <"">
##$SW= 18.0517057926174
##$SWIBOX= (0..15)
0 0 2 0 0 0 0 0 0 0 0 0 0 0 0 0 
##$SW_h= 3612.71676300578
##$TD= 16384
##$TD0= 1
##$TE= 0
##$TE2= 300
##$TE3= 300
##$TEG= 300
##$TL= (0..7)
0 120 120 120 120 120 120 120 
##$TP= (0..7)
150 150 150 150 150 150 150 150 
##$TP07= 0
##$TPNAME0= <>
##$TPNAME1= <>
##$TPNAME2= <>
##$TPNAME3= <>
##$TPNAME4= <>
##$TPNAME5= <>
##$TPNAME6= <>
##$TPNAME7= <>
##$TPOAL= (0..7)
0.5 0.5 0.5 0.5 0.5 0.5 0.5 0.5 
##$TPOFFS= (0..7)
0 0 0 0 0 0 0 0 
##$TUNHIN= 0
##$TUNHOUT= 0
##$TUNXOUT= 0
##$USERA1= <user>
##$USERA2= <user>
##$USERA3= <user>
##$USERA4= <user>
##$USERA5= <user>
##$V9= 5
##$VALIST= <valist>
##$VCLIST= <CCCCCCCCCCCCCCC>
##$VD= 0
##$VDLIST= <DDDDDDDDDDDDDDD>
##$VPLIST= <PPPPPPPPPPPPPPP>
##$VTLIST= <TTTTTTTTTTTTTTT>
##$WBST= 1024
##$WBSW= 4
##$XGAIN= (0..3)
0 0 0 0 
##$XL= 0
##$YL= 0
##$YMAX_a= 1222694
##$YMIN_a= -799616
##$ZGOPTNS= <>
##$ZL1= 120
##$ZL2= 120
##$ZL3= 120
##$ZL4= 120
##$ABSF1= 10
##$ABSF2= 0
##$ABSG= 5
##$ABSL= 3
##$ALPHA= 0
##$AQORDER= 0
##$ASSFAC= 0
##$ASSFACI= 0
##$ASSFACX= 0
##$ASSWID= 0
##$AUNMP= <proc_1d>
##$AZFE= 0.1
##$AZFW= 0.1
##$BCFW= 1
##$BC_mod= 2
##$BYTORDP= 1
##$COROFFS= 0
##$CY= 11.3945322036743
##$DATMOD= 1
##$DC= 2
##$DFILT= <>
##$DTYPP= 0
##$F1P= 2.36226072786647
##$F2P= -0.459571619588291
##$FCOR= 0.5
##$FTSIZE= 0
##$FT_mod= 4
##$GAMMA= 1
##$GB= 0.15
##$INTBC= 1
##$INTSCL= 1
##$ISEN= 128
##$LB= 0.24
##$LEV0= 0
##$LPBIN= 0
##$MAXI= 10000
##$MC2= 0
##$MEAN= 0
##$ME_mod= 0
##$MI= 1.114404
##$NCOEF= 0
##$NC_proc= 0
##$NLEV= 6
##$NOISF1= 3.799351
##$NOISF2= 2.8
##$NSP= 1
##$NTH_PI= 0
##$NZP= 0
##$OFFSET= 15.70392
##$PC= 1
##$PHC0= -19111.37
##$PHC1= 5.60078
##$PH_mod= 1
##$PKNL= yes
##$PPARMOD= 0
##$PSCAL= 0
##$PSIGN= 0
##$REVERSE= no
##$SF= 200.130013532006
##$SI= 16384
##$SIGF1= 3
##$SIGF2= 2
##$SINO= 400
##$SIOLD= 16384
##$SREGLST= <1H.CDCl3>
##$SSB= 0
##$STSI= 0
##$STSR= 0
##$SW_p= 3612.71676300578
##$SYMM= 0
##$S_DEV= 0
##$TDeff= 0
##$TDoff= 0
##$TI= <>
##$TILT= no
##$TM1= 0
##$TM2= 0
##$TOPLEV= 0
##$USERP1= <user>
##$USERP2= <user>
##$USERP3= <user>
##$USERP4= <user>
##$USERP5= <user>
##$WDW= 1
##$XDIM= 8192
##$YMAX_p= 0
##$YMIN_p= 0
$$ End of Bruker specific parameters
$$ ---------------------------------
##NTUPLES= NMR FID
##VAR_NAME=  TIME,          FID/REAL,        FID/IMAG
##SYMBOL=    X,             R,               I
##VAR_TYPE=  INDEPENDENT,   DEPENDENT,       DEPENDENT
##VAR_FORM=  AFFN,          ASDF,            ASDF
##VAR_DIM=   8192,          8192,            8192
##UNITS=     SECONDS,       ARBITRARY UNITS, ARBITRARY UNITS
##FACTOR=    0.0002768,     1,               1
##FIRST=     0,             0,               0
##LAST=      2.2672688,     0,               0
##MIN=       0,             -799616,         0
##MAX=       2.2672688,     1222694,         0
$$ Real data points
##PAGE= N=1
##DATA TABLE= (X++(R..R)), XYDATA
0 0 0 0 0 0 0 0 0 0 0 0 0 0 0 0 -128 128 -128 128 -128 256 -256 256 -384 384 -512 534 -640 768 -896 1024
30 1024 -1153 1300 -1531 1688 -1927 2181 -2442 2731 -3068 3421 -3806 4228 -4697 5202 -5744
45 -5744 6359 -7018 7732 -8523 9387 -10334 11395 -12549 13847 -15288 16915 -18757
57 -18757 20873 -23319 26194 -29626 33809 -39029 45759 -54801 67639 -87496 122292
68 122292 -201769 806601 -227265 -277285 1222694 -702036 180033 418802 -799616
77 -799616 253393 218209 -657434 300390 29404 -154412 278301 -62029 39237 260848
87 260848 -145385 59693 130181 -50612 -74695 -44432 65822 -59626 -100724 106391 -157560
98 -157560 56473 180495 -327706 93503 246727 -300953 113796 68149 -240964 218020
108 218020 -46692 -188636 225408 -132202 -74036 211686 -207016 2239 187427 -220726
118 -220726 75653 113866 -245875 114804 101947 -163005 50606 186 -20620 41618 -57914
129 -57914 35279 -24446 -13533 92918 -122453 2975 113114 -111599 34639 41592 -86829
140 -86829 66317 -22545 -13627 89681 -118223 24260 124950 -138183 45152 69963 -136091
151 -136091 129660 19642 -169946 115764 28141 -54394 23879 -59317 81719 -9861 -80363
162 -80363 120668 -79957 -7923 128501 -148924 44972 93335 -122638 64876 18899 -37662
173 -37662 29462 -68718 86609 15069 -131570 112896 -5335 -80304 104333 -67604 -36786
184 -36786 113814 -55229 -42032 40206 10078 4188 -30334 22944 16686 -43116 34337 6372
196 6372 -34246 24552 -6149 -4297 5532 -15525 10314 -12627 12147 19649 -52513 7557 49847
209 49847 -30504 -29993 32014 8301 -35111 20384 7655 -41084 38429 6839 -44790 27893
221 27893 -1465 -11153 8788 -13980 25834 -26504 -25262 67326 -39369 -36910 70059 -34188
233 -34188 -20789 49788 -38731 -5822 43349 -19856 -16480 4536 19340 2364 -39605 27185
245 27185 16561 -47501 32474 7309 -42056 40411 -3787 -24369 23278 -9907 7430 -9705
257 -9705 -3218 43579 -53771 -1824 63177 -63763 10895 40706 -51387 35532 2428 -31720
269 -31720 35977 -18300 14007 6479 -41465 58150 -13886 -44429 64913 -24942 -23864 38615
281 38615 -22625 3750 3323 -6534 15835 -24592 16318 7604 -38583 35747 1761 -38416 25336
294 25336 4105 -13974 -3055 7187 9522 -22812 8725 12574 -28081 15485 9800 -23924 7044
307 7044 12911 -9159 -12947 17581 8543 -28596 19695 12941 -28114 18509 3633 -8841 8900
320 8900 -5568 12418 -10797 -3160 31141 -33165 1447 37988 -41578 8212 26005 -27161
332 -27161 11676 1807 -5540 10525 -15566 15671 -1256 -22063 32102 -14316 -19319 34836 -17069
345 -17069 -11297 20532 -11160 2382 -2545 -4366 14988 -19779 2486 20640 -32822 12633 18949
358 18949 -37484 18593 10126 -28005 14929 -3135 -4165 3818 -18113 20385 -9927 -21684 35829
371 35829 -26683 -11556 35730 -33913 3471 20461 -25532 10999 -6518 -1371 13857 -28133
383 -28133 22427 6708 -31554 33780 -9491 -22169 31773 -14214 -4190 10832 -9339 10378
395 10378 -10183 5357 12541 -26764 18953 8577 -26169 18884 -2486 -10195 13926 -7111
407 -7111 295 -1984 1229 9902 -16136 3758 8555 -13285 5261 365 -3894 1034 131 7919
421 7919 -10865 1401 9531 -12001 8700 -329 -10112 13995 -5957 1868 2936 -10783 19895
434 19895 -1563 -15026 18440 -4986 -1314 8972 -8391 5433 -818 4270 4298 -18560 13158
447 13158 6761 -20830 18708 -528 -20028 20342 1191 -13505 6565 2873 3766 -2224 1115
460 1115 4284 -12822 13256 12176 -29050 9978 18833 -21384 8123 6782 -18722 13731 6999
473 6999 -13663 2071 -283 6449 -1300 -6566 10122 -12186 1215 19231 -22930 -2653 14238
486 14238 -14489 9960 -4671 -15785 18416 -6828 -3288 3231 -16464 22241 -2979 -18226
498 -18226 15923 -11108 3406 11441 -19247 12249 -3395 -6061 21809 -19009 390 13130
510 13130 -12805 18443 -8675 -15361 23878 -2222 -1190 -1845 -9113 20157 -2676 -8093 6107
523 6107 -7426 13518 -538 -13657 12351 -5111 658 11425 -13635 -560 8089 -4088 3125
536 3125 -1693 -8091 598 9871 -679 -17049 6001 10034 -9310 2536 -5535 -8085 13760 2924
550 2924 -12886 -5152 8462 4033 -7719 4013 -1508 -8886 17295 -318 -20204 11748 7403
563 7403 -9226 4482 -2414 -8731 6205 11037 -8341 -11314 12518 3364 -4158 5588 -10743 495
577 495 18174 -7152 -10808 4561 5070 3673 -3049 -3460 -55 2638 4853 -706 -8442 2326 6315
592 6315 -4194 4532 -2986 -12813 18752 4260 -18257 5136 -3012 6368 10834 -21978 689
605 689 13549 -5160 145 -11918 4489 10706 -11899 3878 -6458 -5141 12573 -10326 4533
618 4533 2733 -14617 17435 -1257 -8513 5826 -11405 14569 7219 -24633 11569 3067 -3029
631 -3029 12954 -18543 3400 17156 -11929 3463 -3146 -4148 15282 -9795 -430 6154 -10483
644 -10483 14301 458 -10738 5854 -4433 8499 2782 -13587 5885 -282 3911 4600 -15364
657 -15364 6952 8102 -7935 4387 -4200 -1454 9677 -2070 -2594 -1110 2367 2848 244 -439
671 -439 -2961 1239 4703 -1408 -3434 -1811 4421 3232 -2093 -2856 -4908 6009 6880 -7837 -2802
686 -2802 2806 3990 3398 -7087 -1295 3322 2118 81 -7508 2595 6337 -4414 1548 -21 -4559
701 -4559 4084 -1153 -282 239 -3953 -131 3164 1985 -5761 -989 7897 954 -6114 -1763 2529 6114
717 6114 -1939 -4134 1224 1667 3584 -4815 -3205 7639 -4164 -1798 5697 -7357 1373 3470 -3769
732 -3769 5880 -5216 -2836 8262 -3850 2667 -3104 -2121 11546 -9758 -1673 5644 -6683 8534
746 8534 -4367 -7598 10311 -7734 1980 3604 -10589 8539 -4117 -3913 10189 -11356 3320
759 3320 5946 -9639 6683 -2903 -3498 9667 -7720 764 2584 -5339 8281 -4324 -3022 7411
773 7411 -5494 847 1315 -5565 4948 -1127 -2639 3553 -4413 2328 1769 -3381 2820 -1712 -1711 3101
789 3101 -2261 -586 4028 -2567 1150 984 -3597 1103 2707 -1913 953 -2183 -1583 3269 -2678 -505
805 -505 782 -653 2022 -2563 -2280 4750 -3846 161 1711 -3256 2265 -1483 -487 3846 -3954 1075
821 1075 2012 -3057 3292 -4145 -944 5348 -5274 1546 1684 -3204 5244 -3675 -61 3602 -3332
836 -3332 2171 717 -1158 3867 -4044 1558 2366 -1669 4379 -2804 879 1980 -4410 4827 -426
851 -426 -3083 6371 -4539 1574 1023 -5348 4787 -1441 -1183 3425 -5238 3418 1290 -4487 5684
866 5684 -3411 -785 2627 -4670 3816 -1584 -2866 4956 -5384 1057 1096 -5774 5835 -2220 -3658
881 -3658 6524 -5451 1280 2783 -4970 3992 -482 -2726 3326 -4257 1589 1684 -3648 3418 -1193
896 -1193 -1924 4020 -2555 1245 1637 -2384 4069 -67 -880 2262 -758 1598 1325 -1656 267 496
912 496 -637 643 -515 -375 1680 -57 -241 -88 -352 524 899 -2480 1423 -1080 -1139 3087 -3370
929 -3370 30 2103 -2956 2394 -1344 -4318 3141 -824 -1043 583 -3640 2873 32 -569 1511 -3873
945 -3873 2921 1779 -3840 3016 -2310 143 2611 -2463 -53 -1264 -1249 3175 -5712 1955 1461 -5156
961 -5156 5275 -1999 -4101 5284 -2317 -684 313 -1347 2377 -70 1900 -202 -3017 5016 -1105
976 -1105 -2092 4503 -4716 1415 3239 -5096 1589 -540 12 2335 -4723 561 1763 -1604 4387 -3664
992 -3664 -2307 5763 -2777 974 -420 -2698 4448 -1202 -1717 782 -2981 4265 -1296 -2170 1850 -2834
1008 -2834 3381 1019 -4801 1610 -948 -1264 3172 -3487 -1508 2564 269 1140 -1638 -1256 3036 1608
1024 1608 -2416 -1781 -387 -608 2794 -1722 -2516 4061 1369 -1438 1349 -1286 926 2015 1056 -1130
1040 -1130 -1933 2884 1056 -1111 415 -2625 735 4371 -3250 -274 -388 495 3613 -6447 -732
1055 -732 5186 -3758 3082 -2318 -5312 6781 -1027 -2641 2833 -2700 853 2869 582 -1793 -1109
1070 -1109 3233 866 -1717 1650 -2190 3185 3599 -6603 -97 2306 965 2491 -4590 -85 4622
1085 4622 -1638 3185 -2604 -2190 5608 -3052 -357 926 -3212 3960 3311 -1833 -2069 -1062 3314 -820
1101 -820 -147 -285 -3223 5772 366 -6177 4158 -1315 740 3096 -6903 2950 2572 -2581 1529 -4373
1117 -4373 -665 5010 -2367 196 1528 -1873 2577 1427 -1998 -1576 1632 2437 1037 -859 -2491
1132 -2491 529 4154 -370 -3889 1084 1777 669 32 -2303 1881 3180 -1725 -1130 -471 -908 3377
1148 3377 -1124 -1656 1932 -2334 -1147 5229 -3869 -2763 5284 -134 730 793 -4468 3936 3515 -4268
1164 -4268 -699 -48 1958 675 -4205 1201 838 -19 874 -4461 1326 624 -1864 2757 -3710 -1446
1180 -1446 1618 -1021 3515 -4295 -3179 6191 -1838 -1700 1806 -5074 4975 2038 -5778 2713 584
1195 584 -1342 1164 -2547 1028 976 907 -40 -2765 2443 -838 274 1463 -3827 522 1471 -1393 2204
1212 2204 -2434 -912 4003 -1379 358 97 -226 3145 -578 -1791 -626 800 619 -849 386 -490
1228 -490 -125 797 -1790 -1042 2148 -698 2126 1096 -1946 2917 -650 -245 2893 -3506 -3 4400
1244 4400 -1749 640 392 -1046 3115 -140 -1719 1614 2237 -116 -1490 95 350 -1479 6 -225
1260 -225 958 194 -1309 1562 643 -1974 -248 1669 267 -1303 -2404 1013 1083 -1003 -2952 489
1276 489 720 -451 1011 -1645 367 3455 -4755 577 2356 -2842 1489 38 -2189 2070 -2313
1291 -2313 311 1596 -2113 359 -677 912 143 -2709 3097 338 -793 837 -2539 71 1663
1306 1663 -2181 308 -353 -868 2450 -1412 1558 1530 -3387 3296 -832 -3201 2260 -1930 281 2452
1322 2452 -2513 733 295 -798 360 -649 1854 -938 -895 -64 -2305 1496 1848 -904 1310 -616
1338 -616 859 986 -2069 1276 -90 -1039 1356 -850 612 -455 -1447 -185 -66 -290 -801 -1307 903
1355 903 -82 -1311 -278 -1431 523 154 -685 1859 -1328 107 765 -661 790 -730 -1741 1317
1371 1317 -1284 -1029 1153 -483 725 -320 -333 -261 459 219 86 600 -273 -1501 1518 400 150 757
1389 757 -74 1409 -385 -1588 -215 -1741 469 -58 -1090 1303 -590 -999 520 -849 1850 -1220
1405 -1220 277 1526 -2247 767 473 -1365 3012 -2160 -1781 1476 -1264 388 1599 -2037 1493
1420 1493 -662 313 1654 -2333 1478 -737 -1405 2581 -911 660 1410 -2442 1486 -724 -1747 2134
1436 2134 -1622 166 1162 -2037 2200 -207 -851 1632 -493 856 1268 -1227 1722 -319 -1015 295
1452 295 -797 723 -293 152 972 121 -224 -652 -1037 477 532 114 733 14 1603 -1134 -342 940
1470 940 -1456 156 -312 274 1222 -796 540 982 -57 425 -48 354 923 -617 -277 -669 -136 145
1488 145 684 514 -1339 154 147 252 881 655 -1220 1660 228 -1819 216 737 -126 100 576 -242
1506 -242 -9 493 62 -1450 1391 -904 204 -272 -70 1245 -164 712 598 -2058 1745 -302 -1570
1523 -1570 966 -742 640 1168 -1198 324 -869 -393 1466 -3213 1883 1244 -1873 2844 -575 -1270
1539 -1270 2197 -1335 -791 -478 -1821 167 -1684 187 588 -2606 1980 1984 -2691 887 -770 697
1555 697 556 -1233 -479 474 2 798 -1477 -478 818 1343 1532 -1825 -159 1296 15 472 -9 -795
1573 -795 296 122 -709 -622 352 -262 147 -169 -1820 1250 1851 124 -788 -350 202 1630 -2161 -960
1591 -960 -253 275 1266 -1308 -1343 528 1029 570 -353 -1019 517 13 315 -34 -1448 -331 464 -71 -215
1610 -215 -2143 488 429 -574 -214 -673 161 2699 -1657 -781 1467 -901 -119 1097 -1326 -257 1233
1627 1233 1077 -652 -920 204 -698 862 -8 -1786 1242 1879 -199 -1352 -1142 1454 -543 293 -859
1644 -859 -2660 1465 -30 -1035 1175 -384 -54 474 -540 -333 -703 443 1726 -2742 166 438
1660 438 -576 1481 -1547 -817 2701 -1006 538 -1675 -612 2401 -326 -1141 -519 -15 1208 1059
1676 1059 -1716 1179 -989 328 847 -1718 1114 -32 395 667 -1438 144 824 -127 729 -2038
1692 -2038 512 1174 -170 94 -1088 -17 1407 365 -1116 -701 53 -530 -196 -421 -883 340 1129
1709 1129 487 1374 -747 262 791 -1052 52 -528 -855 1788 -867 -1798 1503 712 552 -242 -255 1934
1727 1934 -616 -377 1109 -918 830 -46 -935 169 -654 120 821 -1053 1423 -959 240 2229
1743 2229 -2372 615 517 -688 1326 -1178 -808 889 225 -260 -623 106 203 200 215 -592 711 305 -67
1762 -67 304 -1080 -46 26 -127 475 -117 -1631 1299 239 -350 508 -130 804 270 -1318 722 649 -120
1781 -120 6 -1082 280 158 778 55 -1624 806 -240 -2592 1685 -880 -1435 524 -483 -487 466
1798 466 -1025 51 -336 346 483 -1590 -345 70 -1356 294 1090 -1733 1007 736 916 175 -501
1815 -501 348 1024 480 -139 -1934 984 -26 -1071 673 380 -720 453 674 -34 114 -1633 -624
1832 -624 -62 218 -76 256 -1753 2545 -446 -934 98 84 -740 1046 -831 -910 -312 95 432 -961
1850 -961 716 1282 -1155 -689 883 -875 994 -438 -788 1746 -298 1184 621 -454 899 -721
1866 -721 100 1483 -1702 309 977 -291 1268 -840 -227 586 -1442 1269 -994 -492 1032 84 -405
1883 -405 165 -513 722 650 1313 -759 611 744 331 141 -811 4 -735 -759 -355 1132 -191 155 927
1902 927 -1470 629 -146 -578 795 516 395 -630 716 1214 -725 1874 381 -415 769 292 -241
1919 -241 1055 -564 491 382 -1024 1864 -265 588 1461 -1037 503 414 92 357 806 -453 -226
1936 -226 692 324 -680 -224 1230 -1143 463 636 -580 -405 759 764 644 -274 -584 568 -131 656
1954 656 1239 -468 -188 1011 481 102 175 -1292 754 330 -1739 787 -228 -634 1490 -167 -155 -39
1972 -39 -1206 1819 -946 136 1386 -511 -1038 354 196 676 -175 642 -209 -847 206 -441 -724 1629
1990 1629 -1022 -258 278 -806 -411 88 -653 -41 -366 491 475 -1625 864 -160 -1293 733 -357
2007 -357 1226 876 -44 143 -724 -172 372 501 29 420 -460 1209 349 -92 -700 211 311 -1034 -204
2026 -204 569 350 -251 -237 208 78 -896 1688 -591 -1241 1125 -881 -224 1336 -1375 -407 367 609
2044 609 -5 655 1498 -608 -23 1972 -1532 111 -439 -408 353 -135 786 340 -461 -238 -1101 -786 257
2063 257 -887 -551 -52 546 333 7 559 -872 -18 1155 -302 -1284 -418 -58 393 -779 -502 -7
2081 -7 -88 45 -461 -928 890 -80 -291 -807 8 528 577 761 -281 -806 1041 589 -297 1131 -1410 -726
2101 -726 265 -1326 185 -548 -294 63 -1375 51 1688 -219 135 -628 -310 -421 203 -326 -322 444 216
2120 216 -1055 270 1665 -755 844 1061 -604 540 -156 -446 16 -958 -64 -1042 647 2076 -198
2137 -198 -482 2311 264 -269 -1297 761 -93 -779 -377 -522 -264 1209 9 -344 -279 155 -155 -350
2155 -350 544 -487 502 613 537 418 -313 -380 -114 295 -833 -329 -1235 1299 -108 -650 564 -166 -747
2174 -747 -463 158 130 -330 -465 -1260 -902 -886 1430 -522 -415 -51 42 267 868 12 330 574 -652 355
2194 355 -714 -338 -423 -558 -916 -647 141 1290 490 -307 988 253 -689 170 -14 411 -825 901 153
2213 153 -36 -323 1192 255 584 1195 -992 343 -538 128 -30 -1376 -217 722 -1287 162 413 261
2231 261 71 262 -402 -254 -281 -162 -348 1114 423 -800 1258 -683 -359 1111 932 -197 -225 222 -150
2250 -150 -625 115 197 -386 383 602 -1401 166 250 -788 -547 112 154 -115 -190 -128 -158 -728 -464 1166 -124
2271 -124 -741 804 212 748 1293 -1124 149 197 -324 -321 64 -316 485 296 -450 237 555 433 -337 1187
2291 1187 -340 -349 1317 -1466 25 249 582 -118 428 0 416 -368 -521 456 -1110 66 -619 -140
2309 -140 56 252 -1357 583 -288 -280 -109 -192 -85 -1300 793 -802 782 -293 -58 710 197 478 72
2328 72 -65 -147 444 -386 78 740 440 823 588 -1248 1207 -358 763 -532 203 -383 37 159 -896
2347 -896 915 951 -301 -80 514 -6 719 -971 442 -717 -954 -1455 261 -418 156 460 408 514 808
2366 808 -417 -1148 108 -295 -802 -105 1320 525 903 130 1157 282 -579 -60 -193 -858 -542 -60 581
2385 581 -958 -174 672 -232 -1267 509 116 -608 390 1058 444 376 720 79 -340 -59 276 -349 -677
2404 -677 -444 -440 -642 524 -895 -476 -1264 -279 -213 -281 -34 -329 -266 -318 413 1244 974 -98 -77 -923 -533
2425 -533 110 354 28 -357 71 -649 478 593 -199 1813 -2 1201 689 129 325 923 961 288 123
2444 123 -310 -45 163 -453 -163 279 -95 -430 394 622 562 -110 410 -354 -61 -143 217 753 -422 -218
2464 -218 124 -758 -372 -35 -600 -674 881 -729 -653 -1013 -172 505 240 329 773 -203 -203 207 -1203 -1094 394
2485 394 -595 260 -336 -479 -29 -277 615 318 -47 -209 -126 -717 80 -1059 669 167 -215 517 -162 511
2505 511 -234 -629 432 -191 45 -181 -212 -168 297 546 -1760 -359 610 1245 9 226 -843 -21 1068
2524 1068 305 493 -276 -77 110 -250 -1078 -737 533 232 532 1587 -13 150 415 -838 -1061 -759
2542 -759 186 -1157 -1009 -131 -78 102 899 447 -674 1219 -15 715 400 -692 303 1128 -306 -869
2560 -869 49 -480 192 303 623 16 -59 260 773 256 394 755 -1011 970 1439 206 620 456 382 -1148
2580 -1148 -780 -514 604 420 -125 506 290 720 -1197 -17 -500 758 -410 618 -405 528 -142
2597 -142 -807 11 204 929 537 761 320 431 -471 -12 -443 553 -333 56 -223 3 141 40 -287 163
2617 163 -459 1073 138 -893 229 429 150 -707 100 185 -119 -2 -320 539 662 85 -2 502 -426 -404
2637 -404 586 -74 233 -314 337 -376 289 211 189 428 4 200 135 233 -420 183 -484 -623 681 254 573
2658 573 -377 1158 830 -738 -455 836 303 -15 -24 425 848 -203 593 759 376 -621 -62 1084 1614
2677 1614 479 -469 105 347 -197 -461 -613 408 105 -137 -338 -248 1016 767 -119 750 -568 -426 203
2696 203 72 32 -386 165 -32 55 750 -284 869 465 35 -172 210 -304 -359 321 225 -102 -1081 45
2716 45 -11 -242 548 31 382 -299 -1343 13 516 275 -298 -441 638 -66 251 -442 -283 1540 -915
2735 -915 244 409 -387 177 -760 636 335 -228 -311 322 -149 -103 -258 -1015 652 -1331 51 757 -387
2754 -387 264 164 841 23 -1106 1118 80 -153 -123 267 -1614 -29 590 780 -1346 -25 -894 207
2772 207 -540 -664 -613 252 216 -350 -429 -520 445 -195 -35 -316 657 -407 409 58 207 -127 -95 427 486 444
2794 444 387 548 515 -1051 -1122 387 -1055 -102 -387 437 -609 -125 -273 750 200 -298 -1460 203 248
2813 248 -749 343 198 -118 208 -424 -60 275 630 -32 326 -769 289 181 140 -501 -149 184 -241
2832 -241 669 -395 -696 1144 -630 456 341 253 -116 362 -222 212 -192 195 -208 743 -260 -684 -590
2851 -590 50 301 -351 299 699 118 -569 -1003 69 -680 -674 172 273 -161 -70 -808 -304 49 -289 266 104
2872 104 -56 -556 237 -961 494 -584 -697 262 -245 152 -426 800 -163 -572 1136 807 -179 370
2890 370 -187 1 -346 214 -545 -935 -644 -804 -921 64 496 -732 -196 270 -1011 -419 -1180 -243 283
2909 283 419 756 -864 -466 654 416 -459 -637 1014 -896 -627 646 941 154 -863 -71 1693 936
2927 936 1278 -704 212 -490 356 100 120 -158 456 344 -1307 -404 -212 243 -246 -642 -257 -132 53 -363
2947 -363 -188 711 -86 -295 -214 170 -143 357 369 -140 -940 306 -576 367 -263 738 -256 -124 -359 -581
2967 -581 -133 -978 -652 61 -1040 -518 -327 -881 495 -95 -475 648 -245 622 -1074 80 560 -433
2985 -433 -43 235 -216 516 -686 -437 -455 920 -527 255 -20 26 423 222 -688 -760 -104 -934 -864 -12
3005 -12 -148 74 37 185 511 -280 241 -593 1385 -648 1020 343 172 -315 -374 -157 -814 285 662 233
3025 233 -528 31 243 1861 312 1242 767 26 494 -14 -949 -144 74 -712 -1072 1 -399 -776 1217
3044 1217 721 87 84 747 -156 -488 201 -193 -917 818 -448 -10 -116 549 636 1073 -52 -380 345 -630
3064 -630 1 448 346 -22 -224 194 -58 210 1320 -312 1111 485 -484 231 -489 -438 -598 -21 875
3083 875 151 -349 -123 85 -5 -618 -249 43 -244 379 677 -418 30 195 -871 151 -804 291 -225
3102 -225 728 558 -120 332 287 912 -762 30 -143 -975 426 49 423 253 53 -819 -573 -25 -1042
3121 -1042 313 -200 394 -504 -1 156 -615 -523 393 824 -247 107 -419 237 670 873 643 -103 -749
3140 -749 185 -1039 225 885 385 326 162 -153 -396 -222 592 446 541 -287 -726 270 471 -293 -373 -340 510
3161 510 -333 -875 842 -35 -1020 199 -449 340 -14 116 348 -587 -611 -1253 96 -359 -135 -342 588
3180 588 -227 49 23 361 393 568 -59 1207 -810 371 -170 -288 158 -51 -1005 30 -94 -298 -329 -843
3200 -843 -628 -32 -48 409 248 300 1444 10 -748 -462 -481 74 -584 689 175 256 -36 10 -369 -983 -66
3221 -66 -682 286 -1169 666 1105 157 742 598 -587 -481 -13 318 246 -434 -137 -224 397 935 -510 -319
3241 -319 -134 362 138 -310 749 182 325 -1122 -993 152 645 1398 -1032 -429 333 -147 1167 558
3259 558 202 508 405 217 828 -434 31 66 1381 439 718 705 -537 438 522 -427 -76 -139 -135 -162 -134 67
3281 67 -198 852 -178 1475 1113 -256 -614 -86 -1045 -307 -27 697 165 -868 -266 349 -338 -426 335
3300 335 795 -142 723 -327 -1621 -228 -1034 -249 -491 793 -213 -44 262 -1399 548 223 -292 -318
3318 -318 971 -326 -1319 -470 -392 520 -1086 740 525 1143 -127 222 493 -690 626 339 315 307 -945
3337 -945 680 -666 28 839 404 803 -347 -871 -121 -392 -432 188 113 122 194 -468 -1052 981 197 -380
3357 -380 921 186 -255 -384 -259 -1280 485 -80 -45 117 256 165 -157 -798 232 219 -501 511 -490
3376 -490 -640 -382 -54 -903 -32 627 -420 -346 -814 -627 -199 -679 -424 -72 127 -695 -930 84 626 -335
3396 -335 126 24 259 -1139 838 -1001 -677 228 -278 -516 -161 867 -350 -644 -94 423 -54 -342
3414 -342 -121 941 -261 702 108 168 -483 -792 -403 470 -59 89 -1146 -571 390 -732 -372 -267 -3
3433 -3 -573 -62 -150 583 -400 352 -208 102 404 337 405 20 695 171 379 547 84 -44 -741 -155 229 841
3455 841 -973 -742 -57 -77 103 -632 -364 -222 463 -457 -1008 -294 962 649 996 555 161 100 -554 -496
3475 -496 162 -1013 126 172 -511 616 -409 -893 -517 1073 -1471 -103 -60 -289 198 -548 -869 -366
3493 -366 410 197 734 65 6 -132 -701 544 -250 240 -176 -29 904 395 -168 48 721 -473 -871 -1624
3513 -1624 -236 -466 11 -635 -516 457 309 -505 -867 -630 868 471 1129 434 -331 -29 -731 -195 -183
3532 -183 -78 96 -55 -141 539 -1195 567 -468 -14 -186 295 556 -796 644 730 656 207 -61 -1316
3551 -1316 1032 -538 90 496 -162 130 717 291 -482 613 -919 -234 265 536 -141 553 107 248
3569 248 839 942 383 -294 274 911 -561 -292 -80 57 399 -113 980 369 123 600 31 -88 -293
3588 -293 -555 -34 539 312 402 -1141 558 442 -189 258 681 148 -170 -600 36 -470 -407 899 -202
3607 -202 199 651 262 521 -176 209 -644 -884 1566 65 813 -416 -767 -377 484 877 1139 199 -324
3626 -324 -51 248 -1322 245 372 216 886 557 365 -30 -355 -343 168 454 842 -1095 1116 -79 4
3645 4 509 -476 270 506 452 -137 -372 509 9 -228 -1041 89 -222 550 -160 164 -704 -399 -349 -477 -453
3666 -453 -586 145 167 -91 537 -96 77 -852 -289 541 6 -267 392 -146 167 -97 214 16 -918 -279
3686 -279 -1314 -400 -480 -195 -107 -20 171 -195 -443 -21 7 -529 -324 181 304 654 360 311 -1048 42 24
3707 24 -145 -96 588 669 -1094 328 499 -469 7 -639 -437 285 -634 336 -333 -690 -379 605 64 -264
3727 -264 618 452 11 88 -153 -139 47 -544 277 23 274 719 98 -25 78 1553 -800 454 266 -15
3747 -15 7 570 863 296 -173 -286 557 -46 827 876 388 -670 216 323 410 -17 -38 541 -494 -893 -89
3768 -89 97 180 561 757 -615 696 -965 -660 -958 57 225 198 -474 -1199 -775 384 113 -635 247
3787 247 -280 -323 -1087 308 349 66 164 336 6 -227 -206 61 564 533 -199 100 -49 975 7 -302 103
3808 103 323 941 76 -415 -944 442 286 63 534 -34 572 -552 -197 473 -274 719 302 304 215 122 1033
3829 1033 -223 -85 163 -635 1303 274 -183 -515 164 -202 -440 423 574 -498 213 464 507 75 300
3848 300 287 -21 -427 -249 202 547 1143 239 986 1045 -826 73 643 -511 -1095 352 638 -1071 980
3867 980 739 558 -501 -548 369 -139 474 -384 -323 979 168 753 188 765 -893 526 133 -272 722
3886 722 365 -342 530 -537 -211 174 132 658 -120 88 -151 -134 -392 30 190 -1008 307 866 -488
3905 -488 -410 300 759 -365 -400 1031 177 12 -315 704 -415 551 121 -332 586 793 626 -587 -93
3924 -93 -412 -269 -430 -719 -316 1105 516 -26 -16 -234 162 666 433 1 -132 28 458 731 -306 -341
3944 -341 -227 -426 -672 -179 241 517 240 452 389 -123 -43 -382 -185 670 592 -232 1064 -183 -385 -302 -235
3965 -235 571 440 -672 152 -330 129 -130 221 66 728 681 -951 -552 524 -241 274 -200 133 -93
3984 -93 -921 -906 402 858 288 223 -296 -86 -1087 272 -144 -501 -185 474 218 159 -166 -293 -425 -19
4004 -19 -538 -472 242 480 215 542 380 397 69 -697 -537 76 527 178 915 188 -244 -1206 402 338 145
4025 145 123 -1670 -156 -444 324 -353 1221 -726 296 -417 -574 55 7 382 265 -395 -723 235 -277
4044 -277 -44 552 1185 760 587 -718 -317 -1102 338 -365 -169 136 573 196 -121 92 678 129 -172
4063 -172 -72 714 -22 -6 858 250 -1191 -243 724 -684 -336 130 -243 -430 -269 -1334 -875 23 778
4082 778 -469 685 -44 -317 113 318 102 311 -543 1165 25 1392 -299 -51 941 12 -352 393
4100 393 797 -320 -762 -518 -79 297 -141 -191 -320 -454 -184 -189 123 -139 -298 101 141 -630 348 -1253 -482
4121 -482 269 26 -1232 1070 -660 45 354 717 499 767 207 307 -577 0 -207 113 163 -644 855
4140 855 241 -285 -23 -269 424 289 383 147 -45 1213 -905 1025 95 1032 -256 -337 476 -551 585
4159 585 118 -401 0 -261 -379 -551 208 77 -262 -380 -740 638 356 1017 798 353 -142 -87 311 269
4179 269 -627 -569 413 -160 380 -679 558 1330 -1050 -45 665 79 707 -362 -708 -729 -526 847 411
4198 411 163 475 774 -775 -1058 -378 45 435 462 -542 -676 127 -165 -284 -362 11 382 171 233 -580
4218 -580 607 362 343 91 599 621 -1161 -272 831 818 -1174 -629 -432 282 -8 48 -533 -586 -972 -311
4238 -311 -77 1105 -846 -1240 -33 -65 1094 -811 -452 273 -156 17 512 84 -427 -134 -75 -229 582
4257 582 -230 -496 -534 -178 1014 838 92 237 532 -464 26 770 256 -7 -614 552 -328 -132 -209 287
4277 287 -313 -351 597 297 -44 1518 538 -4 918 -694 297 182 106 702 -252 473 866 879 499 -359
4297 -359 131 340 -326 416 218 -546 1077 -785 -148 -646 2 713 -216 -507 -795 295 1707 -1198
4315 -1198 -486 -581 671 -689 129 -56 229 -399 213 570 338 502 335 580 -939 586 -436 -204
4333 -204 -550 -368 -669 -181 16 689 -240 -981 622 -277 -444 1562 532 278 100 -952 -618 -127 994
4352 994 -1122 212 -482 -503 -72 322 458 597 -342 -234 -172 -80 506 867 -389 148 -191 386 -409 -614
4372 -614 473 253 -432 -1 -542 442 -327 -24 -414 -252 332 -555 -738 -86 58 -1416 433 -871 -374
4391 -374 -382 -108 19 -542 11 -663 43 399 -293 -257 -19 -711 193 429 -581 226 -261 -7 72 -53 186
4412 186 -988 -281 -1572 776 -93 -348 -58 -909 550 -768 365 242 509 -83 -710 -452 -678 -90
4430 -90 -1464 436 -120 -1490 -1380 -356 -2 -1193 64 769 -591 690 -202 -76 341 -787 -338
4447 -338 -335 389 -224 560 898 -124 -42 -969 -26 920 83 -93 -132 761 691 -315 663 151 -242 110 118 -773
4469 -773 62 289 -306 -328 -912 159 138 253 100 391 -111 -407 -527 907 -644 568 561 75 798 282
4489 282 -499 -527 -356 -524 -82 747 -213 782 -538 188 -486 430 103 -79 62 110 -58 -19 374 -371 -252
4510 -252 433 -71 -602 276 88 -226 -371 855 -254 -525 -1276 -70 -869 419 481 -1003 1146 107
4528 107 513 158 424 272 1374 -239 1059 -630 525 -553 112 -402 718 -632 -546 -554 -556 328 -841
4547 -841 57 -285 408 514 -386 -166 167 -283 742 80 172 407 -326 953 -757 -537 93 -490 308
4566 308 -305 231 -566 -844 -7 -20 280 404 841 74 -495 -297 -1165 -348 624 -141 -446 -316 855 652
4586 652 -747 -17 -51 381 -112 -351 -861 1042 -126 -311 -261 36 211 -653 -924 -367 -825 87 505 370
4606 370 -167 620 109 -226 -443 1113 -175 805 -105 -302 489 -160 -22 99 244 -394 179 209 168 1164
4626 1164 979 -1053 652 -593 141 706 529 393 -1203 -331 -72 -267 228 99 -50 1221 955 -211
4644 -211 704 -245 74 165 19 -853 -563 -1344 -118 -174 -1688 269 -643 23 -884 406 -58 -22 854 705
4664 705 654 -279 161 605 656 414 -542 489 -103 -49 167 -685 997 -38 1213 -882 198 -1033 -521
4683 -521 -620 669 843 183 -29 -189 -670 872 47 202 -199 449 349 -561 -352 293 -1204 -489 651
4702 651 -882 187 883 -615 -1056 -806 64 713 -435 164 -360 -70 -486 -440 334 986 -77 -784 -236
4721 -236 105 -981 147 -413 -645 -31 -69 82 -117 -60 14 86 -321 -70 -448 456 -452 -309 266 -13 58
4742 58 -286 1063 -79 -157 194 96 -94 1167 -158 385 676 -84 1516 1148 -514 -479 -21 31 -594 482
4762 482 -930 -307 -679 16 272 -20 -633 -724 -345 381 -33 72 -4 -484 249 270 59 734 -21 185 -485
4783 -485 -486 671 -817 505 -674 112 169 469 -976 -6 87 -526 -847 -691 128 623 516 -710 -936
4802 -936 348 -664 -188 788 -1073 565 -856 233 77 -775 613 970 366 -43 -72 498 -90 1081
4820 1081 -245 -480 257 631 419 -861 264 408 -140 175 305 351 -773 363 242 288 1094 -278
4838 -278 -563 -201 -239 787 268 -157 450 357 -226 349 1007 77 -144 -76 -150 466 -889 -1349 -843 76 -330
4859 -330 80 137 -810 -322 603 410 268 169 300 577 -965 231 328 -348 537 151 -368 500 -201 -500
4879 -500 212 -637 -186 -252 -922 84 -732 106 -386 484 473 -781 228 -423 -937 -125 -586 -52 848 -503
4899 -503 501 -401 -91 -319 798 397 260 -227 -204 -527 59 -515 87 -309 -397 875 -215 -223 1172 -423
4919 -423 96 183 273 87 -283 -509 -4 -45 -631 82 -993 762 -383 -433 365 826 -49 79 106 293 -1384
4940 -1384 79 726 -670 133 -1795 -435 332 -611 -270 -888 97 -146 -968 -619 276 37 -20 -339 -972
4959 -972 -242 -256 459 217 272 -35 -763 304 776 -43 -750 -465 -187 238 759 29 552 -1120 363 -792
4979 -792 -136 -264 189 -358 -747 740 -798 -536 445 15 394 -247 -277 -546 1005 1007 -248 -209 662 419
4999 419 -794 718 -456 327 -442 2 -79 443 529 414 -248 270 727 156 234 327 999 -634 937 -329
5019 -329 26 301 -929 -314 -46 323 808 112 -153 -393 72 -468 -853 -166 -735 -314 321 -605 -314 -486
5039 -486 74 -309 -384 -163 -1629 -461 542 664 -696 -16 -123 -895 -781 241 -356 637 -455 625
5057 625 -206 -26 887 274 -5 1067 956 943 -123 -32 288 -1184 146 561 -646 742 224 -163 -110
5076 -110 -673 -633 534 -53 -981 400 701 -294 203 -21 406 -764 317 421 875 -411 430 605 591
5095 591 -47 -65 85 -772 536 332 -470 -148 -149 192 2 125 -1088 735 -252 757 -284 68 -533
5114 -533 -1218 110 -224 103 -1087 -818 604 -332 659 -130 -446 768 -128 366 661 460 48 -159 168
5133 168 853 -525 -236 83 -129 112 328 -297 -853 -454 513 942 -535 51 -939 -240 72 14 55 400
5153 400 15 -419 -198 -1089 -294 -449 170 -513 -345 -734 632 305 -452 -183 242 -157 103 -1345 -503
5172 -503 -424 -964 -1245 55 2 551 -389 799 354 -352 99 -644 -44 471 550 690 -3 230 -161 -215 694
5193 694 367 -1465 526 -822 394 421 192 -233 1069 80 47 436 299 -291 -428 -468 -428 -1596 202
5212 202 332 289 -730 -156 -216 85 650 -712 835 569 -995 753 164 -184 982 -320 -495 594
5230 594 479 -1174 365 -151 176 -188 746 532 -567 545 273 288 -225 -93 -531 -191 564 -409 -400 382
5250 382 199 557 379 547 -600 488 208 348 474 178 -450 120 -647 643 -132 -163 901 618 -97
5269 -97 753 149 243 617 492 -293 -899 -355 -424 202 -161 -817 302 -265 225 18 440 308 421 -856
5289 -856 -580 -330 1322 -189 -684 651 -232 17 406 -777 -207 -882 328 -242 -187 723 -445 93
5307 93 434 -16 -377 458 206 -437 287 -439 -548 583 -45 1718 -310 -760 655 -376 -909 92
5325 92 -155 937 412 257 -787 109 23 187 -172 -493 -697 675 10 731 -361 -180 45 372 584
5344 584 -199 -271 -1293 510 -1191 -46 442 204 -47 466 411 127 775 -854 -31 200 -801 399
5362 399 179 -196 27 -242 -618 84 47 339 -631 -1449 422 189 -126 575 752 1176 -357 369 -778
5381 -778 -308 -578 -654 -533 -76 -68 395 -611 720 -742 -277 879 -709 -754 323 -932 214 790 74
5400 74 -446 940 414 17 487 -1574 -712 541 -373 -902 848 -780 476 -339 -425 100 904 207 -141
5419 -141 -620 -486 -146 515 -134 13 66 -278 32 370 347 269 1311 708 118 -893 -575 537 -757 -28
5439 -28 218 -62 603 -507 727 -123 398 -750 -6 434 -128 -976 1009 392 -853 -21 -732 -222 218
5458 218 219 -637 658 -299 214 -714 429 306 -692 -47 119 -5 -166 -806 499 102 -801 -189 -266 -39
5478 -39 48 367 228 -71 157 445 -233 -146 -295 980 104 419 -14 848 -316 430 -327 -167 -584 -654 533
5499 533 81 330 -326 -570 778 98 479 677 404 467 1340 -161 201 -522 445 -7 116 898 -475
5518 -475 -864 -193 -682 -991 922 783 402 4 22 -114 -126 -475 -128 -672 297 -552 -668 -546 514 188
5538 188 14 169 638 -258 252 969 -28 -391 -226 45 -123 431 53 -192 285 -402 -62 -273 -670 153
5558 153 -668 -1073 285 -118 158 -679 940 334 744 117 257 607 -60 -270 -48 -847 506 689 -319
5577 -319 -575 -428 -882 -830 -193 52 650 145 1379 332 -399 483 262 -372 -456 822 -1237 -87 8
5596 8 83 469 -375 -54 -246 -485 73 -106 86 185 -160 213 -776 283 -792 717 150 208 97 -1042
5616 -1042 -305 -387 -218 -2220 152 -345 676 -614 856 -576 86 -210 151 45 -1148 298 577
5633 577 15 -256 468 573 -248 -133 -266 846 1257 -281 -944 -463 -179 -82 65 -327 -500 790 -1071
5652 -1071 294 209 -817 1502 -324 -331 -406 -436 -774 167 -23 -967 -378 -24 -366 326 197 500 361 -193
5672 -193 195 -1008 542 -926 459 -114 1554 293 -495 -252 431 709 330 600 -292 661 3 375
5690 375 88 -649 157 -545 -361 184 165 888 -801 192 -119 621 -203 634 -100 264 -42 569 -797 -181
5710 -181 618 960 716 116 -640 278 543 678 95 -709 -204 -143 479 -103 1050 496 -953 -262 838
5729 838 -31 -210 631 1231 -33 -289 355 161 549 -789 1125 -762 147 -543 -844 3 236 -1001
5747 -1001 -792 483 -195 -191 -117 -129 -503 -618 -642 -29 277 -242 -347 -13 -1215 -269 -304 -631 -413 267 -260
5768 -260 1149 -61 263 -134 -215 -423 72 -166 174 394 -385 83 -549 577 152 837 61 -125 -49 652
5788 652 -609 -249 -106 407 137 677 414 -1027 204 38 174 452 929 106 45 1365 -66 543 -194
5807 -194 1060 15 276 -578 -207 470 -453 170 -217 512 -686 156 672 650 -626 1297 -417 976
5825 976 -124 -243 -253 -1146 -733 -38 -317 465 646 -331 373 -140 -41 -214 227 -189 30 -122 1391 -79
5845 -79 -333 -384 -83 -148 245 -325 851 -340 194 285 -66 -529 -381 -83 -25 -85 -319 -121 511 -136 710
5866 710 -369 -644 -183 258 936 -765 110 616 292 685 -390 489 -528 -269 491 -166 -765 -427 -92
5885 -92 -199 -221 340 496 232 -187 -197 550 467 147 263 245 -166 716 -721 1101 854 908 323 -84 467
5906 467 614 434 -218 -167 185 23 -986 987 -675 218 -118 348 -591 988 -126 -553 244 -461 323
5925 323 556 -558 494 -98 -67 91 -1088 570 -551 -76 -1265 -1366 804 -377 -208 376 -20 -915
5943 -915 -665 414 -493 -10 -872 506 594 -269 420 309 -205 -996 479 -751 234 -1522 -22 -154
5961 -154 199 -515 721 452 541 329 -948 -236 -833 -124 -297 -92 -820 -598 682 -415 445 9 -374
5980 -374 1056 193 -484 -233 151 -377 472 121 785 -598 1057 -14 256 485 1398 302 -459 -341
5998 -341 -249 166 -28 -353 -236 -54 297 681 -185 652 1339 -153 542 -147 1029 47 1173 607 -111
6017 -111 -350 -635 -206 -458 376 -207 626 -130 914 -167 -186 -541 -600 806 856 -495 -262 519 -468 177
6037 177 40 431 554 -255 483 -177 456 136 47 279 966 -336 -17 1229 -627 420 -582 -1194 307
6056 307 473 249 569 1517 -158 -434 258 -410 166 294 122 315 167 332 -12 -407 236 241 -183 -242 -753
6077 -753 -545 -794 -437 1000 192 330 -179 -191 115 -835 379 -870 -150 602 379 -532 -416 -291 -319 192
6097 192 -681 552 226 -101 136 -801 320 449 546 -845 -1357 -332 26 -1245 238 -117 162 -439
6115 -439 -1267 -662 344 278 -423 1007 -395 432 -361 -634 -425 -213 684 212 -146 568 411 -877 -17
6134 -17 -319 -108 254 -682 152 662 935 -397 -939 -987 99 -474 -781 238 -168 -135 383 594 106 -194
6154 -194 -33 -69 -30 898 -737 -1609 -406 -587 752 -773 288 491 139 -704 -275 271 -150 -141 -1369
6173 -1369 -474 468 -356 233 204 -10 176 437 -1174 -372 -1001 473 380 -304 4 -35 -229 886 388 683
6193 683 636 -141 -283 -29 473 283 58 173 633 876 -368 313 -182 -292 1032 767 311 13 -434 -165
6213 -165 1715 5 46 -362 87 489 -1027 -728 -257 1248 -735 -574 -1394 406 435 -503 81 -603 -633
6232 -633 647 914 -399 530 1199 -65 156 541 -973 946 289 -394 39 280 -118 275 511 -70
6250 -70 855 567 195 975 -66 140 1062 785 719 612 -1161 843 265 -929 267 116 479 50 868
6269 868 56 54 -156 429 1391 -634 167 509 363 -660 1194 451 -750 -601 778 -664 -114 698 68
6288 68 133 1118 -179 113 553 431 890 -9 -1188 -491 281 344 -565 500 326 1449 632 37 -502 -149
6308 -149 870 384 132 -365 586 537 -194 -302 184 -514 -601 -180 298 -663 -306 -638 -190 -587 -51 -137 752
6329 752 295 1040 278 160 -40 -202 -45 -10 -199 689 -123 64 149 338 -4 -814 1376 -654 594 967
6349 967 -473 252 -1025 -114 686 -14 135 125 -563 767 -480 -820 499 183 158 140 -346 -665 885
6368 885 -624 277 815 -110 -959 -539 700 217 6 -793 227 -82 -376 -170 -216 -136 308 -192 154 -18
6388 -18 -250 -272 382 97 645 -252 895 588 -453 127 509 -379 -1014 -930 1281 -192 92 -199 72 232
6408 232 -1041 -138 -46 -116 945 938 179 -400 659 1057 -7 543 -679 831 -647 -380 -245 -522 155
6427 155 323 189 -399 966 -90 -832 698 -295 -23 -5 -451 734 -115 -186 844 -243 -1185 352
6445 352 253 74 26 -159 -587 -378 361 234 -289 -384 111 254 511 320 770 621 217 114 -246 -607 234
6466 234 -125 -171 -467 -226 96 -491 -10 -1090 753 120 -154 -458 161 1156 874 -502 -522 1057 899
6485 899 -912 725 804 869 128 -364 -1212 -1068 -257 189 -453 -1005 72 -74 -679 167 -402 304 780 -207
6505 -207 -602 -343 314 -1705 -606 -582 241 790 230 -106 910 -447 -485 -709 -924 1110 1258 1312 417
6524 417 250 316 -518 367 48 -566 492 1149 490 -35 455 -351 -391 -457 480 206 236 -191 -591 102 -516
6545 -516 -53 -677 -294 -125 -368 -113 -417 218 -845 -989 -411 128 713 -178 -596 -1246 -546 193 -662 -188
6565 -188 453 -472 59 -826 549 -103 -153 1462 470 774 841 -581 992 -871 -787 175 448 -1010 -629
6584 -629 520 -587 109 -931 -1001 -235 953 -1476 -901 -1435 55 808 15 -691 113 108 495 284 -274
6603 -274 -591 -464 -654 -605 268 -527 -33 -227 795 -604 -1040 -600 -265 -618 -534 -8 116 -31 -27 -1320
6623 -1320 236 379 237 -1013 94 273 -310 -61 -404 861 579 22 -945 374 -482 -224 -128 35
6641 35 -546 681 828 165 -57 -210 279 -602 -370 -140 -748 -731 801 -815 313 -95 586 130 -456
6660 -456 -535 270 -592 120 -173 1623 268 -53 -352 307 1241 -742 5 23 313 -600 -339 551 -57 220
6680 220 -157 -44 176 -211 32 -193 616 625 -21 -128 233 -323 709 -1129 612 -795 267 -309 -159
6699 -159 74 -1081 136 171 161 -63 -415 701 -304 598 394 -186 691 -469 -538 -745 426 207 -314
6718 -314 98 980 -513 -39 115 -419 -292 1222 201 -122 101 -31 409 425 -1 -495 1024 -296 297
6737 297 403 296 -441 1485 -172 25 -817 -859 124 -1053 -974 -460 521 194 -245 16 244 -169 241 54
6757 54 -863 -785 6 175 -50 261 -305 -399 -459 551 72 317 -64 -906 70 894 -380 465 -844 396
6777 396 196 211 -233 -1231 78 -468 223 -249 -109 -219 487 -134 59 543 194 382 40 114 -1187 -373
6797 -373 -235 126 55 -188 762 110 -908 -175 649 602 -70 -1298 585 30 -682 -166 252 -434 -215 351
6817 351 126 554 317 -735 -349 -543 736 -588 122 130 -670 235 -80 -342 210 711 -276 -200 -160 -869
6837 -869 1286 -506 148 745 -1229 -369 -49 -259 50 -456 -223 -815 -524 -1435 611 339 -636 292 503
6856 503 -1233 -419 -112 -118 -176 48 1092 404 -304 -7 352 -124 -1342 245 1137 -598 -723 364 83
6875 83 866 1330 -853 -236 148 107 9 106 -700 -789 340 -494 333 -325 -696 -353 584 92 225 -314 914
6896 914 204 -271 884 -803 451 -498 741 -386 -24 392 -204 418 622 -411 -471 -74 -6 -462 -55
6915 -55 1159 678 774 -427 489 294 -376 -190 -598 1502 101 78 901 605 -578 -145 444 114 -520
6934 -520 845 570 -982 283 1032 665 -276 -315 -317 103 -1 358 91 -1181 -419 23 269 -674 -63 1311
6954 1311 -534 194 -171 -445 849 -326 -559 -481 -78 -580 651 801 1093 -944 808 -127 1228 408
6972 408 -1011 1120 -823 -867 -350 165 274 269 -173 -144 -599 319 -677 1130 -144 -153 -377 -25 -47 886 -554
6993 -554 -264 1146 214 -222 -182 -245 169 -881 238 -165 -497 -110 -260 810 475 -637 676 -5 373
7012 373 162 -674 -388 864 385 -295 518 -160 40 -859 545 -223 401 -398 492 395 -6 242 -86 360
7032 360 133 -122 -389 -386 -322 -335 -796 -268 153 -1075 394 644 -330 -586 338 332 -98 87 -685 -106 426
7053 426 347 609 375 500 -376 -123 114 -223 95 113 105 -487 759 -654 99 -714 -458 812 696 188
7073 188 -170 563 106 -954 -187 393 274 282 648 675 159 803 588 1297 671 246 330 654 -179 -130 496
7094 496 -177 161 169 333 -217 -539 22 -509 708 -106 1048 -1186 33 462 -97 -806 -930 867 -42
7113 -42 -469 -105 1155 994 8 -75 52 -170 -401 -410 191 264 -19 -39 557 166 803 14 -208 259 -519 703
7135 703 167 -530 -241 207 -1335 -576 296 57 858 938 64 -121 -479 -615 -1059 175 5 -591 -531 -313
7155 -313 697 -685 -346 -649 279 -708 -473 -302 511 348 576 -320 336 1071 -980 -877 -1240 -657 -1349
7174 -1349 199 -528 112 380 1253 -530 -39 515 -175 37 -748 4 439 509 344 -139 642 224 573
7193 573 1402 596 387 415 -838 577 431 -364 627 -616 340 714 593 269 122 -102 463 605 -421
7212 -421 255 -788 -50 -428 132 -24 250 -687 -722 292 933 460 -434 853 307 985 251 762 259
7231 259 -242 -855 641 260 -69 770 -101 -502 -279 485 466 -369 -724 -326 149 -405 -120 547 -205 171
7251 171 -152 -608 453 -75 201 -297 -780 116 -848 17 -963 936 604 -443 3 -402 416 -523 387
7270 387 347 802 -552 171 -701 554 -1188 -167 -265 -338 -29 -343 876 546 370 -309 317 28 -544
7289 -544 370 -1032 235 -144 -293 172 589 1186 -809 -91 1313 -487 -110 -707 -703 -902 -179 457 1032
7308 1032 -45 -176 -538 370 -410 -398 -786 780 -15 -203 329 332 288 158 537 -262 279 252 434 729 440
7329 440 299 229 -999 -82 296 -257 225 -215 384 -108 225 415 -565 -437 305 -487 -534 -327 -637 -39
7349 -39 886 -525 -1038 -877 -2 506 -755 -27 363 683 371 351 571 -174 652 21 140 -85 256 165
7369 165 -24 -197 -586 131 624 128 -50 -67 -230 -726 -448 398 -160 -266 529 277 -75 -476 -1534 412
7389 412 741 279 -335 159 386 97 -769 654 -622 -21 -412 655 -221 176 949 -130 -27 1033
7407 1033 -125 -75 848 -617 1077 -382 196 54 380 837 273 -807 224 431 -1470 101 -422
7424 -422 1121 -100 -776 -209 543 -818 -151 253 131 90 416 -233 759 -455 -345 805 -784 742
7442 742 696 -625 -17 -270 -900 -310 -319 927 -337 -554 65 647 296 80 271 566 155 -299 314 193
7462 193 94 -416 -896 -266 653 -128 -326 946 -368 82 671 -108 -114 335 -265 304 -507 239 -571 -62
7482 -62 -11 310 -1456 913 -827 117 230 -484 -596 735 -230 767 176 159 509 -750 427 590 -55
7501 -55 299 72 584 -160 -488 450 -620 -467 -712 -1552 -407 -83 487 970 679 170 -652 -27 -474 357
7521 357 1232 721 634 65 126 -950 -304 432 285 -841 702 147 -313 636 34 667 -232 -1263 -757
7540 -757 -729 60 -332 177 -774 -44 -672 414 264 414 207 -525 -30 -39 9 -1089 29 15 -67 -271 -687
7561 -687 -677 201 594 230 -41 -12 -917 26 -29 476 -485 -583 37 234 324 -811 992 515 387 7 934
7582 934 108 -957 453 1014 365 251 -47 -71 756 120 -132 -350 58 220 -96 807 339 -72 -275 -457
7602 -457 -738 -1178 151 -341 256 66 838 -59 -678 463 388 574 -221 -667 470 848 -640 25 -1126
7621 -1126 -421 -13 734 -449 -656 -36 612 -175 -308 -706 -47 -1133 -882 -342 184 239 82 11 -571 -376
7641 -376 457 -250 303 821 356 -171 -550 -652 -277 -620 269 592 -448 -582 292 -618 -662 816 579 624
7661 624 275 -1744 -12 -549 -165 -515 135 109 92 363 -175 90 -1044 -74 -210 338 -675 -631 72 4
7681 4 -1402 542 -365 -509 218 378 -248 -550 232 -206 -2 -288 -340 902 -776 -418 -192 -484 -607 -135
7701 -135 -254 -177 616 100 260 -22 -555 548 -150 -1629 325 -816 368 405 -338 -662 549 -1155
7719 -1155 826 108 -475 -460 -771 498 1 208 447 -654 36 -192 659 245 -671 -24 1254 -586
7737 -586 -298 -1069 -167 201 -467 277 -134 486 -320 128 450 -244 -530 -833 667 -311 782 416 -438
7756 -438 -541 -272 -750 -313 665 350 -215 -929 225 1263 561 -985 -284 -228 -412 116 -247 -364 -659
7775 -659 33 -416 152 1073 304 -1100 -87 81 -319 580 879 536 1562 -427 -827 225 -1021 1133
7793 1133 -44 -669 -616 -301 391 171 -91 1287 532 -97 -69 -363 247 609 105 -252 867 -580 -511
7812 -511 36 359 924 129 84 576 351 395 -776 157 1055 261 543 -753 242 -399 812 -123 707 219
7832 219 -743 -754 402 -181 111 934 240 -276 284 -151 -325 278 -791 530 137 -236 -188 -724 -600 -395
7852 -395 762 173 -392 301 564 283 -432 -729 363 46 -767 -92 236 281 689 -358 246 -607 -1099
7871 -1099 115 349 -139 -32 429 285 508 -403 -532 53 30 -233 217 244 -1055 197 221 -406 -143 267
7891 267 -452 -437 946 -1041 26 197 151 465 -574 256 -1229 -1448 144 559 678 -73 171 -95 31
7910 31 -679 986 590 -141 -321 379 340 1216 -1037 -455 -474 -1506 500 -401 275 -132 1360 -413 -291
7929 -291 1058 532 100 475 -87 -800 -37 337 36 422 529 -833 280 -440 -1467 -875 -87 -1000 85
7948 85 74 144 -536 842 246 -260 808 699 269 195 -109 -208 1193 -158 -1245 -158 520 821 243 142
7968 142 -422 -569 -521 1077 -1154 -110 -548 -636 -599 -328 -72 -256 1100 509 -519 -86 653 725 542 -852
7988 -852 57 687 1165 935 -1131 254 -176 148 -76 -381 -607 -625 -180 -839 529 -728 -842 633 974
8007 974 -425 -350 402 -78 175 -543 -110 459 121 436 82 -260 -555 349 -856 366 -120 39 37 25
8027 25 -1152 -303 -570 -34 -30 -48 315 -658 226 -397 -158 -271 -1 160 473 -1044 8 83 -238 -908 -224
8048 -224 -1039 -480 -18 -862 227 -473 493 805 10 -397 192 -309 303 -519 74 -810 -1317 -308 334
8067 334 606 202 -205 839 -115 71 -267 -27 416 473 -149 5 -1097 254 -261 -866 -1146 863 -430
8086 -430 -197 920 -110 574 198 129 53 -196 797 -612 449 1035 1006 -311 157 293 -401 889 685
8105 685 155 -336 -116 842 -986 -178 -366 91 890 -875 -96 -369 -876 52 1587 268 128 1023 -447
8124 -447 -1056 15 74 313 287 -92 439 251 -431 -145 -218 -310 274 239 161 761 -269 253 250 -151 308 -597
8146 -597 -879 -586 357 92 -1152 216 -349 518 928 38 123 -197 21 391 -1282 18 -164 503 453
8165 453 696 357 -1296 -923 935 -357 91 548 -1170 486 -528 -82 78 271 746 -704 577
8182 577 323 72 650 199 287 -177 608 -83 122
8191A22
$$ Imaginary data points
##PAGE= N=2
##DATA TABLE= (X++(I..I)), XYDATA
0 0 0 0 0 0 0 0 0 0 0 0 0 0 0 0 0 0 0 -73 128 -128 128 -128 128 -140 256 -256 256 -376 384 -429 512 -584 641
33 641 -756 836 -923 1037 -1166 1305 -1455 1619 -1805 1998 -2206 2436 -2692 2967 -3277 3599
49 3599 -3967 4365 -4818 5310 -5860 6480 -7176 7975 -8899 9980 -11259 12796 -14702
62 -14702 17134 -20324 24727 -31214 41637 -61182 109714 -450296 -580441 430139 -351531
73 -351531 -151789 67690 -196928 -7668 145920 -1109 -148432 179476 248140 -305251
83 -305251 201224 148945 -304591 293173 -107732 -212098 433887 -397062 -92653 483082
93 483082 -443024 87114 308434 -453499 350061 143899 -463079 385173 52204 -245403
103 -245403 269187 -170727 -6318 213508 -227467 106300 49459 -151604 177967 -80863
113 -80863 -38970 113980 -107244 93042 -23216 -72803 126584 -148375 88433 121411 -291661
124 -291661 164131 109474 -254654 195219 -15735 -181749 233950 -96853 -117208 170425
134 170425 -117500 27404 63693 -156178 130227 -22866 -113602 181611 -98945 -70951
144 -70951 130718 -83705 22414 12179 -69634 84785 -40065 -6980 24223 -101879 127974
155 127974 30203 -174011 114287 52769 -107257 77857 227 -54197 80724 -19149 -39616
166 -39616 46186 -16984 18432 -6670 -37014 84465 -65054 -58230 155893 -81333 -74424 121021
178 121021 -66312 1400 50997 -83301 53175 14723 -28536 22324 -71365 82015 24857
189 24857 -135279 115867 -7574 -103041 126764 -67237 -34245 95172 -101641 53223
199 53223 27242 -103516 111153 -45538 -46041 119474 -126643 14875 112183 -122538 32755
210 32755 31398 -53761 57288 -50784 4563 43349 -70069 58962 -12482 -68451 92475
221 92475 -40517 -41117 73890 -49821 -7764 25926 -24179 33786 -39308 -2882 68189 -73573
233 -73573 15271 56215 -85457 53543 36328 -95876 56766 26159 -49268 32841 -16021
244 -16021 12037 16207 -43843 47487 -9410 -34806 65796 -37824 -21819 58064 -40758 -5077
256 -5077 33870 -16667 -5846 -8231 21235 3022 -38798 33006 5418 -32518 28244 -8222
268 -8222 -18386 27252 -3175 -17672 1482 15895 -1980 -22458 17254 12165 -24491 2200
280 2200 17620 -10923 -13522 23246 -3783 -25023 32366 -7262 -25348 38436 -8883 -17991 17754
293 17754 -6278 12337 -17934 -3059 37896 -45480 7247 37016 -52643 26322 18205 -43665
305 -43665 30567 -1153 -12528 11009 -15672 28059 -16202 -20712 50097 -35856 -8457 43202
317 43202 -38091 7572 16859 -23954 15838 -9817 4770 6681 -30388 34423 -5678 -36439
329 -36439 44133 -12546 -27019 31563 -15633 -8141 11898 -10935 5078 -9315 -1336 10618
341 10618 -25125 10455 14063 -29616 9019 12820 -21957 4339 5176 -5360 160 -5926 9934
354 9934 -5924 -9022 23835 -15176 -9651 28388 -18721 -7908 22276 -10327 -398 2878 3140
367 3140 3656 -13094 17715 2588 -20670 25992 -5891 -16895 25684 -7555 -7410 9445 -364
380 -364 6007 -13589 7309 15142 -23834 16706 6545 -24075 21367 308 -11907 9620 -1896
393 -1896 6578 -8281 954 16153 -23833 11763 17942 -26602 16733 5547 -14230 15054 -7665
406 -7665 1534 3132 -7218 15701 -15782 -3014 20606 -19846 4678 7153 -14801 9849 -5024
419 -5024 949 2528 -12274 14308 -6498 -7239 13251 -13207 6249 8076 -13841 6619 -4894
432 -4894 4338 10810 -17981 8699 10944 -11869 8018 129 -4065 6453 1622 1679 -8579 4229
446 4229 12747 -15570 5869 10261 -17560 9897 12563 -15957 1239 9398 -901 -3847 1466
459 1466 2229 -9828 6089 11085 -22865 -2559 22454 -14824 -5406 13393 -14117 3013 13313
472 13313 -13545 -4062 5928 1330 -1359 -6511 7521 -3453 -4226 16685 -13918 -10450 20211 -8224
486 -8224 -1031 4933 -15013 14155 2203 -11670 5747 -9957 11129 7980 -24545 13746 1934
499 1934 -5396 15171 -17197 3444 8178 -14137 18190 -10190 -11988 23063 -13243 5140 3264
512 3264 -23110 23333 3679 -13388 4632 -10150 15753 4133 -19090 9554 -3157 3536
524 3536 8284 -19740 10078 5919 -10511 12974 -10273 -7672 15039 -4543 -2440 2241 -7418
537 -7418 3474 8936 -2053 -12182 2683 14691 -8269 -6652 4941 -5602 8640 7896 -14455
550 -14455 -3250 11640 4564 -8380 1508 4063 -7633 10831 5067 -20690 7351 15583 -10395
563 -10395 -444 2601 -6164 5559 10816 -7297 -13123 11183 7975 -11564 4660 -3857 -5268 15556
577 15556 -6570 -15173 7136 4084 -531 -5577 -6008 1434 688 1606 -1394 -9890 1195 6511 -5690
592 -5690 -1087 57 -11397 12577 8956 -23442 3750 7253 -2615 10695 -16838 -5799 21188
605 21188 -5749 -3827 -3951 1333 15507 -10463 -2256 5471 -6192 13842 -3333 -5525 11112
618 11112 -12428 9155 9694 -15872 8549 -2037 2301 16374 -24090 5464 16381 -11617 7772
631 7772 -8700 -5573 24580 -9904 -5996 7695 -7793 12893 -2464 -8656 11391 -7443 5466
644 5466 8523 -14930 5065 2253 381 5681 -14670 1709 7461 -2784 4430 -12029 738
657 738 12975 -10017 -1493 2296 -6111 9155 -1546 -7518 1288 2134 1724 -223 -1351 -2233 1137
672 1137 4620 -1643 -4257 -1997 2555 2940 -4433 -2282 -2403 2184 6692 -6847 -4413 5172 1851
687 1851 1402 -5124 -3133 5892 424 -2296 -5337 44 8240 -4481 -2164 2150 -3917 2336 1253
702 1253 -2836 913 -1412 -549 2321 -437 -4820 -1972 7088 213 -7350 395 3545 4924 -2318
717 -2318 -5386 2888 1583 989 -1187 -4921 6914 -778 -5560 6971 -5583 -1629 6485 -5080
731 -5080 2982 -78 -5997 8722 -2654 -3275 1176 -5582 9101 -3802 -9261 9643 -5418 426
745 426 3759 -10349 9334 -605 -5817 8514 -9656 3500 4925 -8255 11228 -5366 -5671 11216
759 11216 -7764 1337 4065 -6904 11224 -3273 -5432 7984 -4940 3367 53 -7420 7981
772 7981 -1649 -2603 5035 -4613 2072 3414 -4076 3354 -788 -739 3762 -3285 692 1218 -4575 2205
788 2205 421 -1931 5058 -1608 -486 2873 -4061 -410 4102 -2835 556 -83 -2389 4330 -570
803 -570 -1662 3292 -1935 627 940 -2189 2420 -624 -2452 3825 -1653 368 1387 -2347 3277 -1065
819 -1065 -1531 3155 -3493 1915 42 -4374 5443 -1349 -1527 5837 -3554 1793 1754 -3501 4994 -2917
835 -2917 -926 4212 -2833 2865 -812 -1754 3647 -2148 3221 -433 -2620 3692 -4309 739 2758
850 2758 -6554 3955 -1644 -2464 4241 -6070 1799 1593 -5086 4229 -2443 -389 4954 -6192 3272
865 3272 407 -4907 5773 -3266 -49 2391 -4771 4579 -2060 -3238 5960 -5744 3490 2813 -7700
880 -7700 6060 -525 -3406 4879 -4094 524 2395 -5019 3578 -1350 -1778 3482 -3692 1433 1746
895 1746 -3588 4693 37 -1411 2225 -3523 1498 1776 -2815 604 -755 353 1626 -1813 -50
910 -50 -17 -938 1072 -438 534 811 -173 -1021 1357 -1097 -1306 1077 -3132 258 -280 -2468 1645 -1579
928 -1579 -2813 2756 -2302 50 2033 -4053 2420 247 -1739 1208 -3433 1144 814 -1976 1764
943 1764 -3045 486 4006 -6058 2503 1340 -3146 4838 -1352 -2534 2655 -1597 3433 -2932 -1200
958 -1200 4130 -4136 2326 1493 -4797 5538 852 -2619 2345 -1743 1173 1152 -1387 929 -2287 2946
974 2946 1862 -4807 4120 -1821 -1493 5198 -5244 652 3183 -3526 4641 -2271 -2665 3829 -2864
989 -2864 1971 -121 -4393 6704 -299 -3095 2861 -3512 2687 1770 -4003 -9 -710 3533 189
1004 189 -3751 3239 -655 364 4038 -4302 642 3762 -2996 2971 -1724 -2314 3661 1124 -1306
1019 -1306 -871 -834 2466 2469 -1952 -1024 1711 573 568 -997 -2093 2776 1508 -2680 999 -581 974
1036 974 2361 -563 -568 -272 797 3072 -2212 -136 -1003 -13 3303 -3622 -2207 2787 566 3236 -4115
1053 -4115 -2524 6123 -2563 -620 870 -6282 5619 2745 -5685 3325 -1668 -2678 3670 -779 -2808
1068 -2808 -905 3079 2494 -4125 272 -399 306 4278 -4340 -1425 4975 -1789 1719 -3740 -1529 4176
1084 4176 -2539 1521 403 -3129 6243 -452 -4097 3145 -3168 280 3044 -3941 -2314 207 2706
1099 2706 496 -2939 638 -2075 2393 2081 -6438 3053 2090 -2524 3342 -5078 1271 6250 -2795
1114 -2795 -379 -192 -2605 5886 -851 -3410 2489 -1587 517 2560 -1791 -833 1344 3341 432
1129 432 -2722 -776 1162 3828 228 -5482 1614 4442 -441 -914 -2954 1853 3289 -2067 -1728 1603
1145 1603 331 1745 -430 -2851 1735 -399 -2036 3660 -1660 -4742 5111 1272 -3403 1812 -3033
1160 -3033 933 4407 -5219 -2415 2719 881 641 -2543 392 1797 -427 2333 -2341 421 1442
1175 1442 -3200 1925 -647 -2778 3812 -617 553 -316 -5258 5249 713 -4588 2608 -4505 2082
1190 2082 4286 -6140 1196 3217 -2861 1983 -1459 -677 1437 -370 258 -2755 1349 958 -1156
1205 -1156 2029 -2802 -312 4430 -2063 480 -458 -1962 4624 -851 -2770 744 -1047 1475 7
1220 7 -2453 -7 1687 -170 -1284 -1341 2019 394 848 -427 -1413 2268 646 124 2130 -2660 42
1237 42 2675 -2017 2212 -2624 -1860 3973 -1594 -1856 1874 -478 493 93 -2081 904 1746 -362 -2057
1254 -2057 308 622 -1183 423 -1166 -141 1587 1 809 860 -964 -172 1346 94 -220 -622 383
1271 383 1159 -41 -1168 886 1960 -909 759 -162 -1410 2806 -2201 -525 3131 -3260 53 741
1287 741 -3502 2002 -566 -2444 3107 -2099 -390 27 -1484 2343 -1239 589 3114 -3068 1350
1302 1350 -345 -1458 2630 -1169 -239 946 -1703 1513 -851 -1418 3471 -3807 729 1872 -3933
1317 -3933 3087 -100 -2899 2354 -113 -947 304 -597 980 -515 481 498 -1047 563 -1794 -219
1333 -219 783 -1962 129 635 -745 929 -684 449 1226 -1387 190 898 -903 932 -1308 -129
1349 -129 616 42 486 -490 379 947 -898 -369 -1402 333 113 -2065 1900 -353 -1182 645 -183 247
1367 247 434 -1570 1368 -5 -397 762 126 135 954 -719 -334 434 -707 70 671 83 -2168 807
1385 807 786 -469 293 -661 704 1272 -777 570 382 802 851 -2131 1699 269 -1843 2123 -943
1402 -943 415 354 -697 2418 -395 771 1569 -2471 2392 1168 -3219 3721 -140 -1695 1600 -757
1418 -757 981 -187 -2043 1438 -1120 15 1923 -1067 1737 -338 -1863 2149 -1236 -1097 533
1433 533 -1851 1483 -672 -1247 1209 -869 260 1113 -2321 2561 -747 -1170 1364 -821 312 659
1449 659 -1810 1286 -715 651 508 -1769 817 18 -35 832 -108 -69 -636 196 -688 -2143 542 -589
1467 -589 -746 -519 -1308 1049 222 128 652 -1025 189 262 -247 331 -119 -609 1544 -1582 1 1155
1485 1155 -133 1191 -87 -1205 -382 -624 341 5 -1594 -491 -729 1520 674 -691 487 1792
1501 1792 679 -369 -1256 176 985 110 452 -1128 1354 51 -1402 -149 -1007 -99 616 -475 1056
1518 1056 -1412 1208 731 -869 -846 1118 -259 1521 -878 601 529 19 970 -729 -916 2222 -1477
1535 -1477 529 298 -1536 1239 -595 -488 393 -2544 1535 1381 -1738 1755 -2159 693 2195 -1802
1551 -1802 192 665 -768 2438 -1273 -848 479 516 928 -948 436 2477 -37 -511 956 -1799
1567 -1799 1862 1136 -1741 -659 -158 1183 1870 101 95 33 1176 584 -1157 -1380 -287 1537 529
1584 529 -41 84 -787 1666 -993 -1096 505 33 172 -44 -1083 261 141 -250 804 -1454 -297
1601 -297 1172 82 -84 -1662 -549 1291 730 66 -387 98 2000 -1166 -475 1199 -291 1902 -471
1618 -471 -1878 1119 170 -241 1276 -553 -750 1219 674 -343 -1000 971 402 24 -814 -2483 572
1635 572 307 -485 -1005 -617 1586 80 -1306 1379 -899 878 1791 -2235 -321 922 -888 951
1651 951 -968 -640 201 133 504 -1095 -626 2126 -861 1884 -1069 -952 1895 -106 696 346 -1476
1668 -1476 1638 -109 -1868 1323 472 1395 492 -1598 959 582 -442 904 -1524 -510 461 -1335
1684 -1335 -730 962 -1842 1082 489 364 -622 -1873 1516 1271 -99 39 698 927 938 -3120 578
1701 578 1240 -1018 -237 -168 -355 1743 123 614 591 -577 -100 221 -609 -913 -667 -860 1949 -187 -2221
1720 -2221 630 1416 171 -504 -1477 1750 -373 -657 539 -591 1035 386 -327 -224 -804 57 448
1737 448 -256 587 -807 -999 1347 -1918 -576 1139 -1160 631 839 -1210 1051 113 -1121 236
1753 236 -830 114 78 -1074 -169 -126 162 565 -498 -576 -1100 884 -1158 -558 950 -1470 -671 752
1771 752 -1871 329 36 598 1017 -1305 -808 850 -1727 356 -966 990 248 -417 252 -1496 630
1788 630 690 -2867 1765 2022 -2334 1155 149 -725 875 -1023 -199 1302 -688 368 -787 558
1804 558 668 -1708 369 1110 -1724 128 1269 237 201 381 445 -687 563 -203 -932 485 372 -175
1822 -175 241 1812 -266 -1002 -108 326 -1151 -146 -199 -52 914 -382 601 -861 1532 1420 -901 247
1840 247 425 -572 -94 -182 -157 982 -979 1646 -504 -1484 1544 20 -53 1350 -1042 629 -19 -1145
1858 -1145 69 -417 -75 596 -1685 111 -873 -837 563 -467 -75 1393 -1243 357 -556 -942 1168
1875 1168 -206 488 592 -593 915 674 -932 257 -1274 -203 271 142 379 806 1453 -454 -1211
1892 -1211 -726 611 -172 -658 -55 -12 -350 -464 687 -558 -358 354 -906 -715 571 -1418 -624 92
1910 92 802 301 728 531 -1170 379 -25 -416 -176 -589 29 851 189 1223 563 -425 955 292 -103
1929 -103 793 -1548 -81 524 -929 -50 467 213 179 -536 1118 42 399 -582 -322 300 286 -792 73
1948 73 -383 314 -429 247 642 66 -416 352 -143 -299 -603 2064 394 -1375 50 -983 462 264
1966 264 286 799 386 15 1083 -1003 616 977 -691 1345 229 -178 1421 -613 254 561 -369 1145
1984 1145 -147 1475 311 -1260 285 -387 317 257 -915 -907 194 -1082 1074 -1022 179 -7 -1220
2001 -1220 -665 1075 -1773 808 1289 -1039 1448 -771 -420 -649 -866 33 105 3 832 227 -87 161
2019 161 -1268 -368 -557 901 719 732 245 -180 184 222 33 357 -51 315 -686 -1185 1362 82 -157
2038 -157 1103 72 144 -78 418 643 -162 584 237 -591 926 -1089 -978 746 172 261 250 -644 277
2057 277 -692 58 -575 -1317 943 -295 -645 -822 574 700 -220 281 -506 952 1499 -255 -1443 148
2075 148 755 -280 970 -823 860 375 -114 605 -854 940 357 371 908 -857 975 33 -830 -125
2093 -125 -412 -429 439 -372 -22 480 -49 1292 -1346 -1124 -333 -310 2090 -135 -220 633 -704 688 65
2112 65 -192 -101 -147 -72 -1036 -227 801 -411 -1226 1055 -703 7 1042 -875 792 -306 -234 485 574
2131 574 151 439 -51 55 -913 -1356 -683 492 363 -838 -525 95 855 128 -649 -306 807 -13 819
2150 819 530 -405 10 -101 -1063 -279 651 163 -430 701 -296 -189 653 -198 253 -828 -392 -44 -2 116
2170 116 1392 211 351 1152 -1104 929 888 -225 1115 -982 -51 1024 -848 -197 346 253 956 338
2188 338 -224 -491 -206 -279 -885 -107 -526 -792 53 784 -141 1082 -484 -693 169 -818 -127 178 1347
2207 1347 102 205 -97 -104 -91 461 -474 261 -810 -1349 118 -978 540 946 -450 799 -324 -1040
2225 -1040 -178 -177 -291 555 342 1339 142 -708 1564 99 -1025 -248 227 535 -49 151 -1105 -518 -743
2244 -743 -79 590 590 -147 922 704 -448 320 1067 33 531 159 498 240 1167 826 3 -1386 -341
2263 -341 1483 -118 779 516 614 169 187 243 -765 265 -540 510 -189 -210 469 613 -500 129 165 -177
2283 -177 567 149 736 -652 317 -1054 -752 888 -433 535 724 -820 -1 207 -347 322 -658 -829
2301 -829 621 -106 660 -260 844 1277 -572 499 638 -857 122 -652 -18 67 496 272 -630 -232 -575
2320 -575 -86 298 199 13 -36 -1136 -4 393 -1780 -596 827 -109 -340 -489 740 750 463 -317 439
2339 439 -531 -1015 -505 888 -226 789 -70 95 525 199 -229 -189 -892 1283 138 4 885 1665 -235
2358 -235 819 -158 -835 638 348 537 -353 920 1337 -341 458 1010 -47 440 70 495 154 -381
2376 -381 -868 -173 -14 391 -166 551 74 -433 951 -257 -117 -1104 38 -769 -580 299 668 409 -335
2395 -335 -294 465 -217 239 -287 341 674 804 37 208 1157 -50 795 471 200 196 -570 -469 -412 -81 -369
2416 -369 -243 455 782 1038 757 -344 221 526 245 660 759 -944 -287 -1388 -188 355 -137 -376 405
2435 405 -1050 -138 -1010 -402 43 -1266 708 -229 278 378 459 355 -278 320 279 -764 220 591 -1252
2454 -1252 1392 400 19 -751 -41 -779 31 311 -127 -209 -4 -391 -773 53 39 714 -405 564 372 366
2474 366 -1090 816 234 185 1323 -931 145 74 53 752 270 -783 -182 -894 1011 553 313 1429
2492 1429 -291 896 136 142 96 718 -1372 1127 -824 -417 399 -456 9 212 252 -989 322 1042 -938
2511 -938 -399 263 -117 -464 238 -248 182 12 572 -35 -663 -307 -1533 -312 380 -41 844 324 136
2530 136 -141 -954 441 -1117 866 -235 -784 -206 -1092 -551 -186 -434 879 15 626 470 17 -883
2548 -883 -61 -743 -490 -47 -1144 638 -241 400 262 -650 437 -119 -199 628 -426 508 396 -307 -106
2567 -106 3 -1057 -162 -346 890 733 -395 303 -597 538 -433 500 -125 -27 702 934 -540 50 894
2586 894 906 383 478 361 417 -679 -352 228 323 -130 -310 15 141 890 -524 92 -166 -270 -372 -1001 -886
2607 -886 498 22 -344 -129 -598 -227 309 -192 -191 -136 -850 663 -751 -646 406 434 247 842 273 -124
2627 -124 120 -211 -73 -493 -1053 459 -251 10 625 903 652 -801 224 -180 820 986 -491 -163
2645 -163 370 456 988 82 141 291 191 -203 153 -11 -77 1322 -449 -39 889 -658 -22 -166 -716 -215
2665 -215 663 -550 378 -208 -216 -380 -642 369 583 312 15 -445 -405 -357 -130 1694 -1083 249 -73 869
2685 869 -262 -788 -433 -3 734 -188 255 -1182 -302 464 129 169 -56 -268 -615 -357 -431 -490 400 305 18
2706 18 -204 -53 -103 649 5 1491 1252 -965 -822 731 1013 84 -258 209 -734 -273 -436 482 -62 -291
2726 -291 1041 781 -829 -1400 -173 790 334 -819 -204 1311 891 -258 229 -223 -77 556 41 -70
2744 -70 390 92 1413 598 325 -713 1470 66 -103 -69 -163 437 1780 -219 75 -299 -946 -419 -844
2763 -844 121 1732 981 -171 86 599 477 596 -261 500 776 -478 -155 291 78 -1015 187 639
2781 639 -107 -522 -537 473 1061 626 79 -772 -562 350 -555 -195 -424 91 -77 192 288 255 -110 303 -236
2802 -236 -643 981 -88 593 -432 59 -583 -1099 1448 -802 251 205 -368 78 896 -619 99 762
2820 762 -82 62 -8 387 -431 -202 -756 406 -90 -248 98 101 445 -383 -420 648 -195 -84 -92 285 618
2841 618 -402 49 272 -193 -214 701 110 494 -527 -536 -1052 -283 185 10 406 -521 -373 -526 119 -72
2861 -72 79 -171 -185 -1212 -552 434 -595 985 -430 384 -864 462 -182 431 -264 -1060 -377 -145 296
2880 296 239 768 113 -621 -806 -645 -924 1129 922 60 163 661 949 -496 627 -1026 375 -136 560
2899 560 -478 517 -347 242 454 475 407 29 -328 -480 303 754 39 818 394 351 -1083 486 299 -51
2919 -51 -260 324 363 212 -1377 -458 514 450 -843 331 -336 530 958 -614 -484 720 130 184 41 271
2939 271 311 1378 55 -301 327 -36 728 -61 438 -166 360 -622 64 1188 128 359 -388 -6 568
2958 568 -707 -85 -316 -595 -919 -1299 211 -818 485 454 -52 202 -437 469 -429 153 -271 -779 36
2977 36 -141 396 -1016 128 -1425 -279 523 408 1019 -370 1087 776 -97 -362 -195 166 173 759 1882
2996 1882 379 -101 -745 -406 -601 261 337 -1776 -130 -321 45 -86 1145 -995 -431 730 198 1081
3014 1081 166 -332 -611 527 262 381 55 438 125 -58 336 965 -605 -470 1155 -154 -798 -1024
3032 -1024 -366 363 -688 432 -591 701 -159 -222 -248 213 -270 -675 539 -322 423 -49 -46 -400 -445 299
3052 299 -241 -254 -1050 1051 892 474 -379 -683 542 -887 102 -168 102 -1085 -342 -98 580 -846 -563
3071 -563 818 651 205 519 -976 460 655 329 -385 -577 446 9 575 -147 540 549 -728 180 -891
3090 -891 346 540 218 371 -73 -103 -1110 -781 413 647 -299 -190 7 40 -130 1265 -146 -128 995
3109 995 -1115 558 1150 -381 85 228 -641 94 -892 856 467 747 820 170 166 680 1629 93 -802
3128 -802 721 466 -95 1198 112 -695 344 -1165 99 -207 -14 5 -813 466 -208 -170 -92 956
3146 956 1510 -22 61 -375 371 -111 -135 -777 443 85 462 348 -838 927 -509 -78 -795 -37 -37 325
3166 325 -866 1003 -316 190 1111 -880 386 885 648 716 431 311 205 -611 69 133 417 694 -703
3185 -703 244 446 -597 751 152 -328 -792 467 937 -100 -296 514 -691 -231 -1183 411 -150 700
3203 700 175 -252 -228 -426 654 328 -274 916 409 739 267 460 5 -161 640 71 -460 8 701 -260
3223 -260 373 672 632 -216 -303 528 1013 -728 -17 255 108 -69 355 208 457 719 664 221 -305 -412 194
3244 194 185 1003 665 1244 -1145 -701 424 -482 -202 -846 -167 129 196 1090 -48 942 -25 -623 -834 -396
3264 -396 36 -710 -28 442 523 -240 184 577 502 -453 -86 -648 277 -317 106 -62 74 103 627 300 -325
3285 -325 -320 294 -155 -561 -1179 457 593 -376 -360 -196 -248 -9 -315 116 1343 -234 -502 -104 -269 933
3305 933 -518 -155 -368 139 395 -56 -225 25 533 -862 -18 -210 -636 -247 -79 590 263 72 389
3324 389 -589 807 -599 -871 236 259 -97 -175 714 5 621 109 -1670 -571 566 -247 -190 -123 -862
3343 -862 562 -435 534 -637 -206 381 202 608 -443 336 -811 -819 -70 -22 -306 -22 -242 -829 554
3362 554 -257 65 1219 613 358 -656 555 -638 158 736 -131 279 263 -699 -452 -313 49 629 -47
3381 -47 240 1114 -65 -300 437 593 94 -537 1008 657 -251 218 -668 -852 -955 192 -96 -573 483
3400 483 -67 -239 547 -599 -1157 -390 67 58 30 505 -376 -520 330 -175 -238 -994 -495 -306 584 -507 458
3421 458 518 -96 659 71 296 283 -424 2 957 -333 599 680 84 -143 160 101 -661 11 387 538 -78
3442 -78 -141 1285 156 689 -574 739 535 346 93 -515 -1008 -964 355 29 595 -584 247 96 -457
3461 -457 859 614 -238 -35 357 -5 283 60 562 1054 327 -242 527 -528 -443 1247 -676 -380 -20
3480 -20 767 -379 625 138 247 24 -575 980 778 204 -379 593 426 -22 -254 -789 492 -395 879
3499 879 401 242 211 498 652 -699 180 -341 -739 -101 -1050 -114 541 -839 241 -121 -255 -625 139
3518 139 577 272 228 -154 -246 -40 450 -357 -54 -120 -114 838 71 360 -523 -45 -42 -227 -308 70 -297 596 741
3541 741 -1099 183 762 -267 -583 18 10 -146 291 459 201 80 1048 -148 22 -12 -99 1106 -664
3560 -664 -298 -174 311 -291 179 376 -734 -427 407 814 -93 369 -118 -600 -157 90 66 -146 553 -319
3580 -319 -1154 -131 622 -945 190 -406 822 294 32 703 440 982 281 -336 238 275 -412 904 -205
3599 -205 -273 944 -1033 291 164 -784 310 -552 452 -363 -66 -812 -513 185 260 -28 681 -71 -41
3618 -41 815 -128 392 -98 603 474 -7 -177 -604 202 -9 -79 76 -10 320 -600 -926 -203 319 -22 1384
3639 1384 182 711 -155 1018 -241 -810 -280 -611 -595 777 -740 -6 -1224 -924 -64 272 522 -449
3657 -449 -283 -99 159 -696 454 -174 -121 239 -50 93 220 308 1065 363 -257 800 -427 -242 -69 1102
3677 1102 -119 180 656 -1046 -25 576 316 1100 -571 -446 -892 635 122 428 -127 838 1366 423
3695 423 42 696 90 -35 254 -39 1114 510 -280 201 345 -1006 0 -305 362 453 -136 919 -43
3714 -43 337 -317 380 712 -307 -183 -247 -459 -612 -1098 42 679 168 55 191 -956 -793 292 332 355
3734 355 395 633 786 -138 -955 -130 -1165 439 -1158 172 -134 -143 -615 61 -198 -1157 610 -144 16
3753 16 -38 -371 586 1 -386 167 -80 213 -161 -358 826 -54 -316 -38 -536 215 510 -1035 845 203
3773 203 212 -1047 393 775 15 -219 -269 125 -487 396 -139 348 334 -324 -416 -178 -780 -17 260 315 137
3794 137 116 318 -273 193 582 319 -124 406 635 -329 -9 674 595 102 584 -610 319 -612 -1031 -1155
3814 -1155 538 -259 915 514 -20 171 358 -684 -212 256 86 0 306 40 -71 -398 -283 520 129
3833 129 106 -660 -1096 -332 294 -626 189 675 44 149 -1056 -139 672 405 -171 -657 886 -298 78
3852 78 706 -217 -448 -208 116 -662 539 504 184 1141 941 276 -499 -514 -191 274 -283 -23 -681 -211 -57
3873 -57 219 225 -288 -806 -226 634 328 -80 425 28 557 -220 -1021 270 -680 472 258 -68 -259 -1229
3893 -1229 392 -156 -512 -554 805 267 -203 -511 59 -407 303 -275 -574 -1856 -710 478 -42 -50 1196
3912 1196 -143 16 57 578 971 496 990 153 -642 131 -131 487 -118 -553 -39 -629 -537 17 1509 -50
3932 -50 -354 804 42 143 1267 -140 -1161 -1133 617 524 -715 774 -38 949 711 -447 -85 -467
3950 -467 -441 369 -255 913 -846 -910 7 -225 264 373 -180 -219 -1365 -146 83 90 -30 280 107 -255
3970 -255 1116 -398 892 38 1046 -261 556 -532 567 -260 1224 816 -225 -679 -1003 865 -839
3987 -839 374 -625 -441 -906 93 105 278 1063 -348 -266 32 98 776 -92 959 -127 524 159 -336 -337
4007 -337 527 246 469 271 -329 750 -243 105 678 199 -72 -625 -289 24 -551 -335 -197 -365 -283 761
4027 761 167 -112 -523 1450 -284 512 -249 -293 392 85 -1283 52 -670 -682 544 -472 61 -742 496
4046 496 -750 628 248 840 -304 745 235 -258 -1144 -316 385 -910 220 -569 -259 -783 -66 300
4064 300 -217 642 -358 997 -201 -133 -213 65 792 56 401 520 -515 -950 373 98 -442 352 -657
4083 -657 -424 -365 -979 60 -416 -589 699 573 1057 -36 502 -73 715 372 -833 7 -50 203 -346
4102 -346 -985 -583 -1327 -937 -471 -806 -447 487 378 828 -512 -142 555 75 -378 -360 967 696 43 639
4122 639 654 142 -402 -600 133 -481 174 -719 -762 -313 159 450 -333 -537 -736 705 -315 -1541 54
4141 54 -1086 -1016 -186 -844 207 -126 -1270 403 256 -39 -473 801 -593 1289 609 -658 -35 -467
4159 -467 260 468 1106 -193 383 -749 491 -452 -484 -693 -1064 488 -926 -199 -84 64 325 646 -119
4178 -119 -440 1150 -679 150 -758 365 200 346 -142 -25 126 -166 181 989 -21 -85 -1509 -187
4196 -187 -344 958 957 9 466 48 -179 483 -401 -503 -1060 -53 -424 292 -31 -368 755 -458 -1032
4215 -1032 -506 -773 73 458 -27 170 -620 83 -216 -183 -908 825 392 131 191 436 -640 111 -252 -837
4235 -837 -520 581 647 56 -327 333 -4 217 633 195 -356 -1354 -220 162 104 447 533 743 -247 -463
4255 -463 -1460 622 1060 -321 456 705 403 103 -374 511 411 -104 212 -663 -870 446 -521 277 -366
4274 -366 -1490 -533 258 -192 -254 -353 407 1338 1 -143 -546 27 673 893 690 41 171 729 -774 718
4294 718 702 -132 79 833 323 361 -523 -73 -671 254 -908 358 424 -966 -136 -224 640 85 -585 -170
4314 -170 503 -516 -1116 205 -132 317 -54 476 -712 406 -719 -678 -241 -359 445 -455 -1419 262
4332 262 -442 -247 994 -267 -277 -46 -187 -242 -912 -240 680 477 86 -539 -534 -701 -115 313 979 -858
4352 -858 240 -699 248 -1540 283 -208 -190 -161 697 -281 851 -455 -588 -225 -958 -460 222 546 -86
4371 -86 -209 -502 -700 -535 193 -450 624 -429 1078 -326 -41 158 304 1070 -1214 -268 -633 237 947
4390 947 -127 -271 464 -183 498 -525 -1273 -546 -152 -375 -127 4 -138 798 -127 104 -22 -394 -84
4409 -84 225 499 -238 -308 419 950 -470 984 -231 474 406 -67 -813 -1077 64 -187 -372 -257 -87 345
4429 345 -229 -365 -1187 761 -514 -353 -257 -443 131 347 -819 -140 373 535 741 -60 -508 -177 1124
4448 1124 -470 91 -840 -56 277 156 508 29 828 815 583 168 287 1073 -385 1238 -283 218 396
4467 396 109 621 -101 -20 34 -1264 50 80 365 -1040 -1267 147 122 465 462 55 330 -162 545 -514
4487 -514 -481 1067 -286 -56 -198 -541 626 -579 -538 -55 855 -838 -293 739 1266 -71 -715 609
4505 609 -102 -238 -176 27 -860 -108 -27 -74 464 316 46 175 284 -444 -122 -252 521 1331 440 -162 -44
4526 -44 -125 95 594 960 312 -550 323 -154 474 -187 -33 595 -274 538 -539 635 -797 798 -73
4545 -73 263 0 234 -556 -507 -122 -788 -1324 -5 1071 -276 -697 -704 -578 1219 447 -286 -595 -265 558
4565 558 -366 -37 -222 -46 -367 770 572 -824 -238 310 -143 573 -644 -898 559 -138 -594 -110 -15
4584 -15 46 1596 -80 -510 -78 588 142 -716 -424 504 252 -334 360 765 -726 -396 318 -168 -292 -56
4604 -56 -881 381 153 -857 -227 577 65 -108 997 -998 609 299 -82 -372 257 314 -1251 69
4622 69 252 -393 -1395 -401 -162 1106 1002 282 -1478 -613 99 109 828 -385 189 -989 553 -230 285
4641 285 418 -487 1278 149 1743 1501 -47 1254 -920 370 634 259 766 -755 -142 -265 -310 36
4659 36 -257 40 470 -306 -10 414 -1564 697 468 -502 -27 -452 -616 -543 -273 37 463 979 450 -685
4679 -685 -339 89 -705 -510 213 -367 509 72 -749 82 154 -154 -842 -453 971 -456 512 351 -792
4698 -792 155 -548 931 -130 22 269 35 -16 91 -43 -99 74 1242 -74 -159 -603 -121 599 -146 -52
4718 -52 -154 -299 -337 -517 610 -81 -328 192 632 655 821 -54 -364 -194 68 -634 116 293 -906 274
4738 274 462 165 168 1237 125 -690 -421 -1100 -319 265 265 -198 426 552 -571 569 -216 -372 90 119
4758 119 -221 358 428 -359 349 -147 269 -55 -591 -145 -149 226 549 -363 111 191 -432 -582 -31 379 98
4779 98 141 -346 -433 1426 589 777 -557 1228 -104 -163 127 -68 767 278 -821 -47 396 -574 98 -434
4799 -434 494 -474 -998 1163 -19 147 -200 530 -863 540 -176 -153 10 1161 1070 -1310 104 171 554
4818 554 -722 154 -104 -241 -1288 -828 -1124 654 -222 617 -544 25 -746 433 -430 92 -709 963
4836 963 -1061 456 -534 337 -185 -834 -173 -73 191 371 -913 -596 1095 -338 1147 -368 -32 -396
4854 -396 -939 344 686 563 -122 111 -450 -354 -541 -882 412 582 423 411 239 -438 -8 -1184 -926 -563
4874 -563 221 593 713 58 -19 11 -448 637 1970 437 204 -564 -13 -458 -418 -748 -37 -41 -112 318 662
4895 662 -343 -141 498 96 -283 13 -428 828 307 -227 208 -624 191 162 -348 82 -297 347 666 -414
4915 -414 -1198 971 294 42 592 660 -505 -354 -476 148 264 -934 -270 -673 171 715 448 -113 751
4934 751 502 221 -989 359 -239 305 -433 245 272 -537 836 -100 699 -736 346 581 91 669 -1467
4953 -1467 -1 -239 368 639 965 899 311 1 -17 -584 83 -810 280 -4 211 -266 -98 199 24 -413
4973 -413 -679 -400 184 678 534 -750 -554 -450 -706 -585 397 -553 1055 -172 -1022 -595 -538 500 512
4992 512 -168 -902 206 -746 -486 225 459 -380 121 -762 312 183 274 327 336 51 -67 106 -523 -562 -670
5013 -670 -62 143 433 -973 11 128 -302 -396 48 -241 335 -257 45 167 111 -347 -650 419 -258 908
5033 908 -151 388 284 280 170 109 -259 153 -505 198 517 104 452 563 217 11 723 245 625 957 -655
5054 -655 317 422 -298 177 -135 -974 609 268 561 -85 135 -270 432 540 133 -243 -1062 411 -338
5073 -338 300 -43 293 406 -416 -462 146 489 431 174 311 341 194 6 600 -951 869 99 256 -686
5093 -686 -604 -30 394 446 202 1043 121 -417 465 -356 -618 347 19 115 -894 571 -877 -395 -758 -666
5113 -666 230 344 21 72 596 -263 -167 -211 155 174 604 -433 657 742 -689 372 289 -156 -625 67 -21
5134 -21 309 -277 -110 256 178 -167 64 -861 -515 372 -282 183 593 534 306 -52 -695 43 56 212 315
5155 315 53 215 213 -483 319 -258 88 392 1013 536 618 98 -1098 -1087 -748 -399 -560 261 974 1773 108
5176 108 -268 -311 178 -76 1040 169 701 890 -127 1117 -329 -226 576 93 174 131 313 -305 47 -146
5196 -146 1003 -278 -889 409 -503 688 -6 793 705 17 -257 -992 250 178 20 -562 -860 1098 412
5215 412 402 -546 -555 499 342 213 336 818 341 461 247 -17 -804 -312 -76 -92 -269 -179 308 -310 101
5236 101 42 -401 -903 36 -324 -413 1234 932 232 408 569 -302 -589 557 12 -399 -125 451 411 -350
5256 -350 -599 -342 -893 82 -174 -20 -568 -195 572 107 612 -777 -109 798 -668 1212 122 -545 -709
5275 -709 395 1070 15 414 82 -729 -823 63 -213 227 -282 323 -170 -995 1060 -206 660 99 -887
5294 -887 384 -487 -354 635 -583 409 1095 -480 601 489 -823 -30 -1578 529 140 -605 363 -126
5312 -126 561 -162 413 -224 209 460 -333 -157 -607 118 -142 -621 269 414 -660 -265 -266 846 171 -1130
5332 -1130 427 -634 -566 30 -446 -674 -554 -593 900 -77 -126 35 1039 729 -806 -762 -958 -653 838
5351 838 48 -475 755 644 286 -123 80 -402 -104 -775 779 209 248 672 882 442 -532 -202 -368 710
5371 710 242 -512 130 1139 -770 667 481 -158 303 187 293 -383 -660 675 1104 -727 -476 -890
5389 -890 -40 684 259 83 -88 179 186 223 544 1064 -477 -810 341 721 -242 994 190 -538 -425 -720
5409 -720 -251 466 -443 -559 -492 269 164 -485 195 -63 -90 -756 561 -349 -367 -352 1631 39 -110 -537
5429 -537 673 -838 -317 -773 -293 776 97 -510 -553 83 806 412 863 -364 951 529 -194 -553 85
5448 85 -77 -192 328 390 431 -643 129 204 347 280 -215 -455 -143 -739 899 230 -158 958 811 2 1166
5469 1166 -952 41 -364 815 396 -151 28 -93 -1277 -98 286 980 -398 614 -258 -160 -121 92
5487 92 -348 -124 123 -81 -839 173 -1018 -213 826 155 -185 -335 1486 530 222 -196 17 90 -690
5506 -690 207 -724 -1058 -647 -908 618 -33 870 408 -647 -904 135 241 -893 -14 -366 -695 -392 -602
5525 -602 483 383 540 726 14 -1141 -515 -1263 -118 1527 40 673 -308 -1338 91 -606 -489 -361
5543 -361 -61 -313 -412 -306 558 356 -675 -516 -530 -607 -145 -663 514 60 625 867 -867 801 830 951
5563 951 -258 -56 57 705 1061 -155 50 306 -1388 1030 491 376 511 -651 442 657 552 -18
5581 -18 611 -406 78 -801 539 691 -79 350 -369 -84 -720 699 -274 -255 601 -171 -198 -855 -20 85
5601 85 -134 252 -163 -497 -237 274 -202 -272 23 35 -55 344 591 -506 542 -315 -139 543 114 -25 649
5622 649 371 -171 103 -30 583 -222 191 1710 -748 72 -440 -178 -320 108 402 -984 -830 -646 487
5641 487 -809 -387 31 1286 420 -510 329 1594 838 -255 129 -992 -155 1002 -991 38 218
5658 218 360 120 -735 482 -101 212 -48 738 -263 14 -386 765 -601 271 1402 868 -612 -571
5676 -571 -324 -50 -65 349 860 429 -718 21 532 -738 782 156 -163 348 -383 -22 10 -20 100 -30
5696 -30 164 145 281 671 338 -164 -626 -101 -48 -299 255 621 250 -480 -159 -692 600 -626 -66 -186
5716 -186 536 -300 563 -169 -1288 -617 -190 636 418 166 -164 183 423 72 130 543 326 -16 -818 -251
5736 -251 42 819 481 -666 -462 227 -1280 609 -1073 42 275 346 -515 -360 -258 -459 407 54 -773
5755 -773 196 755 -129 -737 -449 -350 -717 -634 -89 123 -1009 359 436 524 790 -200 -677 1675 154 -696
5775 -696 198 750 446 561 1030 540 -1139 349 525 402 -199 -589 -681 -900 -119 126 -393 -209 936
5794 936 106 943 1160 -489 1400 23 -273 -204 -633 -320 -101 -166 -252 -354 -435 -594 -74 738 484 -924
5814 -924 229 175 -801 645 496 -869 -527 373 105 -279 759 161 313 145 -554 168 -252 -194 387
5833 387 -189 -3 1335 -301 -200 666 -189 -115 845 -31 -252 232 82 145 -360 227 217 -391 827 289
5853 289 228 -624 -221 -39 336 1336 770 -303 1078 -416 -182 262 -282 -621 -154 983 -297 240
5871 240 -229 -679 1187 -1092 -390 -946 -133 171 662 597 128 22 -709 581 -802 311 670 -933
5889 -933 38 -328 310 41 169 -1218 -984 -930 900 -705 452 483 -402 -259 356 906 661 -490 575
5908 575 391 375 828 202 -210 -453 -822 -384 421 151 -170 -418 629 1666 -818 946 699 -292 1360
5927 1360 726 1499 1038 182 377 -121 -53 -552 -153 1615 -444 931 1048 395 542 -186 627 -1011 -76
5946 -76 -15 622 11 -404 433 -892 -342 842 -587 -332 -113 -279 265 317 293 -136 -171 -337 430 -278 677
5967 677 -285 -332 959 35 -607 276 -32 440 -7 -677 231 363 -815 -214 339 242 -1069 652 -223
5986 -223 -488 -72 297 -481 -1092 -606 1006 547 903 -245 -1157 -190 -134 396 229 -856 263 283 -865
6005 -865 -840 1056 -4 -1196 -68 -460 636 1091 133 -40 508 830 5 -350 234 -899 -226 -38
6023 -38 210 -592 300 -1427 -1423 476 137 857 275 -62 304 825 -37 465 -138 -750 -329 483 -319 -18
6043 -18 -202 388 36 904 -13 -748 -9 -79 -513 -469 -102 122 -85 507 -818 440 -61 640 -211 800
6063 800 658 223 946 1643 120 -1271 -992 430 -368 90 124 959 -907 444 895 -56 442 -55 -12
6082 -12 -175 325 -287 636 -397 -523 -599 255 76 -755 146 51 -519 -68 -349 -286 -56 588 -303 1112 -317
6103 -317 -207 156 784 2106 548 -251 -323 318 -178 257 -118 -191 -121 721 -185 157 110 -598 63 -7 450
6124 450 -984 374 591 149 679 -902 258 -455 437 334 -297 355 -341 707 616 -108 610 495 -299
6143 -299 161 -25 371 161 -18 214 651 236 142 585 -87 -810 399 -1371 -562 1238 -272 -877 -296
6162 -296 -164 -637 -538 -505 -864 18 -367 346 -399 384 -835 1180 -516 779 162 8 560 -11 518
6181 518 343 -87 -1111 -747 -804 73 -224 -680 -62 -536 18 -1116 -1629 -151 170 -253 187 1049 114
6200 114 -1132 -626 -165 -443 238 709 1364 1373 -220 306 -1321 490 -339 -182 -775 -136 1105 456 -374
6219 -374 -958 -129 -494 -235 -896 575 -832 498 -338 -1156 390 972 -1069 119 408 343 92 -705
6237 -705 770 -852 -46 -165 627 698 479 693 391 876 123 -337 -447 53 608 -437 564 366 1347
6256 1347 -498 33 -116 -769 -75 349 -475 -371 286 -762 -186 725 104 -972 -362 111 58 -66 -535
6275 -535 -463 -82 80 -127 -573 915 -611 -644 285 -971 424 144 -254 141 -1228 -466 -321 321 38
6294 38 110 -249 22 32 375 -369 -456 1228 488 -783 175 -1120 1717 -1190 -89 12 251 408 -116
6313 -116 371 561 1200 -303 -707 -171 1031 789 170 121 223 -29 464 -448 668 299 412 -296 -284 196
6333 196 246 214 335 -333 1254 -153 -58 97 -783 771 -75 -279 -612 -329 529 -245 -259 -255 151 -843 635
6354 635 158 469 -911 1103 -368 -1256 -309 59 -659 -212 -814 -143 207 1111 660 -774 -295 693 -169
6373 -169 97 772 410 -109 356 339 -118 86 255 -143 -388 588 -742 201 -358 -479 519 -12 1026 503
6393 503 -208 -276 768 -1405 -259 -225 -203 1212 116 -172 -161 532 -306 -1 63 -669 1352 418 -34 4
6413 4 -778 19 -111 739 -24 394 -81 75 -603 161 188 -221 687 -95 -198 -351 131 171 -291 372 -83
6434 -83 15 -480 -1242 497 394 -13 -548 -245 -133 226 -747 768 26 -613 -56 68 -74 -537 718 73
6454 73 -1014 -127 435 1155 -468 43 625 392 -204 135 -250 481 77 305 551 541 -78 -475 132 -1093
6474 -1093 756 -371 180 -1091 945 -590 310 -921 164 715 301 895 878 46 108 -637 -1038 -663
6492 -663 352 314 -173 -94 -96 -302 -35 254 335 -182 -38 -295 362 162 656 520 618 731 509 -420 -260 1530
6514 1530 214 675 -779 -986 -995 -468 659 -195 652 685 -478 11 -562 -822 -147 -411 26 260 773
6533 773 -354 -659 114 267 39 -180 -182 -320 224 447 -215 -140 390 -675 -178 -470 -974 422 93 -147
6553 -147 3 894 226 -211 -619 322 206 -318 -735 -482 -391 829 516 -530 438 -574 -37 195 287 -27
6573 -27 -989 -616 437 -478 -151 -58 749 262 -506 453 650 539 -1078 -129 7 961 95 945 237 -216
6593 -216 159 -388 387 -167 -282 -75 91 -345 480 386 21 91 -331 1233 114 489 -108 -173 -471 627
6613 627 -170 995 -119 367 -694 885 8 -806 -862 100 38 -301 160 -445 164 -620 -136 893 476
6632 476 227 -1046 -484 127 307 866 -335 -107 189 -1331 -408 -1090 -278 -817 88 770 448 894 524
6651 524 593 -1336 -299 -376 -336 -323 -40 -482 31 -210 232 180 -166 99 -451 207 477 -340 -1055 -330 -2185
6672 -2185 -910 919 566 689 -384 -377 -383 633 -186 -543 -662 -231 356 -389 -412 -83 -493 -458 340 869
6692 869 -461 702 51 -156 -506 728 647 -775 550 -748 951 79 -56 69 -69 -402 420 -596
6710 -596 67 -1110 469 277 -253 -965 19 -338 -699 576 -229 985 910 -496 413 -459 -671 -475 -549
6729 -549 475 95 16 -370 -52 42 678 -404 -699 -513 363 -155 -145 -337 546 -904 -767 -228 -248 -117
6749 -117 596 17 -426 72 -239 254 -1429 349 595 -38 -517 -344 783 516 -332 -659 -908 -483 -761
6768 -761 -557 538 -517 716 -83 29 -790 -868 -329 137 194 389 171 -162 368 -167 -617 734 296
6787 296 -1209 422 -562 -90 708 449 537 -737 1224 1438 -1559 -659 -580 -705 -269 -41 547 478 -699
6806 -699 2 -407 45 64 245 613 226 -48 -61 1223 1102 754 -364 39 -840 -864 -46 -114 -315 -3 -985
6827 -985 -487 -1315 -117 5 -15 -23 -434 -63 -34 -309 318 -5 -401 1651 899 54 675 464 -1185 146
6847 146 520 -5 -271 1008 -435 -517 -934 -639 381 -460 -37 173 -511 279 -435 553 -441 668 -488
6866 -488 0 77 -258 409 1036 453 -464 -112 1355 779 -347 641 -477 -474 -310 -121 176 -449 103 72
6886 72 -231 -810 -98 -324 -23 218 -458 520 -1000 502 1000 108 1282 -599 366 1786 -232 -507
6904 -507 35 881 259 1156 -334 -119 -346 573 -571 -787 -194 -64 -576 -98 -606 569 -65 479 6
6923 6 -381 -379 743 -796 -1534 113 553 322 387 820 186 -409 -1706 126 -178 -348 -78 33 199 -1857
6943 -1857 -173 525 -129 -676 225 -1009 993 109 1368 298 -616 687 564 1044 -190 531 -568
6960 -568 823 -381 -756 525 980 788 -251 201 480 -378 -551 473 501 -533 -902 12 156 -1258
6978 -1258 -248 157 -524 -567 1117 -400 576 -207 -431 -1299 430 883 -681 -228 1197 148 570 656
6996 656 272 -394 888 285 237 -512 -225 -273 878 -169 706 -561 -352 1370 108 -200 363 -33 -50
7015 -50 -548 -542 144 -280 130 682 526 145 -565 -1112 -278 -55 471 -461 204 578 -140 -111 195 151 259 -57
7037 -57 -484 33 -267 -36 611 -309 549 -694 -745 -631 200 -299 403 -1183 -130 456 301 -74 -1194
7056 -1194 -56 -740 -122 572 34 -307 -252 119 -436 1284 729 252 488 -702 -46 -356 -553 8 -932
7075 -932 488 -756 -289 -695 612 891 1004 2 -687 262 -32 854 1211 -452 -264 -633 -6 953
7093 953 -296 277 -818 -48 71 372 -435 1191 -881 449 -17 593 -449 1075 486 -272 235 -429
7111 -429 -607 -317 626 230 -527 -777 712 51 128 771 -103 -391 -292 547 -32 281 343 -33 -806 146 90
7132 90 522 335 467 302 -276 451 -471 48 -196 245 -529 878 163 -368 239 -55 7 -1138 -39 -102
7152 -102 37 909 299 551 -638 221 -732 -294 58 646 493 122 211 904 338 -1319 -181 171 596
7171 596 120 1133 477 322 -1249 -1286 1142 -520 -325 -831 1033 -392 -456 -148 -261 -1302 -520 -35
7189 -35 122 -250 344 -241 -596 815 735 314 -248 246 448 1143 -714 -897 921 -295 45 156 496
7208 496 -501 603 -427 669 -435 689 644 -188 528 17 -98 -234 -683 205 -567 -845 -718 -166 -373
7227 -373 -1772 367 -582 -607 49 887 973 -204 -36 210 33 -211 75 15 -1156 324 -121 -35 -1287
7246 -1287 438 303 8 1182 338 -647 44 471 -341 1327 398 -806 -917 -63 464 979 421 -196
7264 -196 121 855 540 714 427 -301 781 81 -394 -457 -889 -592 -432 -388 487 91 -475 25 162 -12
7284 -12 118 -234 147 161 447 878 139 -507 -8 -177 -627 695 -42 257 -507 -111 302 -397 -171 -263 -330
7305 -330 -538 2 -812 -41 -504 -444 166 158 -809 35 -12 -308 997 24 -486 -156 386 -860 -595 -42 -604
7326 -604 53 588 530 -68 519 -753 -715 426 202 -1254 -520 723 269 -135 -991 -117 94 -202 103
7345 103 17 -45 -903 1278 205 -1029 -1285 57 -379 1198 624 80 993 172 237 -56 384 -1285 -66
7364 -66 253 337 -216 -580 -95 -35 207 274 -173 701 953 683 21 -140 205 827 914 330 113 679 1138 -256
7386 -256 95 -42 -459 -60 -148 -1146 -582 15 -18 196 525 -602 -408 271 -312 283 -460 -721 -262 39
7406 39 -75 438 -766 -312 -151 -916 96 1166 604 -627 757 -77 -645 -924 953 99 -962 -1042
7424 -1042 -428 1135 -274 -824 -274 28 683 -1471 -1181 454 265 -513 -419 -431 133 402 862 -497 -125
7443 -125 -16 659 399 -216 823 -291 -456 138 -96 607 207 -330 579 183 -395 351 792 -934 556
7462 556 -69 37 -385 -395 -409 -731 -738 746 -606 1271 -1033 288 -269 537 -444 -165 236 -50 -410 219
7482 219 1234 -575 -779 -364 -787 -706 -955 34 6 355 428 -101 322 -134 -986 -487 289 -880 905 573
7502 573 73 -1416 -175 1047 -666 136 -296 284 -856 -832 -82 456 -559 918 -278 -105 -183 -104
7520 -104 77 701 -614 526 -77 277 146 -580 586 641 -101 -664 61 47 -763 190 -511 78 115 748
7540 748 530 -852 -508 175 256 1404 613 -80 749 536 306 -275 612 217 574 2 -108 -451 1161
7559 1161 -491 -830 -295 -172 -239 -260 -131 367 -414 52 70 -294 45 42 -530 -443 -407 -612 -297 -565 600
7580 600 420 524 -1992 -1198 61 1676 -56 -441 -389 -149 -461 417 482 -153 -51 -582 329 -905 -218
7599 -218 847 10 506 -1104 -253 -248 -70 698 -514 -365 -13 -83 521 327 -403 243 -602 -939 -322 287
7619 287 -1052 -51 563 511 -880 -184 1126 -336 825 -751 963 -1121 -764 280 -1115 -1313 -542
7636 -542 -495 -360 123 896 -444 -715 -43 -724 450 -1174 248 -98 -334 -58 -813 182 -289 -75 -373
7655 -373 -963 64 209 241 -598 64 -691 -644 191 594 -929 -131 142 -492 146 -694 673 90 244 338
7675 338 -779 108 -377 610 -326 120 612 -751 -20 464 930 -597 78 953 382 248 352 -188 529
7694 529 -46 -77 -406 -506 101 532 -471 -1550 344 -371 -370 316 -168 -865 -427 -344 564 -301 498 -147
7714 -147 772 -406 -641 -4 -396 -106 -193 -10 13 -772 -207 958 743 444 -1159 2048 606 769 1269
7733 1269 61 -440 -489 -225 -193 1111 996 490 171 -127 124 -102 79 -626 256 -140 837 131 818 -375
7753 -375 1040 -1157 1013 -718 -691 294 165 665 741 -724 -210 352 -709 -195 -1333 -114 -438 -670
7771 -670 674 -281 -170 -90 -459 -607 -806 23 922 834 -704 -796 149 584 863 -302 -303 -520 -1042 106
7791 106 -826 -371 215 -1009 -523 -580 119 -229 586 339 -201 97 -156 -6 480 -179 -292 -321 -211 -294 706
7812 706 502 108 -332 -94 443 -735 -292 -487 -427 -495 -343 -258 -31 -557 502 385 -141 -472 -695 -1343
7832 -1343 497 490 111 1781 725 349 -379 67 -255 -1056 53 -79 -632 -16 -183 734 268 129 115
7851 115 1308 37 900 107 -1118 -452 -1000 -345 460 -468 -599 75 -254 -506 -224 -884 -499 147 -351
7870 -351 -2 125 157 911 817 143 -111 -379 -113 461 -994 912 290 269 71 645 -152 159 121 -154 935
7891 935 -517 279 -180 103 979 58 1241 459 504 382 204 -97 -1602 505 458 80 -213 632 -116
7910 -116 555 -597 -123 686 -98 -94 504 1507 -536 -82 -514 -464 -229 790 225 87 507 -44 -491 118
7930 118 378 420 -455 315 548 -218 1166 -291 -133 -431 -512 -359 304 490 159 162 -761 -496 54 -347 -869
7951 -869 467 158 -583 -41 -366 -58 -856 -95 -440 -698 -770 -191 -845 -62 -858 392 35 169 173 215 -384
7972 -384 -173 -595 422 102 -286 -1197 163 726 -406 26 626 -46 706 -759 -1100 172 -1019 865
7990 865 209 -346 64 -612 8 -1330 -429 360 -1644 -309 -484 75 -601 255 -447 52 129 -65 -74 -350
8010 -350 128 891 -1135 -91 -291 -242 -557 27 -274 -409 104 -176 560 -254 83 560 195 470 -568
8029 -568 -322 -708 -569 343 254 -875 -1004 112 706 571 -115 -840 -428 -426 208 947 -773 635 -365
8048 -365 13 428 -378 -40 -1267 450 830 223 -291 10 454 -15 678 -334 -846 -505 199 -356 -1124
8067 -1124 6 666 766 255 -215 -58 -298 -249 657 -657 956 -237 -127 636 800 995 262 17 -725
8086 -725 -264 -628 435 -188 22 -114 -301 -162 200 -348 503 1167 -703 211 251 447 495 -31 -385 385
8106 385 352 -101 -1560 130 -11 186 -320 501 362 382 1051 -1103 -457 -918 -458 -1478 -252 199 457
8125 457 -507 -86 111 842 -1532 -548 -536 272 -672 191 760 -1 503 258 1036 -1205 -135 556 357
8144 357 -112 169 -584 -634 -904 -486 -16 685 -785 -260 -860 -237 -220 -400 -322 39 -658 -965 84 346
8164 346 -675 -641 938 -184 -197 714 193 -31 121 -139 1011 825 495 -93 -395 -308 169 -747 717
8183 717 5 -558 -451 -289 -122 271 1198 219
8191B19
##END NTUPLES=NMR FID
##END=
