##TITLE=1H_AT-54
 CDCl3
 300 sc, 
 2.12.2022
##JCAMPDX= 6.0         $$ Bruker NMR JCAMP-DX V2.0
##DATA TYPE= NMR FID
##DATA CLASS= NTUPLES
##ORIGIN= UXNMR, Bruker Analytische Messtechnik GmbH
##OWNER= root
$$ XWIN-NMR		Version 3.5
$$ Fri Dec  2 14:19:43 2022 Russian Standard Time (UT+4h)  she@DPX200
##.OBSERVE FREQUENCY= 200.13135
##.OBSERVE NUCLEUS= ^1H
##.DELAY= (6, 6)
##.ACQUISITION MODE= SIMULTANEOUS
##.ACQUISITION SCHEME= undefined
##.AVERAGES= 300
##.DIGITISER RES= 18
##SPECTROMETER/DATA SYSTEM= spect
##.PULSE SEQUENCE= zg30
##.SOLVENT NAME= CDCl3
##.SHIFT REFERENCE= (INTERNAL, CDCl3, 0, 15.7039)
##AUDIT TRAIL= $$ (NUMBER, WHEN, WHO, WHERE, WHAT)
$$ ##TITLE= Audit trail, XWIN-NMR		Version 3.5
$$ ##JCAMPDX= 5.01
$$ ##ORIGIN= Bruker BioSpin GmbH
$$ ##OWNER= she
$$ F:/spectra/data/she/nmr/H-F/1/audita.txt
$$ ##AUDIT TRAIL=  $$ (NUMBER, WHEN, WHO, WHERE, WHAT)
(   1,<2022-12-02 14:16:04.92 +0400>,<she>,<DPX200>,
      <created by zg, POWCHK disabled, PULCHK disabled
       configuration hash MD5:
       00 E9 B6 7A A2 85 ED C7 34 08 36 98 17 FE 4E 26
       data hash MD5: 16K
       58 7A 06 77 5B B7 E6 DC A4 5F 48 75 A9 DF 04 14>)
$$ ##END=
$$ 
$$ hash MD5
$$ 45 CA 7A 3C FE A0 E8 72 32 E1 DC 41 E5 E4 65 CD
##$RELAX= 
##$RELAX= 
##$RELAX= 
##$RELAX= 
##$RELAX= 
##$RELAX= 
$$ Bruker specific parameters
$$ --------------------------
##$DU= <F:/spectra>
##$EXPNO= 1
##$NAME= <H-F>
##$PROCNO= 1
##$TYPE= <nmr>
##$USER= <she>
##$AMP= (0..31)
100 100 100 100 100 100 100 100 100 100 100 100 100 100 100 100 100 100 
100 100 100 100 100 100 100 100 100 100 100 100 100 100 
##$AQSEQ= 0
##$AQ_mod= 1
##$AUNM= <au_zg>
##$AUTOPOS= <>
##$BF1= 200.13
##$BF2= 200.13
##$BF3= 200.13
##$BF4= 200.13
##$BF5= 200.13
##$BF6= 200.13
##$BF7= 200.13
##$BF8= 200.13
##$BYTORDA= 1
##$CFDGTYP= 0
##$CFRGTYP= 5
##$CHEMSTR= <none>
##$CNST= (0..31)
1 1 145 1 1 1 1 1 1 1 1 1 1 1 1 1 1 1 1 1 1 1 1 1 1 1 1 1 1 1 1 1 
##$CPDPRG= <>
##$CPDPRG1= <>
##$CPDPRG2= <>
##$CPDPRG3= <>
##$CPDPRG4= <mlev>
##$CPDPRG5= <mlev>
##$CPDPRG6= <mlev>
##$CPDPRG7= <mlev>
##$CPDPRG8= <mlev>
##$CPDPRGB= <>
##$CPDPRGT= <>
##$D= (0..31)
0 1.2 0 0 0 0 0 0 0 0.06 0 0.03 0 0 0 0 0.0002 0 0 0 0 0 0 0 0 0 0 0 0 
0 0 0 
##$DATE= 1669976164
##$DBL= (0..7)
120 120 120 120 120 120 120 120 
##$DBP= (0..7)
150 150 150 150 150 150 150 150 
##$DBP07= 0
##$DBPNAM0= <>
##$DBPNAM1= <>
##$DBPNAM2= <>
##$DBPNAM3= <>
##$DBPNAM4= <>
##$DBPNAM5= <>
##$DBPNAM6= <>
##$DBPNAM7= <>
##$DBPOAL= (0..7)
0.5 0.5 0.5 0.5 0.5 0.5 0.5 0.5 
##$DBPOFFS= (0..7)
0 0 0 0 0 0 0 0 
##$DE= 6
##$DECBNUC= <off>
##$DECIM= 32
##$DECNUC= <off>
##$DECSTAT= 4
##$DIGMOD= 1
##$DIGTYP= 9
##$DL= (0..7)
0 120 120 120 120 120 120 120 
##$DP= (0..7)
150 150 150 150 150 150 150 150 
##$DP07= 0
##$DPNAME0= <>
##$DPNAME1= <>
##$DPNAME2= <>
##$DPNAME3= <>
##$DPNAME4= <>
##$DPNAME5= <>
##$DPNAME6= <>
##$DPNAME7= <>
##$DPOAL= (0..7)
0.5 0.5 0.5 0.5 0.5 0.5 0.5 0.5 
##$DPOFFS= (0..7)
0 0 0 0 0 0 0 0 
##$DQDMODE= 0
##$DR= 18
##$DS= 0
##$DSLIST= <SSSSSSSSSSSSSSS>
$$ [...]
##$SUBNAM2= <"">
##$SUBNAM3= <"">
##$SUBNAM4= <"">
##$SUBNAM5= <"">
##$SUBNAM6= <"">
##$SUBNAM7= <"">
##$SUBNAM8= <"">
##$SUBNAM9= <"">
##$SW= 18.05172834244
##$SWIBOX= (0..15)
0 0 2 0 0 0 0 0 0 0 0 0 0 0 0 0 
##$SW_h= 3612.71676300578
##$TD= 16384
##$TD0= 1
##$TE= 0
##$TE2= 300
##$TE3= 300
##$TEG= 300
##$TL= (0..7)
0 120 120 120 120 120 120 120 
##$TP= (0..7)
150 150 150 150 150 150 150 150 
##$TP07= 0
##$TPNAME0= <>
##$TPNAME1= <>
##$TPNAME2= <>
##$TPNAME3= <>
##$TPNAME4= <>
##$TPNAME5= <>
##$TPNAME6= <>
##$TPNAME7= <>
##$TPOAL= (0..7)
0.5 0.5 0.5 0.5 0.5 0.5 0.5 0.5 
##$TPOFFS= (0..7)
0 0 0 0 0 0 0 0 
##$TUNHIN= 0
##$TUNHOUT= 0
##$TUNXOUT= 0
##$USERA1= <user>
##$USERA2= <user>
##$USERA3= <user>
##$USERA4= <user>
##$USERA5= <user>
##$V9= 5
##$VALIST= <valist>
##$VCLIST= <CCCCCCCCCCCCCCC>
##$VD= 0
##$VDLIST= <DDDDDDDDDDDDDDD>
##$VPLIST= <PPPPPPPPPPPPPPP>
##$VTLIST= <TTTTTTTTTTTTTTT>
##$WBST= 1024
##$WBSW= 4
##$XGAIN= (0..3)
0 0 0 0 
##$XL= 0
##$YL= 0
##$YMAX_a= 13844504
##$YMIN_a= -17940452
##$ZGOPTNS= <>
##$ZL1= 120
##$ZL2= 120
##$ZL3= 120
##$ZL4= 120
##$ABSF1= 10
##$ABSF2= 0
##$ABSG= 5
##$ABSL= 3
##$ALPHA= 0
##$AQORDER= 0
##$ASSFAC= 0
##$ASSFACI= 0
##$ASSFACX= 0
##$ASSWID= 0
##$AUNMP= <proc_1d>
##$AZFE= 0.1
##$AZFW= 0.1
##$BCFW= 1
##$BC_mod= 2
##$BYTORDP= 1
##$COROFFS= 0
##$CY= 11.3945322036743
##$DATMOD= 1
##$DC= 2
##$DFILT= <>
##$DTYPP= 0
##$F1P= 2.36226072786647
##$F2P= -0.459571619588291
##$FCOR= 0.5
##$FTSIZE= 0
##$FT_mod= 4
##$GAMMA= 1
##$GB= 0.15
##$INTBC= 1
##$INTSCL= 1
##$ISEN= 128
##$LB= 0.24
##$LEV0= 0
##$LPBIN= 0
##$MAXI= 10000
##$MC2= 0
##$MEAN= 0
##$ME_mod= 0
##$MI= 1.114404
##$NCOEF= 0
##$NC_proc= 0
##$NLEV= 6
##$NOISF1= 3.799351
##$NOISF2= 2.8
##$NSP= 1
##$NTH_PI= 0
##$NZP= 0
##$OFFSET= 15.70392
##$PC= 1
##$PHC0= -18746.67
##$PHC1= 4.200714
##$PH_mod= 1
##$PKNL= yes
##$PPARMOD= 0
##$PSCAL= 0
##$PSIGN= 0
##$REVERSE= no
##$SF= 200.130013532006
##$SI= 16384
##$SIGF1= 3
##$SIGF2= 2
##$SINO= 400
##$SIOLD= 16384
##$SREGLST= <1H.CDCl3>
##$SSB= 0
##$STSI= 0
##$STSR= 0
##$SW_p= 3612.71676300578
##$SYMM= 0
##$S_DEV= 0
##$TDeff= 0
##$TDoff= 0
##$TI= <>
##$TILT= no
##$TM1= 0
##$TM2= 0
##$TOPLEV= 0
##$USERP1= <user>
##$USERP2= <user>
##$USERP3= <user>
##$USERP4= <user>
##$USERP5= <user>
##$WDW= 1
##$XDIM= 8192
##$YMAX_p= 0
##$YMIN_p= 0
$$ End of Bruker specific parameters
$$ ---------------------------------
##NTUPLES= NMR FID
##VAR_NAME=  TIME,          FID/REAL,        FID/IMAG
##SYMBOL=    X,             R,               I
##VAR_TYPE=  INDEPENDENT,   DEPENDENT,       DEPENDENT
##VAR_FORM=  AFFN,          ASDF,            ASDF
##VAR_DIM=   8192,          8192,            8192
##UNITS=     SECONDS,       ARBITRARY UNITS, ARBITRARY UNITS
##FACTOR=    0.0002768,     1,               1
##FIRST=     0,             0,               0
##LAST=      2.2672688,     0,               0
##MIN=       0,             -17940452,       0
##MAX=       2.2672688,     13844504,        0
$$ Real data points
##PAGE= N=1
##DATA TABLE= (X++(R..R)), XYDATA
$$ [...]
1143 618057 -978405 -364516 1472379 -294427 -1411715 771333 732536 -838099 2852
1152 2852 247664 -522385 523973 395477 -1208016 108733 1332308 -674014 -884148
1161 -884148 890841 190325 -527333 397076 -149985 -429402 920050 106377 -1185854
1170 -1185854 506465 1007613 -828728 -407589 714975 -185215 -186164 393393 -532622 -223993
1180 -223993 936524 -309625 -972667 684425 507568 -801638 -1542 417866 -354585
1189 -354585 169958 315387 -667908 68358 849903 -477207 -584367 721989 187922
1198 187922 -502664 238916 98399 -274763 414700 52343 -657957 344034 579695 -612563
1208 -612563 -242993 572350 -139472 -280583 259726 -186190 -170067 447130 -182415 -506862
1218 -506862 432224 248434 -524922 40701 318205 -233328 35280 196851 -315648 68294
1228 68294 445432 -306467 -271958 483688 46982 -368001 190175 134595 -207253 158351
1238 158351 70876 -301907 160660 247929 -349476 -93003 317956 -141538 -195776 189690
1248 189690 -69738 -155107 199805 -57588 -258619 206295 135709 -277780 30433 222034
1258 222034 -125424 -44064 149098 -74915 -8105 176726 -87666 -90429 204787 9330
1268 9330 -167747 109111 84873 -132142 35862 73431 -121699 6059 94559 -113039 -60673
1279 -60673 107195 -39875 -93747 54767 -375 -61847 43638 -3281 -62675 63145 37772
1290 37772 -78696 30272 85156 -42283 -15554 80597 6833 -23711 47517 16109 -19343
1301 -19343 29704 15476 -19117 17032 1239 -30029 1831 -4907 -44905 -5382 8504 -47776
1313 -47776 -27771 21755 -24234 -43212 12841 9604 -23966 5690 23580 1550 6802 12302
1325 12302 6047 23695 17901 -1160 28692 39610 -14165 -4026 46120 -2499 -36224 21617
1337 21617 16602 -44326 -17381 12449 -31287 -31890 -1723 -16945 -16921 -5741 -20430 -7295 9232
1350 9232 -26343 -65 48513 -11262 -22998 65755 28953 -46640 33325 59964 -22463 6677
1362 6677 41936 -16326 9222 32730 -47320 -8022 55693 -52137 -46423 62977 -33485 -73708
1374 -73708 73988 -6489 -119106 68790 66960 -145709 -7355 128246 -73245 -64758 96082
1385 96082 -27743 -40669 97279 -55285 -77933 162423 12964 -161130 115863 113232 -151855
1396 -151855 29299 115104 -142094 15161 169944 -161801 -97470 237240 -50663 -219887
1406 -219887 127447 57235 -156028 66676 7080 -164530 151584 90735 -297209 46768
1416 46768 287523 -196885 -142560 246615 -39403 -113393 204733 -76752 -169880 307209
1426 307209 47301 -353597 166699 269063 -249530 -37075 182482 -154147 45229 187139
1436 187139 -329650 -70639 448993 -195935 -411914 342699 142961 -347048 100935 99175
1446 99175 -243073 228795 155606 -469886 117406 514731 -338769 -270364 434182 -11720
1456 -11720 -209028 253214 -136167 -208027 502678 -34199 -627442 362474 474046 -549260
1466 -549260 -152622 424382 -183787 -92977 244100 -364495 -77487 609256 -290827 -591602
1476 -591602 555509 281501 -568211 79015 264383 -261792 218598 163674 -588282 204123
1486 204123 705647 -550735 -457734 710255 89332 -477211 214435 19136 -198703 460066
1496 460066 -113560 -693096 524305 546911 -788759 -188783 659633 -194061 -234505 266389
1506 266389 -329758 -29425 673560 -442197 -675915 804380 338957 -833367 86184
1515 86184 484716 -277049 98864 136085 -553078 335547 711328 -775924 -440128 979879
1525 979879 20220 -736029 305584 191507 -268372 373909 -128793 -681510 641197
1534 641197 548897 -1007320 -171779 915837 -248885 -479360 327324 -149383 -45917
1543 -45917 571151 -499927 -606196 975250 284090 -1067442 182709 758591 -387684
1552 -387684 -125138 243600 -390562 281342 602611 -815735 -365764 1101735 -69038
1561 -69038 -923776 394997 375332 -377621 196975 -69660 -551016 631850 430623 -1077401
1571 -1077401 -60036 1055455 -360534 -649016 460447 56329 -156769 384667 -391264
1580 -391264 -422597 923391 139475 -1067712 311466 828532 -509418 -262743 362570
1589 362570 -220892 149052 420127 -718636 -224348 1038731 -200941 -956384 503753
1598 503753 485675 -504203 23576 84512 -345801 474495 251336 -931385 108421 986246
1608 986246 -496788 -647994 616133 133342 -329045 272910 -201628 -309130 742492
1617 742492 39154 -943145 391547 774228 -610868 -307644 488712 -123692 -35455 288369
1627 288369 -508091 -113100 831459 -290866 -816525 582635 438499 -618661 -22323
1636 -22323 269537 -252431 220654 174083 -647016 135642 752236 -480566 -524901 620296
1646 620296 149449 -410397 173777 -3510 -189920 461368 -29316 -662428 392816 575394
1656 575394 -599144 -240287 532454 -90998 -201355 208253 -243558 -82054 514842 -254032
1666 -254032 -552719 502975 292485 -560184 9881 311800 -207584 67170 144791 -391357
1676 -391357 128251 510502 -405532 -338853 556571 73096 -413143 174681 117517 -180870
1686 -180870 231231 7659 -399764 274041 343399 -468112 -128123 435680 -118788 -229980
1696 -229980 190006 -90431 -101514 289497 -153597 -335127 356195 172825 -430673 37240
1706 37240 303313 -169572 -52377 152261 -161396 34254 268103 -223325 -175595 356622
1716 356622 25085 -292455 137698 127384 -155479 78958 38753 -204408 129744 171597
1726 171597 -277657 -57172 274034 -98840 -178707 141282 -6974 -96857 123617 -49900
1736 -49900 -146186 181361 64803 -226840 61803 170356 -125712 -28834 121137 -74580
1746 -74580 -437 137644 -109094 -81037 191420 -9408 -167805 103510 86601 -119581
1756 -119581 19549 60011 -90627 26822 72189 -118279 -25180 122630 -63228 -89875
1766 -89875 92420 3058 -76380 58021 7979 -73642 67198 46407 -95905 23142 97349
1777 97349 -54375 -34581 74412 -4793 -31323 42025 -8717 -28869 47377 -2076 -51743
1788 -51743 35216 20934 -56880 2287 23923 -45615 -9283 31026 -38794 -25018 37718 -14350
1800 -14350 -42264 24691 17977 -27264 7379 20893 -6708 8228 10018 -7366 15410 19722
1812 19722 -11195 9964 31514 -10290 -10266 24203 -4518 -26366 8805 3271 -31529 -7409 8681
1825 8681 -17671 -13434 4193 -10596 -6901 1466 -12392 1525 14008 -14016 -3185 31272 577
1838 577 -17932 33341 21313 -24533 14894 37128 -13480 -8569 28314 -2005 -15689 12100
1850 12100 -5737 -15091 11457 -6527 -20873 14829 -1450 -33207 7733 6015 -35298 5963
1862 5963 25201 -33980 -8372 41597 -10606 -23364 28078 7378 -12659 18148 -1856 -9236
1874 -9236 39768 -1558 -37985 40763 27940 -50977 13312 40782 -44943 660 48449 -53007
1886 -53007 -26508 71432 -33311 -72465 55199 13859 -65955 26573 10528 -60997 49721
1897 49721 26592 -105309 30349 105989 -87957 -44627 119084 -18911 -62135 86196 -12205
1908 -12205 -68544 109410 15263 -133385 78253 102129 -121833 -15004 97423 -67944
1918 -67944 -12720 75987 -109802 -33336 159440 -85619 -160530 151550 55381 -167664 40504
1929 40504 78261 -98184 55469 67362 -155667 47114 189169 -144213 -100435 199117
1939 199117 -3606 -119217 104718 -11604 -83888 164210 -18961 -229172 153366 170235
1949 170235 -245847 -53507 199940 -85072 -75125 99677 -117436 -24362 216146 -143890
1959 -143890 -211004 262966 81407 -269181 71801 144014 -131425 72310 77046 -224842
1969 -224842 109658 272745 -271355 -151643 351834 -8321 -250861 134034 42466 -113515
1979 -113515 168307 -50370 -272259 252118 202488 -393969 -37740 344093 -138040 -160656
1989 -160656 166903 -97479 -43119 266884 -186262 -269057 383576 124174 -420618 75415
1999 75415 283808 -165831 -17345 102394 -193641 128486 274505 -356882 -157445 476607
2009 476607 -43345 -385168 194087 140383 -176696 121457 -26874 -269272 284336 203170
2019 203170 -482808 -22402 459150 -178511 -264326 208597 -25355 -60738 216933 -220404
2029 -220404 -222303 470013 59031 -529979 170126 392547 -263641 -95284 180926 -145050
2039 -145050 92239 237055 -376745 -118669 533020 -105241 -476473 260320 215634 -250805
2049 -250805 50851 15397 -218251 282091 152245 -523477 45461 537547 -260967 -346850
2059 -346850 321302 62564 -155910 163360 -134432 -172184 435447 19484 -536234 224316
2069 224316 432358 -340116 -155752 258872 -90771 12920 177540 -336529 -64909 519911
2079 519911 -179288 -496532 347965 261718 -356110 -4148 130759 -153159 181809 96305
2089 96305 -433205 110864 490899 -317769 -328042 393607 81088 -236095 121239 -46143
2099 -46143 -121259 345826 -35513 -466735 270665 392242 -400919 -164078 333999 -59537
2109 -59537 -94941 129315 -211901 -28907 398739 -205667 -407414 374226 218356 -398522
2119 -398522 3804 210111 -138775 79165 86239 -320993 115849 399381 -324995 -272188
2129 -272188 422833 68002 -305376 114470 64969 -113935 204162 -31220 -334308 251602
2139 251602 288613 -395674 -112649 356413 -80097 -171605 131956 -95540 -42536 263370
2149 263370 -167233 -291299 330444 152642 -375414 23008 247343 -123106 -19194 89464
2159 89464 -172766 83119 255039 -252350 -165066 355370 18480 -280878 117027 107468
2169 107468 -118879 99274 43 -209746 175680 178575 -310092 -59844 293979 -91436
2179 -91436 -179673 126164 -18079 -64033 143808 -98873 -167611 240241 72076 -284386
2189 -284386 64408 211093 -133626 -43621 112824 -90827 28059 159080 -162938 -89822
2199 -89822 255072 -17210 -219025 115995 99025 -126192 33134 33684 -121132 89190 94031
2210 94031 -202036 -17157 203479 -93836 -137748 123857 10244 -85891 82117 -20507
2220 -20507 -98876 132192 47867 -171425 48119 149216 -96145 -50020 98274 -29335
2230 -29335 -18667 80756 -64633 -45429 131757 -18794 -129984 78614 63744 -101754 1652
2241 1652 46042 -62358 15195 47292 -88776 -8041 98888 -54641 -71174 79315 10289
2252 10289 -58084 38420 6341 -41257 59888 18183 -75250 41808 73803 -63332 -18272
2263 -18272 70976 -20331 -26941 44791 -19313 -28695 53149 -11527 -60651 38318 25412 -61801
2275 -61801 379 32763 -37750 -6210 26427 -37451 -9878 45083 -23919 -33994 44203 12901
2287 12901 -37735 20754 25104 -20891 13703 22755 -18989 11036 31059 -19257 -7952 31817
2299 31817 -5885 -21576 16703 -1424 -22018 9383 1316 -27821 3197 10341 -26472 -9727
2311 -9727 14699 -13360 -12687 12430 -3317 -7253 13908 1755 -5366 13928 10913 -8193 12167
2324 12167 16639 -6258 5559 15332 -4033 -675 11814 -4720 -6778 7019 -5287 -10652 4431
2337 4431 -7107 -16473 3648 -4904 -16924 945 2072 -16315 304 9310 -15563 -1887 16138
2350 16138 -7475 -7181 20964 2697 -9501 18076 6716 -8691 17231 9855 -16159 13012
2362 13012 19371 -20316 -4953 19002 -15332 -14242 14973 -12645 -17785 18095 -9091 -27658
2374 -27658 16971 6317 -29324 2187 12679 -19285 5703 15071 -23962 8503 33336 -22001
2386 -22001 -11965 42175 -577 -21751 27909 6497 -18696 31536 2529 -39750 29551 29557 -48317
2399 -48317 -3026 38304 -30656 -15399 28709 -33096 -17839 47398 -33176 -54073 60026 13665
2411 13665 -70624 23185 38992 -41929 17115 31235 -53353 20955 70096 -59564 -30556 91229
2423 91229 -7474 -59639 52846 9705 -42850 52833 -1410 -80219 61278 56787 -108397
2434 -108397 -10335 91497 -52052 -45484 51008 -36627 -23483 77689 -54195 -78653 110486
2445 110486 27139 -123411 36446 81629 -67082 8523 50122 -68462 33777 100401 -102732
2456 -102732 -48263 149602 -15665 -117548 72615 38090 -69540 48973 -5387 -101164
2466 -101164 91386 67410 -165923 -3260 151847 -77198 -85146 87270 -27067 -32699 93470
2477 93470 -71936 -91447 167626 25475 -186561 70122 133765 -102309 -13050 73297 -75038
2488 -75038 41923 107755 -153429 -47224 215729 -46596 -183671 116973 72191 -112965
2498 -112965 39398 10788 -109651 113673 71792 -217609 13290 216255 -114766 -134667
2508 -134667 137403 4776 -67269 88968 -63127 -89337 195780 16152 -237597 100391
2518 100391 189601 -150528 -59592 121849 -51144 9959 94400 -152139 -34552 239426
2528 239426 -80543 -223670 161689 106525 -163960 12778 48140 -93140 100002 54896
2538 54896 -227002 48574 244766 -158101 -160869 191059 28664 -108088 75463 -39481
2548 -39481 -68274 194868 -17461 -247800 147831 203842 -209837 -70917 174154 -44439
2558 -44439 -34079 82053 -130988 -22193 229802 -111284 -230635 204741 117032 -217910
2568 -217910 4885 104089 -82945 57047 46777 -197423 70048 235805 -191942 -160599
2578 -160599 244884 37085 -171640 70669 25018 -67368 140963 -19841 -214818 155685
2588 155685 186644 -237759 -70924 214888 -46414 -90723 77901 -78548 -18638 183569
2598 183569 -118845 -197489 220588 101820 -246182 11101 150685 -80944 -41 46907
2608 46907 -132839 68265 180675 -185626 -117883 247090 15175 -188521 78521 63791
2618 63791 -70612 85966 -15867 -157775 146365 134597 -234754 -41628 222119 -62290
2628 -62290 -124909 88293 -25334 -33922 119783 -95280 -138555 199049 59920 -231030 40831
2639 40831 163624 -97340 -32402 72315 -81725 37585 133594 -148869 -81626 222227
2649 222227 -7012 -187803 89126 88432 -88253 33374 12839 -103943 100154 85593 -189765
2660 -189765 -14142 190359 -77864 -124453 100462 5421 -58704 72722 -48528 -89582
2670 -89582 142961 34811 -178907 48589 142625 -91923 -45390 81882 -35406 3740
2680 3740 78174 -91776 -41358 157228 -25590 -143470 86809 75375 -95960 7956 38236
2691 38236 -64491 43896 49715 -120418 -214 131721 -70632 -91064 90085 14945 -61051
2702 -61051 41833 -10274 -49743 86024 14684 -114887 51737 99611 -83989 -31817 82262
2713 82262 -21128 -19704 50936 -44326 -25949 91334 -25116 -89987 68962 45056 -81207
2724 -81207 3225 40677 -43965 10402 30787 -65768 1308 78082 -52684 -57413 71735 10523
2736 10523 -59419 30111 19270 -33264 34423 16033 -54512 28874 55403 -52423 -19101 58511
2748 58511 -11536 -27602 31031 -12610 -20049 38632 -11421 -46607 35809 23256 -52879 -703
2760 -703 32264 -25525 -8586 18779 -23586 -1965 32471 -22592 -22937 40875 2668 -32243 20112
2773 20112 17823 -18372 14447 14732 -22669 14069 25898 -25192 -8997 31880 -9881 -21941
2785 -21941 16451 -649 -17698 11293 -3845 -22252 11504 8694 -26111 -879 17434 -15830
2797 -15830 -11179 14923 -5794 -8043 14349 -2312 -10926 16952 7775 -13813 10260 14873 -9286
2810 -9286 1528 10955 -5045 778 9301 -7989 -6093 11357 -5769 -12146 6211 1571 -12815
2823 -12815 -466 2595 -10245 -1310 5452 -9899 -3099 6521 -4556 -4306 8328 -52 -3026 9914
2837 9914 3224 -2983 9398 4168 -5817 7876 6739 -8607 5487 9926 -8067 -2367 9386
2850 9386 -6052 -5845 4793 -4177 -8500 5451 -4823 -12590 6850 -543 -16283 5911 8456
2863 8456 -11673 869 12519 -10650 328 16266 -7560 -7942 18960 2890 -10750 12177
2875 12177 9119 -9843 6784 4502 -12530 6554 11384 -18348 -4765 18136 -13454 -13739 13080
2888 13080 -6321 -13769 13022 -5318 -17517 18040 6486 -24864 9850 16840 -15338 1734
2900 1734 14116 -11393 7258 20968 -22711 -7656 35568 -5713 -24900 23743 9096 -21263
2912 -21263 13172 3636 -24849 19191 16230 -41468 301 36113 -25110 -20056 25487 -13113
2924 -13113 -15164 27734 -18708 -27468 47698 4627 -53713 26108 38615 -37149 -427 29504
2936 29504 -23260 11644 37034 -39498 -13333 61863 -16836 -49612 39983 15613 -38340 19367
2948 19367 5361 -41579 35194 23423 -71216 5790 66853 -43660 -41511 49377 -5032 -28073
2960 -28073 33261 -20216 -32134 64258 3113 -75949 39028 60882 -56086 -9150 46023
2971 46023 -27155 4599 41180 -54127 -16573 86744 -27876 -78576 59570 34826 -62868
2982 -62868 10201 17504 -41678 38557 20793 -87895 20248 91421 -67586 -54937 77711
2993 77711 -322 -43965 40343 -16393 -34346 81943 -5288 -100287 62821 78735 -86680
3004 -86680 -18341 69847 -28231 -7754 40140 -63910 -8643 103261 -53174 -98279 95816
3015 95816 42007 -99402 13263 44155 -47880 30492 24811 -94115 30271 107170 -87743
3026 -87743 -68028 109645 8239 -72947 39955 1830 -31992 74879 -12143 -106413 80833
3037 80833 90589 -118147 -28846 103106 -26505 -40803 41930 -44053 -8261 93567 -63131
3048 -63131 -97534 113791 42219 -121281 13315 65981 -47216 13439 23274 -83199 42669
3059 42669 101995 -107852 -61468 136306 3785 -101263 45960 27917 -37816 54205 -15501
3070 -15501 -90861 88629 71152 -134635 -16030 122856 -42586 -60939 52172 -25698 -15051
3081 -15051 78759 -64262 -84517 123551 34306 -140301 24772 95428 -56628 -14200 35264
3092 35264 -54648 33641 80710 -102631 -44528 144030 -12700 -114754 60141 48814 -53883
3103 -53883 30211 903 -72470 77159 57839 -130882 -6832 126646 -51061 -77261 61141
3114 61141 -522 -25714 50756 -48982 -56595 110301 12744 -129328 43615 96589 -70513
3125 -70513 -25195 52269 -33171 14171 56911 -80036 -25735 121854 -23492 -105113 65133
3136 65133 49099 -62764 10645 12294 -46794 54728 29694 -109620 11191 110775 -63495
3147 -63495 -73813 73376 9659 -43835 33859 -19829 -39970 80032 5134 -102056 47694
3158 47694 82077 -71031 -25386 61478 -20580 -4877 41765 -54450 -15250 93205 -30774
3169 -30774 -86856 68286 45424 -71627 2807 32113 -33982 20502 20614 -68192 12747 74531
3181 74531 -57641 -51302 68386 4406 -48421 27356 1676 -27843 47333 2856 -68806 41165
3193 41165 59600 -61889 -19778 59208 -11849 -21981 25701 -22091 -8256 51063 -26956 -53058
3205 -53058 53105 23953 -60785 5834 34599 -29290 3257 19808 -39633 6825 47999 -38433
3217 -38433 -32577 54652 3111 -42388 22424 12752 -18344 21372 3154 -34764 30458 31927
3229 31927 -45863 -4981 46064 -15740 -24101 25426 -6116 -15114 28219 -12692 -31158 30630
3241 30630 11743 -42914 4365 25963 -21491 -5887 14793 -17417 1672 24174 -23094 -15442
3253 -15442 36313 -697 -29404 17034 18027 -17136 5537 11187 -14675 9800 18262 -21568 -4010
3266 -4010 24849 -8863 -16175 13896 -960 -13242 9232 -6022 -15062 14019 4868 -23420 4549
3279 4549 17649 -14632 -6175 13479 -4404 -3542 9398 -5641 -3263 14858 41 -12037 11761
3292 11761 7483 -9952 5071 7532 -9447 1742 8492 -12138 -4663 13784 -5946 -12456 9103
3305 9103 1696 -12123 2874 2138 -10472 3489 2508 -10372 1506 8704 -7494 -3268 10311
3318 10311 -735 -3495 9626 2157 -5229 9405 4256 -8367 4519 6842 -6655 -265 6531
3331 6531 -3088 -3445 4932 -4712 -5886 3155 -3051 -7756 3624 -1067 -7214 4102 3180 -6878 630
3346 630 6281 -4351 -944 6103 -3095 666 5631 -914 -1432 6963 54 -2745 6440 1884 -5087
3361 -5087 3348 2366 -6013 2172 3516 -8486 -1191 6705 -6525 -7462 6228 -3748 -6372 5274
3375 5274 -3043 -5757 8302 499 -9461 8082 6416 -10728 2369 10830 -6940 1227 9910 -7929
3389 -7929 -3081 14789 -4206 -12076 12043 4523 -12529 2514 3836 -9844 4634 4018 -16296
3402 -16296 297 13692 -14036 -11014 12552 -3527 -9488 9811 -2454 -8509 15307 1670
3414 1670 -18253 12349 14942 -14801 -185 13775 -5379 1854 11414 -14217 -782 22456 -11019
3427 -11019 -18307 19706 5428 -20782 6863 5409 -16120 11158 5130 -25386 6576 25020
3439 25020 -23560 -13445 25840 -4050 -14797 16046 -6161 -10465 25097 -3819 -28467 23869
3451 23869 22364 -31479 1369 25277 -12768 -1219 16789 -21928 -1604 32085 -20572 -29423
3463 -29423 33927 8144 -33999 9439 10839 -20022 12466 5758 -35474 14547 33997 -36490
3475 -36490 -17663 42346 -4579 -25905 20605 -2204 -12585 31423 -5650 -36892 35379 28085
3487 28085 -45433 -3376 38050 -15763 -11436 18844 -22350 -2394 38155 -29419 -35412 48094
3499 48094 6943 -51671 13026 22336 -26213 8815 11233 -35635 20650 39432 -46361 -17411
3511 -17411 58651 -7849 -37144 26890 5782 -16324 28378 -9903 -40276 47632 27784 -63325
3523 -63325 1803 54008 -25270 -23785 26391 -16650 -3795 36575 -36720 -35440 60605 5750
3535 5750 -65100 18830 36236 -32057 -339 13550 -30194 21702 38225 -56407 -15117 71374
3547 71374 -11306 -53096 33662 17551 -25791 20747 -5235 -34680 44590 22209 -69920 6356
3559 6356 62125 -32812 -32684 33903 -8182 -10374 28287 -33971 -29362 63262 -2301 -70425 29481
3572 29481 46621 -40964 -6571 24652 -21866 17239 27682 -53741 -4370 72960 -25175 -53887
3584 -53887 47482 24585 -34892 14423 1869 -28895 38133 12999 -67774 16059 63275 -45044
3596 -45044 -37115 44832 -1832 -22902 23200 -22213 -19817 56504 -6638 -66279 38431 46254
3608 46254 -50369 -10601 38875 -16111 2272 24023 -39119 -1874 63290 -26143 -55334 51290
3620 51290 23627 -47565 7782 15148 -21576 22379 7777 -55551 20018 54120 -46788 -34613
3632 -34613 50102 -63 -31755 19460 -5344 -14368 39777 -8383 -50763 37767 37298 -49252
3644 -49252 -7000 43120 -13249 -7341 17775 -23927 1289 44753 -29098 -39231 48428 15402
3656 15402 -48478 7432 22591 -22111 8603 8121 -35805 15257 37125 -42715 -21976 49088
3668 49088 -2408 -34147 20092 4904 -15248 25076 -5759 -34365 34576 27106 -45117 -2694
3680 -2694 42209 -15374 -15244 20163 -10405 -3263 28328 -22152 -26476 40190 6313 -41796 10328
3693 10328 23695 -21067 314 9227 -21422 7913 23782 -30008 -13341 38040 -5580 -28732
3705 -28732 18056 10176 -14712 11994 2916 -18015 21151 14493 -30530 2360 31552 -15614
3717 -15614 -16619 18023 -2797 -7889 14063 -10098 -15759 21916 2519 -29244 9937 17163 -18290
3730 -18290 -3407 12660 -8890 1838 13413 -16427 -4327 26087 -6289 -19607 16774 9681
3742 9681 -13589 6060 5932 -10990 8754 6687 -17580 2082 19265 -13804 -12401 12581 -2648
3755 -2648 -10167 7040 -3882 -8887 12693 670 -18902 9371 11229 -13455 -2958 13638 -3528
3768 -3528 -3712 8663 -4354 -2706 12055 -2594 -9143 10502 5981 -11290 1815 7749 -5995
3781 -5995 1134 4799 -8343 100 7676 -8943 -9035 10018 -333 -9016 2077 375 -5612 4151
3795 4151 2103 -6856 3842 5989 -7623 -292 7377 -3054 -2196 7662 -1941 -2009 7092 -9 -5083
3810 -5083 6349 3674 -7489 96 4689 -3765 -1889 1885 -5355 -1192 4538 -5141 -3252 5780
3824 5780 -1123 -4538 3947 1233 -6149 961 3073 -3260 745 4501 -2093 135 6916 -237 -2123
3839 -2123 4802 474 -2069 3894 803 -2535 2903 1889 -4143 1776 3814 -5880 -1462 3444 -3075
3854 -3075 -2757 4331 -2678 -4501 2051 45 -3277 2836 179 -3255 1987 1398 -4117 804 5143
3869 5143 -1528 264 4066 -3320 -378 5744 -569 -2674 4928 1453 -4170 687 799 -4120 2322
3884 2322 442 -6262 1488 4722 -6908 -1892 6664 -3566 -3746 4871 -1729 -4241 6148 -192
3898 -192 -7770 6712 6961 -9131 -77 8149 -4211 -1933 6516 -4737 -966 8408 -3947 -7437
3912 -7437 8894 414 -9995 4504 3994 -8376 1588 1308 -11233 3782 7425 -11014 -4597 10330
3926 10330 -2748 -6464 5773 -973 -2871 7839 -2249 -8339 12183 6090 -11975 3310 13097
3939 13097 -6710 -3520 7148 -5907 203 10217 -10609 -8772 14834 -1247 -16658 6188
3951 6188 5551 -10893 3530 3484 -11950 7181 10054 -18415 -3139 20976 -8367 -12169 12279
3964 12279 2272 -6275 10689 -2785 -13219 17378 5424 -20341 3487 17230 -12353 -4980
3976 -4980 12040 -9641 -1415 13219 -15523 -9859 22628 -3272 -23247 10910 11609 -15029 1878
3989 1878 4849 -11431 8631 11423 -22184 -1246 26738 -9200 -16925 18873 4559 -9409 10643
4002 10643 -3195 -11986 19169 5996 -29610 7160 22758 -18334 -9191 15103 -7373 -3207
4014 -3207 12670 -15834 -8571 26680 -7246 -28884 16271 15501 -22314 273 9679 -11553 9498
4027 9498 12692 -25217 1310 32477 -14799 -21162 24655 6552 -15561 9617 -1283 -11402
4039 -11402 19775 3493 -32467 13218 28128 -25690 -12395 22438 -7166 -8468 9979 -13806
4051 -13806 -7303 28420 -9722 -31187 24362 19138 -26715 -748 17094 -10893 4894 10721
4063 10721 -22040 3312 32528 -20044 -22036 29940 7559 -23637 8544 6090 -13282 14613
4075 14613 698 -28674 14873 26362 -28782 -12875 29001 -5445 -14520 10168 -8066 -6951
4087 -6951 24696 -10691 -26877 26885 17460 -33074 2096 22450 -8639 -2615 10159 -15382
4099 -15382 3559 27054 -21399 -19617 32480 3426 -27509 9488 9419 -13213 11422 376 -22904
4112 -22904 14815 20804 -30313 -9566 31630 -7290 -18408 13576 -1036 -6931 18304 -9181
4124 -9181 -20378 26733 13482 -30428 3001 25466 -13188 -7860 12407 -10198 726 20495
4136 20495 -17299 -15330 30808 1914 -30047 10166 13071 -14839 1904 3458 -16426 11206
4148 11206 13367 -26097 -5051 26316 -8572 -19605 14517 3612 -8634 12114 -3128 -11210
4160 -11210 21322 7692 -25293 5489 22016 -14855 -10101 12787 -3746 -1654 12956 -13689
4172 -13689 -8150 22316 -4976 -25196 11844 12296 -16137 658 5417 -11221 5569 9425 -19333
4185 -19333 -978 22706 -9656 -15235 16636 5981 -10150 6663 2191 -8160 13293 3720
4197 3720 -18739 5775 18074 -13882 -8790 13313 -3218 -6050 8335 -6503 -6738 13913 -3311
4210 -3311 -14976 11112 10243 -13179 -46 8124 -4754 1506 4004 -11216 808 13754 -7823
4223 -7823 -9540 15092 4133 -9995 6285 3706 -4886 4657 2462 -10963 5834 10310 -11479
4236 -11479 -5195 11031 -3457 -6807 3738 -339 -4676 7303 -3249 -9361 8844 5583 -10893
4249 -10893 613 9027 -4350 -976 4438 -1934 356 7941 -5625 -4650 9074 1218 -6483 3399
4263 3399 3664 -5438 2460 2634 -6371 2063 5858 -7920 -4232 8362 -2963 -6577 3227 -138 -4166
4278 -4166 3715 775 -5510 3738 2775 -4165 506 4277 -1692 -2022 5229 -2475 -1915 4570 -1004 -1756
4294 -1756 4795 275 -4857 2885 4998 -2808 -1262 2764 -1881 -547 2747 -4626 -1809 3858 -2483
4309 -2483 -4162 1927 286 -3208 1073 -261 -2167 2898 1975 -1776 1674 4191 -1838 -208 4484
4324 4484 -637 -2139 2781 -1103 -690 4005 -698 -2217 1932 1365 -3284 -242 1925 -1988 -2382 602
4340 602 -3796 -1194 3368 -566 -2314 2469 -485 -2736 2493 2092 -2330 2109 3655 -2077 1968
4355 1968 1727 -2151 -134 2081 -299 -1367 1421 693 -3545 427 1681 -3680 -246 -710 -3845 -859
4371 -859 2688 -2842 -1764 3314 -2676 -1640 2832 300 -749 1666 -495 -975 1872 -311 -4399
4386 -4399 3037 2349 -1600 -130 2824 -1948 -596 2909 -2541 -1538 4118 -796 -4032 2455 -39
4401 -39 -4344 965 602 -4072 2159 1449 -5535 172 4285 -3402 -2580 4382 -532 -2173 3882 -282
4417 -282 -3832 5278 1180 -6207 4742 5453 -4994 -414 2411 -3014 -1231 3879 -3569 -1542 5207
4432 5207 -2839 -5103 5374 2815 -6903 1045 1124 -4259 3309 878 -7259 1073 7590 -4499 -4444
4447 -4444 6791 -12 -3760 5076 -1124 -3361 8784 917 -8176 6105 7014 -7815 -848 5948
4461 5948 -3509 -2378 3844 -7003 -2542 9589 -5358 -7534 7902 2394 -9660 2425 2384 -5663
4475 -5663 2072 2428 -7523 4314 9683 -9338 -5584 12078 -697 -5670 7703 -1424 -1703 8119
4489 8119 -1858 -10946 8278 7069 -12260 841 10011 -5425 -3144 4859 -5585 -204 10852
4502 10852 -9149 -10207 13284 3344 -11994 4032 6413 -4933 5268 3600 -8865 5781 11952
4515 11952 -12198 -5543 14624 -883 -9586 7051 862 -3186 7082 -3297 -10790 10864 6730
4528 6730 -16200 -980 11230 -6952 -5256 5668 -6122 -1436 9146 -9469 -9628 15287 2935
4541 2935 -16060 5275 8623 -6741 2831 5032 -7783 6361 10350 -13703 -2554 17566 -5340
4554 -5340 -11484 8733 2432 -6036 6828 -3996 -11836 11571 5671 -19208 1373 14893 -10032
4567 -10032 -7292 6465 -3222 -2330 7372 -8965 -7398 16694 552 -18503 8063 11237 -9041
4580 -9041 769 4862 -6262 5042 8114 -14124 -2186 18393 -5976 -12801 11674 5008 -9284
4593 -9284 2840 -1368 -7985 11565 3646 -17634 5464 17456 -11142 -7965 11536 -2104 -3158
4606 -3158 9649 -6278 -5322 15723 -1348 -16709 10999 11799 -11258 472 7268 -5272 3686
4619 3686 4842 -12155 330 14984 -8530 -12854 12000 5393 -10600 2911 2426 -6355 7477
4632 7477 710 -15379 5293 13825 -12495 -6876 13304 -1278 -6200 6051 -3585 -4077 13961
4645 13961 -2606 -13182 11882 9787 -14049 -891 10802 -4504 -378 5111 -8513 -57 12090
4658 12090 -8397 -10628 13492 1293 -11149 3074 3155 -7071 4807 1783 -10770 6680 8433
4671 8433 -11145 -3806 13824 -711 -4831 5864 -265 -1842 7339 -2232 -9723 10488 5354 -12035
4685 -12035 1094 9955 -6671 -2153 5918 -4607 1127 7545 -7929 -6856 11687 996 -11269
4698 -11269 3884 4794 -6748 1297 3000 -6441 5086 6941 -8152 -1951 11201 -3041 -7944
4711 -7944 7736 2469 -3665 4115 -1043 -4547 6130 3363 -9158 347 7287 -5473 -3077 4526
4725 4526 -2016 -216 4500 -4592 -3989 7821 -1092 -8916 4001 3910 -4094 1535 3894 -3655 2585
4740 2585 1623 -5385 209 5898 -3140 -5255 6244 1544 -3975 2637 1087 -2874 3803 1335 -8246
4755 -8246 -1042 6123 -4665 -3008 3439 -2416 -3314 1847 -1217 -486 4948 1243 -4739 3388 2615
4770 2615 -4865 1651 5904 -1201 1739 2738 -1436 403 4385 -1445 -3283 4752 -93 -3835 1441
4785 1441 519 -2552 997 1535 -5446 207 4109 -5876 -3605 3364 -256 -3083 2301 -97 -2092
4800 -2092 1984 167 -2151 2287 1958 -3147 811 2665 -674 -1181 1438 -511 -2351 2823 -2300
4815 -2300 -2047 742 323 -1828 829 2815 -2958 967 1484 -1702 -1001 1302 -1455 -455 3139 -192
4831 -192 -2589 2190 474 -2198 1524 -1303 -1175 724 2267 -1250 206 1753 -1204 395 3014
4846 3014 -1673 -2328 867 -916 -735 -495 513 -3218 1546 -372 -2291 1840 400 -364 -578 310
4862 310 -361 -1419 2213 220 -680 2695 -837 -2105 4201 1881 -522 286 2836 -1148 545 2767
4878 2767 -2502 838 2205 -3160 -1336 536 35 -2226 861 -237 -2237 474 702 -2250 1823
4893 1823 2050 -3680 448 4045 -876 -478 2835 -1439 -288 3879 93 -1441 2999 1488 -1911
4908 -1911 496 3937 -1569 -33 17 -1594 1693 3242 -4801 -1334 3288 -889 -3270 2019 584
4923 584 -2450 1090 -23 -3938 3405 2774 -6071 1696 5272 -1222 -1382 4012 -1730 -77 1687 -492
4939 -492 -2709 6171 113 -6085 3177 2210 -2950 201 1635 -2083 2342 3051 -5127 -575 6096 -1167
4955 -1167 -5451 3327 2714 -2482 1320 -896 -2131 3987 2524 -7595 268 6775 -2585 -2392 3520
4970 3520 -1515 -1581 4638 -3222 -545 7273 -492 -8752 4181 5990 -4640 -60 3129 -3494 1148
4985 1148 3840 -6458 -1584 7789 -3834 -6794 6975 2132 -4320 3470 1717 -3680 6684 2420
4999 2420 -8175 3219 9820 -4726 -3133 7780 -2544 -2825 3391 -2311 -3011 8326 -2377 -9901
5013 -9901 6372 4174 -6438 -875 3876 -3603 600 3263 -9144 -1181 9505 -5797 -7293 7965
5027 7965 2451 -8225 4328 1992 -4248 5943 2766 -8404 4249 8645 -8888 -3644 8681
5040 8681 -1097 -3444 4131 -2504 -2734 7155 -4221 -10202 8355 4254 -10460 -624 6282 -5906
5054 -5906 411 3097 -6950 2232 9606 -9818 -7779 11812 3160 -9124 4213 2350 -3867 5660
5068 5660 899 -8737 5000 8693 -10249 -2810 11220 -1753 -5439 5576 -2073 -2715 6020 -4576
5082 -4576 -7461 9866 4386 -12878 -510 8199 -5649 -1375 6113 -5299 619 6058 -7181
5095 -7181 -5959 13801 1427 -10197 4430 6049 -3730 3153 2338 -9054 5412 6796 -11820
5108 -11820 -2957 12843 -4382 -8660 6454 -111 -4810 4604 -3462 -5649 9584 3752 -12739
5121 -12739 3478 9083 -4981 -3536 4232 -1776 773 6905 -8101 -4292 13202 -2485 -10678
5134 -10678 6167 3665 -5858 1171 3017 -6436 5225 3732 -11367 -976 11105 -6467 -8887
5147 -8887 7703 -765 -5408 4205 -1597 -6699 8473 504 -12201 4134 10675 -7337 -3176 7696
5161 7696 -1011 -1038 6145 -4616 -2580 10789 -1718 -10560 7554 6293 -7940 -261 2343 -4637
5175 -4637 2419 3460 -7478 -228 11031 -4449 -8968 7595 1297 -7401 826 1311 -3822 5441
5189 5441 963 -7653 4646 7882 -6819 -3130 8319 -802 -2367 2665 -2171 -1166 7466 -1517
5203 -1517 -7473 6526 3720 -7847 -427 5119 -4000 -744 3730 -6164 2117 6473 -5482 -6313
5217 -6313 7903 2053 -7549 3204 2170 -3796 3257 -49 -4714 4629 6221 -7040 -1438 8306
5231 8306 -676 -3453 3075 1529 -898 3850 -1027 -5070 5107 3363 -7243 737 4228 -2351
5245 -2351 -3315 2653 -2018 1999 4146 -3784 -2318 5951 189 -5507 1036 3112 -3114 778 3356
5260 3356 -1824 2451 3943 -5009 -1080 6712 -2324 -3447 2374 1172 -2899 -188 -1273 -4993 3046
5275 3046 915 -4316 219 3237 -2826 -1883 2836 -976 -100 1152 -2474 -1269 3787 -842 -3761
5290 -3761 3279 2996 -2314 635 2859 274 656 1731 -1300 -1027 4171 -1635 -2070 2888 -1166 -2408
5306 -2408 835 592 -2524 1138 282 -3011 871 3952 -1929 -2359 2221 898 -1208 2023 -860 -362
5322 -362 3343 716 -3002 2709 1363 -1450 745 1597 -1506 -424 1537 -2070 -558 2225 527
5337 527 -2202 1903 -300 -2515 -450 575 -2779 1025 475 -3043 63 98 -1822 -347 1736 -401
5353 -401 -2447 2625 322 -969 -35 964 -757 -192 1571 -3257 636 1863 -2207 975 1376 -444
5369 -444 -2176 1395 -1486 -2313 2538 -117 -1145 635 1431 -3861 357 3274 -1823 1290 2034 -524
5385 -524 -550 3446 60 -1656 1908 966 -596 2434 2626 -3272 2156 2543 -2714 -443 1378 -3497
5401 -3497 -734 4536 -1719 -3280 1200 941 -485 744 -224 -1309 1236 -1932 -2849 1233 2410 -2995
5417 -2995 595 2591 -789 353 1199 -1655 -343 5094 -2128 -2565 3794 1320 -2961 1283 145
5432 145 -2122 979 328 -4196 -437 4369 -4822 -2318 3704 -531 -2977 1831 -818 -2517 4633
5447 4633 187 -4092 3129 3909 -4162 1242 4594 28 -1430 2572 -515 -466 4041 -1988 -3452 6009
5463 6009 2132 -5747 671 2581 -1681 1489 -829 -4523 1549 3560 -6089 -4174 6288 255 -5344
5478 -5344 2750 29 -2241 3744 -346 -5392 4917 4452 -4924 912 6021 -2601 -2651 2358 -2822
5493 -2822 -281 5386 -4419 -5413 5069 1634 -7643 3245 4060 -3862 466 870 -5297 3295 5880
5508 5880 -8396 -3358 8563 -2160 -5742 5147 179 -1938 3927 -194 -5461 7588 5530 -8218
5522 -8218 2172 7804 -2812 -3517 5170 -2198 -1466 6015 -4991 -5146 7581 822 -9815 1189
5536 1189 4616 -5131 -981 2200 -3048 3038 4763 -6233 -1095 9115 -3752 -6896 5307 4238
5550 4238 -3436 3023 499 -3679 7475 3529 -10526 1847 9063 -6241 -5109 4668 -1391 -2214
5564 -2214 3828 -5870 -4222 9741 -1903 -10740 4770 6751 -7211 293 4741 -4739 2585 4338
5578 4338 -8239 -265 11590 -5703 -7149 8374 3113 -7037 3495 2048 -5534 6724 2764
5591 2764 -9821 1982 9975 -8383 -5768 8101 -308 -5933 4116 -3419 -4296 9055 -1108
5604 -1108 -9857 5856 7616 -7020 -1073 7220 -2372 1479 3911 -6011 429 9021 -4194 -6953
5618 -6953 10671 4328 -6591 2584 3560 -4767 3752 1749 -9302 2545 9514 -9009 -4668 9295
5632 9295 -125 -6517 3475 -2588 -3591 7928 -1069 -10627 7642 5953 -9725 331 7679 -1986
5646 -1986 -1362 4493 -4106 -1337 7066 -4264 -6700 10163 2618 -6998 3220 3801 -2781 2734 -169
5661 -169 -6042 3932 6732 -9255 -3426 9767 -1352 -7642 3258 -280 -3714 3731 -2112 -7113
5675 -7113 5821 4723 -8143 -238 7972 -3591 -2660 4383 -2109 -903 6945 -2929 -5432 8145
5689 8145 1363 -8291 971 5053 -4174 -1383 2070 -4618 2389 4053 -9935 -3139 8666 -720
5703 -720 -8839 4137 3495 -2553 2745 413 -4340 4981 3555 -7136 -171 7540 -3700 -4523 5216
5718 5216 -1575 -2421 4031 -2838 -4635 6564 464 -7563 4419 4420 -5689 102 3508 -2236 589
5733 589 3817 -5767 -2028 6280 -2688 -5620 5057 2212 -3757 2746 1133 -2737 4408 1756 -4251
5748 -4251 1308 5553 -3540 -5207 2882 -2095 -2353 1053 -2465 -2720 3189 -458 -5389 2793 2571 -5552
5764 -5552 -938 3223 -955 -497 1846 -2413 -1787 4776 -2183 -3752 4857 2480 -4031 1117 2344
5779 2344 -1742 2157 1442 -3465 224 3301 -2675 -3784 3499 200 -2759 2188 752 -4498 1046
5794 1046 -277 -3717 1175 2314 -3489 11 2739 -218 -1019 2266 -1268 -593 2732 -1034 -1836 3312
5810 3312 2020 -2943 2290 3285 -2205 -1306 907 -1917 -1834 726 -1770 -597 719 -359 -3562 995
5826 995 1071 -2615 748 1478 -1915 519 2148 -2921 -1111 2497 -1022 -1853 3831 606 -1568 2821
5842 2821 720 -1319 1504 732 -2153 1437 2509 -1436 -576 438 -2697 -834 1059 -927 -2951
5857 -2951 1153 73 -1618 1691 742 -2257 1329 743 -1625 287 2686 -1927 666 4612 -1573
5872 -1573 -596 2796 -182 -321 3831 -544 -2043 1119 1488 -2608 -432 685 -1794 -922 681 -3354
5888 -3354 -1599 2878 -1406 -1935 1525 748 -3779 2929 1180 -3454 2226 463 -2402 -389 4568
5903 4568 -2289 -86 1555 -1917 819 2898 -686 -2086 3339 529 -3482 756 1981 -1999 -863
5918 -863 -8 -1813 482 1695 -3102 -1896 2525 -1463 -4014 931 428 -999 2749 321 -4412 2275
5934 2275 2116 -4195 283 4639 -2248 -212 2322 -1466 1101 2023 -1767 -1275 4459 330 -4959 1029
5950 1029 811 -3446 -129 -978 -3403 504 2972 -4878 -848 6424 -2634 -4855 3266 -409 -1469
5965 -1469 2640 -1091 -3952 5401 2316 -6051 1313 6104 -3392 -614 3579 -990 -587 2493 -3079
5980 -3079 -1256 4228 -1162 -6889 3099 1660 -3896 -674 1918 -1542 -78 2936 -3292 -383 7388
5995 7388 -3542 -5784 3686 1685 -2829 2196 117 -3764 4453 1314 -4487 3612 5621 -4928
6009 -4928 -3903 4794 -172 -1248 4043 -3470 -2597 7106 -405 -6328 4237 3635 -5761 -412 3245
6024 3245 -2929 1853 3376 -5246 -554 8650 -2427 -5240 6282 1543 -4260 3466 758 -4052
6038 -4052 3341 -56 -6265 2197 7679 -7378 -2610 6890 -725 -2576 2684 -2997 -2114 7492 -2116
6053 -2116 -7635 6859 3086 -8090 -629 4859 -3675 -389 2390 -6565 336 7762 -3728 -4052
6067 -4052 8699 1860 -7303 2564 2173 -3060 4108 719 -7091 3406 8233 -7604 -2953 8287
6081 8287 -2761 -5490 3379 -1189 -2435 6081 -2605 -7591 6752 3570 -9151 2047 7112 -1364
6095 -1364 -1396 4126 -4048 1070 9468 -6481 -4482 9300 -191 -8180 1556 2983 -3443 2213 98
6110 98 -6319 4565 6492 -10216 -2607 9657 -2929 -6710 2382 -198 -3165 3608 -1066 -5209
6124 -5209 7040 2436 -9142 2018 7576 -5410 -4136 4397 -2883 1170 5980 -6772 -3374 9581
6138 9581 -48 -8580 4232 4355 -4102 1486 1881 -5695 2659 3204 -7672 -2143 7914 -3121 -7420
6153 -7420 5769 -374 -3950 4468 -1095 -5190 7476 2090 -9673 1455 7441 -3199 -1598 4805
6167 4805 -1515 97 4579 -4320 -1081 7378 -1656 -7715 4278 3096 -5839 -646 2365 -3094 2015
6182 2015 4503 -7800 -679 8567 -3620 -6597 4581 2461 -3545 3532 1802 -2421 6403 1499
6196 1499 -7488 1827 6055 -4316 -3871 4277 -1491 -2825 2084 -2363 -1443 5345 -903 -7435 4794
6211 4794 5745 -6219 -2132 2162 -2811 -760 2485 -3287 826 5781 -2971 -5419 6808 3345 -5154
6226 -5154 2112 2469 -2416 2367 2146 -3809 3391 4360 -6497 -3131 4591 -1294 -3946 2226 -1437
6241 -1437 -1494 3520 -2055 -5385 3984 2497 -4991 -364 3894 -396 -1250 2551 -966 140 4161 -1900
6257 -1900 -3306 5729 3351 -4139 376 3703 -1799 989 -91 -2508 1450 2746 -3693 -774 4096
6272 4096 -1114 -4491 61 -523 -2270 490 -1845 -3646 2870 3119 -3778 -179 4235 -1698 -2963
6287 -2963 3583 -647 -558 3175 -348 -2335 4100 341 -3201 788 2705 -1199 -729 939 -2685 -743
6303 -743 1369 -2851 -2305 1948 -555 -3803 776 -280 -2359 1914 -796 -2119 745 1081 -2134 -1497
6319 -1497 3127 -700 -889 1832 37 656 2550 -1815 -596 2378 -41 -2960 1515 1548 -3715 132
6335 132 959 -2063 246 1017 -703 -651 1668 1622 -2730 2171 553 -2412 403 -32 -795 1467 2247
6352 2247 -1146 -486 2757 -728 -817 1501 -66 130 2309 228 -757 1436 -1450 -3312 552 646 -2512
6369 -2512 -631 2270 -1900 -200 1609 -1527 -1489 2032 74 -1855 -183 -349 -2706 925 1288 -2851
6385 -2851 1210 1393 -493 -6 1221 -645 885 960 -1422 -2046 2857 943 -3257 1575 1132 -2189
6401 -2189 -527 637 -315 867 2100 -2998 -829 2590 -2462 -1189 2644 431 -2288 1654 945
6416 945 -1766 1849 1644 -1881 -351 3316 -2315 -1941 2831 -893 -384 695 624 -2236 3955 240
6432 240 -2712 2543 1822 -2917 -1542 1801 -2173 672 769 -2730 382 3292 -2050 -3949 2615 1900
6448 1900 -1235 1676 1763 -183 2451 1643 -2754 848 3602 -1819 -2507 3038 -934 -1692 2020 -1698
6464 -1698 -2379 2974 -1409 -5103 2156 2366 -3354 -1749 2616 -1340 361 1051 -3698 2 2754 -2737
6480 -2737 -3690 4209 1781 -2889 2613 957 -1823 3249 1014 -5000 2167 3235 -3971 -822 3775
6495 3775 -1563 -2920 1135 -348 -1811 2824 -3729 -4685 3095 1254 -6576 -858 3091 -3180 82
6510 82 2769 -3468 345 4629 -2293 -2060 4803 1734 -3545 2214 3068 -2865 3640 -429 -6028 4100
6526 4100 3282 -6369 -2771 4498 -2693 -4460 504 -1427 -3452 3030 -2152 -5444 4401 2187 -7138
6541 -7138 57 4322 -4791 -369 2621 -2512 2168 4876 -3635 -2522 7226 631 -4515 2376 2419
6556 2419 -3343 732 -1322 -4076 3007 4575 -5991 -2782 6727 -1454 -3754 3863 -626 -1009 2891
6571 2891 -1140 -4410 4678 1633 -6454 2031 5820 -2842 -2387 2894 -883 1053 3479 -2721 -1877
6586 -1877 8244 -283 -6215 3827 3108 -2660 781 22 -3562 3299 1651 -6681 -1183 7247 -2478
6601 -2478 -5475 3875 1262 -1977 2315 -1240 -2004 5566 1236 -7432 1128 5746 -3022 -1051 4396
6616 4396 -1870 -468 4061 -3192 -1835 7032 -2141 -6507 4056 3740 -5280 -1760 1190 -3942 -134
6631 -134 1078 -7941 -149 6468 -3702 -4426 2760 2677 -2943 1815 497 -3569 3905 1796 -5408 1634
6647 1634 6218 -5362 -1816 5013 -589 -1862 2302 -1656 -213 5516 -2289 -5688 4277 2580 -4590
6662 -4590 166 4650 -3679 849 1884 -5000 1042 6321 -3252 -4736 7102 999 -3650 1912 75
6677 75 -1442 4145 1347 -4513 2827 5699 -5652 -2143 5526 -254 -3124 3424 -1281 -3243 3940
6692 3940 -1967 -5026 4351 2700 -5228 -586 5227 -2323 -1445 1688 -3592 127 4912 -1954 -2412
6707 -2412 5721 1133 -3456 1905 2510 -2740 1292 1101 -4084 2549 4132 -4563 -2558 5148 333
6722 333 -3239 1310 -127 -1681 2314 -695 -2406 5032 2367 -5078 -392 3723 -1343 -1881 2780
6737 2780 -1229 1406 3285 -1130 -834 3781 627 -5636 3103 2839 -1671 1108 1596 -3749 1423 2840
6753 2840 -4069 -2029 4411 -1217 -3721 1102 -363 -1471 966 -1105 -2093 3884 2397 -5762 -53
6768 -53 3037 -2198 -2090 2220 -171 155 1898 -825 -1762 4701 1244 -4394 1932 3787 -2133 -1554
6784 -1554 2511 -1561 -794 -789 -3210 284 1725 -948 -2557 1355 26 -2200 627 1198 -3209 1066
6800 1066 470 -2452 1457 3938 -1046 -2014 3582 303 -2559 1881 -991 -1055 2191 96 -3911 1053
6816 1053 1055 -1789 -697 2681 -1693 -440 1902 -2687 -562 2415 -497 -1713 2247 281 -2006 129
6832 129 435 -882 791 603 -1043 826 2523 -2041 -808 2924 630 -1404 2412 1818 -2265 203
6848 203 1139 -2371 652 726 -2520 -1982 -423 -1811 -1020 1629 -456 -447 1335 -611 -2011 2464 917
6865 917 -3441 470 361 -287 379 1765 -1218 -448 2528 -672 -276 2736 -615 -2027 854 -1052
6881 -1052 -2931 -91 802 -1976 431 2035 -2216 -185 926 -2324 -283 1130 -192 -1255 2454
6896 2454 -38 -1510 96 294 -762 1965 1540 -1964 2186 1832 -838 1960 1615 -430 972 758
6912 758 -22 -367 1564 880 -1896 1487 517 -3311 -163 -206 -2392 -610 701 -2446 -165 1205 -1426
6929 -1426 -2438 2062 728 -1428 2377 995 -255 2252 1797 -1001 1063 1918 -3644 -1163 2166
6944 2166 884 -1786 2612 -1723 -637 3373 -739 -3432 1359 1914 -2926 482 1548 -1692 -2
6959 -2 495 -323 1535 1034 -1039 -403 4549 542 -1954 1462 1279 -292 1279 1420 -2920 1749 2862
6976 2862 -2040 -2983 4624 -1509 -3349 1023 -640 -3007 829 -315 -2465 1106 1387 -4422 -196
6991 -196 3474 -1576 372 1813 -2842 1511 3667 -2633 -1494 4401 -595 -3009 1138 2831 -2304
7006 -2304 2304 742 -2940 3140 1960 -4821 -397 3393 -2836 -2978 1399 -516 -1852 1434 -2052
7021 -2052 -2573 4216 165 -3742 1970 4250 -2629 -1332 3029 -484 1784 2113 -3313 -485 4020
7036 4020 -1182 -5332 1806 1869 -2314 1297 -111 -3154 1008 986 -4003 816 5593 -1694 -2472 3521
7052 3521 861 -2268 1366 -1107 -2174 4552 213 -4340 1815 5629 -3067 -1309 3125 -1262 890
7067 890 3252 -2130 -2784 5268 -1404 -3889 3374 1135 -3112 565 1878 -2191 -33 2803 -5926
7082 -5926 -1121 4446 -2242 -2812 3212 1496 -2760 1824 -471 -2052 3305 814 -4572 2274 4539
7097 4539 -3584 -209 3968 -80 -1287 2663 -1232 -1246 5552 -1402 -4651 4965 2675 -4970 -130
7112 -130 2706 -3623 1262 -918 -3212 632 5472 -2928 -4285 5447 1248 -2307 1798 539 -816
7127 -816 3879 448 -5072 3043 3254 -4192 -1616 3699 -492 -2925 1551 -1084 -1115 3668 -2774 -4447
7143 -4447 3590 2668 -5390 -356 2406 -3578 1118 939 -2860 -1336 2638 -3365 -1680 3670 1038
7158 1038 -3410 2469 2680 -1108 1801 1315 -2464 2435 2978 -2769 -1397 3811 -2642 -1249 2366 -1521
7174 -1521 -1326 2138 -857 -3353 2656 2150 -6109 -933 2610 -1925 -705 1645 -446 -558 3737 -2012
7190 -2012 -1830 5392 1572 -3906 2876 2851 -1970 131 356 -1316 1408 3107 -3549 -26 3884 -2239
7206 -2239 -4491 2006 718 -1384 1915 38 -1775 2623 2080 -4013 921 3320 -2282 -2053 1610
7221 1610 -263 -917 2160 81 -369 5035 -194 -4023 2290 2627 -1600 -266 1354 -624 2554 228
7237 228 -3019 37 2118 -701 -4031 1741 -762 -1048 1226 -1609 -1445 3250 1266 -3713 718 4540
7253 4540 -1182 -2147 793 -571 -300 1831 802 418 3245 -202 -3109 935 539 -2011 -143 811
7269 811 -1841 -866 760 -2081 595 3292 -597 -3522 2630 2700 -3223 -348 1146 741 610 1071 -2054
7286 -2054 983 4071 -1092 -1417 1362 960 -1084 -411 524 -691 1116 831 -2228 2434 1915 -2689
7302 -2689 -1528 985 81 -1208 162 -1606 -1797 593 -1078 -1507 1098 1214 -3123 457 241 -853
7318 -853 1546 1522 33 916 1801 -1205 -625 2034 -216 -164 1246 -1488 -2802 3085 -163 -1884 1012
7335 1012 -133 -886 -1212 545 -663 -1663 1056 -606 -1907 -36 -1666 -771 1869 750 -153 1606
7351 1606 1309 671 1647 738 408 -139 1349 -1133 -44 1255 619 -623 695 -305 -1417 214 -645
7368 -645 -2163 -211 1191 -2347 -90 1165 -1502 -1153 2008 -394 -2145 1217 382 -1167 2110 -903
7384 -903 -2031 1353 203 -186 939 824 -810 -951 1406 -1523 -971 -176 1010 -1849 1636 360
7400 360 -2085 813 -860 -1833 -21 695 -826 10 -237 -653 -83 1874 -1135 -3063 1746 1233 -1016
7417 -1016 550 -1411 174 110 1285 -1565 1830 2320 -2842 541 3584 -567 -1155 -972 -285 480 718
7434 718 112 -1728 1161 625 -2953 277 1106 -1623 252 1321 -475 590 3386 103 -860 2023
7450 2023 315 -1240 742 2044 -1552 874 1637 -1257 967 2423 -2622 445 2177 -591 -2325
7465 -2325 1096 -993 -2219 1131 -1167 -2944 1044 -1053 -2001 108 2108 -991 -39 775 -845 1198
7481 1198 2517 -696 373 2580 43 -2788 819 1016 -1194 61 -163 -131 1613 961 -3417 -1979
7497 -1979 3133 -990 -2930 1894 -856 178 357 822 -1314 2139 1440 -2399 841 2611 -599 -135
7513 -135 2681 -81 -2292 723 -1481 -71 2578 1244 -2688 1121 2115 -1869 -264 485 466 1218
7529 1218 727 -2882 -374 2707 -2214 -1066 2194 -254 -2871 147 -479 -2305 3914 2123 -3347
7544 -3347 528 3227 -2201 -64 3227 211 -1947 919 -1833 -103 3437 -989 -4998 2333 1663
7559 1663 -3020 -80 120 -1915 -1248 2316 -2490 1171 3247 -2604 -2793 4955 202 -1892 2332 594
7575 594 -1398 2891 1268 -2962 1882 3145 -1447 -1069 3771 -982 -2279 1370 -334 -1760 3227
7590 3227 -2299 -3974 3869 2154 -3541 -644 1650 -2098 128 -459 -1652 -185 2585 -1183 -2053
7605 -2053 2963 2969 -2061 663 1210 -1151 1181 677 -2499 2309 2687 -4030 -265 4374 257 -2171
7621 -2171 934 89 -1250 3494 -1306 -3666 3229 758 -3450 22 2321 -3188 -389 1703 -416
7636 -416 -54 2724 -2552 -1469 3266 1013 -2313 2306 2414 -1169 2286 1918 -2623 2064 1955 -3919
7652 -3919 -281 2664 -1048 -3746 283 -1967 -1739 417 -1031 -2447 3737 1609 -4688 637 2969
7667 2969 -2366 -2691 1802 -1207 -381 1598 -2225 -1965 3303 850 -2734 2010 3469 -1360 -646 1523
7683 1523 -1864 2326 760 -2061 -1717 3195 -1287 -2503 3020 -539 -1707 1362 29 -774 1677
7698 1677 -257 -3001 875 4218 -2504 -2184 2104 54 1109 1740 -2108 180 2739 -1265 -2625
7713 -2625 3850 2974 -2042 579 -1204 -1295 92 1344 -2750 1019 1696 -1533 -2073 1915 145 -758
7729 -758 482 403 -1827 513 730 -1892 591 3563 -1886 -1061 2899 -885 -139 2085 156 -2185
7745 -2185 2787 -854 -3994 2175 1972 -1929 -828 2675 9 -346 1051 331 412 3240 -1571 -1676
7761 -1676 1546 901 -1273 -360 1373 4 616 1315 -1106 1035 3433 -1300 -1059 2888 53 -2193
7777 -2193 403 893 -338 2590 663 -486 913 619 -1959 -1810 1626 -724 -961 -457 -1106 -1152 3091
7794 3091 -1959 -1696 2338 1868 -2068 -629 1767 -1348 73 606 148 1162 2371 -1914 -699 2376
7810 2376 -1194 -1572 1302 217 -616 648 106 -453 1574 985 -1991 -1798 914 1244 -1344 387 -919
7827 -919 -14 -357 473 -518 1346 -994 -1010 870 1215 -1637 -302 3037 280 493 798 -1253 -175
7844 -175 1423 -593 -2890 -320 1218 -1041 -39 -138 -756 -456 446 -1339 -694 -401 -85 -281 291 -89
7862 -89 470 1649 359 -950 1269 882 879 -549 1241 -998 -26 1675 -571 1032 346 -423 -900 1777
7880 1777 -379 -1270 93 -529 -621 -1094 272 -1641 -802 1352 -946 -935 1198 -693 563 753 -186
7897 -186 151 1841 1817 -505 2077 2017 -1671 2004 677 -1244 1068 2518 -1861 -1528 1507 -484 -1953
7914 -1953 619 923 -73 -1002 -1086 -1004 1288 -341 -1425 1611 1888 -596 -414 1219 165 -517 2157
7931 2157 -200 -1469 730 -85 -1032 1309 967 -754 -44 1365 -2353 -620 -894 -1120 -439 1457 229
7948 229 -1449 393 665 -1647 1237 -352 -720 -290 1225 -2444 766 222 -1441 -675 1844 457
7964 457 -5 1263 -379 -574 1982 23 -2505 1041 794 -622 -556 489 -1154 -826 877 -1843 346
7981 346 1322 -2970 -2100 643 127 -1248 465 181 -813 1878 -95 -1382 740 3225 -1005 -68 1643
7998 1643 1673 367 2493 -680 386 3158 -224 -2156 1948 906 -4296 -181 708 -1922 -278 892
8014 892 -1110 -268 1123 -900 -2589 1772 573 -2484 839 -364 -1551 -139 864 -248 1379
8029 1379 1404 -1248 -1822 3147 1277 127 675 -394 -717 977 301 -2309 1494 616 -2579 -374 1571
8046 1571 -2898 521 1508 -2166 325 2304 -1209 -2050 1522 933 -3546 469 240 -1195 1126 322
8062 322 -988 2555 2789 -3104 -654 1648 -895 -1264 -314 814 -413 3410 -249 -2020 939 -228
8078 -228 -3996 -545 1775 -2152 -338 1009 309 450 2016 -2135 -1567 2630 531 -1671 632 2149
8094 2149 -671 779 1632 -144 1238 85 -1799 -772 4266 -1124 -1064 197 328 -1401 -361 -760
8110 -760 -2736 936 -1038 -3807 381 2194 -2046 679 1157 52 22 2280 -2434 86 3779 -32
8126 -32 -1831 160 1991 -1693 -540 1886 -1490 786 2585 -2065 -2014 2654 -2072 -2054 2471 -518
8142 -518 -2108 -940 596 -2690 1659 310 -4014 -998 1370 -242 -798 1936 926 101 2053 -26
8158 -26 -308 2506 -798 53 1728 1868 -723 -154 673 95 873 -544 -2150 -723 3355 -2594 -2431
8175 -2431 1877 -815 -3036 -865 532 -1170 1267 2447 -2251 206 2978 -1450 -295 1766 -731
8190 -731 -1120
8191 -1120
$$ Imaginary data points
##PAGE= N=2
##DATA TABLE= (X++(I..I)), XYDATA
0 0 0 0 0 0 0 0 0 0 0 0 60 -300 300 -300 300 -418 600 -764 900 -901 1200 -1500 1800 -2100 2400 -2701
26 -2701 3166 -3665 4249 -4826 5472 -6195 7072 -7973 8953 -10061 11266 -12585 14038
39 14038 -15648 17340 -19191 21242 -23515 25952 -28579 31495 -34677 38167 -42009 46272
51 46272 -50932 56128 -62017 68642 -76113 84690 -94674 106440 -120525 137722
61 137722 -159270 187113 -224538 277587 -358280 494229 -764054 1492840 -7295431 -17940452
71 -17940452 10491459 8922209 -9629350 -560651 4532414 -3015600 5404968 2535908
79 2535908 -10557500 3565777 12437940 -7740632 -7029697 8646914 541578 -3550689
87 -3550689 4373852 -4808847 -4362809 11375420 -1662786 -15950321 5885448 11583936
95 11583936 -10359113 -6656033 7538411 280763 -2177197 546474 -5968688 705612
103 705612 8725705 -6515168 -8410497 9836345 4263597 -7979586 2027176 3250125
111 3250125 -4206229 4220092 2511038 -9509367 3103283 11778003 -6924527 -8085019
119 -8085019 8568245 2855774 -5958598 545735 315596 35582 5633979 -3464475 -8256030
128 -8256030 7047061 5188450 -10322307 -1462481 8017185 -2746126 -2635665 3993877
136 3993877 -3199899 -1086293 7535427 -2925816 -7236619 6682036 4274414 -6965483
144 -6965483 -339587 4325019 -490925 1962635 756665 -4341736 4060815 6006671
152 6006671 -7144989 -3251185 8911700 77027 -6307882 3042809 1946702 -3499006
160 -3499006 1719976 -155107 -5176857 2759024 3852020 -5614293 -1711199 4811373
168 4811373 -1233492 -2319738 1566670 -1509250 395056 4452509 -2842497 -3485216 6600142
177 6600142 2364821 -6204699 1256495 5014575 -2258083 -1290916 1996553 -1424052 258116
186 258116 2317040 -3009518 -1726584 3634650 -878191 -3509560 1389276 190454 -2001121
195 -2001121 1592949 -377673 -3199508 2411831 2059947 -4783171 -1081017 3969882 -1250067
204 -1250067 -2565497 2096303 945006 -569749 1169279 -710577 -984512 2496521 253930
213 253930 -2378947 1713810 1938914 -1978735 43694 1431007 -1756905 -167549 1971369
222 1971369 -1828248 -1658687 2362359 -128552 -2745576 569798 1087423 -1255917 -315755
231 -315755 51657 -779745 737366 335025 -1559947 757900 1957305 -1150804 -696901
240 -696901 1776583 -213079 -1092260 1311539 526894 -860971 1120191 1061045 -981856
249 -981856 58271 1023825 -359906 -301498 428708 -106981 173855 254037 -933766 -294938
259 -294938 744047 -836618 -1196860 717229 224396 -1171235 62667 689271 -525153
268 -525153 -273238 544891 -50433 -199297 367652 225587 141395 353344 189981 364101
278 364101 520417 -120891 -71178 610931 5149 -578583 343021 526695 -467574 -293359
288 -293359 373113 -204965 -689550 -177868 17508 -299815 -292828 -45541 10057 -196036
298 -196036 -372420 -127180 113021 -158565 -200325 320693 334494 -143776 47595 505119
308 505119 209043 -104238 302202 476366 -5779 -115370 296175 250179 -148192 -37210
318 -37210 245015 -49371 -395428 -190784 -19720 -266788 -325618 -17708 41056 -232923
328 -232923 -264184 -44306 -68127 -223714 -86888 152156 120894 -4407 75110 217351 141121
339 141121 -17621 107991 315942 136530 -37434 277594 358876 -91662 -44139 327283
349 327283 -29626 -357633 68287 114918 -298044 -113412 88211 -203614 -146870 -7476
359 -7476 -278803 -139370 113442 -287013 -268106 214147 -99268 -279877 304138 132739
369 132739 -257409 329593 294883 -390937 148985 569100 -192969 -60717 544583 -19753
379 -19753 -146336 354630 -182998 -248198 561052 -90919 -710429 387518 283755 -834716
389 -834716 -109951 379519 -524835 -116737 339378 -667333 -179240 795124 -502143 -698551
399 -698551 888606 182223 -796574 448775 330866 -525017 660581 467181 -956100
408 -956100 493405 1191986 -991124 -522429 1283207 -103770 -651479 693507 -185361
417 -185361 -474790 1021249 -363106 -1431080 1087616 730713 -1834714 -143087 1170506
426 1170506 -909322 -372957 825761 -907545 -158143 1578311 -957704 -1366621 1870258
435 1870258 589201 -1724894 593442 1031730 -759557 579109 481201 -1398193 964502
444 964502 1760900 -2034918 -923917 2453928 -333824 -1891256 986078 262256 -980152
453 -980152 994458 -380099 -1857735 1668166 1271460 -2643645 -161637 2285942 -962326
462 -962326 -985897 1018921 -754929 10602 1861072 -1601082 -1600121 3081734 578159 -3103821
472 -3103821 930065 2093210 -1328959 -47535 790593 -1280719 1091770 1748422 -2743511
481 -2743511 -817003 3382193 -765889 -2719702 1571733 740195 -1297802 1018782 -481249
490 -481249 -1972376 2484617 1319694 -3860437 194403 3660218 -1590830 -2083179 1744551
499 1744551 -16787 -387717 1487589 -1684865 -1291825 3676350 86892 -3994350 1669205
508 1669205 2925896 -2220737 -639486 1410814 -1159668 821607 1718862 -3117054 -664826
517 -664826 4330535 -1137611 -3851617 2205289 1674287 -2163174 191682 14080 -1506854
526 -1506854 2267773 722620 -4212960 886287 4239986 -2483197 -2574137 2880096 444191
535 444191 -1276538 1275863 -1097190 -1093369 3560479 -193649 -4255251 2105264 3334199
544 3334199 -2945366 -1301284 2010864 -621157 164534 977621 -2841590 -41374 4126896
553 4126896 -1985680 -3923127 3194264 2036751 -3037456 -59268 1097697 -985704
561 -985704 1524788 402984 -3494371 1385180 3908007 -2988583 -2503800 3455881 555617
570 555617 -1965907 970022 -477628 -748795 2988327 -715374 -3930684 2756912 3211439
579 3211439 -3763456 -1289401 3034603 -532111 -898340 926913 -1741927 148030 3317959
588 3317959 -2124697 -3199746 3621790 1650900 -3579752 228688 1891135 -1136688
596 -1136688 652398 512136 -2688789 1279364 3247387 -3078014 -2225351 3732219 510945
605 510945 -2683298 779394 566892 -605647 1680805 -735390 -2668795 2640119 2234652
614 2234652 -3694833 -701897 3283583 -758189 -1543540 1072082 -729712 -156467 2125023
623 2125023 -1729947 -2339326 3060857 1099319 -3347781 304074 2090912 -1037542 -87611
632 -87611 479541 -1563019 1152386 2146244 -2705818 -1259905 3472263 -139708 -2771504
641 -2771504 1162673 1023384 -1085493 774399 -132149 -1706420 1756499 1347406 -2876478
650 -2876478 -226239 2683459 -936792 -1435527 1157220 -282448 -335343 1393456 -1208934
659 -1208934 -1454188 2527723 563613 -2856909 627464 2076557 -1245922 -620749 877575
668 877575 -651296 315935 1104540 -1620185 -595543 2299766 -388989 -1944432 1149019
677 1149019 812145 -1125648 395845 202438 -1100808 1036906 904471 -1950363 -64992
686 -64992 2059707 -759128 -1284458 1099948 256599 -566423 555911 -410341 -624781
695 -624781 1328606 47231 -1642076 715508 1164106 -1178510 -307576 887028 -535165
704 -535165 -91056 804201 -835181 -447985 1370230 -233677 -1239947 792975 642134
713 642134 -788782 107137 305876 -446830 483802 328333 -1012405 229347 1084174
722 1084174 -773452 -649508 971274 10001 -669863 472940 53652 -544601 530610
731 530610 202796 -804926 269120 647655 -570499 -222860 487299 -216175 -125612 337922
741 337922 -368634 -161734 656838 -226350 -623718 563992 332039 -615863 77681 426473
751 426473 -294191 -49766 293854 -229331 -44570 358270 -178504 -207183 304448 -26353
761 -26353 -220131 193779 -18980 -215191 240024 50920 -371645 120470 263966 -321841
771 -321841 -156750 276508 -48020 -191646 109348 37059 -73153 62331 -22927 -51740
781 -51740 121919 2987 -89373 132246 62415 -131389 79641 130341 -131474 -19043 170992
792 170992 -56136 -125878 88909 35414 -107984 -16171 30851 -28509 -27478 -45717 -34307
803 -34307 38578 -26516 -83662 55662 64407 -100192 -27433 113898 -21683 -90949 86999
814 86999 92630 -58862 2588 109276 14826 -47538 36619 53659 -9564 -12913 25280 31184
826 31184 -2608 -38448 -12033 19406 -45230 -76482 17540 21755 -74724 -37909 48668 -22344
838 -22344 -78125 4681 37089 -20332 -32721 18192 46632 1531 -38209 43502 83318 -27937
850 -27937 -23032 104099 17296 -76336 74832 76973 -85600 10959 95150 -75784 -68547 54080
862 54080 -48505 -60381 37856 -79933 -65102 102364 -88229 -169963 147733 59672 -226699
873 -226699 57829 176284 -154403 -12368 201089 -100319 -37818 251619 -77141 -167048
883 -167048 240642 54860 -206523 144518 102521 -171481 137549 72460 -317162 114843
893 114843 288640 -356681 -138586 417157 -110919 -303892 229840 -23741 -240991 237709
903 237709 -38759 -374139 320473 242260 -490813 42397 427493 -263036 -97980 323476
913 323476 -223205 -28622 501433 -296763 -379245 652732 112746 -654418 248521 372809
923 372809 -389601 75300 188140 -448764 225297 458751 -713320 -232475 805230 -272623
933 -272623 -650970 473865 90213 -395035 401886 -73424 -605513 650400 390182 -999998
943 -999998 106337 947101 -474347 -385937 580137 -181092 -116389 613984 -509823 -499010
953 -499010 1103107 67092 -1188709 482198 773469 -744555 -119957 402704 -522143
962 -522143 217964 582136 -1005247 -255414 1317707 -379542 -1097695 782268 414263
971 414263 -669485 307588 30880 -607652 860595 409374 -1388678 290867 1432093
980 1432093 -814124 -782499 942508 6869 -366664 542136 -539414 -460856 1335575
989 1335575 -160088 -1591472 837155 1105735 -1164350 -286341 751936 -449119 150133
998 150133 550258 -1186903 -93511 1668309 -742900 -1484587 1252416 685658 -1108895
1007 -1108895 184844 322578 -517881 823067 241835 -1580698 586129 1685738 -1282035
1016 -1282035 -1006323 1465866 118943 -809621 507462 -311146 -440179 1327608 -290847
1025 -290847 -1758007 1137877 1328080 -1616897 -496056 1195398 -355594 -227284 465910
1034 465910 -988394 80274 1676623 -1017699 -1548171 1728493 787451 -1640220 148430
1043 148430 818098 -516080 467230 215264 -1365165 751668 1624324 -1576750 -1015010
1052 -1015010 1840260 111525 -1245805 470952 53165 -378255 1030424 -468284 -1587204
1061 -1587204 1379292 1190239 -1977810 -398275 1655338 -372861 -652145 511044 -536956
1070 -536956 99566 1302257 -1073097 -1244363 1866748 593777 -1844522 286653 1124021
1079 1124021 -593433 106413 239082 -1037161 722157 1287812 -1678161 -799780 2016257
1088 2016257 -71717 -1568307 598129 440953 -524004 585847 -339653 -1144036 1342306
1097 1342306 864834 -1986357 -105918 1804018 -618404 -930763 733665 -175963 -94539
1106 -94539 959009 -872484 -921635 1754180 341313 -1893122 438452 1310725 -762711
1115 -762711 -266252 431007 -586443 460914 843202 -1399255 -456177 1803252 -288566
1124 -288566 -1519122 770409 636846 -703743 233786 -35116 -737579 921681 525841
1133 525841 -1573518 81571 1557564 -662284 -899109 818426 79440 -286521 551129
1142 551129 -531738 -532756 1320594 79424 -1498311 595312 1132918 -874143 -353824
1151 -353824 595380 -334895 114688 509002 -936310 -201116 1316228 -445162 -1198585
1160 -1198585 817300 519528 -794183 132954 204930 -483706 563444 322052 -1109281
1169 -1109281 220098 1179840 -693536 -706033 863523 114730 -461441 373153 -153195
1178 -153195 -337525 799978 -19424 -1013057 520433 767482 -813925 -268072 633442
1187 633442 -247974 -163080 354921 -480569 -179329 786799 -302474 -772669 634901 392862
1197 392862 -657024 58605 332156 -288636 188832 215604 -554691 167736 683122 -486184
1207 -486184 -407982 652410 54383 -439276 248183 53240 -245837 342018 -149 -522593
1217 -522593 315372 391417 -528330 -119022 429416 -184565 -171862 221850 -211008 -96039
1227 -96039 401273 -201824 -388853 417644 163248 -449155 98049 282915 -201008 44978
1237 44978 182335 -228409 65604 318432 -252823 -165380 372638 -19860 -265830 185497
1247 185497 58239 -199891 133937 39700 -266409 118921 188206 -281522 -73299 244378
1257 244378 -108129 -153364 139143 -31539 -95361 134364 -43161 -141345 167633 69712
1267 69712 -181352 76973 152641 -112174 -4810 128943 -69230 -17276 135817 -49436
1277 -49436 -73995 121452 4727 -115470 42720 35723 -78055 13490 18178 -78143 16218
1288 16218 32335 -95853 -21387 74290 -45087 -57446 63643 10745 -50785 30095 28416
1299 28416 -23188 27442 36423 -8750 20439 32072 -6733 17714 29933 -12605 9884 34835
1311 34835 -20936 -20857 31459 -6285 -43744 6059 9655 -43881 -27728 -70 -27004 -28146 -11226
1324 -11226 -14375 -4553 426 -18985 4151 28293 -11149 -4940 49385 21746 -23206 31898 44460
1337 44460 -19376 -2283 45065 3433 -15111 19513 1454 -18960 -4007 -15696 -18745 -978
1349 -978 -28403 -27092 17117 -27668 -59353 25919 18197 -63738 1388 56224 -28459 -21547 43901
1362 43901 -1526 -4257 43301 -12324 -6807 72728 -5695 -43771 71792 18744 -68508 59407
1374 59407 39747 -104269 32488 93519 -123591 -55007 133556 -49134 -113386 82150 8712
1385 8712 -84577 62535 -12082 -104144 109769 49052 -175909 53975 152436 -136457 -35044
1396 -35044 157358 -82650 -46609 178442 -81458 -132827 224152 39862 -230800 107298
1406 107298 151888 -155527 6700 88492 -136969 65487 134677 -247686 -43252 296295
1416 296295 -146037 -246266 222693 37557 -211355 126776 19904 -207612 204043 125442
1426 125442 -345728 71534 346848 -209505 -140908 260047 -49371 -63908 209949 -182308
1436 -182308 -139970 418015 -57516 -457030 286160 291265 -383105 -25872 230055 -216252
1446 -216252 45664 210220 -388756 -45722 511662 -252089 -425078 412379 128031 -349997
1456 -349997 163588 59365 -247844 351866 125229 -581579 220770 601943 -469099 -310245
1466 -310245 535285 -24868 -275361 251809 -142283 -196151 510748 -111782 -654378 432379
1476 432379 444060 -620271 -110777 436657 -219054 -43745 241771 -434935 -4406 686911
1486 686911 -394170 -615365 675057 283166 -627178 100686 278896 -236932 246591
1495 246591 80051 -609889 334424 676198 -681556 -374841 776777 -22812 -478830
1504 -478830 270582 -56943 -193745 532702 -207737 -737542 638891 519422 -885718
1513 -885718 -130840 690668 -230369 -207505 245857 -361167 75702 685472 -569104 -608007
1523 -608007 939348 247036 -894972 191184 502979 -320684 124753 119380 -563285 397895
1533 397895 672138 -858909 -376643 1018722 -64133 -742032 328873 152901 -245913
1542 -245913 387738 -227405 -658490 753504 462408 -1094497 -57719 954300 -333072
1551 -333072 -457939 368132 -155435 -4573 559268 -552423 -513642 1029229 176065 -1051150
1561 -1051150 283376 693049 -428807 -62211 202322 -418300 352874 540409 -902799
1570 -902799 -280182 1109086 -186843 -910055 445660 338527 -372756 187098 -116680
1579 -116680 -468930 673535 307804 -1056273 88736 999250 -447711 -553597 498049
1588 498049 6306 -122014 383569 -434131 -349050 939571 34407 -1040348 393233
1597 393233 758010 -551719 -220364 331909 -230691 185207 339646 -749337 -105623
1606 -105623 999255 -335531 -872683 590198 383682 -528916 95468 75214 -343125
1615 -343125 493457 205115 -888968 186848 914504 -530234 -548350 608912 79922
1624 79922 -279214 261471 -232121 -226710 720506 -71482 -865330 468891 657714 -644823
1634 -644823 -224984 474902 -157690 -38535 243591 -472823 -50305 732480 -335860 -686667
1644 -686667 576934 331965 -562710 32210 214626 -222445 247930 109143 -594749 220954
1654 220954 665098 -513359 -409336 618575 74034 -380192 195069 -15474 -166965
1663 -166965 418169 -71655 -570974 395945 440291 -575482 -148099 457526 -147109 -141393
1673 -141393 196868 -262447 -38114 474343 -286315 -460001 505823 209095 -515427 71100
1683 71100 285333 -199783 74418 125947 -329611 147795 412954 -378177 -236356 492279
1693 492279 5873 -342989 184699 72233 -169070 207340 -24327 -344550 261051 261936
1703 261936 -426004 -76673 377220 -132989 -195868 173185 -73340 -76527 231881 -132873
1713 -132873 -240121 308778 106972 -339361 74293 230197 -154411 -9583 124093 -145910
1723 -145910 52205 212411 -210119 -118564 297261 -22982 -237821 132694 83826 -137799
1733 -137799 69380 20329 -159554 111765 105298 -226618 -11557 201579 -112414 -111107 131373
1744 131373 -31019 -65352 121074 -51417 -114033 163868 42789 -185689 71198 142062
1754 142062 -110513 -23645 104839 -57916 -14405 94132 -75368 -51080 131505 -24033
1764 -24033 -117040 78432 39872 -98496 24203 36785 -80428 24554 59735 -93174 -17841
1775 -17841 98904 -48620 -73844 69318 13455 -52796 34643 20425 -31564 38705 23082
1786 23082 -47540 28168 48461 -38323 1001 50881 -21053 -16390 37926 -19120 -36373 36042
1798 36042 -797 -52107 11916 21426 -39766 -13883 16659 -14413 -11167 6860 -13471 -115
1810 -115 14581 -15137 -4366 28643 -2082 -12315 29598 14742 -16090 18834 26016 -12656
1822 -12656 1486 25177 -4475 -12673 8190 -6060 -13621 261 -10921 -9201 6759 -16256
1834 -16256 -19877 12311 -8547 -33687 10569 17214 -28719 -361 38876 -8165 -17652 31077
1846 31077 12445 -14645 18277 14868 -7085 16468 9779 -14797 16487 14124 -23450 6367
1858 6367 18535 -27292 -5154 26721 -27975 -26484 32771 -8941 -42967 16566 13036 -26524
1870 -26524 3279 4903 -18416 21316 5031 -42268 24182 37495 -44244 -1850 56188 -21550
1882 -21550 -12941 56849 -22013 -37478 70702 784 -77212 46712 44485 -67701 6363 38377
1894 38377 -54061 12985 41501 -89934 -8851 102311 -70829 -88426 105182 9183 -101282
1905 -101282 56991 26677 -85373 66264 49214 -123999 39115 131421 -99355 -52099
1915 -52099 127551 -24391 -53493 90064 -42774 -55374 149220 -22156 -173601 120351
1925 120351 105717 -179563 -15841 124132 -86580 -21634 86186 -122210 -22977 178123
1935 178123 -105125 -156581 182948 50145 -167196 68016 67071 -98293 104469 53105 -200736
1946 -200736 96855 220879 -206032 -108928 246418 -18915 -145892 107835 -26709 -80463
1956 -80463 175144 -63160 -237252 206321 148448 -292454 -11754 212736 -125857 -45039
1966 -45039 117445 -161105 7722 268802 -194206 -224986 336064 78433 -314214 93183
1976 93183 162510 -138141 76957 53246 -234605 158743 260494 -338552 -127818 390182
1986 390182 -61172 -271577 167852 23333 -129325 192840 -72627 -296561 291066 203567
1996 203567 -431625 -25746 370585 -142188 -158597 155824 -99607 2936 258877 -246367
2006 -246367 -231160 445238 64992 -448758 140865 282922 -204112 4359 98449 -213797
2016 -213797 159891 262063 -405102 -122998 497973 -92655 -387681 212431 109622 -166369
2026 -166369 133114 -82187 -253432 352420 149762 -534745 54788 483424 -239393 -249892
2036 -249892 251969 -34984 -53609 222837 -234787 -191201 491317 20326 -522980 207105
2046 207105 366562 -277576 -73810 157508 -157252 128163 205675 -427826 -72584 550630
2056 550630 -174036 -475468 308045 197140 -272526 60791 13959 -198537 294804 113869
2066 113869 -513898 108810 515776 -298600 -294495 337430 28503 -130730 168658 -171509
2076 -171509 -136477 457246 -46336 -533579 282400 396113 -381099 -131407 259138 -104260
2086 -104260 16284 144267 -333653 -12636 483601 -231989 -436990 375691 202413 -342102
2096 -342102 34515 104323 -146370 209472 62959 -428761 159968 463790 -351312 -281450
2106 -281450 403101 48510 -225245 124389 -55998 -98053 329056 -80412 -430997 304145
2116 304145 326915 -414909 -107137 318921 -96996 -76069 126947 -223361 -1849 380602
2126 380602 -234640 -361092 392775 171614 -389340 38046 198669 -133508 81766 63332
2136 63332 -287893 150600 341664 -332165 -201811 405773 14211 -275401 127792 38833
2146 38833 -105034 195440 -57742 -301967 255729 229165 -381359 -70143 319625 -97101
2156 -97101 -145364 119287 -93661 -17461 228820 -174973 -226816 321290 97647 -332708
2166 -332708 64694 208984 -129383 6966 80315 -161397 94049 218880 -245763 -120642
2176 -120642 325396 -18663 -249324 120616 77603 -114597 88014 -19506 -179172 171746
2186 171746 124063 -284600 -9494 253567 -117156 -137163 133609 -35737 -51637 137248
2196 137248 -96330 -131587 225645 46495 -243953 81995 175495 -125533 -23943 97700
2206 97700 -81218 32256 122737 -152981 -59841 213827 -45217 -183898 114695 67174
2216 67174 -125401 35033 29085 -108097 73605 75277 -168072 -4361 167098 -80912 -103326
2227 -103326 108250 9385 -63521 66435 -19912 -64522 112125 24142 -129726 62844 110152
2238 110152 -90973 -25354 84873 -35271 -16313 60708 -60329 -33683 97394 -31059
2248 -31059 -92881 65972 35484 -79256 11464 26859 -53867 24375 29519 -75841 9935
2259 9935 79457 -54010 -43759 77086 1145 -47031 42941 8735 -33457 46213 15671 -55949
2271 -55949 31396 50478 -50132 -8642 50627 -21931 -21977 31594 -23497 -26582 37298 -15552
2283 -15552 -50088 29832 17125 -50656 345 28708 -26770 -7774 21450 -19051 -5892 29637
2295 29637 -11821 -15288 35748 9055 -20112 21494 17734 -15629 12441 15141 -17832 3730
2307 3730 21182 -16882 -12161 18360 -7019 -20364 8170 -2805 -17637 3383 -1092 -18442
2319 -18442 3032 5192 -16065 -1399 12147 -8385 -2853 13609 -1449 -3903 15435 3794
2331 3794 -3304 14411 6318 -2729 11686 7095 -5589 7177 7390 -12358 60 7234 -12629
2344 -12629 -7154 7087 -12942 -12944 9953 -6920 -17934 9569 564 -19523 5300 9068 -14088
2357 -14088 5689 12222 -13800 6035 22758 -11355 -7661 28018 -350 -12835 20442 4330
2369 4330 -13183 16737 7054 -23780 12310 17502 -28484 -4155 18552 -17334 -10440 12048 -22111
2382 -22111 -10506 25937 -20347 -28405 32595 4992 -33739 16769 16964 -23686 17968 17753 -32624
2395 -32624 19289 43515 -35991 -10443 54519 -11289 -25845 36406 -6745 -25112 43957 -9658
2407 -9658 -58965 44967 30626 -74860 -1416 50747 -42091 -18529 36686 -41393 -11851 63677
2419 63677 -44006 -55660 79799 11796 -77504 39067 40994 -49580 30068 31692 -65220 38738
2431 38738 77768 -84421 -30090 109388 -20147 -71337 57450 2461 -46181 60199 -17740
2442 -17740 -91894 81036 51960 -131425 -605 102751 -64070 -41771 61706 -46112
2452 -46112 -13327 93549 -69613 -77959 138958 23312 -136547 53383 85411 -72741 16486
2463 16486 42928 -79638 52819 94783 -134951 -38097 168734 -41713 -127757 88014 26492
2474 26492 -74074 61412 -21768 -108673 120485 58728 -192389 20564 166610 -97354
2484 -97354 -78133 98311 -35482 -19040 106055 -96844 -82179 201387 5919 -204391
2494 -204391 95008 138443 -122222 -9314 73038 -83468 52285 101144 -175355 -35991
2504 -35991 227216 -72888 -190051 133508 65231 -119448 45694 1573 -106779 132311
2514 132311 57259 -231235 41928 224359 -135945 -127340 152188 578 -58100 90019
2524 90019 -78036 -68544 213140 -15396 -239679 133180 174764 -172951 -42504 118518
2534 118518 -66357 23025 84062 -177708 -12648 246053 -112886 -219561 180042 88609
2544 88609 -165759 27938 35781 -89852 120446 33219 -235927 86065 243222 -186461
2554 -186461 -139747 210617 11281 -108826 83377 -45686 -58248 197179 -40381 -241445
2564 -241445 167443 183560 -227543 -55569 170278 -58975 -30643 70485 -141916 -293
2574 -293 225431 -140555 -214324 226390 95554 -224628 24784 104675 -83023 64571 36419
2585 36419 -188122 92183 219373 -203660 -128370 246256 11088 -157836 77806 8132
2595 8132 -56962 144171 -47123 -205070 176443 157789 -250430 -48267 206984 -61217
2605 -61217 -81770 70806 -81136 -1273 166835 -134406 -164010 226649 67316 -230194
2615 -230194 40497 134496 -84565 19181 39913 -129634 86277 164848 -193094 -90628
2625 -90628 244942 -10389 -179834 87324 50958 -72328 80174 -28597 -143272 149095
2635 149095 102305 -233119 -12769 204473 -82960 -105199 94003 -33981 -26263 118264
2645 118264 -99120 -116709 198156 39649 -215158 58932 148993 -96649 -19377 63973
2655 63973 -72892 46608 108339 -149122 -51631 204555 -33218 -165126 97870 65366
2665 65366 -90145 36222 4017 -94319 94159 64456 -175341 4046 165704 -82165
2675 -82165 -99277 95663 2035 -45866 66198 -47876 -64951 135869 14748 -155666 66650
2686 66650 118885 -95850 -28892 79015 -38362 4324 65593 -86099 -28509 134662 -37411
2697 -37411 -118343 82818 52018 -87169 13746 23896 -58195 47077 32516 -111460 17295
2708 17295 110934 -75002 -67277 90971 3649 -53782 44730 -9103 -40093 77808 6021
2719 6021 -92861 53149 75869 -77646 -15159 69225 -26957 -15943 42514 -41978 -20759 75629
2731 75629 -31971 -72816 61385 31729 -72933 6539 37213 -40053 6413 24954 -49263
2742 -49263 4739 58571 -41031 -37342 61822 4042 -42587 28872 13374 -25095 31138 8934
2754 8934 -43887 27801 39065 -45371 -11451 45611 -14029 -21934 21590 -10622 -15553 26614
2766 26614 -12898 -33999 30606 10393 -42688 5611 23801 -24381 -1090 17874 -17642 1052
2778 1052 28610 -17301 -15876 34705 1944 -24725 17557 12708 -14064 9728 11458 -15715 6419
2791 6419 16991 -22177 -5996 21474 -12226 -18123 13533 -2424 -15342 6915 -787 -17658
2803 -17658 7536 7577 -18711 498 15909 -10914 -5100 12769 -2388 -3344 12141 -2239 -4097
2816 -4097 14270 4008 -9201 9475 8013 -8556 2366 9145 -6603 -1850 7949 -7289 -6986
2829 -6986 6414 -5894 -10047 4560 -2004 -8237 3023 1466 -8109 4679 4132 -7254 2997
2842 2997 8187 -6918 1359 12323 -3339 -2975 12609 835 -5315 9583 2722 -5902 7526
2855 7526 1593 -8006 6017 4569 -13963 -1198 8084 -12566 -8433 9250 -9212 -11015 10688
2868 10688 -4163 -13674 14044 5237 -17169 5962 12882 -10379 2702 11923 -8351 5537 16710
2881 16710 -11277 -4962 23315 -3765 -13871 15049 3237 -15800 8547 2361 -18264 10159
2893 10159 9829 -27095 -2092 19182 -15932 -10372 14031 -10922 -4950 18916 -13578 -14448 30599
2906 30599 2675 -29909 19229 20596 -21472 6438 17747 -19436 9323 26180 -30221 -6951
2918 -6951 42987 -12714 -28694 26626 831 -24068 19700 -5927 -34346 31245 15019 -55289
2930 -55289 7639 45467 -34803 -22105 34896 -13933 -11822 33310 -23721 -25298 56523 2956
2942 2956 -57040 34896 37573 -40195 5728 28454 -29936 16622 35950 -55792 -10408 72326
2954 72326 -27028 -58898 48213 17282 -43760 20351 2675 -39348 41353 19539 -76769 15536
2966 15536 70798 -52867 -35901 57995 -10894 -22384 40136 -27997 -29771 78836 -4231 -86566
2978 -86566 50428 62345 -65496 -9728 43783 -29166 11480 36611 -68047 -4429 92624
2989 92624 -48293 -78922 73585 25433 -69877 21375 11176 -43608 51091 15814 -97845
3000 -97845 34446 95699 -79270 -49679 86240 -4581 -38468 45077 -26295 -26386 91395 -21068
3012 -21068 -105473 79652 75180 -103326 -12959 75756 -37150 -8592 39420 -69497 -1571
3023 -1571 105624 -63795 -96145 103872 35860 -99620 18366 38607 -41636 40433 14692
3034 14692 -98093 49568 106618 -103827 -59794 122452 -243 -74321 42467 -328 -27941
3045 -27941 76880 -25884 -104431 92936 72379 -125180 -14624 98984 -40363 -30951 38965
3056 38965 -56226 2815 96405 -79408 -89126 128489 30818 -127079 27319 66440 -49178
3067 -49178 17498 17673 -77610 54827 91225 -116220 -44986 138640 -15593 -94452 55714
3078 55714 16265 -38108 58393 -24300 -91145 98041 62880 -142711 -6715 120961 -48140
3089 -48140 -58967 50731 -27199 -5309 73436 -73476 -69317 130594 18490 -136353 41946
3100 41946 87493 -62791 -5541 36097 -57419 40031 73624 -107589 -31347 136628 -23820
3111 -23820 -107646 62156 37875 -49502 30046 -12600 -61893 81136 37310 -130267 13231
3122 13231 115689 -64440 -64857 66454 -6819 -23241 51657 -48084 -45291 108476 1697
3133 1697 -117688 50014 83953 -67640 -15203 44739 -33998 22302 46246 -86861 -12300
3144 -12300 117158 -39150 -97029 72983 39679 -69116 14944 13475 -45420 50590 22724
3155 22724 -99393 20130 97544 -64477 -56343 72233 661 -35047 37449 -23217 -29827
3166 -29827 81287 -5931 -93334 54417 69834 -73709 -18217 59022 -19508 -7096 33156
3177 33156 -46356 -6165 74756 -39336 -68129 66849 26952 -65171 10436 23278 -33428
3188 -33428 25118 16257 -64246 18829 67950 -54548 -41419 67471 4511 -41096 24839 2303
3200 2303 -18116 42642 -4444 -53397 44123 42500 -60334 -8045 49717 -19734 -15868 27235
3212 27235 -24346 -8503 44857 -25611 -43670 47534 15736 -52428 8675 26774 -23754 4299
3224 4299 12715 -31445 14502 37188 -38698 -17120 51480 -5069 -33664 26707 11242 -19236
3236 -19236 20192 6207 -30722 23736 24028 -38558 -3121 34873 -15327 -18578 19025 -7838
3248 -7838 -10290 20097 -15646 -22930 29107 6242 -35670 9742 24377 -19138 -4955 16073
3260 16073 -11689 776 19902 -14425 -8958 26679 -1610 -18790 13371 9786 -12135 6731
3272 6731 4569 -13324 11776 9614 -21210 764 19009 -12433 -12872 13541 87 -10206 5826
3285 5826 -2912 -10962 10982 2331 -16731 5718 11955 -12400 -2058 11776 -5833 -261 12792
3298 12792 -4346 -3798 14440 -396 -12885 10435 7290 -10480 741 7088 -5238 -1247 5157
3311 5157 -8035 -1606 7737 -7411 -10190 7927 -1281 -9830 4946 2273 -7807 4425 5269 -8051
3325 -8051 1846 8722 -4622 -2368 9788 1007 -3721 6984 -248 -3569 7234 1639 -5180 3673
3339 3673 3192 -5748 1366 5180 -6929 -3526 5381 -5494 -6054 3717 -2069 -5217 2841 182 -2661
3354 -2661 5130 1789 -5317 3837 5500 -4520 3208 6052 -2221 2828 7858 -5611 -1589 8417
3368 8417 -2557 -5644 7421 853 -7149 1984 804 -6873 3317 362 -11973 2246 8573 -10669
3382 -10669 -5521 9528 -5268 -6902 9596 -3981 -8563 12067 1238 -11489 8897 11513 -12178
3395 -12178 2028 10283 -4835 3111 9055 -10639 -2437 16242 -6115 -13370 13242 959 -14839
3408 -14839 4839 914 -11865 8765 4033 -18961 3813 16461 -15237 -8922 13708 -3142
3420 -3142 -5774 10462 -6275 -5844 21532 -4401 -20783 17605 14062 -20474 2737 15193 -10621
3433 -10621 3220 11973 -19379 -67 25641 -15623 -21316 24863 2050 -21839 9487 3179
3445 3179 -16940 15263 4289 -29590 12778 26841 -29032 -10841 31823 -7136 -14483 17599
3457 17599 -7936 -9082 32253 -7894 -32001 30574 19205 -36681 1569 26357 -15862 -240
3469 -240 15204 -27390 1248 35154 -30006 -28191 39861 5212 -37150 13318 10927 -20618 15692
3482 15692 3671 -34229 20726 35190 -42003 -14976 46428 -7687 -25267 21506 -3335 -10418
3494 -10418 32671 -14352 -38477 41771 24026 -52132 2355 39401 -24274 -9715 19177 -27041
3506 -27041 2178 38756 -38165 -33007 55891 5286 -52928 19045 22514 -24704 13881 6361
3518 6361 -37026 30491 39217 -54266 -11252 64210 -13587 -39456 32095 3083 -18535 30558
3530 30558 -15056 -39622 49930 21776 -67848 6135 51800 -30933 -21234 23813 -20852 -723
3542 -723 37200 -40521 -29769 66340 -1431 -64855 27895 38475 -31837 2830 14797 -30546
3554 -30546 27366 32632 -58301 -8783 71286 -21620 -48564 37871 11558 -25923 23238 -9191
3566 -9191 -33397 50993 15111 -72018 14692 60862 -39102 -29675 34424 -11752 -6935 27567
3578 27567 -36897 -20173 66694 -8115 -67532 38805 40302 -41314 -1047 22738 -23032 19836
3590 19836 27100 -55078 1397 70413 -31690 -51719 48066 17026 -35845 13409 100 -27558
3602 -27558 38987 7108 -67444 23418 59437 -49486 -31259 46344 -5853 -18269 23896 -21283
3614 -21283 -15998 56863 -12082 -60755 43174 40346 -49158 -5301 33518 -15680 3813 19764
3626 19764 -39731 4531 57802 -35779 -44923 50972 15403 -43764 9484 12308 -21960 24264
3638 24264 1212 -49492 22101 46205 -47421 -23423 48850 -5063 -27740 19688 -7944 -9354
3650 -9354 38619 -13752 -44050 42868 30092 -50383 -2159 38016 -16618 -7656 17395 -23909
3662 -23909 2430 38765 -32794 -32652 47440 7960 -44575 10825 18852 -21193 10203 6129 -35031
3675 -35031 17197 32824 -40979 -13437 46861 -6524 -28580 21470 4211 -12346 23629 -6472
3687 -6472 -27844 33260 20019 -42253 2813 36252 -18061 -13122 16815 -12611 -2679 22620
3699 22620 -21360 -22234 34009 660 -36987 10527 19357 -21480 605 8437 -16369 10999 18413
3712 18413 -27249 -6447 33739 -8135 -22653 19731 9345 -13885 8647 -518 -14939 17423
3724 17423 10291 -28590 3504 23554 -15886 -11815 14510 -7271 -4843 11456 -11483 -11523 20339
3737 20339 -667 -25068 12162 14343 -18143 -1461 11779 -7556 3071 11448 -13044 -1710
3749 -1710 21369 -6094 -14401 14995 6276 -11664 5372 2749 -10175 9914 6144 -18497 3439
3762 3439 16287 -12992 -11415 13313 -3269 -10741 5136 111 -6372 8010 1166 -11897 6444
3775 6444 8745 -9965 -483 10279 -2806 -194 8197 -4752 -2538 10165 -2136 -8645 8766
3788 8766 5339 -7922 808 4738 -6585 1173 2397 -7504 1156 4992 -6391 -3943 7175 -2919
3802 -2919 -6562 4073 -403 -4258 4694 -110 -6319 3976 5778 -6712 622 8751 -837 -1621
3816 -1621 4237 -1556 -1065 4900 -989 -4225 5308 1595 -5983 1225 3606 -5449 -1294 1670 -4638
3831 -4638 -2183 4335 -3081 -4620 2643 80 -4504 2733 1258 -3446 3526 2468 -2864 2243 5086
3846 5086 -3100 834 6131 -2254 -1151 5774 -387 -3037 3656 1106 -5445 596 1419 -4090 115
3861 115 953 -5989 840 3636 -6072 -2425 4314 -2667 -2204 4173 -414 -3000 5662 2498 -3554 3801
3877 3801 4061 -5132 1128 6069 -1678 1452 4954 -4018 1206 5314 -5149 -4073 7151 -433 -6301
3892 -6301 2467 121 -7103 2837 -680 -7931 3510 6818 -7989 -2319 8072 -2972 -4082 4937
3906 4937 -316 -2026 7407 -961 -7467 9345 5356 -11328 3559 8893 -4987 -1101 6055 -5529
3920 -5529 -510 9191 -7266 -8010 10614 -1655 -11109 5222 3541 -7202 4628 1669 -9406
3933 -9406 7390 8504 -13521 -902 14440 -6034 -6570 9471 -509 -2504 12349 -3771 -9507
3946 -9507 14095 3700 -16300 6067 11523 -10742 -904 7352 -9788 1844 12471 -15740 -8834
3959 -8834 18121 -3742 -20315 9497 6224 -12747 3840 3425 -13255 9754 12559 -20125 315
3972 315 21647 -7411 -11603 13043 -332 -4536 14134 -6062 -11565 20240 4570 -24234 6659
3985 6659 18086 -14397 -4908 10511 -9683 815 12373 -17369 -7736 23597 -5757 -25477
3997 -25477 14243 10459 -15480 5181 4316 -13454 12160 12469 -23691 1302 28720 -12742 -16366
4010 -16366 19455 2809 -8308 11052 -5743 -11559 20502 1246 -30231 11155 22879 -21029
4022 -21029 -7692 14316 -8278 -2938 12616 -19160 -7101 30044 -9369 -26840 22262 13904
4034 13904 -22910 3768 11126 -11102 12673 10191 -27513 5769 32617 -19344 -20618 26286
4046 26286 2053 -17089 10226 -3471 -12943 23064 252 -33113 16104 24764 -28259 -10453
4058 -10453 23110 -7762 -7005 12478 -14200 -4047 26876 -10389 -28589 25201 17436 -27616
4070 -27616 1755 18034 -10923 5081 8622 -22614 6516 29155 -23685 -19149 31232 2286
4082 2286 -23335 8560 4124 -11450 15131 -2271 -28412 18468 21982 -31373 -8537 27598
4094 27598 -6240 -12216 13258 -8718 -2468 23691 -13378 -21840 29071 13859 -31857 4005
4106 4005 20921 -11310 1884 8439 -18804 6944 24428 -25484 -16150 31854 123 -28637
4118 -28637 11581 8089 -12577 8955 -931 -21792 19334 19357 -29652 -4156 29754 -8442 -17714
4131 -17714 15075 -1476 -5493 15221 -9170 -19776 26612 9268 -31990 6101 23773 -13133
4143 -13133 -3874 10601 -9412 3562 14760 -18810 -10293 27722 -3179 -25939 11324 9653
4155 9653 -15112 3005 1647 -13563 11997 11334 -24964 -213 25942 -11584 -14684 15021 1172
4168 1172 -8682 10035 -4519 -11431 19639 2796 -25927 7070 20145 -15622 -6823 11810 -6550
4181 -6550 -2403 9051 -14256 -7361 21613 -5620 -22001 12882 11063 -16187 1256 6312 -7408
4194 -7408 6437 6379 -17014 943 20448 -13005 -11584 16930 2975 -9441 6838 75 -7705
4207 -7705 11323 882 -16784 8345 12040 -14114 -4766 11288 -3663 -4663 5925 -7221 -3607
4220 -3607 13153 -5567 -14277 12186 7456 -13165 1493 7416 -5304 2032 6504 -8906 1169
4233 1169 12798 -7079 -6779 13097 1827 -9563 3972 546 -5686 4774 372 -9455 4603
4246 4603 6967 -11526 -4143 8997 -3905 -6464 5510 -2716 -1431 5851 -2666 -7612 7700 4296
4260 4296 -8816 1577 6047 -3887 -1297 3695 -3977 -141 6589 -6914 -4402 8467 -178 -6137
4274 -6137 4687 4408 -4106 1468 1550 -4946 1132 3186 -6252 -1236 5813 -2325 -4515 2177 -244
4289 -244 -3477 1341 -715 -3138 4088 3828 -4045 358 5268 -1906 -1820 3798 197 -1974 4583 -1837
4305 -1837 -2863 4087 -312 -4366 2593 2760 -3662 -1046 481 -2812 156 2278 -2905 -2143 2266
4320 2266 -1118 -3114 3273 91 -3254 2479 1453 -991 3375 2326 -3121 2035 3702 -2132 -352
4335 -352 1991 -1831 -1326 2979 -1288 -3329 1754 -663 -3825 353 37 -2429 494 299 -3567 -1383
4351 -1383 2332 -3368 -1011 2382 -1194 -2261 2346 194 -2134 2225 473 -1277 1884 2960 -829
4366 -829 153 1533 -1456 -1703 2394 -1696 -2093 5504 -494 -3402 621 1894 -2549 195 353 -3240
4382 -3240 2274 266 -3551 5 2610 -2978 -1814 3257 -1912 -1529 2369 20 -712 4438 -384
4397 -384 -4284 3185 3113 -2118 -1464 3010 -1803 1045 3089 -4462 -625 4534 -2019 -5066 2936 630
4413 630 -3753 363 858 -3185 3839 2365 -5663 1434 6554 -3341 -1255 5594 -1917 -519 4513
4428 4513 -2029 -2786 6068 -28 -4857 3760 4721 -6645 -565 2847 -3179 -684 3374 -6062 -678
4443 -678 7197 -5894 -5307 7035 1054 -6653 1863 39 -3259 3124 1300 -7933 3377 7178 -6681
4458 -6681 -2404 8677 -429 -3381 3654 -2406 -3146 7855 -1116 -9354 4608 5791 -9124 -344
4472 -344 6459 -5081 647 2645 -7749 -18 8691 -7921 -6567 10593 1668 -8264 3818 2721
4486 2721 -5051 6402 2423 -8166 6846 10901 -10241 -3642 11296 -3262 -7462 6083 -2288
4499 -2288 -2691 9381 -4097 -12328 11005 5170 -12347 1719 9017 -6010 -1106 4460 -8347
4512 -8347 1774 11627 -9652 -7756 14602 2686 -12153 3895 7165 -4927 4802 793 -9109
4525 -9109 7586 10860 -15389 -3738 16733 -3805 -8051 7767 678 -3130 8972 -3452 -11778
4538 -11778 11644 5635 -16430 1132 11915 -7567 -5267 7405 -6021 2125 11641 -11067 -7029
4551 -7029 17439 660 -16045 6350 6787 -6562 3347 2180 -9614 9067 10359 -15766 -2173
4564 -2173 18161 -4815 -12085 9402 608 -5859 6410 -3389 -9165 12541 4047 -19505 3800
4577 3800 14615 -10564 -5586 8015 -4551 453 8889 -10470 -5325 17851 -2201 -16016 10681
4590 10681 10735 -9197 2036 4330 -8005 7221 6733 -14099 1080 16219 -10048 -12418 10519
4603 10519 903 -9270 4082 -2922 -6762 11964 1721 -17060 6807 12901 -11147 -5489 11638
4616 11638 -2492 -1450 7849 -6976 -2767 15924 -4789 -13351 11538 8097 -12906 314 7383
4629 7383 -3939 1969 1697 -11878 1236 13834 -9198 -11066 13498 2120 -9559 4202 -216
4642 -216 -7316 7628 20 -13677 8033 12738 -12714 -3969 12757 -1002 -4429 3833 -4102 -1573
4656 -1573 11453 -3487 -11306 11186 6691 -14308 740 9387 -4098 429 2246 -8472 2847
4669 2847 10619 -10055 -8164 13531 193 -9913 4813 2991 -3981 5597 72 -9411 7269
4682 7269 7482 -10136 -1523 13222 -2829 -5820 6502 -1506 -2617 8116 -5737 -7880 9817
4695 9817 2980 -11201 2533 7119 -7017 -2622 3177 -5569 -60 7605 -8038 -5875 9999 -2669
4709 -2669 -8404 4367 2997 -6089 1967 2206 -5074 4180 5060 -8900 1542 9824 -3697 -5164
4723 -5164 5276 482 -1890 3660 -2968 -4881 6314 1427 -9989 3081 6261 -5591 -3065 4822
4737 4822 -2008 181 3028 -4800 -2744 6887 -319 -6540 5265 4776 -3881 1475 3876 -1632 3201
4752 3201 3419 -5441 -32 5994 -3632 -3498 5254 -366 -3523 2706 -399 -3023 3964 -2042 -4517
4767 -4517 3067 4271 -5305 -884 3520 -1174 -2619 1541 -2124 -308 4248 -173 -2711 4974 2176
4782 2176 -2971 1190 3994 -2511 560 3285 -2400 224 3379 -2043 -3155 2562 -494 -3127 812
4797 812 197 -1476 793 213 -4218 1246 2584 -2544 -2037 3144 -1235 -1154 2187 549 -321 2622 -335
4814 -335 -2426 2647 1712 -1206 583 1902 -1621 638 1021 -485 -560 790 -973 -1464 2914 -299
4830 -299 -2021 1321 -126 -1774 1532 918 -1969 809 1729 -2026 -1207 2566 -465 -596 1897 539
4846 539 -2450 2796 193 -240 2193 1383 -2036 688 862 -1324 1713 1634 -1061 -1738 1671 -1304 -2437
4863 -2437 1027 -2 -1835 1711 -588 -2197 671 -239 -1484 313 1614 -1207 -309 1824 -311
4878 -311 -48 1385 70 -848 3311 2402 -2440 -221 1027 127 475 1372 -3136 761 2470 -2038 -370
4895 -370 2902 -507 -2466 3182 -1333 -1280 3379 693 -1795 2499 2301 -2704 -274 4184 -1645 -1100
4911 -1100 2593 -1088 558 2678 -2367 -579 3780 984 -2684 1109 1930 -3470 1046 1169 -4621
4926 -4621 1213 3143 -4787 -2249 4612 -2443 -3756 3006 -846 -1660 2165 -727 -4266 4612 279
4941 279 -4472 1674 5841 -1047 -481 3840 -736 -49 2943 -3164 -2690 5774 291 -6031 2891 3413
4957 3413 -2950 1090 -715 -4168 2328 4398 -5980 -410 6246 -1639 -5292 4252 418 -3289 2046
4972 2046 -1445 -1879 5633 1797 -5332 4544 7390 -3518 -74 3821 -1203 -59 4079 -4491 -3369
4987 -3369 8586 -2617 -8961 5844 3151 -7334 -1082 1466 -3665 2522 3229 -8029 990 7689
5001 7689 -4525 -6197 7480 1696 -4481 3272 -593 -3449 7279 398 -9209 5128 7948 -6460
5015 -6460 -1690 7397 -3236 -3060 3815 -5675 -2110 7319 -2608 -10889 6300 5461 -9937 178
5029 178 3314 -4225 1328 3482 -6669 1401 9982 -6595 -5967 8924 1682 -4962 4558 755 -3098
5044 -3098 6173 892 -9679 6147 8961 -10002 -3460 10231 -2799 -4493 2762 -4066 -1519 7205
5058 7205 -5326 -9478 8847 4029 -11618 1748 7553 -4742 1312 3609 -8337 2617 9594
5071 9594 -7064 -7327 11958 535 -9423 5281 2618 -4029 4264 -484 -10021 8703 6667 -11157
5085 -11157 -1401 11377 -4075 -4272 3950 -2445 -3088 5869 -3124 -8600 9060 3809 -12628 1525
5099 1525 8888 -7234 -1186 4326 -4444 3075 8371 -9071 -4087 12616 -1215 -10494 5542 4483
5113 4483 -5016 2423 291 -6981 6846 5526 -12599 -1979 13814 -5344 -8236 5615 -900
5126 -900 -3428 5680 -4423 -7375 10541 806 -12539 3784 9772 -5903 -2926 4953 -4882 430
5140 430 5396 -7022 -4024 12704 -951 -10394 6818 4680 -7885 1741 2875 -6057 6177 2617
5154 2617 -11464 -660 11963 -7079 -6839 7478 350 -5257 3494 -2807 -4415 8144 155 -9021
5168 -9021 6757 7131 -7774 -4543 6801 -573 -2690 4272 -5215 -1305 9309 -2809 -7756 7319
5182 7319 3390 -6403 -365 3209 -4011 1935 2589 -8091 652 6531 -6539 -4915 7515 -238
5196 -238 -5101 2526 2102 -1970 5536 1281 -7846 5668 5371 -5999 -1450 7509 -2926 -2262 4071
5211 4071 -3597 -422 5205 -3946 -6543 7550 2307 -7419 -514 4737 -3052 -70 1080 -4241 -79
5226 -79 6278 -5911 -3453 7044 984 -5006 3121 1759 -2679 1552 -160 -3855 4635 5825 -7114
5241 -7114 -381 6408 -338 -3294 3027 -280 -2498 2073 -3744 -4214 5094 1733 -7036 1094 4020
5256 4020 -4016 -617 1962 -226 179 3976 -3928 -406 5011 37 -3383 4088 1147 -2233 1302
5271 1302 173 -1549 1974 3815 -4823 173 3962 -2016 -3961 2449 23 -2156 2531 -2451 -2650
5286 -2650 3486 621 -4739 653 3000 -3223 -1830 1230 -199 -186 3004 -1691 -411 2574 -286
5301 -286 -3171 2159 1291 -2125 211 1405 -1611 -441 573 -2828 -58 2250 -1430 -2844 3196
5316 3196 682 -3620 1245 1034 -1637 1032 441 -1533 -272 1258 -1551 -1449 2003 -392 -1617 1311
5332 1311 98 -605 3033 727 -2548 2447 2196 -1560 181 1932 -1408 -32 500 -3171 -931 690
5348 690 -1519 -1826 1945 -880 -3980 1238 901 -2742 876 1089 -1904 -659 2421 -1991 508 2786
5364 2786 607 -797 2132 458 -1399 1772 -730 -787 856 1574 -2601 714 950 -3386 -231 1671
5380 1671 -1846 -2462 1437 197 -1927 582 43 -2298 2321 399 -2528 395 2761 -1357 1043
5395 1043 1918 -1165 1014 2681 -2053 -1492 3458 -171 -2333 891 1533 -2843 -387 -876 -1804 -571
5411 -571 349 -4116 696 1710 -2169 -3147 3909 -1613 -1975 1217 -2924 -935 3479 -21 -3005 2290
5427 2290 2873 -4734 320 3907 -1955 2475 1732 -2882 223 4357 -3342 -3304 4884 1107 -3838 794
5443 794 1182 -3558 1060 -608 -4250 1196 4275 -3882 -3400 4524 -1370 -2772 3857 -1212 -2452 3442
5459 3442 -1712 -5964 3958 3001 -4587 -126 4133 -1916 -368 3607 -3027 -1559 3882 -3593 -3521 5372
5475 5372 -479 -5525 1995 1815 -2306 1537 -284 -4750 3450 5013 -5559 -3279 7335 -1296 -3943
5490 -3943 2510 -324 -1797 4863 -1183 -4196 6507 4391 -8998 1297 5855 -2437 -121 2287
5504 2287 -3016 -545 3682 -5263 -6016 7880 211 -7773 3046 3501 -4035 1259 672 -5732 3697
5519 3697 4546 -7353 -2976 8116 -2401 -4876 7169 2233 -3101 4699 -1015 -5061 7296 3433
5533 3433 -9299 1239 7705 -4694 -3252 4628 -2716 -1357 3765 -5386 -4525 9815 -1029 -10870
5547 -10870 4029 5124 -4814 154 2080 -3963 3393 5909 -7534 56 10969 -4085 -6891 7171
5561 7171 2822 -3972 5491 -1734 -4947 8094 1396 -10978 2263 10532 -8417 -3983 6869 -2032
5575 -2032 -1314 3146 -5225 -2907 9661 -1699 -12095 7525 5113 -6787 2917 3989 -3892 1789
5589 1789 3765 -9239 1081 10265 -7258 -7612 11199 2763 -5669 3106 140 -5709 6812 498
5603 498 -11202 3805 7881 -8004 -4271 7392 -1108 -5030 4749 -4698 -3162 10059 -3693 -10054
5617 -10054 7264 6522 -9862 1021 7127 -3757 943 2691 -7904 1362 10498 -6240 -6708 8929
5631 8929 2440 -8785 1568 3205 -5404 3639 625 -8477 2669 7352 -10306 -4555 7922 -1690
5645 -1690 -5241 4377 -45 -2712 7003 -2434 -8656 8065 5479 -9794 883 7051 -4373 -1221
5659 -1221 4157 -4916 1441 7108 -5723 -5523 9007 76 -8964 4209 3920 -5101 2346 950 -6050
5674 -6050 2912 6757 -9747 -1543 9628 -2622 -4647 4760 485 -2065 3698 -547 -6524 7060
5688 7060 3822 -10678 500 7474 -3331 -3670 3504 -1665 -1238 3894 -4700 -2961 6158 -400 -9807
5703 -9807 2209 3776 -4712 -430 2054 -6339 3186 3329 -7191 -752 7437 -1625 -5657 4961
5717 4961 1898 -4072 3189 -419 -4037 6079 1913 -7870 2547 6934 -2421 -1817 4393 -1828 -2535
5732 -2535 1990 -4887 -3939 6188 -411 -6428 2378 3569 -4713 -1109 2508 -1998 1393 3972 -4069
5747 -4069 209 7203 -2800 -5293 4117 2841 -4543 1200 2420 -2331 3750 -76 -6436 797 5773
5762 5773 -3988 -3158 3823 -1786 -2301 1910 -1470 -2627 3235 -570 -3898 1729 4092 -5804 -1210
5777 -1210 2961 -1138 -1131 4260 -1579 -638 4922 -1555 -2164 4304 1566 -3659 896 1391 -1962 2257
5793 2257 2833 -3477 743 2987 -3879 -3070 3582 -1204 -2907 821 105 -1446 2106 -1628 -3799 2394
5809 2394 3411 -5162 -1247 2428 -1864 -797 4265 -618 -1781 3614 380 -1948 2787 697 -3789
5824 -3789 198 1980 -2826 380 1363 -1711 491 1150 -2180 -1193 1272 -1039 -2665 -320 965 -2466
5840 -2466 840 941 -1474 1206 2597 -1674 247 2804 -839 -349 1753 552 568 2289 804 -570
5856 -570 2388 656 -2040 1992 1568 -3466 -933 2099 -2461 -670 1787 -1295 -2417 3601 -129
5871 -129 -1486 3120 448 -2069 1920 909 -2424 2464 2995 -18 9 2532 -2262 1056 2091 -1483
5887 -1483 -1718 1766 525 -2226 456 -1598 -2639 -17 1505 -3722 792 1266 -2173 -999 2896
5902 2896 -531 -1969 1697 -429 -775 1481 -304 -2431 2027 2030 -1493 1460 3565 -1690 -138 2530
5918 2530 -23 -826 1998 -2044 -2299 3163 417 -3243 331 915 -3052 1457 -317 -3177 1171 3305
5934 3305 -3573 273 3992 -666 -2487 531 -1098 -605 2083 -121 -2766 3859 1858 -4597 1667
5949 1667 4537 -1287 -534 2396 -1853 -254 3493 -3347 -2839 4084 -1503 -5632 1351 1142 -4360 841
5965 841 874 -3253 866 3546 -6408 -806 6011 -2560 -2348 4792 557 -1872 1865 466 -2624 6115
5981 6115 606 -6165 2845 4190 -2432 -1970 1770 -2175 -1817 1831 -5144 -1095 5050 -1405 -6571
5996 -6571 2267 3494 -4785 735 1710 -3270 3395 1807 -5075 438 6802 -3900 -3314 5895 1435
6011 1435 -1271 3661 -456 -3819 7127 161 -7146 3252 4344 -5532 -2822 3940 -3176 -1782
6025 -1782 3748 -4224 -2176 5438 -1288 -6299 4818 3821 -5701 819 3145 -3594 2841 2447 -6282
6040 -6282 1766 8656 -4176 -4078 6476 397 -4005 2897 1892 -2876 4895 -278 -8288 4670 6521
6055 6521 -7756 -3196 5205 -3541 -1804 3740 -3731 -745 6400 -3192 -8532 7763 3460 -8118
6069 -8118 1182 5273 -3382 1698 3292 -5031 1747 8228 -7349 -4725 9042 1393 -7897 1476
6083 1476 2113 -3249 4602 -947 -5871 4463 5378 -8304 -2869 8335 -2827 -3554 4296 -1635 -1426
6098 -1426 7086 -2171 -6368 9050 3057 -8173 1367 6288 -3349 -1363 4326 -4172 3085 6202
6112 6202 -7054 -5267 8713 423 -7952 4712 4071 -3242 2206 267 -6501 3176 4067 -8687
6126 -8687 -1885 10104 -2400 -6173 4249 -687 -1059 3882 -2475 -5969 7409 3454 -10670 1574
6140 1574 6993 -4547 -2319 3130 -2909 1353 6231 -3879 -3371 9463 -787 -8056 2971 3676
6154 3676 -5433 572 954 -4991 4785 2940 -9411 1109 9127 -4572 -5945 4487 318 -2192
6168 -2192 4649 -879 -3260 6809 3428 -9303 3264 6770 -6275 -1075 3409 -1484 -388 3223
6182 3223 -4004 -2744 7948 -1409 -9209 4886 3656 -6552 922 2229 -4519 2030 1747 -6122
6196 -6122 -745 7218 -4036 -6122 6681 2935 -4955 2767 1249 -1564 4966 851 -4355 1951
6210 1951 5928 -4854 -3502 5153 -847 -1350 1366 -1937 -2824 4994 -1245 -5994 2901 2542 -4872
6225 -4872 77 2711 -1297 -485 609 -3138 25 4343 -4380 -3591 6766 1959 -3427 1592 1644 -1286
6241 -1286 1926 858 -4452 2905 4805 -4779 -3434 5306 -1654 -2140 1456 -939 -2616 3880 -1857
6256 -1857 -4767 4635 1855 -5137 270 4421 -1238 404 3114 -81 1358 2462 -3456 -2656 5835
6271 5835 1182 -4022 1048 2346 -1599 -145 1119 -2523 282 2956 -2632 -2750 5120 -1247 -3084
6286 -3084 2200 -208 -2437 976 -914 -1916 4343 2667 -2272 -2659 3687 -1440 -922 1143 -1509
6301 -1509 -363 1973 -738 -1902 2866 128 -3082 2045 2971 -2430 -70 2179 -2685 1427 1338 -2130
6317 -2130 -1668 2512 -1502 -3280 1564 -1129 -1957 1183 1196 -99 2662 3062 -1109 906 3042 -1980
6333 -1980 -1287 3320 -416 -745 2044 -171 -2750 3544 293 -3103 966 -237 -2011 -914 1870
6348 1870 -1767 -1224 1324 -2589 -2144 2311 -1957 -2097 2316 -182 -2398 1173 3439 -2705 66 1699
6364 1699 -1823 192 1349 115 -236 1635 -364 -2673 1314 -923 -750 2125 96 -1831 -238
6379 -238 584 -4307 116 199 -2075 -1788 2380 -555 -2315 2313 -339 -1507 1292 1030 -1753 2041
6395 2041 1909 -1831 -913 2123 -1114 921 2245 -1082 377 1929 -2145 -1150 478 -414 -3945 1439
6411 1439 365 -958 -415 1919 -1837 1438 1489 -2595 394 3547 -1147 -2424 1341 410 1587 2064
6427 2064 -853 -1388 2661 704 -1728 1835 3027 -1388 -350 1651 -596 -889 2142 -1212 -1610 2509
6443 2509 -1878 -2032 420 1960 -3348 52 2572 -2200 -236 859 -3685 -308 4862 -2380 -2736
6458 -2736 4081 1133 -904 2353 388 -2085 3251 491 -2605 2157 4278 -4098 -972 3731 -1926
6473 -1926 -2745 2065 -2136 -1154 2578 -2052 -3903 3034 2756 -3781 497 3301 -202 -93 1941 -3459
6489 -3459 1927 5091 -4271 -2123 5789 1380 -4365 1822 749 -54 2142 -106 -4931 2331 4336
6504 4336 -5921 -1199 4992 -1572 -3537 2555 -3095 -1569 4806 -3403 -4097 4256 2877 -5507 1179
6519 1179 3049 -2011 604 2470 -1406 1771 4902 -3224 -3579 5418 -1013 -4602 2926 992 -2186
6534 -2186 2870 -198 -5081 3283 4520 -7865 -1351 5271 -3122 -2210 2499 -1868 -2816 3943 -3404
$$ [...]
8191d62
##END NTUPLES=NMR FID
##END=
