##TITLE=1H_AT-54-1
 CDCl3
 8 sc, 
 14.11.2022
##JCAMPDX= 6.0         $$ Bruker NMR JCAMP-DX V2.0
##DATA TYPE= NMR FID
##DATA CLASS= NTUPLES
##ORIGIN= UXNMR, Bruker Analytische Messtechnik GmbH
##OWNER= root
$$ XWIN-NMR		Version 3.5
$$ Mon Nov 14 15:12:25 2022 Russian Standard Time (UT+4h)  she@DPX200
##.OBSERVE FREQUENCY= 200.1313499994
##.OBSERVE NUCLEUS= ^1H
##.DELAY= (6, 6)
##.ACQUISITION MODE= SIMULTANEOUS
##.ACQUISITION SCHEME= undefined
##.AVERAGES= 8
##.DIGITISER RES= 18
##SPECTROMETER/DATA SYSTEM= spect
##.PULSE SEQUENCE= zg30
##.SOLVENT NAME= CDCl3
##.SHIFT REFERENCE= (INTERNAL, CDCl3, 0, 15.7039)
##AUDIT TRAIL= $$ (NUMBER, WHEN, WHO, WHERE, WHAT)
$$ ##TITLE= Audit trail, XWIN-NMR		Version 3.5
$$ ##JCAMPDX= 5.01
$$ ##ORIGIN= Bruker BioSpin GmbH
$$ ##OWNER= she
$$ F:/spectra/data/she/nmr/H-F/1/audita.txt
$$ ##AUDIT TRAIL=  $$ (NUMBER, WHEN, WHO, WHERE, WHAT)
(   1,<2022-11-14 15:10:59.87 +0400>,<she>,<DPX200>,
      <created by zg, POWCHK disabled, PULCHK disabled
       configuration hash MD5:
       00 E9 B6 7A A2 85 ED C7 34 08 36 98 17 FE 4E 26
       data hash MD5: 16K
       D7 40 09 D5 57 5C 22 76 CA 21 0B 14 4F CC D7 93>)
$$ ##END=
$$ 
$$ hash MD5
$$ D1 6C 57 9D 48 86 1D 31 92 06 CB 39 3C F0 7B 49
##$RELAX= 
##$RELAX= 
##$RELAX= 
##$RELAX= 
##$RELAX= 
##$RELAX= 
$$ Bruker specific parameters
$$ --------------------------
##$DU= <F:/spectra>
##$EXPNO= 1
##$NAME= <H-F>
##$PROCNO= 1
##$TYPE= <nmr>
##$USER= <she>
##$AMP= (0..31)
100 100 100 100 100 100 100 100 100 100 100 100 100 100 100 100 100 100 
100 100 100 100 100 100 100 100 100 100 100 100 100 100 
##$AQSEQ= 0
##$AQ_mod= 1
##$AUNM= <au_zg>
##$AUTOPOS= <>
##$BF1= 200.13
##$BF2= 200.13
##$BF3= 200.13
##$BF4= 200.13
##$BF5= 200.13
##$BF6= 200.13
##$BF7= 200.13
##$BF8= 200.13
##$BYTORDA= 1
##$CFDGTYP= 0
##$CFRGTYP= 5
##$CHEMSTR= <none>
##$CNST= (0..31)
1 1 145 1 1 1 1 1 1 1 1 1 1 1 1 1 1 1 1 1 1 1 1 1 1 1 1 1 1 1 1 1 
##$CPDPRG= <>
##$CPDPRG1= <>
##$CPDPRG2= <>
##$CPDPRG3= <>
##$CPDPRG4= <mlev>
##$CPDPRG5= <mlev>
##$CPDPRG6= <mlev>
##$CPDPRG7= <mlev>
##$CPDPRG8= <mlev>
##$CPDPRGB= <>
##$CPDPRGT= <>
##$D= (0..31)
0 1.2 0 0 0 0 0 0 0 0.06 0 0.03 0 0 0 0 0.0002 0 0 0 0 0 0 0 0 0 0 0 0 
0 0 0 
##$DATE= 1668424259
##$DBL= (0..7)
120 120 120 120 120 120 120 120 
##$DBP= (0..7)
150 150 150 150 150 150 150 150 
##$DBP07= 0
##$DBPNAM0= <>
##$DBPNAM1= <>
##$DBPNAM2= <>
##$DBPNAM3= <>
##$DBPNAM4= <>
##$DBPNAM5= <>
##$DBPNAM6= <>
##$DBPNAM7= <>
##$DBPOAL= (0..7)
0.5 0.5 0.5 0.5 0.5 0.5 0.5 0.5 
##$DBPOFFS= (0..7)
0 0 0 0 0 0 0 0 
##$DE= 6
##$DECBNUC= <off>
##$DECIM= 32
##$DECNUC= <off>
##$DECSTAT= 4
##$DIGMOD= 1
##$DIGTYP= 9
##$DL= (0..7)
0 120 120 120 120 120 120 120 
##$DP= (0..7)
150 150 150 150 150 150 150 150 
##$DP07= 0
##$DPNAME0= <>
##$DPNAME1= <>
##$DPNAME2= <>
##$DPNAME3= <>
##$DPNAME4= <>
##$DPNAME5= <>
##$DPNAME6= <>
##$DPNAME7= <>
##$DPOAL= (0..7)
0.5 0.5 0.5 0.5 0.5 0.5 0.5 0.5 
##$DPOFFS= (0..7)
0 0 0 0 0 0 0 0 
##$DQDMODE= 0
##$DR= 18
##$DS= 0
##$DSLIST= <SSSSSSSSSSSSSSS>
$$ [...]
##$SUBNAM2= <"">
##$SUBNAM3= <"">
##$SUBNAM4= <"">
##$SUBNAM5= <"">
##$SUBNAM6= <"">
##$SUBNAM7= <"">
##$SUBNAM8= <"">
##$SUBNAM9= <"">
##$SW= 18.0517283424941
##$SWIBOX= (0..15)
0 0 2 0 0 0 0 0 0 0 0 0 0 0 0 0 
##$SW_h= 3612.71676300578
##$TD= 16384
##$TD0= 1
##$TE= 0
##$TE2= 300
##$TE3= 300
##$TEG= 300
##$TL= (0..7)
0 120 120 120 120 120 120 120 
##$TP= (0..7)
150 150 150 150 150 150 150 150 
##$TP07= 0
##$TPNAME0= <>
##$TPNAME1= <>
##$TPNAME2= <>
##$TPNAME3= <>
##$TPNAME4= <>
##$TPNAME5= <>
##$TPNAME6= <>
##$TPNAME7= <>
##$TPOAL= (0..7)
0.5 0.5 0.5 0.5 0.5 0.5 0.5 0.5 
##$TPOFFS= (0..7)
0 0 0 0 0 0 0 0 
##$TUNHIN= 0
##$TUNHOUT= 0
##$TUNXOUT= 0
##$USERA1= <user>
##$USERA2= <user>
##$USERA3= <user>
##$USERA4= <user>
##$USERA5= <user>
##$V9= 5
##$VALIST= <valist>
##$VCLIST= <CCCCCCCCCCCCCCC>
##$VD= 0
##$VDLIST= <DDDDDDDDDDDDDDD>
##$VPLIST= <PPPPPPPPPPPPPPP>
##$VTLIST= <TTTTTTTTTTTTTTT>
##$WBST= 1024
##$WBSW= 4
##$XGAIN= (0..3)
0 0 0 0 
##$XL= 0
##$YL= 0
##$YMAX_a= 663273
##$YMIN_a= -819801
##$ZGOPTNS= <>
##$ZL1= 120
##$ZL2= 120
##$ZL3= 120
##$ZL4= 120
##$ABSF1= 10
##$ABSF2= 0
##$ABSG= 5
##$ABSL= 3
##$ALPHA= 0
##$AQORDER= 0
##$ASSFAC= 0
##$ASSFACI= 0
##$ASSFACX= 0
##$ASSWID= 0
##$AUNMP= <proc_1d>
##$AZFE= 0.1
##$AZFW= 0.1
##$BCFW= 1
##$BC_mod= 2
##$BYTORDP= 1
##$COROFFS= 0
##$CY= 11.3945322036743
##$DATMOD= 1
##$DC= 2
##$DFILT= <>
##$DTYPP= 0
##$F1P= 2.36226072786647
##$F2P= -0.459571619588291
##$FCOR= 0.5
##$FTSIZE= 0
##$FT_mod= 4
##$GAMMA= 1
##$GB= 0.15
##$INTBC= 1
##$INTSCL= 1
##$ISEN= 128
##$LB= 0.24
##$LEV0= 0
##$LPBIN= 0
##$MAXI= 10000
##$MC2= 0
##$MEAN= 0
##$ME_mod= 0
##$MI= 1.114404
##$NCOEF= 0
##$NC_proc= 0
##$NLEV= 6
##$NOISF1= 3.799351
##$NOISF2= 2.8
##$NSP= 1
##$NTH_PI= 0
##$NZP= 0
##$OFFSET= 15.70392
##$PC= 1
##$PHC0= -18030.64
##$PHC1= 9.600698
##$PH_mod= 1
##$PKNL= yes
##$PPARMOD= 0
##$PSCAL= 0
##$PSIGN= 0
##$REVERSE= no
##$SF= 200.130013532006
##$SI= 16384
##$SIGF1= 3
##$SIGF2= 2
##$SINO= 400
##$SIOLD= 16384
##$SREGLST= <1H.CDCl3>
##$SSB= 0
##$STSI= 0
##$STSR= 0
##$SW_p= 3612.71676300578
##$SYMM= 0
##$S_DEV= 0
##$TDeff= 0
##$TDoff= 0
##$TI= <>
##$TILT= no
##$TM1= 0
##$TM2= 0
##$TOPLEV= 0
##$USERP1= <user>
##$USERP2= <user>
##$USERP3= <user>
##$USERP4= <user>
##$USERP5= <user>
##$WDW= 1
##$XDIM= 8192
##$YMAX_p= 0
##$YMIN_p= 0
$$ End of Bruker specific parameters
$$ ---------------------------------
##NTUPLES= NMR FID
##VAR_NAME=  TIME,          FID/REAL,        FID/IMAG
##SYMBOL=    X,             R,               I
##VAR_TYPE=  INDEPENDENT,   DEPENDENT,       DEPENDENT
##VAR_FORM=  AFFN,          ASDF,            ASDF
##VAR_DIM=   8192,          8192,            8192
##UNITS=     SECONDS,       ARBITRARY UNITS, ARBITRARY UNITS
##FACTOR=    0.0002768,     1,               1
##FIRST=     0,             0,               0
##LAST=      2.2672688,     0,               0
##MIN=       0,             -819801,         0
##MAX=       2.2672688,     663273,          0
$$ Real data points
##PAGE= N=1
##DATA TABLE= (X++(R..R)), XYDATA
0 0 0 0 0 0 0 0 0 8 -8 8 -8 16 -24 25 -33 40 -49 64 -80 97 -116 137 -166 195 -230 269 -312 359 -415 479
30 479 -549 623 -708 803 -907 1021 -1149 1287 -1439 1606 -1790 1987 -2203 2440 -2699 2984
46 2984 -3294 3632 -4002 4409 -4856 5351 -5897 6503 -7185 7954 -8825 9822 -10982
59 -10982 12342 -13972 15957 -18449 21674 -26025 32253 -41949 59190 -99017 384815 -199235
71 -199235 -578149 663273 149864 -346729 138842 -2412 -203133 441444 -44460 -575913
81 -575913 296350 411543 -516199 -142927 322369 -145257 -31011 157952 -393311 -22469
91 -22469 507384 -316821 -503371 479447 256330 -437746 -21042 226684 -38134 82504
101 82504 -64692 -239216 295412 238100 -446342 -65365 440400 -76608 -198915 165758
111 165758 -46257 -30982 233241 -206137 -261560 395545 124855 -447637 22715 294352
121 294352 -105348 -79290 3939 -109448 193267 135754 -387831 -14110 448509 -165838
131 -165838 -340718 260210 112773 -198885 99046 4090 -168244 233720 87333 -368215
141 -368215 80133 331036 -211971 -165109 200548 -19920 -30913 125144 -171925 -50634
151 -50634 330317 -117958 -336542 279111 211450 -305283 -16568 200460 -99406 -299
161 -299 88126 -171255 35855 226693 -179351 -156536 234056 18727 -167216 76089 7610
172 7610 -70725 140838 -39443 -205674 169431 151288 -244727 -39890 206554 -60005 -98400
183 -98400 62807 -29749 8602 86217 -111632 -55843 167887 -31545 -149726 89405 53438
194 53438 -83333 54520 15570 -98632 85910 71583 -150898 5548 151696 -63511
204 -63511 -78180 79988 3749 -21662 43659 -56401 -22294 119204 -36698 -119784 96562
215 96562 62756 -116431 9837 71421 -65050 1636 60937 -75459 -18290 98494 -41902
226 -41902 -72010 75764 17354 -62924 27677 10181 -37199 49224 10571 -74113 45100 65450
238 65450 -80614 -20602 86354 -22622 -51199 48145 5712 -37766 30312 6871 -37919
249 -37919 24603 20698 -36727 3914 23082 -21407 -292 14972 -23769 1289 25315 -28130
261 -28130 -20854 32904 -357 -31342 10618 16671 -12998 -6673 4082 1470 2725 -4284 -1410
274 -1410 12329 -2259 -9973 13150 5442 -14253 8912 14622 -13310 -2662 16792 -2898 -7478
287 -7478 8625 1630 -4062 1802 -4584 -869 8480 -7144 -8561 13005 -852 -20019 5167 11591
301 11591 -17231 -6818 17810 -3274 -15675 8399 7650 -12302 -2120 10877 -923 -3798 5501
314 5501 3029 -467 2302 -24 1107 5589 -1428 -3349 8862 3453 -9715 3252 10635 -9315
328 -9315 -8421 11483 284 -14492 3409 9201 -10094 -7529 6909 -1295 -9450 -296 3662 -2235
342 -2235 -3319 1120 2619 -1267 -2127 2341 2646 -1337 475 4134 2895 413 -283 4136 7026 -3262
358 -3262 -5030 12016 4754 -16029 3543 16863 -13379 -11090 18248 -3395 -18520 12395 3208
371 3208 -21501 9104 11950 -23569 117 19984 -17314 -9251 18811 -11038 -7579 23693 -13105
384 -13105 -17989 36648 1035 -40418 26384 30486 -36792 -125 34366 -20686 -6643 28310
396 28310 -23716 -12985 41605 -15128 -36645 34566 8753 -36666 14426 6607 -28873 25155
408 25155 9183 -52727 21754 48198 -52722 -20567 58844 -11080 -31384 30389 -6189 -12514
420 -12514 41453 -19961 -40094 58820 17419 -63878 21146 39011 -37073 8934 19236 -48184
432 -48184 26178 52270 -76676 -25142 92273 -23426 -72341 46221 16197 -35604 29123
443 29123 -18173 -44387 76319 14541 -106240 38243 88231 -73310 -27780 66422 -30297
454 -30297 -4896 59459 -67181 -27891 121872 -31269 -115337 87085 61287 -92712 7485
465 7485 38965 -46271 43378 22419 -114247 40265 122089 -110936 -75363 129469 -2013
476 -2013 -85731 50754 -5842 -41807 89922 -24006 -121984 103146 88621 -141238 -16060
487 -16060 114815 -36398 -27437 37627 -59136 28414 104997 -113396 -80515 167479 10813
498 10813 -153320 49609 72584 -60051 20143 -1326 -79238 92442 65864 -163340 -2724
509 -2724 163666 -64399 -95862 79353 2007 -18514 64215 -82451 -56505 171325 -10727
520 -10727 -191825 89930 135236 -118246 -36006 70145 -38789 36402 44620 -139167 20020
531 20020 180335 -106152 -138327 149057 43442 -112923 35745 5003 -51663 110866 -12514
542 -12514 -176545 106458 153110 -172466 -69887 157025 -15912 -64492 43947 -52920 9230
553 9230 133746 -103165 -127180 185904 59362 -187844 28853 112602 -64539 5276 21972
564 21972 -97704 75399 113312 -172219 -60536 198270 -25215 -146507 67116 38175
574 38175 -37566 53346 -58875 -82339 158167 33188 -204092 48737 166478 -100454 -69216
585 -69216 79970 -24967 11617 64623 -115608 -23519 181259 -51393 -161050 110996 82220
596 82220 -98544 8010 18985 -46411 88383 12580 -162946 63803 159536 -134162 -95211
607 -95211 137759 6900 -74778 36811 -30733 -16741 112991 -55523 -130894 129560 83285
618 83285 -149691 -6080 100775 -42832 -4453 31130 -82410 38414 116689 -118102 -82205
629 -82205 159712 13599 -131161 42300 51699 -42589 34193 -14572 -77235 94019 59338
640 59338 -144085 505 133279 -55918 -68867 63348 -12725 -16556 60762 -61494 -55349
651 -55349 119810 3449 -129242 49830 83326 -67518 -15537 32714 -32104 34695 31783
662 31783 -94599 9944 112543 -60783 -78939 84072 21167 -57733 26537 -1185 -31681
673 -31681 62433 -1607 -88019 51252 69705 -77835 -21617 62679 -20228 -12277 27671 -44352
685 -44352 2853 73188 -51518 -61949 82638 18738 -77905 21292 35362 -35937 15668 11895
697 11895 -49870 29993 46396 -64659 -14612 67866 -21639 -37999 36752 -5202 -18788 38256
709 38256 -17039 -39859 53204 17735 -62717 15602 47286 -31660 -12797 25352 -14999 1092
721 1092 22567 -30429 -9614 42667 -14910 -35462 28708 10052 -27762 10447 6659 -21106
733 -21106 16035 11627 -31921 5446 29773 -19839 -14846 22210 -1158 -9261 10941 -6219 -4409
746 -4409 19812 -6928 -18531 19883 8869 -21690 5606 13992 -12679 598 10458 -12306 -1187
759 -1187 13930 -10706 -8651 13822 -1956 -10173 7373 -662 -7265 8388 -1307 -11408 9842
772 9842 6425 -14465 2416 12520 -8605 -4494 10184 -2689 -5153 7231 -1076 -5252 5958
785 5958 510 -6016 3759 1577 -5844 2513 2885 -5965 1082 5455 -5026 -2595 6154 -1079 -5011
800 -5011 3446 2727 -3373 129 3331 -206 -1296 1045 1043 33 1 647 962 201 -373 -150 330 -178
818 -178 -1462 -709 1060 -507 -2271 692 1161 -2849 -1422 1947 -1335 -2860 1556 1578 -2108 163
834 163 2845 -120 -1449 1725 1843 -986 496 2293 501 155 1248 -44 12 1401 -872 -1474 2329
851 2329 165 -3217 1252 1615 -4608 -342 3020 -4548 -2419 5028 -2726 -5798 5107 1002 -6866
866 -6866 2532 2958 -4997 2275 3683 -5833 2967 7324 -7271 -1573 10748 -3611 -5663 8963
880 8963 -656 -6023 8836 -431 -10199 9265 5263 -14569 2446 10801 -9678 -2791 7814 -7711
894 -7711 -506 9555 -12386 -5974 17955 -5541 -16096 13924 5351 -13374 7504 3488 -12728
907 -12728 12092 7753 -22173 6638 22576 -17603 -9501 20351 -5694 -8615 13933 -10695 -8169
920 -8169 26455 -8045 -28494 25040 14458 -31481 3994 18657 -17343 4478 12848 -26144
932 -26144 6388 32420 -29804 -20398 40687 -1703 -30859 19045 5587 -16924 21833 -3828
944 -3828 -33511 32420 23661 -49967 756 44671 -21951 -18343 24274 -13169 -4000 30356 -29583
957 -29583 -25238 53611 -175 -54945 25666 31220 -32547 2634 12490 -25968 23804 23952 -55375
970 -55375 2348 64286 -31605 -43251 44275 7940 -26933 20498 -11036 -21108 50268 -4192
982 -4192 -66602 37729 49998 -56947 -14960 43151 -16555 -3764 20436 -41935 4241 64775
994 64775 -44004 -55194 69680 20491 -62473 13879 24107 -22600 25558 -1002 -55457 44517
1006 44517 53040 -77513 -20122 79325 -16187 -44091 30328 -6875 -8353 45026 -37684 -49227
1018 -49227 79507 20049 -91568 18489 63416 -39042 -13708 20982 -30597 25053 40914
1029 40914 -74686 -15313 97049 -26132 -77965 52172 30526 -40235 16835 -5373 -32775
1040 -32775 61830 11798 -94220 31203 85533 -62784 -42730 58355 -4588 -15568 25371
1051 25371 -43448 -7842 83831 -36047 -84933 73535 48492 -77283 -2749 40119 -22000
1062 -22000 18098 8972 -64816 33622 75168 -75922 -47022 88329 3728 -59447 23542 4526
1074 4526 -14200 45534 -27247 -63544 74019 42290 -96163 -1335 76830 -28962 -27542 24390
1086 24390 -24089 15142 47774 -65696 -32593 96154 -6150 -86628 39238 43383 -39262
1097 -39262 8226 3169 -35851 50341 26719 -88603 10619 90354 -45894 -55108 52758 6941
1109 6941 -22600 23585 -29558 -20057 72662 -13844 -84425 50247 58166 -64411 -15248 41603
1121 41603 -17637 5578 18794 -51552 10086 71203 -47234 -54856 67507 18769 -53612 13348
1133 13348 13512 -17604 32246 -6444 -55659 44304 47461 -69049 -16792 63523 -14230 -30625
1145 -30625 21954 -12830 -2221 39234 -35180 -38153 62763 11606 -65374 17385 38801 -27827
1157 -27827 78 11126 -27609 24326 30494 -54860 -7975 64203 -19138 -44255 33491 11264
1169 11264 -21087 16833 -9589 -22387 41088 4960 -54687 20607 42164 -36745 -15068 29043
1181 29043 -11608 -3672 19063 -27178 -6684 44195 -17401 -39341 34882 17731 -33083 5578
1193 5578 13675 -14819 13911 6884 -31100 14583 31789 -31746 -15142 35145 -4433 -20387
1205 -20387 15207 -2777 -9835 20354 -7855 -24766 24385 13008 -31037 2551 21247 -13396
1217 -13396 -3914 9809 -12642 3694 17358 -19195 -9549 26624 -3448 -20991 13729 7713
1229 7713 -12397 6654 2757 -11828 11395 7877 -18877 2897 16987 -11490 -7612 11703 -3979
1242 -3979 -4844 9277 -6822 -7012 13954 -2055 -15379 9137 7974 -12038 667 7420 -6347
1255 -6347 1157 5677 -7920 393 10292 -6552 -5601 9969 -458 -7059 5978 1032 -5668 5334
1269 5334 1939 -7477 3601 5548 -7081 -1323 6066 -2916 -2964 3554 -1803 -1958 3519 -2058 -3261
1284 -3261 4331 248 -4675 2469 2654 -3683 399 2689 -2124 -281 2603 -1152 -1094 2239 142 -1039
1300 -1039 1021 312 -652 581 -276 -591 665 -210 -1319 524 515 -1349 -365 692 -443 -872 173
1317 173 55 -169 -379 -20 672 182 -447 617 947 -646 -150 1171 133 -577 518 686 -744 -433
1335 -433 703 -388 -663 349 36 -820 -10 -138 -410 -94 -449 -487 965 -49 -1613 777 1418 -1575
1353 -1575 -298 2216 -565 -919 1834 -89 -887 1723 -253 -1569 1694 608 -2047 1147 948 -2496
1369 -2496 1418 1307 -3739 678 3515 -3907 -1983 4642 -1300 -3531 3044 -538 -2696 3512 -591
1384 -591 -4395 4689 2481 -6263 2098 4848 -4618 381 4522 -4833 684 6958 -6016 -4040 9787
1399 9787 -1511 -8665 6009 2568 -6329 3981 736 -7494 6560 4284 -12722 1928 11522
1412 11522 -8689 -5141 9831 -3631 -3960 8761 -6007 -6499 14660 -1174 -15922 10405 9627
1425 9627 -13114 761 8001 -7662 3790 6826 -14953 1864 18586 -13347 -12837 18467 764
1438 764 -14354 8232 851 -9159 13158 -682 -20143 14212 15773 -23042 -3265 20439 -8015
1451 -8015 -6454 10526 -9798 -330 20149 -15462 -16896 28031 4301 -27661 9521 14541 -13936
1464 -13936 3978 4557 -17264 13330 16749 -29687 -4675 33143 -11216 -21954 17851 2400
1476 2400 -9806 13357 -9814 -15491 29532 3496 -37476 14130 29175 -23530 -9087 17907
1488 17907 -8454 2973 13830 -25889 -2200 38728 -17121 -33342 30197 13859 -27027 5704
1500 5704 6138 -13299 19668 2070 -37364 18814 35485 -36404 -17827 36472 -3735 -17621
1512 -17621 13428 -10124 -3974 31753 -18282 -34088 40095 18993 -44851 3430 29477 -15041
1524 -15041 -1108 8182 -23359 14920 30410 -39905 -17845 50472 -4172 -39992 18262 12884
1536 12884 -14290 12871 -8525 -24241 36033 14522 -52405 6948 46611 -23728 -22558 22598
1548 22598 -4215 -764 18276 -28733 -10976 49980 -9817 -49363 29768 29198 -31422 -2326
1560 -2326 12343 -13640 18363 8748 -43679 11940 48102 -34039 -32238 39885 6257 -24458
1572 -24458 10676 -6053 -8473 33630 -11891 -43485 35994 32045 -46417 -7985 35946 -9897
1584 -9897 -7631 10531 -20940 8777 35407 -33985 -28233 49656 7162 -44305 11375 19819 -14707
1597 -14707 8914 -2232 -26658 28393 23537 -48514 -5238 48682 -14709 -29138 20344 1539
1609 1539 -6126 18044 -19976 -18533 43264 2434 -48180 17751 34186 -25859 -8417 14865
1621 14865 -11443 10149 14324 -34698 -379 44707 -19804 -35091 30216 12946 -23313 6340
1633 6340 457 -11527 24102 -698 -37601 20047 32285 -33219 -14014 29931 -4419 -10686
1645 -10686 10959 -13006 -1043 29070 -17488 -27764 32781 13684 -33365 3817 18682 -11462
1657 -11462 3229 4186 -20146 13256 21955 -30044 -11007 34073 -5188 -23494 13320 3728 -8671
1670 -8671 12791 -7495 -17408 24335 8803 -31390 5657 25119 -14867 -8211 12491 -6855
1682 -6855 1455 12947 -17598 -6580 27072 -6330 -23817 15850 11009 -15713 2730 4560 -9662
1695 -9662 10010 5343 -20774 4889 20372 -15029 -11519 16517 -475 -8972 7348 -3852 -5120
1708 -5120 14316 -3695 -16325 13265 10228 -16227 -303 11455 -6273 -714 5803 -8595 1703
1721 1703 12147 -10317 -8314 14367 75 -11839 5725 3229 -6512 4931 187 -9346 7377
1734 7377 6397 -12350 -241 11210 -5584 -5030 6856 -2026 -2268 6481 -3925 -5001 8944 491
1748 491 -9095 4781 5341 -6353 439 3867 -4163 1288 4045 -5766 -797 6772 -3408 -4866 5238
1763 5238 585 -4296 2358 563 -2935 2912 828 -4446 2122 3517 -3930 -570 3757 -1735 -1368
1778 -1368 2560 -1161 -1080 3164 -1068 -2453 2608 742 -2956 860 1373 -1930 78 835 -1545 261
1794 261 1477 -1762 -599 1738 -906 -1288 1313 66 -1050 886 356 -810 678 668 -795 350
1810 350 1043 -579 -105 903 -153 -285 499 -266 -443 388 -251 -800 273 41 -799 -23 249 -730 -189
1829 -189 429 -322 -418 341 81 -233 458 71 -288 513 199 -395 546 290 -429 382 411 -551 113 636 -738
1850 -738 -111 637 -628 -600 425 -422 -436 387 -790 -448 1058 -434 -1004 961 289 -1422 676 1003
1868 1003 -1150 644 1260 -1617 264 2115 -1405 -952 2337 -410 -1328 1617 -521 -1543 2140 -478
1884 -478 -2967 2221 1493 -3670 271 2687 -2389 -503 2144 -2540 -251 3486 -2775 -2692 4584 -103
1900 -103 -3817 2871 1348 -2807 2503 565 -4416 3509 3575 -6315 25 6483 -3523 -2928 4432 -1784
1916 -1784 -1871 4604 -3243 -4062 7138 141 -8337 4175 4726 -5968 448 3385 -4717 2428 4663
1931 4663 -7974 -559 10378 -4891 -7368 8322 1439 -5695 4100 -264 -4874 7935 709 -11455
1945 -11455 5976 8975 -10498 -2989 8992 -3804 -2368 5277 -6589 -1526 11644 -6833 -10909
1958 -10909 12749 4160 -12927 3298 6139 -6052 4026 2179 -10780 7064 11431 -14747 -4461
1971 -4461 16800 -3582 -10346 7911 -428 -3977 9024 -5862 -10924 15183 4758 -19487 3976
1984 3976 14432 -9663 -3630 6616 -6424 3289 9539 -15307 -4338 21340 -5424 -18125 12580
1997 12580 7804 -10748 3748 1044 -8123 12741 3987 -21134 6623 20552 -14992 -10696 15530
2010 15530 -1200 -5896 7082 -8682 -3660 19687 -7564 -21453 17821 12439 -20773 -643
2022 -643 12052 -6944 2779 3931 -15965 7154 19849 -19331 -12783 24577 1196 -17719 7550
2035 7550 3501 -5623 11164 -5246 -17130 19292 12359 -26863 -843 22852 -8872 -9782 8349
2048 8349 -5478 1821 13161 -16990 -10537 27053 -688 -26603 10787 14649 -12352 339 3000
2061 3000 -9768 12520 8729 -25063 1853 27570 -12723 -18154 16635 3752 -8663 6745
2073 6745 -6718 -6868 21323 -2956 -26294 14913 19375 -20733 -6173 14879 -5041 33 5968
2086 5968 -15602 2822 23212 -15793 -19006 23381 7241 -20067 4130 7030 -6582 9155
2098 9155 -1128 -18646 14755 17249 -24146 -6898 23947 -4085 -12755 7907 -2659 -1529 13196
2111 13196 -11463 -14533 22604 5837 -25332 4775 16903 -9901 -2888 4937 -8527 7600
2123 7600 11272 -19757 -4238 24804 -6251 -19148 12617 6763 -8900 4857 -2303 -8311 15592
2136 15592 2914 -22478 7693 19305 -14637 -8762 12770 -2410 -2940 6591 -10142 -2262 18312
2149 18312 -7577 -17796 15367 9363 -15594 637 7393 -5663 4714 2680 -13676 6425
2161 6425 15464 -14424 -8954 16993 223 -10732 5662 379 -3591 9098 -3931 -11970 12512
2174 12512 7489 -16589 49 12605 -5966 -3798 5295 -5293 1221 8968 -9945 -6338 14825
2187 14825 -599 -13093 6112 6069 -6498 2102 1299 -6099 6698 4651 -12148 1280 12345
2200 12345 -6410 -6707 7884 -114 -3702 4511 -3319 -3998 9022 -783 -10563 5765 6608 -8015
2214 -8015 -1029 5169 -3370 620 3396 -6209 188 8230 -5013 -5976 7906 1375 -6084 2867 1752
2229 1752 -3522 3517 727 -6065 3730 4825 -6641 -1219 6124 -2296 -2774 3235 -1576 -1556 4166
2244 4166 -2465 -3837 5192 916 -5759 1863 3277 -3275 221 2182 -2452 775 2672 -3386 -742
2259 -742 4396 -1512 -2800 2849 515 -1972 1531 -68 -1968 2065 669 -3240 987 2459 -2551
2274 -2551 -696 2020 -895 -803 1258 -982 -740 1913 -618 -1843 1790 740 -1626 479 996 -963
2290 -963 429 949 -1165 230 1476 -836 -651 1348 -83 -993 571 85 -702 336 91 -820 374
2307 374 312 -1099 51 661 -554 -289 696 -392 -291 456 -182 -349 587 197 -489 376 454 -380 187
2326 187 502 -336 -10 596 -327 -35 570 -278 -298 277 -141 -613 190 58 -600 176 225 -365 -59 222 -503
2347 -503 198 421 -571 105 556 -323 -144 523 -91 -162 505 -163 -476 616 3 -804 657 456 -915
2366 -915 276 413 -618 49 509 -980 -87 1116 -860 -735 1227 -217 -951 1043 -144 -961 1252
2383 1252 132 -1649 991 1097 -1554 -45 1259 -756 -61 1111 -1298 -253 2118 -1132 -1709 2269
2399 2269 139 -2202 978 440 -1632 1029 447 -2560 1317 2295 -2947 -411 3124 -1358 -1429 2201
2415 2201 -892 -979 2699 -1402 -2392 3986 841 -4097 1602 2619 -2769 267 1602 -2684 984 2967
2431 2967 -4198 -1201 5388 -1863 -3954 3508 462 -2771 2278 -722 -3182 4317 1274 -6240 2135
2446 2135 5300 -4451 -1866 4233 -1708 -599 3384 -3775 -1399 6854 -2098 -6229 5583 2967 -5895
2461 -5895 954 2656 -3432 2488 1760 -6735 2208 6943 -6440 -4174 7562 -716 -4732 3431 -917
2476 -917 -2337 5977 -2223 -7084 7261 4566 -9357 295 7112 -3698 -1072 3297 -4488 1484
2490 1484 7070 -7438 -4784 10786 -188 -9412 4477 3533 -4637 2615 -181 -6089 6839 4367
2504 4367 -11604 520 11256 -5381 -6161 6375 -605 -2000 5120 -5108 -4095 11370 -880
2517 -880 -12315 6588 8446 -8450 -1318 4940 -3625 2662 3733 -10019 1270 12423 -7471
2530 -7471 -9422 10556 2653 -7932 2874 195 -3840 7655 -1165 -11718 8029 9400 -12272
2543 -12272 -3177 10624 -2501 -3528 3944 -4894 616 10108 -7906 -9081 13492 3237 -13183
2556 -13183 2784 7007 -4807 1433 866 -7616 6426 7877 -13296 -3067 14599 -3485 -9854
2569 -9854 6193 1607 -3409 5221 -4239 -6628 12088 2624 -15076 4077 12030 -7824 -4208 6033
2583 6033 -2734 1175 5225 -9760 -1678 14308 -4855 -12692 9516 6022 -8769 1337 1886 -4338
2597 -4338 6585 1409 -12478 4997 12204 -10399 -6664 10751 -190 -4989 3818 -3399 -1371
2610 -1371 9894 -4830 -10905 10962 6569 -12373 122 8050 -3748 -407 2600 -6737 3461
2623 3461 9002 -10101 -5891 12841 -234 -10223 4270 3197 -3765 3904 -1599 -7116 8536 4822
2637 4822 -12578 694 11417 -5141 -5586 5398 -1260 -697 5193 -6058 -3655 11233 -1027
2650 -1027 -10964 5885 6446 -6635 -31 2735 -3705 3727 3203 -9169 1139 10146 -5939 -6966
2664 -6966 7656 1197 -5058 2687 -814 -2814 6462 -873 -8381 5583 6275 -8032 -1487 6463
2678 6463 -2290 -1525 2963 -3930 336 6705 -4735 -5430 7636 1760 -7189 1881 3165 -3021 1560
2693 1560 616 -4723 3587 4253 -6987 -1274 7111 -2282 -4114 3572 22 -1869 3288 -1946 -3441
2708 -3441 5710 1200 -6199 2151 4412 -3558 -782 2510 -2155 866 2718 -4206 -734 5252 -2161
2723 -2161 -4462 3735 1389 -3054 1448 679 -2147 2332 1012 -4053 1475 3633 -3343 -1432 3425
2738 3425 -516 -1455 1869 -882 -1039 2959 -830 -2826 2829 1556 -3203 585 2139 -1507 -105
2753 -105 1163 -1731 491 2027 -2101 -1134 2489 -572 -2039 1304 438 -1262 966 166 -1444 1533
2769 1533 1062 -2238 302 1755 -1074 -641 1320 -498 -348 965 -709 -748 1512 -207 -1503 960
2785 960 873 -1289 100 645 -770 213 658 -1023 -74 937 -557 -746 844 137 -889 456 204
2802 204 -489 601 190 -606 611 628 -588 -19 671 -334 -294 559 -22 -543 454 -288 -576 226 196 -659
2822 -659 143 138 -600 98 302 -442 17 455 -350 -155 488 -156 -245 213 50 -297 325 98 -336 302 281
2843 281 -159 19 118 -359 42 279 -412 -230 323 -356 -265 283 -135 -522 253 -130 -395 471 153 -563 77
2864 77 452 -514 207 480 -110 147 470 -418 -76 659 -251 -530 593 -63 -486 316 -50 -523 575 110
2884 110 -1110 251 666 -964 -301 725 -496 28 614 -544 -199 1321 -410 -1040 1157 443 -1174
2901 -1174 496 443 -879 604 480 -1404 752 1550 -1307 -596 1687 -686 -1027 923 -593 -741 1407
2918 1407 -459 -1893 1593 889 -2200 161 1630 -1324 -75 974 -1586 275 2068 -1973 -1117
2933 -1117 3035 -77 -2226 1499 608 -1375 1248 2 -2186 2145 1374 -3397 304 2971 -1866
2948 -1866 -1374 1863 -1131 -365 2057 -2119 -1852 3765 -191 -3834 2131 2067 -2499 369 1141 -1945
2964 -1945 1575 1766 -3661 158 4402 -2442 -2805 3431 175 -1968 1795 -995 -1849 3630 -153 -4766
2980 -4766 2970 3391 -4382 -639 3256 -1680 -496 1902 -3149 54 4786 -3340 -4147 5248 1003
2995 1003 -4756 1584 1884 -2257 2144 294 -4338 3409 4074 -5758 -1296 5900 -1617 -3268 2670
3010 2670 -770 -699 3346 -2879 -3701 6003 1209 -6963 1825 4515 -3557 -822 2070 -2622 1832 3295
3026 3295 -5823 -1096 7508 -2282 -5853 4408 2114 -3250 1851 -529 -2910 4986 807 -7442 2776
3041 2776 6619 -5131 -3076 4637 -960 -1220 2372 -3563 -758 6580 -2797 -6686 5843 3425 -6002
3056 -6002 275 3230 -2324 1928 1040 -5540 2915 6078 -6363 -3425 7645 -40 -4953 2534 294
3071 294 -1519 4114 -2156 -5371 6126 3323 -8079 175 6305 -3000 -1999 2401 -2511 1198 4314
3086 4314 -5415 -2893 8145 -468 -7393 3362 3548 -3499 1016 570 -3234 4325 2449 -7384 579
3101 579 7613 -3976 -4458 4538 394 -2050 2341 -2539 -1908 6468 -788 -7397 4173 4867 -5530
3116 -5530 -1092 3572 -1742 860 1782 -4853 1095 6491 -4557 -4807 6428 1340 -4937 1604 1196
3131 1196 -1946 3025 -569 -5444 4019 4388 -6407 -1525 5818 -1600 -2799 2195 -1529 -299 3846
3146 3846 -3356 -3715 6043 1329 -6359 1642 3926 -2710 -113 1124 -2646 2143 3139 -5118 -973
3161 -973 6198 -1769 -4377 3229 1000 -1899 1746 -1030 -2216 4103 541 -5385 1967 4465 -3654
3176 -3654 -1800 2987 -1014 -385 1881 -2572 -599 4582 -1873 -4067 3768 1846 -3393 458 1498
3191 1498 -1550 1585 853 -3419 1458 3402 -3350 -1996 3830 -472 -2406 1592 -285 -1066 2427
3206 2427 -1215 -2834 3095 1534 -3665 170 2764 -1495 -507 1265 -1363 272 2148 -2143 -1318
3221 -1318 3483 -121 -2682 1625 1428 -1665 535 485 -1398 1549 917 -2766 537 2365 -1490 -1348
3237 -1348 1667 -278 -923 895 -693 -712 1988 -238 -2132 1240 1198 -1710 -96 1005 -738 201
3253 201 821 -1157 -78 1624 -1003 -971 1545 86 -1306 683 430 -785 697 224 -1206 804
3269 804 791 -1335 -126 1290 -448 -499 635 -252 -239 620 -394 -570 1026 168 -1013 427 609 -686
3287 -686 -34 388 -419 49 550 -725 -257 839 -294 -510 606 172 -478 333 10 -554 454 133
3305 133 -660 15 453 -549 -346 475 -309 -215 304 -210 -232 386 -31 -280 415 277 -534 167 328 -255
3325 -255 120 305 -243 78 334 -215 -75 197 -82 -308 224 -147 -294 128 161 -291 145 260 -270 136
3345 136 297 -242 15 418 -232 -8 307 -54 -39 398 57 -172 194 60 -269 141 158 -437 85 395 -110
3366 -110 -181 161 -230 -145 300 -248 -147 454 -64 -474 214 219 -179 112 91 -380 215 294 -519 -48 563 -414
3388 -414 -201 455 -159 -205 515 -518 -507 547 -174 -682 360 330 -758 120 486 -574 200 492 -902
3407 -902 -32 938 -596 -511 795 49 -455 584 -227 -453 850 -12 -1280 673 830 -1257 23 774
3425 774 -615 22 662 -922 -8 1164 -987 -1093 1413 128 -1122 651 357 -872 820 107 -1340
3442 -1340 1013 1242 -1645 -260 1649 -462 -656 988 -465 -178 1557 -904 -1183 1988 437 -1816
3458 -1816 746 1101 -1239 76 336 -1361 648 1436 -2064 -326 2363 -724 -1735 1560 507 -807
3474 -807 981 -368 -1193 1921 402 -2619 860 2252 -1728 -526 1737 -595 8 1418 -1663 -421
3490 -421 2992 -1061 -2685 2080 1253 -2165 316 775 -1251 1207 604 -2722 1133 2867 -2377 -1587
3506 -1587 2922 -143 -1421 1254 -687 -584 2309 -947 -2731 2751 1689 -3287 50 2253 -1238
3521 -1238 -109 926 -1812 705 2392 -2707 -1787 3768 -336 -3170 1371 1030 -1302 1021 -430
3536 -430 -2212 2517 1466 -4013 315 3722 -1807 -1697 1856 -332 -305 1808 -1763 -1419 3985 -182
3552 -182 -4007 2080 2389 -2669 -264 1369 -1448 1025 1193 -3510 208 4076 -2480 -2896 3258 699
3568 699 -2203 984 -166 -1020 2707 -383 -3657 2521 2912 -3631 -814 2890 -781 -747 1077 -1732
3584 -1732 222 3119 -2499 -2920 3921 804 -3685 942 1700 -1348 845 151 -2489 1867 2414 -4030
3600 -4030 -826 3980 -871 -2422 1731 246 -678 1793 -1348 -2093 3408 651 -4320 1219 3179
3615 3179 -2310 -825 1462 -1107 587 1652 -2856 -527 3965 -1262 -3308 2697 1248 -2052 409
3630 409 390 -1262 2081 515 -3498 1187 3121 -2838 -1712 2717 -52 -916 1180 -1107 -295 2672
3646 2672 -1185 -2976 2704 1661 -3020 37 1835 -925 114 625 -1841 815 2391 -2690 -1452
3661 -1452 3213 -111 -2313 985 553 -1129 1134 -459 -1777 2185 1213 -2980 265 2636 -1276
3676 -1276 -900 1475 -694 -15 1430 -1442 -1079 2676 -320 -2539 1299 1399 -1590 58 621 -929
3692 -929 745 799 -1988 282 2453 -1281 -1507 1688 255 -1152 588 -252 -601 1494 -38 -1843
3708 -1843 1349 1330 -1875 -227 1416 -640 -279 686 -1000 -138 1400 -1031 -1145 1663 229 -1556
3724 -1556 426 778 -962 361 344 -1261 704 925 -1454 -330 1506 -334 -748 710 28 -547 713
3741 713 -331 -560 1239 287 -1375 516 779 -725 -69 667 -398 118 505 -906 -445 1035 -523
3758 -523 -913 725 224 -702 298 171 -183 484 67 -714 217 637 -510 -147 730 34 -229 292 -193
3777 -193 -217 459 -243 -717 452 205 -608 -43 398 -369 52 53 -239 -133 308 -385 -395 483 -101 -527 407
3798 407 217 -396 46 81 -255 304 247 -347 -4 554 5 -242 459 -322 -144 243 -142 -109 295 30 -186
3819 -186 228 348 -261 51 177 -228 -96 342 -130 -147 223 -35 -96 217 175 -188 272 30 -152 163 11
3840 11 -151 66 174 -210 -88 232 -198 -4 246 -151 -220 116 -117 -190 160 -116 -428 173 148 -64 111
3861 111 140 -132 -10 172 -117 -89 262 -49 -45 120 -103 -272 203 20 -347 189 121 -145 -65 91 -227 54
3883 54 233 -334 -76 413 -267 -290 362 -194 -267 287 -81 -282 500 24 -503 61 388 -323 119 218 -264
3904 -264 -31 288 -332 -175 593 -331 -541 351 -76 -261 136 -24 -174 518 193 -566 66 469 -398 -295
3924 -295 397 -260 -67 418 -372 -215 736 -248 -718 532 290 -613 264 189 -405 317 407 -727 141 656
3944 656 -524 -495 844 -184 -385 476 -227 -273 762 -321 -795 691 426 -971 178 736 -515 4
3962 4 261 -569 131 979 -840 -779 1164 82 -920 511 395 -553 520 -263 -903 828 641 -1473
3980 -1473 18 1192 -606 -584 732 -280 -140 747 -780 -605 1405 -102 -1362 587 787 -932
3996 -932 43 521 -672 521 652 -1584 130 1624 -800 -1065 1332 108 -658 670 -389 -618 1265
4013 1265 66 -1834 902 1335 -1511 -470 1057 -644 -19 689 -999 -85 1596 -1075 -1443 1748
4029 1748 488 -1655 424 561 -619 632 74 -1548 903 1332 -1811 -605 1758 -432 -815 611
4045 611 -398 -177 1211 -1050 -1290 1835 348 -2093 376 1588 -934 -198 499 -801 519 1073
4061 1073 -1754 -393 2365 -528 -1652 1108 450 -927 486 -91 -987 1399 358 -2214 559 1906
4077 1906 -1168 -919 1150 -428 -313 800 -1095 -404 1875 -689 -2015 1435 1048 -1595 -48 623
4093 623 -489 471 528 -1543 442 1682 -1487 -1179 1904 -26 -1323 529 15 -394 1242 -547 -1454
4110 -1454 1327 1128 -2040 -170 1598 -547 -447 599 -657 72 1278 -1315 -1046 1970 -23 -1821
4126 -1821 834 907 -989 394 269 -1038 1156 869 -1852 68 1860 -963 -1180 948 29 -416 735
4143 735 -664 -672 1504 -43 -1865 610 1310 -1383 -322 827 -421 205 515 -1138 68 1699 -924
4160 -924 -1278 1293 256 -1081 366 307 -568 689 -67 -1397 683 1202 -1242 -506 1221 -218 -868
4177 -868 623 -290 -9 1117 -630 -1020 1224 358 -1522 274 910 -550 -30 308 -724 490 850
4194 850 -1068 -483 1442 -247 -1019 523 52 -635 377 -132 -684 697 168 -1138 283 1035 -719
4211 -719 -199 635 -186 -277 528 -567 -184 1152 -191 -945 547 581 -773 107 206 -395 207 118 -843 149
4231 149 659 -699 -460 812 135 -474 262 -1 -235 323 -1 -527 489 584 -781 154 593 -405 -60
4250 -60 259 -242 -192 510 -401 -229 787 46 -661 314 68 -328 -45 104 -472 219 168 -569 -114 447 -248
4271 -248 -428 368 -23 -144 114 -154 -160 382 146 -459 274 466 -292 -133 281 -25 -6 23 -321 5 253
4292 253 -154 -372 411 224 -278 -88 133 -269 140 -11 -170 226 241 -185 -127 395 -172 -94 155 -112 -175
4313 -175 164 -32 -145 286 86 -178 -104 161 -89 52 210 -232 -132 249 -187 -27 160 98 -196 84 22
4334 22 -199 -154 140 -164 177 118 -145 45 303 -185 30 286 37 -150 240 -77 -186 161 144 -155 48
4355 48 59 -223 61 214 -217 7 250 -185 -113 114 77 8 102 224 -142 60 7 44 123 154 -117 2 14 -286
4379 -286 41 204 -140 47 207 -260 -132 216 56 -279 71 124 -130 110 9 -272 -5 108 -143 78
4399 78 188 -70 -110 98 -92 -19 232 -90 -153 364 -164 -195 88 93 -37 89 -2 -173 90 173 -388 -45 222
4422 222 -142 -184 162 -145 -124 282 -266 -246 383 -50 -393 226 252 -355 -79 72 -198 279 252 -400 75 661
4444 661 -216 -319 366 160 -167 342 84 -290 383 6 -467 375 339 -413 -316 281 -166 -85 302 -509 -3
4465 -3 602 -290 -416 392 210 -407 59 274 -247 272 274 -571 380 392 -541 -272 677 -145 -342 257 -237 -237
4487 -237 561 -169 -403 652 242 -754 -21 569 -325 11 219 -551 90 576 -775 -277 865 -221 -552
4506 -552 532 3 -328 378 -43 -441 461 357 -890 29 733 -386 -224 393 -102 -35 551 -642 -249
4525 -249 953 -394 -1070 523 476 -768 52 190 -317 374 314 -825 208 959 -604 -512 671 58
4543 58 -501 271 -223 -423 638 -154 -817 746 513 -851 2 697 -269 -136 335 -395 112 836 -621
4562 -621 -713 955 112 -872 31 359 -253 206 143 -623 604 678 -1053 -19 1120 -176 -624 455 -20
4581 -20 -221 430 -529 -460 1069 70 -1257 382 675 -732 -207 260 -325 350 492 -759 -178 893 -363
4600 -363 -885 618 137 -391 161 86 -299 656 107 -1144 520 861 -862 -449 637 -134 -280 331 -524
4619 -524 -38 875 -496 -698 863 485 -715 65 444 -351 192 87 -503 376 684 -850 -164 852
4637 852 -172 -513 346 116 -35 416 -236 -610 815 280 -943 254 613 -268 -414 442 -421 -5 405
4656 405 -569 -387 807 -76 -653 392 503 -316 186 207 -250 503 151 -666 -7 740 -380 -191 564
4675 564 225 -275 75 -48 -149 481 -168 -660 586 425 -582 -8 310 -148 35 236 -533 -54 686
4694 686 -238 -406 712 263 -490 86 218 -132 271 -117 -510 301 414 -623 -131 507 -248 -252 102 -99
4714 -99 66 389 -310 -254 391 57 -530 68 425 -323 -1 124 -239 128 190 -474 -23 601 -181 -527 223
4735 223 193 -303 109 74 -111 163 -32 -295 166 214 -495 -106 279 -130 -102 83 -130 -57 191 -226 -235 183
4757 183 63 -183 110 317 -141 151 16 -206 231 373 -2 -124 236 70 -362 77 -29 -104 64 -50
4777 -50 -206 275 172 -121 127 147 -140 -74 76 57 5 80 -184 22 171 -109 -128 151 165 -1 -134 -72 0
4800 0 -2 74 -182 78 169 -66 -211 237 69 -141 226 -64 -95 103 -158 -35 65 160 -161 159 140 88 -131
4823 -131 109 43 -42 67 -84 -134 136 -30 -138 219 128 79 -26 -82 27 -64 74 -208 -120 77 30 -54 73
4846 73 -53 -116 194 -53 -131 82 188 -12 -69 13 -153 -41 -28 -42 -134 20 0 -49 163 -78 -22 98 11 -3
4870 -3 69 126 -18 86 -6 -171 0 39 -67 48 110 -189 60 139 -42 -83 45 -7 -28 59 1 -89 6 -30 -326
4895 -326 99 124 12 88 64 -149 -120 171 -118 40 47 -58 0 37 41 -173 -51 39 2 -141 -51 12 -175 18 -62
4920 -62 54 139 144 -26 -39 -233 38 110 -109 -47 379 130 -218 -126 134 -21 24 112 -240 -99 152 -46 -215
4943 -215 238 -106 -120 97 63 -201 22 -80 -20 149 85 -310 123 301 -223 -196 119 -137 14 69 -165 10
4965 10 221 45 -365 97 80 -122 24 92 -17 26 81 -183 -62 304 -158 -218 204 263 -174 -69 139 -152
4987 -152 219 23 -261 23 298 -190 42 253 -135 54 49 -112 27 237 -210 -209 278 34 -499 6 83 -79
5009 -79 118 44 -142 111 167 -269 -31 293 -48 -179 7 70 146 178 -63 -181 269 110 -309 103 225 -154
5031 -154 28 8 -210 117 380 -255 -135 437 -292 -429 318 40 -165 107 -145 -182 286 65 -476 7 357
5052 357 -243 -242 340 -121 -77 169 -153 -274 260 -220 -516 338 20 -411 43 255 -117 1 -113 -498 239
5073 239 284 -316 -303 302 -60 -188 316 56 -102 286 -164 -408 367 235 -550 -5 359 -115 -12 60 -150
5094 -150 81 379 -208 -181 409 39 -516 221 145 -172 68 107 -85 139 154 -269 -136 378 -148 -171 240 -36
5116 -36 -178 217 -74 -73 484 -19 -377 242 325 -225 -140 -41 -90 127 48 -404 39 360 -134 -222 309 -63 -350
5139 -350 88 115 -235 165 -206 -125 10 314 -370 28 127 -128 -148 25 40 -21 147 -216 -89 246 60 -271
5161 -271 239 168 -23 -50 234 -279 298 265 -439 -165 424 -219 -82 134 -1 53 4 -45 -277 350 167 -150
5183 -150 115 301 -201 -16 29 72 -1 264 -162 83 106 -109 -93 191 127 -191 96 -76 -147 100 112 -289 166
5206 166 192 -283 -1 40 129 -116 84 -72 -19 51 -20 -279 223 -53 -136 -38 64 -15 -89 75 -88 -74 180 -183
5230 -183 3 257 45 -215 -149 -58 -205 -42 -78 -15 49 43 14 88 154 -43 -255 147 -28 -145 52 -97 -108 244
5254 244 -175 -110 69 60 -144 -70 6 -127 176 169 -20 154 91 -21 -122 124 82 -3 61 -96 25 -65 -16 -147
5278 -147 224 146 -112 -11 -27 -74 -147 143 -25 53 8 14 63 -29 95 -58 -20 -5 50 -2 53 -81 30 -24 8 43
5304 43 103 119 -134 115 -64 -49 19 -32 -50 -42 -14 75 -105 122 44 -82 -23 -89 36 -58 -94 17 79 -116 16 67
5330 67 64 -82 47 45 27 57 5 -34 -32 -1 -91 -115 219 -89 -106 78 34 56 -10 -170 -57 153 73 -89 -178 13 29
5357 29 -72 -15 -116 -34 -39 63 -25 -121 33 55 18 -35 26 -85 34 54 20 -50 -182 -164 -34 -18 47 -70 28 -212
5383 -212 -66 -60 -107 30 -61 161 -140 -44 -124 -141 -10 59 76 120 27 98 -128 52 -8 13 -39 104 179 44 33 -19
5409 -19 46 148 -6 -119 -53 13 79 -49 107 -24 76 70 50 18 -7 169 74 38 121 -70 22 76 -103 -32 -109 3
5435 3 79 -124 6 -106 21 39 -15 116 199 -48 -98 -52 -9 -72 99 11 10 -80 78 -83 -92 110 -69 -44 117 -180
5461 -180 -134 51 -42 -11 18 -5 -222 -73 27 -67 -28 68 -47 -119 -82 -77 6 -102 -21 2 22 94 -101 178 -122 -133
5487 -133 124 -40 -135 34 29 68 228 -71 -56 -37 24 80 17 51 -216 51 146 -61 -80 -28 42 3 -50 -37 -202 -106
5513 -106 255 -66 -67 235 -31 74 196 -61 -150 79 97 -63 55 -33 -58 -1 42 -47 144 -113 -95 50 -143
5536 -143 -76 -77 74 -88 -180 241 -21 -163 -65 -115 37 36 -84 13 183 160 110 -81 10 72 35 -112 -35 -161 44
5561 44 7 -74 133 135 -226 -58 32 53 -73 -72 -175 -110 19 -48 113 38 -49 40 -10 -74 52 319 141 -39 90
5586 90 -13 -148 53 35 -54 95 -13 -35 140 -193 -124 -118 170 -155 -104 122 54 14 46 89 -78 112 100 -43
5610 -43 117 145 -112 35 -37 18 -88 -4 -140 -135 43 -173 -91 24 61 33 52 170 80 -4 65 62 92 49 125 -33
5636 -33 -22 -160 -21 -93 -103 -133 -49 -125 -46 110 -47 81 -17 34 -41 40 122 -157 109 -68 -27 -32 -63 -26 -84 195
5662 195 -7 -128 -124 -115 -14 8 -103 -151 12 185 -221 -78 63 -12 -116 55 -203 85 60 -11 -27 -87 -49 9
5686 9 -50 -145 24 -16 -139 -162 49 -36 -82 51 -176 4 17 -114 101 -61 -196 131 -2 -17 25 -92 -39 239
5710 239 -54 150 -3 90 -50 -100 -43 -78 16 -4 -38 -60 52 -8 -78 6 -32 23 -22 14 -32 20 -46 -132 162 17
5736 17 -2 -90 45 -9 162 86 57 -70 -50 -97 105 -62 68 -109 -40 28 -20 -42 -45 -80 -169 -25 29 84 106 48 -115
5763 -115 46 -21 -80 -115 -44 57 14 -44 48 -80 -27 10 -33 -44 -60 -74 43 103 -111 -97 2 -50 -117 -105 7 -96
5789 -96 -178 36 -136 -203 -48 62 -58 62 167 -111 -6 -159 87 -19 -109 120 -42 42 -180 -42 -111 -154
5811 -154 46 191 -118 67 -33 134 10 -20 -20 -71 63 -108 -61 -168 45 41 -114 -6 26 82 -50 50 -38
5834 -38 85 -85 -64 35 -86 34 43 -3 -114 -28 -112 -177 -60 18 70 19 97 128 -205 73 38 17 -18 220 -16 48
5860 48 110 -54 -62 -96 101 53 -63 -32 158 39 -107 -10 -41 -85 -8 -138 -62 -78 72 -42 -24 -112 136 111 48 -125
5886 -125 28 3 -46 94 28 -33 36 -209 107 56 43 55 -1 -55 -48 88 -161 79 39 -8 11 52 -194 44 148
5911 148 -19 -70 -6 -1 -177 80 269 -26 188 98 69 46 86 127 -41 -101 25 120 -12 88 55 85 39 64 116
5936 116 169 163 -54 -85 -110 -53 -3 37 -54 106 -72 87 116 2 -69 -23 -100 57 -2 -162 -108 111 195 61 16 -11
5962 -11 -259 -137 138 74 3 -36 63 52 -119 8 -125 74 -10 -177 15 38 -220 -1 37 38 53 -78 -22 -60 91
5987 91 -120 -133 62 -138 -16 -12 -38 152 74 97 -118 226 22 -64 -52 124 28 -103 0 -56 -51 152 -31 -119 138
6012 138 -75 -26 88 -10 71 -15 -161 -48 -18 45 52 -72 29 -62 80 48 142 11 -167 -55 -63 8 -91 -213 -97
6037 -97 94 75 52 -154 -141 -38 70 32 130 -54 112 -140 -54 121 -4 86 111 -38 -27 -125 -186 -1 88 -52
6061 -52 -79 113 -53 -49 -10 69 46 95 84 -122 31 134 -141 -43 64 8 -18 42 10 -169 13 52 13 151 155 0
6087 0 -87 33 -5 7 151 5 95 120 -114 14 69 85 -147 75 52 -72 86 41 -225 -24 128 -175 48 40
6111 40 -21 -124 62 -104 -20 -9 27 89 70 14 -127 29 -21 22 121 29 -119 27 92 -44 64 37 -171 20 378
6136 378 23 87 101 -38 -105 179 -18 23 -47 119 -210 -75 92 -58 -31 38 -93 92 70 -63 151 170 307
6159 307 17 133 18 -109 19 30 -34 79 74 -147 -1 51 -124 -139 -8 -72 -81 115 0 -178 -118 31 -159
6182 -159 -35 21 -67 5 150 -59 166 -2 15 -7 -69 74 63 49 186 -28 91 62 101 76 205 -133 53 193
6206 193 51 84 285 41 66 70 -138 -14 37 102 -37 82 158 -126 13 68 -5 111 37 -61 28 33 6 67 136 133
6232 133 -133 219 -99 14 -54 -8 -27 194 71 -190 -29 52 79 -62 -80 -118 103 42 -7 69 153 151 -56 -66 40
6257 40 -13 96 -127 -2 -44 -3 50 91 66 67 122 67 -24 12 2 -33 65 109 -7 -157 64 94 -39 -81 108 -51
6283 -51 125 -66 -60 21 49 -72 -35 -64 -56 64 50 -117 -134 -101 70 53 45 108 88 90 -44 132 18 -30 1 116 -89
6310 -89 -90 -69 97 44 -204 26 184 47 72 31 111 -72 37 -132 254 107 -24 -59 164 5 206 38 -149
6333 -149 248 -68 126 -201 -16 48 -34 167 10 -181 51 93 -79 -66 -97 -113 -34 67 -39 5 150 32 -280
6356 -280 66 18 -220 4 -9 -71 -44 104 32 -59 -7 64 -15 -119 -155 69 129 308 21 -112 -65 181 126 46 111
6381 111 -4 -60 -15 155 -10 -71 -130 62 89 -211 -3 44 -7 -109 105 -110 136 -5 -102 29 41 23 -272
6404 -272 -97 -63 -41 -55 103 -43 144 27 -47 -15 164 -55 119 10 -46 114 43 -81 -134 59 162 112 91
6427 91 -176 30 19 20 -127 57 205 -40 55 1 24 198 97 -131 10 29 -56 40 94 5 -13 -48 40 -126 89
6452 89 68 -149 72 41 -64 28 55 -37 -29 110 -81 -140 218 -59 -65 85 -10 -85 200 -40 -176 105 147 78 88
6477 88 106 124 -94 165 28 -32 -21 -191 -76 -19 95 86 39 -26 4 -5 -59 -238 52 85 -108 8 139 -75 -125
6502 -125 -10 47 -151 129 17 108 -48 77 -145 10 97 -198 -144 34 11 -51 0 -102 -115 16 -7 -127 99
6525 99 -67 -260 -38 35 -43 38 -50 -192 110 27 -91 -4 298 -64 -14 86 272 7 -60 85 -40 124 133 -107
6549 -107 104 76 33 -95 -68 -48 -29 -124 -73 -103 123 227 -174 34 66 -84 -45 50 -71 33 -41 -138 2 212
6573 212 -112 -133 155 -121 -4 -3 87 -26 121 -212 -206 157 112 -81 -105 -71 -135 55 -91 -124 101 236 -175 -141
6597 -141 210 -163 -249 134 -39 179 -15 -89 -43 92 251 -167 -130 146 -63 109 -32 -65 92 26 -238 -157
6619 -157 222 -73 5 -55 226 -1 -4 -134 -53 -148 8 69 29 285 -77 -119 217 18 -50 67 -34 -85 110 111
6643 111 -166 223 155 -114 16 55 -51 62 65 31 25 149 -37 -187 84 182 -288 -100 161 -193 87 172 -134
6666 -134 28 299 -257 -95 115 -78 -80 100 149 44 231 104 -16 123 89 -242 28 181 38 180 92 -67
6688 -67 34 112 -94 -68 46 -126 -146 61 38 -24 80 -74 -182 -29 -25 -94 129 51 -199 -223 2 125 155 188
6712 188 -24 -66 53 63 -55 -1 44 -60 -35 -12 -44 43 8 27 161 -84 -33 68 162 -67 110 -93 90 -25
6736 -25 -47 132 57 222 115 -174 61 41 56 -64 140 -121 -290 106 -252 71 198 116 -228 17 35 8 -5
6759 -5 101 -123 44 -47 -45 -70 191 -118 -66 42 -68 12 60 -95 -75 30 -10 -48 40 20 107 -66 62 -10 -186
6784 -186 89 -40 6 63 -199 -102 76 -21 -67 -85 63 91 -186 -50 -23 23 120 -77 41 80 148 -15 136 102
6808 102 52 58 188 87 24 79 -39 59 80 -66 52 20 -179 -93 -148 -12 87 35 -93 -121 26 199 -89 67
6832 67 6 3 53 45 -144 33 -91 -82 22 126 48 -49 19 -3 -66 64 24 -108 -99 36 -171 51 159 -67 45 52
6858 52 37 -89 51 35 -15 38 35 92 -21 89 57 173 -18 -131 -37 -76 -39 22 193 -67 24 155 162 -179 184
6883 184 82 -90 37 30 60 84 -193 -36 26 151 -57 -82 -12 51 24 29 -209 -153 49 54 -212 55 268 -105 56
6908 56 261 -110 30 12 -112 -12 107 -113 84 170 -84 -67 92 56 -124 146 -143 -54 118 -77 17 105 95
6931 95 6 99 75 -42 182 107 -111 -96 220 -40 54 -45 -183 -98 -2 31 29 -31 129 -123 -35 79 -156 -13 -12 27
6957 27 -79 43 104 -44 133 -151 -49 8 -19 -287 -93 106 -84 -33 -9 -290 -1 -16 -272 -256 112 140 -14
6980 -14 -88 -83 -203 -8 -62 -14 95 -38 -141 -104 169 -126 180 -41 -13 26 -64 -131 -76 127 -175 8 120 -139
7004 -139 -25 5 75 88 179 -2 36 23 96 -275 -35 52 46 -78 97 -114 -166 214 -47 34 48 199 -277 25
7028 25 18 -216 88 57 -18 -48 104 -11 -53 130 17 -41 108 82 -42 50 -43 -30 60 202 7 -246 62 31 -19
7053 -19 1 -91 -117 52 -47 -158 103 -16 15 -147 -119 -85 -121 -7 -100 50 186 -249 127 191 -99 -163 35 10
7077 10 2 261 -88 -160 38 -27 -6 217 159 -152 -120 47 -115 -18 63 39 151 139 -135 -174 125 126 -94 -72 -9 -158
7103 -158 44 128 -189 93 135 -134 -102 63 61 -36 -29 89 -129 10 -149 -77 25 -99 -85 23 3 -141 19 -99
7127 -99 27 184 228 -144 -90 181 175 -121 44 126 -96 63 -93 -160 59 48 -243 28 168 -84 -83 113 -98
7150 -98 47 60 -62 -91 135 58 -266 29 49 -215 83 -168 -116 152 151 -282 126 145 -189 -47 164 -11 -128
7173 -128 63 52 64 103 -56 -236 -17 130 -234 16 198 -24 100 147 -9 -62 178 -194 -132 381 12 -341
7195 -341 55 214 -136 -30 114 -87 39 73 -307 90 75 -91 54 -105 -90 -108 136 -40 -183 -2 -70 -69
7217 -69 242 169 -52 -102 12 35 45 7 -249 73 189 -51 -160 141 27 -130 -62 -106 -112 -89 76 -123 209 115
7241 115 -170 -118 -98 51 -26 34 -107 253 114 -19 10 283 -61 -41 54 57 -87 22 162 -193 43 50 -39 -9
7265 -9 256 -156 7 6 52 26 -4 -27 54 79 68 -117 -64 57 -86 -162 205 -222 -26 -7 -142 52 239 33 -44
7290 -44 26 44 6 32 15 -281 123 123 43 111 212 -204 -156 85 68 -182 -19 -33 -155 70 -68 6 -79 -87 -137 1
7316 1 85 -88 102 106 171 -131 44 -8 -12 -13 -1 -98 17 -122 -62 -150 -187 78 12 22 106 -76 91 -248 -193 112 -24
7343 -24 -136 110 -32 -123 122 -8 -42 94 219 -172 155 -55 -14 11 109 -1 -67 82 -44 -15 70 -68 -106
7366 -106 -6 -63 73 117 109 -117 -67 127 -183 -97 100 -146 165 -2 19 -199 -88 -75 -139 30 63 9 67 35
7390 35 116 58 224 -111 17 120 83 -216 -30 176 13 157 -97 -157 25 -111 -153 90 17 -19 -6 -52 -32 -89
7414 -89 23 171 -126 235 -48 4 -39 -105 -94 109 -12 34 149 215 -76 37 -35 38 0 82 -36 82 183 -45
7438 -45 -100 203 -16 -197 71 121 0 98 -10 -92 85 54 -109 -57 28 -15 -93 89 62 -14 38 -54 -75 186 98
7463 98 -117 158 -19 41 20 165 135 -3 -11 -154 -32 204 -91 -74 139 94 -75 95 21 -157 120 74 10 11
7487 11 -21 -98 -47 212 -50 -3 -181 -11 47 170 -224 -79 81 -7 -30 128 11 -3 122 -193 -37 144 142 -5
7511 -5 -95 27 48 21 19 108 64 224 -91 14 15 0 -135 -43 124 -42 -5 -43 -177 -72 33 -226 -64 320 -6
7536 -6 -96 196 58 -27 76 -107 9 195 -42 -147 -13 -48 23 -72 52 22 175 -12 -15 25 140 94 -6 122
7560 122 40 -44 118 -4 18 96 -39 -48 146 -7 94 -64 104 -124 -308 40 -88 -88 135 100 -291 181 10
7583 10 -184 45 124 -165 21 181 -305 93 291 -102 -14 216 -6 -109 9 -8 -94 0 -58 -76 174 71 -289
7606 -289 -48 79 -107 -12 239 9 36 101 -65 56 167 43 -156 -21 -24 -83 -121 116 -10 -27 -35 -278 106
7629 106 115 -133 -58 231 109 -14 -13 56 82 147 98 -134 115 201 -180 36 63 -126 -77 106 -4 -127 28 -71
7653 -71 -136 302 -93 -141 178 53 -91 -206 -111 -51 244 -107 -113 -25 265 -101 -12 124 106 80 94 -6 75 92 -183
7678 -183 -259 268 71 -192 -16 66 -184 10 -91 -150 -80 43 -21 -217 236 -32 -197 96 14 -97 30 152
7700 152 -166 137 220 -104 33 -10 -61 42 51 -161 21 36 151 -56 5 151 -218 96 23 21 -3 -45 -33 58 184
7725 184 -26 -39 207 -11 -84 44 -25 12 83 -45 -44 87 13 -120 102 205 25 -71 102 -19 39 -155 22
7748 22 -161 181 13 -179 117 -56 -100 43 -23 71 111 22 -113 -24 180 -70 -175 28 -23 -90 90 30 -65 92
7772 92 91 -230 -28 112 11 49 -38 -67 -48 184 -36 174 -29 -21 60 175 -24 -21 32 57 -206 -11 -94 -52 -43 106
7798 106 -79 -78 40 -144 -27 92 -65 -28 147 -91 -254 90 -1 107 47 14 -155 42 -11 31 12 -44 -78 25
7822 25 37 -93 119 43 107 -106 9 9 -78 70 110 -141 -234 69 -11 120 76 -67 -106 0 95 48 83 62 -46
7847 -46 162 37 49 -109 -202 -61 38 -15 -119 -40 25 61 76 271 22 69 9 -230 -25 23 -60 -161 -47 137
7871 137 -10 105 119 -56 -79 -2 -243 -41 130 172 66 7 -1 -14 -66 49 -86 5 14 -42 -219 35 -20 -56 63
7896 63 66 -83 100 10 -151 207 33 24 33 -120 -136 -63 -74 65 -177 -83 -37 -81 175 -60 9 117 -98 31 12
7921 12 -54 -16 47 -19 61 -6 14 -74 -38 43 -115 -31 3 -32 -100 64 -95 -64 134 -28 -158 -12 32 -6 48 44 6
7948 6 70 58 -85 17 110 -41 -206 154 31 -93 10 -24 -135 148 -51 -81 -53 141 -41 -133 -116 -177 -16 17
7972 17 -139 52 196 22 71 194 64 41 23 -5 -45 -3 -22 -263 -216 163 -78 -53 30 -33 30 -102 129 -18
7996 -18 66 91 -169 140 -26 -43 -122 -46 41 115 85 30 185 -23 9 26 92 14 -44 -42 -189 80 36 -66 29 140
8022 140 -15 -63 99 117 -24 -5 -78 -151 64 190 -106 82 91 8 -17 -77 121 -75 -37 -79 -43 32 28 -36 158 135
8048 135 -59 33 62 3 51 108 -204 91 62 35 -129 139 -9 -104 -160 -56 -99 132 12 -36 -50 139 -138 -182
8072 -182 317 136 -163 76 -10 -58 116 -143 -128 77 67 -240 28 114 -83 -236 -47 4 104 139 -89 -24 163
8095 163 40 -46 11 8 48 -14 19 -72 91 -11 -238 93 42 -71 -74 39 -54 -109 78 -2 -29 68 -59 33 255 124
8121 124 -7 -38 27 -183 43 48 -22 -69 187 -4 -127 -3 -19 -41 -63 -91 -117 -41 -73 -139 35 251 -120 -86 193
8146 193 62 9 -29 -63 -38 24 -134 -115 78 82 -230 -28 45 -118 69 -42 51 82 175 -230 -65 70 16 -239
8170 -239 94 -84 -104 178 -179 -74 190 116 51 99 -69 -55 -17 237 -60 32 52 -45 -219 75 -58
8191e8
$$ Imaginary data points
##PAGE= N=2
##DATA TABLE= (X++(I..I)), XYDATA
0 0 0 0 0 0 0 0 8 0 0 0 8 -8 8 -16 16 -16 24 -32 40 -45 54 -64 77 -88 104 -120 136 -158 182 -210 237 -269
32 -269 305 -345 386 -434 487 -542 604 -673 747 -825 913 -1011 1117 -1231 1357 -1491 1643
49 1643 -1811 1993 -2198 2422 -2677 2964 -3292 3667 -4104 4620 -5240 5997 -6955 8192 -9861
64 -9861 12241 -15876 22044 -34354 67754 -332495 -819801 538676 389936 -479833 41709
75 41709 208276 -214776 256490 122860 -499072 222479 576352 -408513 -266021 456804
85 456804 -13301 -184655 202903 -176166 -101149 474787 -165371 -566094 389176 361224
95 361224 -509100 -143666 337270 -49577 -85398 -13380 -202475 158537 247409 -401473 -172690
106 -172690 461521 -17057 -335948 150064 88375 -100114 177969 -62757 -253342 327421
116 327421 216831 -435340 -36605 400565 -71555 -179178 84672 -17688 99594 156405
126 156405 -290723 -83921 440149 -81514 -421231 222983 226977 -255918 -965 109017
136 109017 -159574 113757 138907 -326706 -14283 361756 -169972 -270981 215440 57884
146 57884 -135351 90909 -66575 -99210 275144 -17256 -344283 216819 295234 -304937
156 -304937 -107846 272969 -54127 -104431 109847 -97980 -37873 213790 -115022 -208680
166 -208680 216885 82721 -223206 31873 87645 -91311 73154 26120 -184695 110864
176 110864 194671 -215699 -95627 241298 -15845 -157059 74845 31641 -33269 71103
186 71103 -59339 -79840 149278 13793 -171059 65026 105139 -97926 2609 54863 -87657
197 -87657 33596 91360 -128558 -38354 158758 -39718 -119029 82725 42495 -53959 29842
208 29842 -14555 -37973 96942 223 -122046 76084 102968 -108206 -22277 102678 -41909
219 -41909 -37130 69030 -43226 -44890 92326 -14510 -93582 60165 40979 -81093 3078
230 3078 35181 -41342 19084 26951 -67788 15353 72900 -68693 -47584 87277 -2216 -70721
242 -70721 41424 30311 -45730 15523 24263 -36911 12193 34415 -30415 -4936 35055 -13532
254 -13532 -11665 21046 -12556 -7144 27585 -14626 -24157 32179 10296 -33691 6557 24040 -14655
267 -14655 -13171 6296 92 -2157 -2923 -3244 8333 -680 -13914 5447 6504 -15430 2411 17221
281 17221 -9586 -7352 16580 -541 -12446 7914 6651 -3826 4360 2773 -164 8223 -1548
294 -1548 -8095 12162 6255 -15839 3387 15763 -13197 -11148 16747 499 -18572 4576 9297
307 9297 -14209 -7733 9162 -1837 -8659 2749 2146 -4799 -1604 -840 -1234 4000 574 -2763 7150
322 7150 5688 -7943 1324 12439 -4206 -7440 13123 6546 -12003 2694 13034 -6429 -7775
335 -7775 8894 2502 -9178 -417 5315 -2500 -4450 750 1176 -3045 -4906 -1114 -100 -4051 -2570
350 -2570 2004 591 -2440 -1914 1088 3509 -2966 -5101 9385 7626 -12104 803 18801 -6975
364 -6975 -13455 18519 6358 -17586 10279 13173 -17744 2910 17414 -18317 -7268 22816 -10070
377 -10070 -16748 18563 -2769 -17258 16548 -4117 -24680 24937 10198 -41900 11713 36466
389 36466 -34672 -16403 38897 -10259 -20266 29424 -6989 -20947 37229 1649 -39403 29721
401 29721 26948 -36864 5291 24718 -24971 8948 21559 -42395 4017 52330 -41715 -39367
413 -39367 56616 1036 -50994 21760 11078 -27063 25133 -3049 -45196 41845 32256 -64543
425 -64543 3745 56699 -31406 -14338 34735 -29139 3575 57141 -51566 -41108 90604 1690
437 1690 -86449 39720 46553 -46712 8413 10531 -44071 46685 31879 -99420 8523 100559
449 100559 -63062 -63695 74453 -5030 -41023 51014 -31265 -49374 101037 1696 -124615
460 -124615 65283 95696 -94707 -22971 74998 -30729 3305 43439 -82293 6578 127030
471 127030 -78753 -105512 127153 35731 -116763 31559 41709 -55497 50900 12765 -115555
482 -115555 64200 111480 -131385 -55366 135184 -16964 -76610 44778 -18777 -10526 90652
493 90652 -70510 -99286 149409 50537 -167215 26287 120837 -62211 -23786 37011 -57257
504 -57257 46004 81200 -134559 -38905 172358 -35882 -138579 78900 47016 -58644 37381
515 37381 -30498 -70439 132271 27672 -192291 52764 171854 -112552 -86071 104690 -6985
526 -6985 -19888 52524 -91416 -18168 170857 -63543 -168029 137229 94270 -140938 2496
537 2496 64971 -53794 55967 27490 -153787 58692 174590 -148418 -117287 174242 21272
548 21272 -119953 37807 2960 -27775 100677 -55059 -141622 151041 99604 -197337 -11921
559 -11921 160092 -54806 -53290 54324 -56792 25092 118487 -126330 -91781 197810 18068
570 18068 -181232 54791 95366 -62178 13112 -6316 -79289 110108 63495 -193506 4785
581 4785 192905 -84302 -123776 98664 15830 -42170 52955 -66450 -52542 157866 -11180
592 -11180 -179542 89305 128797 -112764 -32209 67548 -34275 36992 39840 -131856 24156
603 24156 172000 -103588 -132921 145650 49425 -114428 21847 22190 -36587 76467 -16960
614 -16960 -132566 95068 112657 -149269 -45780 132330 -26113 -56570 44749 -43895 -1368
625 -1368 107986 -80219 -106703 146749 49618 -153545 20198 96403 -49276 -5098 20280
636 20280 -62416 55418 76457 -124380 -30978 147530 -31250 -105464 67441 26970 -45899
647 -45899 43031 -21970 -65630 95021 32156 -132540 25117 111148 -65418 -50019 55702
658 55702 -13552 -1352 37969 -68563 -15001 109931 -37035 -101374 77470 50711 -76860
669 -76860 6718 30929 -34849 34621 18881 -80888 27451 84671 -68404 -46670 76387
680 76387 -1649 -39912 29773 -16840 -15823 64219 -26717 -72294 70928 42123 -85788 3142
692 3142 60039 -33370 -9001 27889 -37100 7410 51885 -50759 -33444 70143 -5354 -56787
704 -56787 32052 15490 -32529 23969 1656 -43373 36740 31241 -61700 -782 58382 -25745
716 -25745 -29942 32683 -1712 -12568 22696 -15672 -17242 40135 -1668 -41003 24244 24234 -30712
729 -30712 1088 18355 -18341 4787 17567 -26697 -4737 31904 -14885 -24360 21969 5633
741 5633 -17763 6951 803 -9567 13989 -896 -20760 14481 15110 -21630 -574 19819 -9509
754 -9509 -6099 13827 -6457 -5655 15033 -4680 -11876 13562 3495 -12992 5574 4659 -8706
767 -8706 4438 2712 -11426 5320 9163 -13566 -2530 13784 -6516 -9282 10025 589 -8185
780 -8185 5846 2144 -6710 4416 3409 -6383 2385 4537 -5251 892 4877 -4624 -1056 5953 -3481
795 -3481 -4350 5660 336 -6294 2224 3627 -3880 -1793 2937 -845 -2503 435 1231 -364 -162 793
811 793 1084 400 37 497 1064 625 -167 267 1814 460 -1361 704 1880 -1761 -1719 2001 -448 -3079
829 -3079 508 1430 -2804 -1544 1581 -1084 -2957 498 911 -1825 -822 1620 322 -732 917 769
845 769 89 1453 844 -449 2375 1921 -2094 1427 3480 -2395 -788 4286 -2091 -3245 5049 -414
861 -414 -6194 3575 2952 -7086 -208 4289 -5007 -1583 3938 -5440 -1443 6461 -5882 -5326 9282
876 9282 -1001 -8672 7223 3166 -7867 5692 3951 -9652 5805 9532 -11632 -552 14461
889 14461 -6117 -7059 9789 -2772 -5050 9511 -6428 -8970 15663 -151 -19168 9588 10687
902 10687 -15887 623 9261 -11635 3881 11106 -18525 -1365 23776 -12763 -16813 21372 2195
915 2195 -15427 11781 -294 -12588 20445 1531 -28842 17817 23456 -30083 -5364 26892
927 26892 -12493 -7962 17270 -16681 -4938 31469 -19134 -29252 37024 9450 -38536 12067
939 12067 19312 -20512 9343 8552 -30118 18699 31732 -43218 -12032 50731 -12975 -33444 26351
952 26351 2398 -16010 24820 -12446 -31003 43660 13457 -58287 13810 45273 -32582 -14500
964 -14500 25388 -17309 4375 27841 -41918 -13023 63487 -17969 -56986 41337 26147 -39220
976 -39220 8919 9802 -24067 32918 11724 -61672 21910 62355 -50765 -33397 54595 -2783
988 -2783 -25605 22697 -20349 -11481 56826 -24713 -64798 59386 39080 -71022 -2122 45660
1000 45660 -22884 386 13904 -44774 21969 59125 -63699 -38617 83631 1007 -65138
1011 -65138 27792 19351 -22980 30266 -12220 -51341 61457 37935 -90540 160 81926 -32728
1023 -32728 -39778 34688 -11684 -827 40128 -52272 -32309 90279 -5697 -92984 42472 55959
1035 55959 -51504 -4612 20318 -29999 34571 26748 -82585 9122 95680 -49957 -66637
1046 -66637 66428 17858 -40496 19778 -14071 -21207 67696 -12634 -89875 57690 70175 -80919
1058 -80919 -24970 62900 -14243 -11967 20107 -45064 10211 75267 -57007 -64802 87227 25247
1070 25247 -78816 13506 33586 -23461 23434 -3351 -59324 52306 57322 -89804 -22540
1081 -22540 91702 -17195 -54625 31727 -298 -7990 40322 -41346 -45107 84752 14205 -96988
1093 -96988 25169 67901 -44303 -16607 24817 -26411 23670 36140 -72938 -9669 95058
1104 95058 -29931 -75977 54564 31121 -41679 12686 -2300 -26294 54287 5554 -83488
1115 -83488 33416 74832 -61720 -37543 56804 -4689 -20073 22024 -31060 -7604 65328
1126 65328 -29537 -67203 60835 37611 -65014 -457 36049 -19391 10698 9071 -47058 25810
1138 25810 56250 -59255 -33325 71169 80 -49302 22182 8484 -15128 29301 -16066
1149 -16066 -42814 51069 26305 -68584 3386 54476 -26337 -20153 22093 -17093 5168 32298
1161 32298 -41839 -21476 63078 -6020 -57211 29425 28716 -29872 5287 7674 -22082 27147
1173 27147 16482 -50289 8310 51699 -30731 -29380 35839 118 -18172 17808 -12959 -15574
1185 -15574 37763 -5458 -44898 27290 29464 -37168 -5778 25010 -12592 -9 12975 -24384
1197 -24384 3410 34154 -24118 -24693 36330 5467 -29129 12237 9453 -14067 13426 2324
1209 2324 -24406 17245 20389 -29516 -5178 27671 -9916 -13170 12987 -5821 -4507 16232 -12418
1222 -12418 -15297 24125 2689 -25709 9353 14828 -14604 165 8245 -10380 4837 11108 -15807
1235 -15807 -2207 19817 -7382 -12645 13093 1794 -8647 7829 -890 -8921 11311 2872 -15921
1248 -15921 5708 12038 -11854 -3990 9980 -4412 -3901 6381 -5374 -3303 9436 -3958 -8759
1261 -8759 8886 2715 -9051 3907 4301 -5929 2597 4488 -6894 1366 7576 -5461 -3341 7402
1275 7402 -988 -4699 3957 552 -3047 3045 -188 -3992 3164 1618 -5107 1024 3450 -3604 -1144
1290 -1144 3205 -1685 -1697 2736 -734 -2111 2067 780 -1583 1001 1066 -510 470 540 -461 748 470
1307 470 -995 709 1123 -840 -395 1020 -312 -771 65 77 -522 -522 -239 -40 -171 -806 124 590 -534
1326 -534 -575 871 429 -738 436 989 -322 -318 878 314 -561 538 685 -551 6 384 -271 16 -203
1345 -203 -683 435 93 -1673 89 1225 -1613 -1155 1629 -357 -1941 1169 379 -1481 1149 730
1361 730 -1566 1167 1434 -1909 598 1984 -1666 563 2294 -2473 -259 4109 -2379 -3134 4688 257
1377 257 -4651 2272 1373 -3625 1793 1003 -4812 2512 3582 -6036 -378 5891 -3949 -2514 5025 -2785
1393 -2785 -2133 6792 -3126 -5763 9164 1823 -9627 4285 6122 -6521 1068 4173 -6122 3022
1407 3022 6594 -10229 -1526 12663 -6115 -9207 9753 286 -7856 6769 -1051 -8875 10632
1420 10632 3003 -16358 6072 13525 -12628 -4268 11855 -4781 -2417 8975 -9544 -2985 18170
1433 18170 -7723 -16566 17243 7263 -17700 4423 8177 -10211 6291 5005 -18129 7463 19043
1446 19043 -20063 -10296 23172 -3334 -14545 10951 -2054 -6767 16413 -7126 -19986 22861
1458 22861 11839 -29400 3380 22478 -13213 -4927 10918 -11991 4114 18937 -22487 -11840
1470 -11840 33368 -3554 -29405 15933 12282 -15848 6385 564 -16596 20388 10844 -35609
1482 -35609 5293 35287 -20536 -19841 22949 -804 -8523 13465 -14626 -9328 34435 -7050 -37983
1495 -37983 25435 25116 -30804 -3172 18350 -11377 6997 9718 -30714 7750 38660 -29225
1507 -29225 -28390 38771 6243 -29585 10486 3638 -11205 22677 -6380 -35740 30356 28404 -44981
1520 -44981 -7439 39711 -11039 -15718 14381 -12433 2361 29739 -27913 -26139 47966 7294
1532 7294 -47696 13166 27675 -19067 935 4440 -21131 22454 21481 -46867 -4690 52011 -17138
1545 -17138 -36438 25766 8240 -13979 13661 -13935 -17218 41562 1413 -52342 21494 41573
1557 41573 -33116 -15212 24532 -7571 2996 14129 -32566 476 48937 -24089 -42442 39598
1569 39598 18963 -34996 4055 9661 -12555 21107 -615 -41600 24390 39638 -43874 -20438
1581 -20438 43875 -2911 -22869 12749 -7572 -2608 31017 -21285 -34077 44286 18772 -49391
1593 -49391 3579 34015 -15790 -4856 8414 -20095 15086 27675 -40410 -15668 51145 -5862
1605 -5862 -41221 19669 15121 -15644 10165 -6398 -20862 32959 11667 -48424 8430 43280
1617 43280 -23888 -21397 22811 -2900 -3203 15512 -23319 -8926 42239 -9754 -42071 27085
1629 27085 24764 -29008 -1900 12960 -11184 12314 6855 -33121 10055 36983 -28428 -24269
1641 -24269 33636 3985 -21989 9446 -1510 -7684 22764 -7798 -30570 26479 21931 -34973
1653 -34973 -4175 27796 -9028 -7531 9770 -12939 4110 23171 -22577 -17957 33862 2863
1665 2863 -30509 10695 13998 -12811 5156 1250 -16935 16209 14225 -29804 -1730 29723 -11674
1678 -11674 -17552 15244 2 -6240 11472 -9758 -10904 23907 611 -26676 12195 18366 -17008
1691 -17008 -3608 11507 -7445 2972 8912 -16343 -786 21769 -10750 -16808 16955 5269
1703 5269 -14121 4728 2263 -7531 9529 1140 -16582 8855 14136 -15683 -5324 14570 -3614
1716 -3614 -6358 7024 -4328 -2358 11576 -5908 -10694 13506 4488 -13839 3504 7994 -7013
1729 -7013 1361 3896 -7968 3415 8394 -10789 -3767 12583 -3402 -8775 6672 1011 -5227
1742 -5227 4851 -721 -6319 6958 3037 -9735 2388 7922 -5778 -2301 5778 -2604 -1220 4780
1756 4780 -3576 -2463 6877 -1235 -6275 4654 2778 -5198 1060 2465 -3106 1106 1993 -4369 525
1771 525 4127 -3564 -2192 4129 -576 -2766 2615 58 -1983 2303 149 -2775 2208 1885 -2863
1786 -2863 225 2321 -1279 -564 1569 -1070 -358 1555 -1231 -1118 1729 -183 -1759 976 598 -1409
1802 -1409 266 485 -988 -118 767 -874 -135 1152 -380 -480 745 286 -265 534 240 -201 394 267
1820 267 -473 507 439 -852 -109 585 -355 -566 459 -268 -566 279 -136 -586 -70 -47 -427 283 156 -551
1840 -551 332 405 -392 36 539 -200 31 619 -334 -192 930 -8 -520 588 109 -420 496 -38 -469 617
1860 617 -13 -1404 759 737 -1405 46 1059 -1315 -129 1037 -1192 -595 1826 -780 -1488 2051
1876 2051 376 -1663 1382 668 -1484 1482 809 -2505 1404 2504 -3004 -573 3302 -1468 -1654 2418
1892 2418 -918 -1559 3233 -1334 -3498 3746 1003 -4592 1563 2760 -3505 709 2032 -3717 1693
1907 1693 4463 -5040 -1754 6918 -1680 -4901 4434 584 -3388 3685 -366 -4714 5598 2241 -8369
1922 -8369 2139 6913 -5756 -2313 5179 -3192 -862 5232 -5682 -3214 9673 -2520 -9390 7156
1936 7156 4576 -7690 1737 3257 -4963 4125 3434 -9878 3011 11231 -8459 -5988 10862 -830
1950 -830 -6228 5422 -2215 -4211 9905 -2681 -12394 10075 7825 -13966 -324 10032 -5693
1963 -5693 -1248 4848 -8368 2055 11991 -11506 -8550 16951 405 -14353 6804 5373 -6574
1976 -6574 5611 -151 -10822 11108 8707 -18589 -270 17969 -7681 -9429 8966 -2176 -2318
1989 -2318 9010 -9770 -8074 19286 -598 -21224 9522 13306 -13168 -1806 6537 -7074 5888
2002 5888 7182 -18035 1019 22403 -11468 -16232 16837 4645 -11510 5667 -1059 -6654 15187
2015 15187 -1306 -21895 13400 18096 -20644 -6649 17422 -4203 -5067 6660 -10247 721
2027 721 19221 -13883 -17697 23081 6918 -22770 3999 11026 -7917 4411 1274 -15535 12449
2040 12449 15960 -24061 -6587 26370 -4711 -16983 10157 1894 -4348 10659 -9233 -13219 22827
2053 22827 5520 -28217 6231 21337 -13132 -7187 8750 -6483 4339 10485 -19809 -4163
2065 -4163 27733 -7989 -24116 16039 11078 -13948 2526 1560 -7973 15077 2866 -25302 9515
2078 9515 24272 -19047 -13039 19220 -268 -8167 7002 -8373 -2705 20767 -9539 -22648 20773
2091 20773 13492 -23508 -1047 14266 -6709 1405 3656 -15153 7778 19365 -20299 -12600 25576
2104 25576 1141 -19304 7294 5163 -5842 9164 -4749 -15017 17977 11077 -25488 -256
2116 -256 22378 -8572 -10224 8516 -3965 615 11163 -14271 -8702 23405 -1127 -23346 10212
2129 10212 13144 -11880 -217 3976 -7724 9360 6550 -20091 2458 22119 -11644 -14415 15122
2142 15122 2917 -8519 5577 -3797 -5564 15191 -2476 -19288 12003 14109 -16578 -4050
2154 -4050 12235 -4359 -1576 5133 -9963 1124 15564 -10758 -12852 16742 4551 -14595 3657
2167 3657 5981 -5444 5053 439 -11359 8758 10803 -15401 -3659 15719 -3715 -8653 6533
2180 6533 -1184 -2548 7748 -5918 -8426 13014 2917 -14900 3701 9825 -7372 -1740 4479
2193 4479 -4982 2701 6188 -10048 -2178 12992 -4062 -9921 7967 3274 -6250 2797 542 -4684
2207 -4684 6823 1969 -10392 3510 9096 -7480 -3938 7307 -1755 -2551 3839 -3743 -2061 7691
2221 7691 -2711 -7676 6955 3591 -7577 852 4208 -3614 937 2281 -5065 1690 6092 -5257
2235 -5257 -3148 7014 -459 -4780 3217 636 -2573 3276 -324 -4227 4050 2506 -5909 384 4536
2250 4536 -2855 -1697 2732 -1698 -621 2767 -2335 -1894 4132 -530 -3811 2387 1808 -2711 757
2265 757 1349 -2015 1359 1560 -2686 212 3182 -1758 -1647 2367 -170 -1665 1321 -276 -1281 1607
2281 1607 -67 -1981 1200 1214 -2042 -73 1389 -1062 -469 1098 -678 -417 1361 -566 -1065 1402
2297 1402 161 -1257 474 947 -629 332 648 -766 143 753 -767 -179 874 -170 -755 592 -53
2314 -53 -813 317 -51 -590 351 214 -661 74 575 -452 -229 535 -166 -87 816 -28 -74 603 251 -325
2334 -325 406 173 -308 174 548 -598 -100 240 -325 -28 195 -352 -155 443 -294 -509 511 -312 -514
2353 -514 469 -46 -402 247 -26 -528 659 304 -838 540 893 -585 -136 771 -302 -287 902 -425
2371 -425 -309 1215 -356 -1104 839 188 -1307 369 352 -1212 588 486 -1486 271 1347 -1451 -770
2388 -770 1666 -531 -720 1495 -443 -725 1765 -436 -1887 1715 1091 -2363 411 1684 -1591 247
2404 247 1216 -2028 240 2479 -2563 -1492 3159 -575 -2614 1801 302 -1779 2009 -274 -2962
2419 -2962 2720 1901 -4146 529 3858 -2371 -1206 2636 -1613 -357 3238 -2649 -2196 5118 -431
2434 -431 -4759 2832 2378 -3593 883 1324 -3353 2281 2482 -5697 413 6123 -3618 -3866 4640 -166
2450 -166 -2743 2868 -1423 -2651 5656 -182 -7085 4236 5156 -5999 -824 4717 -2619 121 3157
2465 3157 -4819 61 7413 -4630 -6084 7494 1716 -6729 2363 1914 -3614 3453 329 -7113 4718
2480 4718 6224 -8930 -2140 8968 -2448 -4242 4029 -1967 -958 6588 -4709 -6316 9988 2331
2494 2331 -10679 2831 7075 -5137 -323 2727 -4930 3479 5984 -9936 -2282 12091 -3667
2507 -3667 -9235 6378 2607 -4982 3181 -1621 -5185 8755 2091 -12609 3886 10921 -8091 -4773
2521 -4773 7192 -1530 -1238 4588 -6443 -1523 12109 -4470 -11543 9713 6043 -10065 876
2534 876 4538 -4035 3807 1746 -10367 4525 11217 -10914 -6608 12153 -211 -7506 3916 -775
2548 -775 -2357 8174 -4253 -10375 11329 6630 -14169 19 10616 -4485 -2581 3630 -5192
2561 -5192 2756 8683 -10318 -6032 14835 -306 -13002 5478 5808 -5585 2210 -278 -6813 8380
2575 8380 5026 -14347 782 14389 -6529 -8481 7765 476 -2766 4850 -5570 -3923 12755
2588 12755 -1476 -14212 7792 9531 -9795 -1965 5970 -3449 2413 3454 -10347 1523 13099
2601 13099 -8341 -10035 11302 2836 -8624 2715 727 -3391 7097 -1541 -11195 8142 9227
2614 9227 -12471 -3246 11084 -2500 -4157 4091 -3647 189 8760 -6879 -8021 12333 2799 -12134
2628 -12134 2560 6872 -4696 641 1355 -6189 5218 6416 -11236 -2384 12664 -3439 -8671
2641 -8671 5938 1790 -3533 3764 -2781 -4913 9019 1638 -11643 3692 9198 -6750 -3133 5279
2655 5279 -2175 305 4075 -6561 -1276 10303 -3826 -8934 7250 4123 -6811 908 2122 -3216
2669 -3216 3726 1255 -8047 3378 7853 -7282 -4010 7728 -659 -4024 3117 -1285 -1701 5797
2683 5797 -2453 -6467 6728 3728 -7761 507 5548 -2862 -833 2034 -3560 1403 5079 -5606
2697 -5606 -2984 7351 -674 -5928 3294 2070 -3197 1999 -120 -3977 3852 2520 -6322 620 5919
2712 5919 -3224 -2630 3427 -740 -1064 2819 -2509 -1900 5273 -643 -5133 3156 2983 -3792 16 2181
2728 2181 -2063 763 1616 -3517 181 4001 -2789 -2839 3471 369 -2774 1525 154 -1616 2151 -23
2744 -23 -2994 1883 2409 -3109 -346 2973 -1101 -1040 1673 -746 -385 2156 -1027 -1781 2531 293 -2352
2761 -2352 971 1287 -1542 288 666 -1621 629 1385 -1874 -535 2095 -806 -1391 1369 9 -911
2777 -911 712 -199 -846 1251 330 -1529 848 1084 -1133 -286 1064 -439 -215 929 -710 -502 1054
2794 1054 -377 -1085 680 288 -901 179 340 -543 219 234 -639 111 621 -535 -232 760 -70 -481
2812 -481 660 67 -425 322 234 -493 306 335 -513 90 396 -306 -330 379 -189 -163 491 -260 -311 432 -59
2833 -59 -482 211 196 -574 129 329 -257 98 393 -155 -42 450 -224 104 332 -74 -113 424 0 -245 125
2854 125 298 -414 224 133 -356 256 216 -564 -149 349 -428 -264 427 -275 -144 398 -196 -258 767 -4 -810
2875 -810 566 448 -559 188 326 -547 192 522 -629 61 948 -634 -492 801 -48 -537 579 -241
2893 -241 -743 889 -103 -1129 630 608 -1353 273 844 -830 162 855 -1103 32 1630 -950 -984
2910 -984 1759 -43 -1386 933 308 -1057 1071 381 -1871 1188 1479 -2292 -280 2022 -848 -850 1190
2927 1190 -846 -583 1879 -1100 -1746 2660 522 -2809 1175 1511 -1664 438 901 -1753 1012 1918
2943 1918 -2845 -674 3343 -1153 -2161 2071 275 -1377 1721 -889 -2220 2967 704 -4310 1328
2958 1328 2913 -2655 -741 2001 -1317 97 2124 -2935 -820 4271 -1541 -3798 3360 1553 -3123
2973 -3123 832 810 -2028 2364 1091 -4611 1484 4511 -3912 -2262 4194 -601 -2344 1818 -1441
2988 -1441 -1046 3982 -1684 -4627 4498 2650 -5462 218 3414 -2261 52 1527 -3503 1476 4588
3003 4588 -4650 -2835 6346 -70 -4766 2460 1388 -2059 2538 -745 -3962 4635 2655 -6782 196
3018 196 6130 -3109 -2822 3071 -1243 -225 3269 -3900 -2548 6866 -701 -7041 3540 3981 -4139
3033 -4139 83 1707 -2610 2784 2223 -6415 765 7470 -4232 -4904 5402 1016 -3212 1838 -1118
3048 -1118 -1951 5419 -1006 -7201 4509 5364 -6433 -1613 5125 -1730 -616 1879 -4046 691 6264
3063 6264 -4588 -5197 7483 1736 -6482 1715 2613 -2355 2315 180 -5082 4371 4700 -7605 -1654
3078 -1654 7691 -1909 -4371 3023 -554 -968 3698 -3342 -4105 7113 1426 -8143 2181 5739 -3866
3093 -3866 -1471 2077 -2397 1796 3354 -6168 -996 8133 -2392 -6226 4703 2379 -3550 1352
3107 1352 -100 -2671 4832 934 -7357 2692 6468 -5364 -3098 4864 -798 -1663 2173 -2887 -860
3122 -860 5940 -2918 -5940 5769 3261 -6011 265 3219 -2137 1123 1078 -4436 2399 5194 -5444
3137 -5444 -3008 6647 -140 -4551 2266 533 -1575 2875 -1618 -4344 4930 2653 -6608 274 5385
3152 5385 -2386 -1957 2219 -1594 381 3121 -3935 -2342 6172 -486 -5434 2733 2799 -2721 660 816
3168 816 -2302 2780 1764 -5080 625 5427 -2970 -3080 3736 -5 -1827 1708 -1237 -1407 3705 -650
3184 -650 -4480 2964 3042 -3866 -565 2717 -1518 -105 1386 -2369 480 3714 -2634 -3011 3901 820
3200 820 -3267 1149 1237 -1494 1432 195 -2687 2040 2327 -3479 -652 3553 -1118 -1739 1540 -678
3216 -678 -801 1880 -1492 -1852 3058 528 -3321 992 2127 -1670 -63 1058 -1050 659 1410 -2190
3232 -2190 -311 2789 -1104 -1757 1989 580 -1218 755 26 -1076 1258 399 -2167 839 1933 -1650
3248 -1650 -769 1443 -615 -449 756 -770 -318 1670 -574 -1458 1397 539 -1377 500 891 -672
3264 -672 200 428 -916 323 1149 -1074 -457 1443 -290 -923 706 29 -700 538 -65 -900 731
3281 731 478 -1014 20 1050 -583 -340 513 -328 -139 468 -243 -473 814 -45 -744 510 424 -377
3299 -377 212 399 -171 202 193 -508 25 496 -344 -345 426 17 -178 194 56 -395 254 116 -558 217 413
3320 413 -367 6 313 -183 -104 399 -58 -108 363 -100 -262 267 134 -338 104 305 -206 151 245 -210 -38
3341 -38 291 -274 -111 144 -95 -335 217 -100 -243 197 -33 -191 161 200 -226 191 124 -294 -3 370 -223
3362 -223 82 428 -5 -62 186 61 -102 458 -94 -510 203 84 -572 72 153 -221 -90 97 -401 205 397
3383 397 -497 -163 658 -295 -289 488 -18 -284 340 16 -464 533 287 -724 431 664 -499 -171 452 -304
3403 -304 79 570 -762 -335 1038 -415 -949 548 334 -745 196 297 -746 573 395 -955 662
3420 662 943 -1012 -434 1132 -244 -460 664 -223 -421 1048 -576 -1169 1232 485 -1393 196 576
3437 576 -724 221 417 -983 328 1440 -1379 -804 1600 -365 -1193 799 364 -699 1046 -104
3453 -104 -1311 1339 1131 -1925 245 1782 -996 -585 1018 -838 19 1448 -1403 -890 2376 -277
3469 -277 -2292 1325 945 -1409 440 335 -1236 1235 854 -2570 184 2422 -1460 -1452 1745 -71 -835
3486 -835 1198 -758 -811 2462 -144 -2864 1758 1897 -2363 -109 1554 -1138 223 1040 -2100 92
3502 92 2900 -2050 -2236 2733 605 -2348 836 500 -1183 1608 -65 -2641 1794 2339 -3275 -703
3518 -703 3068 -822 -1305 1415 -738 -219 2378 -1858 -2245 3513 824 -3635 951 2346 -1691 34
3534 34 553 -1822 1351 1951 -3450 -828 3843 -1076 -3011 2012 699 -1439 1260 -869 -1859 2988
3550 2988 705 -4006 1184 3363 -2449 -1319 2110 -675 -186 1390 -2384 -655 3864 -1505 -3626
3565 -3626 2970 1823 -3157 426 995 -1348 1376 448 -3407 1563 3563 -3277 -1914 3419 -4
3580 -4 -2138 1113 -579 -551 2575 -1261 -3113 3397 2075 -3951 -19 2790 -1342 -417 931 -1944
3596 -1944 760 2576 -3101 -1838 4061 -76 -3427 1414 1399 -1549 999 -229 -2167 2616 1425
3611 1425 -4108 296 3837 -1746 -1920 2125 -208 -637 1618 -1729 -1141 3422 -459 -3799 1997 2509
3627 2509 -2644 -325 1346 -1320 762 1068 -2844 253 3475 -2067 -2485 2843 513 -2129 836
3642 836 95 -851 1997 -221 -2743 2146 2382 -3000 -762 2650 -749 -967 1078 -1170 99 2321
3658 2321 -1836 -1914 3000 531 -2891 640 1537 -1327 383 427 -1646 1342 1644 -2915 -463 2973
3674 2973 -960 -1948 1419 294 -816 1232 -627 -1135 2310 474 -2689 1035 1972 -1784 -356 1208
3690 1208 -663 169 1101 -1777 -395 2475 -844 -2017 1784 958 -1493 375 348 -783 875 510
3706 510 -1677 670 1701 -1614 -883 1654 -202 -592 1000 -249 -436 1316 -370 -1412 1383 985
3722 985 -1734 39 1210 -810 -165 438 -720 252 1221 -1222 -882 1578 -159 -1266 553 528 -730
3739 -730 484 -79 -815 948 463 -1358 240 1230 -557 -618 772 -205 -388 503 -478 -239 1146 -28
3757 -28 -1108 711 528 -701 29 336 -335 285 308 -798 128 818 -451 -585 834 112 -669 413
3775 413 157 -491 396 115 -579 566 392 -565 -128 559 -83 -301 313 -69 -243 378 -288 -349 486 18
3795 18 -587 211 147 -460 -33 260 -274 46 239 -424 -125 284 -185 -179 465 -43 -233 176 62 -268 306
3816 306 174 -275 -14 255 -303 -130 168 -82 -249 125 111 -168 299 -65 -231 205 235 -251 49 243 -284
3837 -284 47 -32 -140 29 127 -29 -100 228 -185 -97 72 12 -263 78 118 -345 79 75 -343 40 202 -486 -70
3860 -70 214 -214 -82 135 -136 -275 101 -186 -225 168 -118 -118 178 124 -47 273 196 -57 -57 46 -144 7 332
3883 332 -102 -297 439 -13 -390 185 44 -162 169 -91 -295 208 251 -344 -27 551 -133 -237 340 -23
3903 -23 -59 318 -85 -285 573 -116 -556 282 347 -362 40 52 -364 269 235 -649 -17 644 -311 -543 401 -23
3925 -23 -463 273 -261 -467 518 -68 -797 571 457 -550 -55 476 -278 100 398 -384 108 818 -565
3944 -565 -515 834 95 -656 352 -15 -564 546 47 -732 468 837 -1163 -152 926 -376 -452 493
3962 493 -384 -165 870 -662 -919 947 437 -1225 234 627 -670 174 203 -793 454 928 -1051 -397
3980 -397 1343 -472 -865 703 -9 -298 760 -481 -943 1124 219 -1263 297 1110 -871 -322 640
3997 640 -524 117 800 -888 -361 1654 -371 -1319 950 552 -858 574 325 -671 979 270 -1542
4014 -1542 463 1485 -1397 -984 1450 -310 -618 565 -562 -287 1545 -422 -1760 1261 994 -1665
4030 -1665 -209 1221 -693 67 541 -1092 484 1674 -1570 -826 2040 181 -1583 707 339 -575
4046 -575 828 -354 -1384 1398 936 -2133 65 1797 -766 -732 642 -441 -131 1092 -1168 -930
4062 -930 2244 125 -2010 819 1208 -1200 261 544 -800 782 893 -1988 147 2183 -1093 -1514
4078 -1514 1396 201 -943 512 -398 -584 1458 -276 -1961 1026 1600 -1713 -534 1335 -398 135
4094 135 585 -1281 33 1770 -1026 -1482 1937 636 -1605 539 671 -661 684 3 -1502 969
4110 969 1361 -1955 -476 1939 -329 -1078 853 -224 -416 1062 -632 -1213 1705 669 -2122 273
4126 273 1463 -993 -286 607 -674 331 904 -1374 -518 1980 -391 -1561 1018 593 -974 295
4142 295 -77 -762 1224 336 -1744 407 1735 -1298 -978 1096 -264 -354 560 -788 -277 1485 -411
4159 -411 -1453 1175 933 -1376 -33 823 -596 274 376 -1076 488 1361 -1176 -732 1496 -54 -1117
4176 -1117 459 210 -458 725 -264 -1111 903 852 -1385 -41 1448 -386 -584 601 -522 -7 700
4193 700 -894 -639 1298 -9 -1340 560 584 -661 95 238 -477 279 459 -1142 -86 1217 -645
4210 -645 -689 637 196 -462 323 -253 -272 716 61 -954 568 621 -731 -205 588 -235 79 302 -536 -106
4230 -106 796 -564 -552 770 240 -637 135 262 -312 376 42 -662 381 511 -597 -217 668 -282 -433
4249 -433 315 -29 -217 319 -227 -231 602 229 -633 288 469 -388 36 313 -140 100 359 -392 -261 658 19
4270 19 -359 412 245 -320 75 108 -224 276 177 -559 -22 448 -261 -342 266 69 -101 222 -119 -99 374 34
4292 34 -237 267 116 -305 75 166 -55 87 116 -66 -56 99 -157 -231 226 -17 -215 191 6 -278 72 63
4314 63 -248 203 164 -152 -3 121 -78 -113 91 -9 -88 104 3 -112 295 -48 -171 190 242 -229 29 63
4336 63 49 -148 -1 -34 -162 191 30 -147 10 83 -241 140 16 -201 79 122 -196 98 113 -16 -56 85
4358 85 247 27 171 18 -178 223 94 -118 -27 8 -33 270 -37 -311 209 -70 2 -199 174 19 -75 307
4380 307 -115 11 183 -39 -61 152 -9 -138 51 72 -41 142 -13 -148 106 226 -194 -20 303 51 -129
4401 -129 89 -144 -91 183 -171 -196 285 131 -260 69 222 -137 53 154 -127 131 232 -258 -302 284 86
4422 86 -189 332 73 -144 246 -14 -265 281 107 -434 -50 268 -318 -276 159 -191 40 349 -360 -125 345
4443 345 -42 -515 371 225 -170 76 40 -206 173 195 -566 67 640 -250 -328 376 13 -266 185 -135 -64
4464 -64 617 -140 -608 319 393 -525 -82 359 -239 24 44 -423 104 667 -558 -340 617 -83 -613 282 316
4485 316 -385 286 36 -459 443 548 -828 -119 536 -294 -184 314 -233 -203 387 -308 -315 854 -53 -824
4505 -824 273 385 -378 111 95 -431 341 545 -806 -44 859 -455 -598 522 89 -410 517 -286 -269
4524 -269 658 -56 -956 496 780 -662 -301 354 -311 -55 273 -542 -120 970 -446 -717 767 361
4542 361 -821 103 289 -455 443 100 -1018 521 1095 -664 -375 776 -150 -537 427 -314 -77 737
4560 737 -451 -702 980 269 -1122 79 531 -307 67 220 -515 111 711 -938 -341 980 -149 -852
4578 -852 462 240 -358 365 -154 -513 693 377 -1006 312 864 -435 -460 454 -150 27 533 -627
4596 -627 -295 949 -54 -1069 675 590 -552 27 288 -428 253 118 -806 163 930 -632 -577 854
4614 854 45 -464 299 -7 -222 596 -210 -961 521 572 -927 -152 753 -97 -260 274 -403 1 638 -645
4634 -645 -579 1026 147 -868 291 300 -420 366 -34 -491 504 480 -771 -171 988 -306 -391 323 101 -165
4654 -165 319 -209 -574 762 161 -925 353 538 -558 -18 366 -204 127 289 -555 -87 723 -397
4672 -397 -711 504 294 -635 185 -56 -283 396 137 -535 362 573 -763 -183 572 13 -106 314 -306
4691 -306 17 550 -330 -453 305 360 -517 232 394 -477 -103 125 -289 244 594 -454 -222 682 -30 -465
4711 -465 112 171 -176 155 -79 -275 455 139 -678 181 512 -255 -113 196 -260 -85 92 -349 -196 430
4731 430 186 -374 166 342 -139 71 2 -207 74 -21 -377 183 400 -316 -396 209 72 -429 180 24 -163
4752 -163 219 -109 -426 84 247 -270 38 315 -98 -24 -14 -170 -13 202 -169 -103 329 155 -361 97 177
4773 177 -193 -59 105 6 41 97 -172 -70 214 -7 -156 130 -22 -38 22 -73 -80 252 55 -168 -74 60 34
4796 34 -300 126 40 -21 131 -184 75 168 105 -204 192 95 -183 212 73 -105 23 116 -71 -17 117 -43 -138
4819 -138 144 -98 -96 53 123 38 69 39 -123 184 24 -103 57 104 -50 94 1 -11 -22 34 2 -14 -50 -99 -54
4844 -54 102 17 -54 151 2 -39 -188 117 -74 -68 241 -35 67 151 76 -109 16 71 106 160 224 -51 1 1 -111
4869 -111 144 -3 -101 -84 93 81 -102 99 -12 -19 -34 141 24 -12 89 -17 71 2 -18 -130 12 -302 -105
4892 -105 106 -73 -19 1 94 -195 284 -210 -123 6 -17 -133 9 -160 1 93 120 -28 -145 140 -57 15 140
4915 140 -128 -75 14 -220 -163 95 -173 -20 155 -28 4 134 32 -232 21 345 -129 -39 219 114 -63 -92
4937 -92 -201 32 53 -114 -266 121 159 -144 83 183 -194 77 -23 -95 -155 228 -258 -226 100 -211 -129 165
4959 165 56 -157 57 105 -12 382 23 -396 84 284 -60 167 114 -79 -4 329 -175 -87 232 -183 -366
4980 -366 342 180 -90 -62 159 -99 160 89 -228 206 320 -317 -284 242 -51 -138 159 -207 9 488 -84
5001 -84 -344 243 161 -272 -52 200 -135 37 -17 -224 41 198 -317 -189 131 78 -160 93 -140 -207 254 -128
5023 -128 -183 264 224 -244 131 315 -217 -54 259 12 96 99 -251 -245 554 105 -380 235 353 -332 -13 212
5045 212 -24 242 63 -392 -20 268 -242 -273 192 -46 -79 113 24 -106 466 -61 -567 288 290 -366 -16 259
5067 259 -251 -154 138 -175 -113 405 -323 -199 336 56 -291 88 240 -196 184 47 -267 302 339 -395 -13
5088 -13 436 20 -200 32 4 -43 136 -178 -186 505 89 -247 186 120 -140 -199 220 -186 -5 207 -279 19
5110 19 378 -255 -365 251 58 -161 108 -16 -75 249 144 -463 110 410 -295 -99 167 26 1 68 -61
5131 -61 80 247 -276 -318 312 125 -388 -54 114 -24 151 94 -297 87 130 -357 -366 270 -35 -215 232 -16
5153 -16 -149 42 61 -263 307 171 -281 98 438 -205 -64 93 -173 -49 230 -142 24 251 -19 -269 117
5174 117 97 -119 -4 -103 -189 97 66 -282 29 146 -191 -168 53 -115 -273 43 -145 -155 203 -104 -174 97
5196 97 65 -166 38 188 80 -85 124 -135 74 192 -124 -206 273 -73 -164 -48 -103 -133 26 137 -299 141
5218 141 -45 -203 151 204 -29 -63 126 -134 141 -15 -181 -182 204 32 -64 104 33 -254 -11 -4 11 -32 -40 -36 -42
5243 -42 72 -5 -242 122 9 -168 -23 -3 -5 285 142 -61 177 207 103 -136 64 73 -2 85 38 47 -68 -152 -162
5268 -162 -8 -41 -196 -21 8 58 99 -12 -87 0 110 -188 -51 -23 9 -42 -50 -53 -11 56 20 -95 -92 160 -52 -180
5294 -180 188 17 -14 54 -110 48 46 -64 -28 -110 -25 -6 15 -116 -131 85 59 151 23 64 -73 37 49 -53 149
5319 149 9 46 -10 27 141 -51 -37 33 13 -49 101 75 50 12 18 -138 152 -103 62 -140 -12 68 208 28
5343 28 -12 157 -75 -75 28 -86 125 -43 157 -26 -66 -21 -24 23 -55 3 2 -28 15 49 2 278 -66 -76 25 -114
5369 -114 -134 71 133 -39 70 23 -32 -78 40 93 85 85 8 191 -77 -71 115 -15 -210 -41 -41 -123 28 165 -75
5394 -75 -138 -69 -46 -16 77 45 -148 -64 -61 54 -72 -59 -133 54 -64 -115 -127 -30 -79 -149 10 -163 36 -74 65 3
5420 3 80 106 -120 0 -6 -6 174 29 -160 22 89 -57 63 66 51 12 -13 -94 3 93 35 -191 9 141 -137 64
5446 64 54 -164 -17 -49 20 62 275 19 -96 199 -36 -46 242 159 -17 133 91 -147 20 132 -108 127 -158
5469 -158 -57 34 30 38 12 -89 19 -9 91 -50 -22 159 -133 -29 -20 34 237 27 -22 -194 -14 37 -121 -76 135
5494 135 -111 80 38 -122 -35 62 1 10 133 64 136 -47 -86 -94 -106 128 -72 8 150 -161 64 -39 -4 -25 14
5519 14 68 2 269 -74 -77 -31 87 71 -4 149 -103 -6 -27 68 10 -7 -71 -59 91 25 -133 38 93 -23 -63 46
5545 46 -175 161 -20 -115 51 -40 58 89 46 55 -107 42 56 -52 -7 -214 -198 30 94 37 75 24 -53 -75 -15 -20 -133
5572 -133 -37 -92 -107 14 75 -62 200 83 -138 -95 -30 -153 62 153 23 -20 218 -20 -195 94 -106 29 126
5595 126 -125 15 60 -16 -67 90 86 -69 107 15 58 25 175 22 154 101 -26 -8 -64 -63 -129 48 6 28 110 -39
5621 -39 -57 -23 -90 64 53 -62 38 -2 -83 -22 241 153 96 42 -12 -117 21 180 97 128 -119 166 -42 98 116
5646 116 64 49 82 -56 -151 49 -19 -74 -44 -99 -126 69 -179 27 -60 -119 116 -156 4 -154 -81 -13 -119 6
5670 6 -90 -62 -91 41 89 30 45 71 -50 124 115 -36 -32 119 68 65 -51 44 20 22 -74 -130 -136 -83 145 55 -43 -8 57 -47
5700 -47 -40 224 -204 150 193 50 -90 78 -7 3 88 -111 84 -112 84 -49 -58 48 -96 -158 -7 -58 -72 -88
5724 -88 -36 86 62 -39 -116 17 169 154 16 -31 18 72 -62 -51 -110 -81 -31 -95 57 97 -7 -8 -57 -142 -67 161
5750 161 -47 -31 151 -2 208 24 -63 -81 -15 18 10 -68 -91 -13 -68 -104 -42 -57 -97 128 -51 67 32 4 26 -14
5776 -14 9 -218 -119 -203 -3 -86 35 182 51 -44 116 -23 -6 115 28 90 -100 -1 -23 74 149 13 9 -126 103
5801 103 -57 125 41 -10 -199 115 18 -31 133 20 16 28 -39 0 152 -234 79 17 -49 -36 40 28 -60 18 15 -223
5827 -223 25 52 -103 23 132 -164 -57 -83 -11 12 -19 -36 -44 68 88 -157 -13 -78 -12 75 13 -48 -1 52 46 -165
5853 -165 -1 203 24 33 -39 41 -46 -43 35 -6 -106 8 18 -78 113 50 -43 -105 -79 54 37 -71 28 -34 -16 56 -11
5880 -11 -57 -101 136 -29 12 -2 73 72 27 84 139 65 25 -95 -58 -55 -31 175 -71 150 77 6 -147 27 -157 -169 -3
5907 -3 33 4 -19 12 -122 77 -7 72 -54 44 -131 -124 -36 1 29 60 21 -5 33 182 -89 102 -224 -117 -52 -47 124
5934 124 87 79 -1 -84 185 -47 12 116 -5 144 -114 126 -8 139 238 -69 -36 29 99 -83 86 -126 12
5957 12 60 -132 -108 36 -54 -165 12 4 -29 -41 35 -86 27 -46 -16 -129 147 96 -110 -107 -38 -4 -79 98 -55 -95
5983 -95 -12 -104 162 -54 -71 30 80 -119 -56 47 70 83 37 66 -150 160 17 -100 78 238 59 106 -39 71
6007 71 128 170 -66 13 99 -58 -6 -145 42 -77 90 -82 51 106 -80 -14 46 -24 75 43 -150 -36 -63 20 -102
6032 -102 -60 13 -33 -72 201 -64 -10 39 39 -156 -105 43 -234 40 -44 -170 -210 91 45 -69 123 -89 22 24 -79
6057 -79 32 160 -15 -33 60 -58 -88 -95 124 -63 109 -44 -82 -229 -22 -44 -15 111 140 -62 -51 -37 -156 -114
6081 -114 -35 -112 -4 51 -4 26 90 -112 -37 82 -32 -90 182 -29 -147 95 -29 -196 29 -3 -184 -20 89
6104 89 16 8 109 -151 -1 79 -153 -93 49 41 -119 8 50 -39 4 13 -162 71 -17 -229 -52 86 -43 -86 -11
6129 -11 -175 -64 45 -55 -86 104 24 -188 -131 -39 -73 213 5 -36 -34 141 -124 -60 -13 2 -88 -24 25 85 184 -35
6155 -35 -29 -11 63 -181 131 80 -70 79 -6 -97 109 36 93 -146 148 27 -99 35 73 -235 42 3 -117 166
6179 166 -14 107 -4 160 12 -10 62 89 -66 114 -86 -40 91 -65 -161 -157 12 -91 33 -4 -19 108 225
6202 225 -229 161 161 -42 -37 26 -158 -199 104 -11 40 120 -127 29 63 -202 -75 18 61 -108 -151 6 24 -71 80
6227 80 -143 -118 233 -21 -107 41 300 -248 -113 -54 16 8 -66 -121 -49 4 -24 -111 62 -85 -176 -16 69 -56 20
6252 20 -64 -8 -3 52 -128 -113 85 -68 60 120 -75 -102 257 93 32 -5 -65 -176 -6 -115 -43 -203 -55 -146 47
6277 47 66 -133 -30 129 68 24 -33 -34 -15 -5 98 -113 136 60 -72 -175 14 -83 89 -75 -51 38 16 67 -20
6302 -20 -12 12 -7 -75 -80 -4 8 92 -73 66 166 -76 33 -94 -147 -32 94 149 103 110 47 -33 38 -38 44 157 26
6329 26 74 65 -90 49 24 104 158 112 100 -129 -8 43 -205 -235 -46 124 -174 91 -87 39 88 -240 -49 67
6353 67 86 -143 63 -54 -40 -63 65 -61 0 122 25 -81 61 67 -172 40 36 24 91 84 -43 99 10 24 31 27 15
6380 15 131 -180 -116 -134 -12 -58 -136 -101 183 -102 45 -34 -119 -129 51 -9 -282 76 97 57 91 -120 -8 302
6404 302 30 -77 -29 153 25 126 -65 15 61 -46 -171 -63 195 -19 -110 117 -11 -46 76 -60 43 74
6426 74 16 -155 -44 -59 53 -92 66 -106 -56 79 53 97 52 -16 -19 177 -161 -144 33 99 -86 -155 73 -38
6450 -38 128 145 -143 -3 211 -13 124 14 99 77 184 70 -35 231 -60 -38 14 203 -24 -10 169 -40
6472 -40 95 153 -153 9 -33 -171 -23 18 47 84 -57 43 14 -39 39 -130 -47 57 -103 -33 -48 28 -44 121 -216
6497 -216 -10 95 -18 -88 41 -17 -135 -22 73 83 184 -1 -151 -81 -1 -177 -152 150 -6 -91 -14 -28 -100 130
6521 130 -100 131 34 -108 -235 6 143 -37 -79 164 8 73 111 -311 -36 108 38 -111 67 -54 -57 122
6543 122 -60 -76 178 101 -95 -15 182 26 107 -9 64 -42 -21 -140 -166 41 -82 -37 -12 87 -220 -124 123 -137
6567 -137 41 34 -152 45 175 -20 -74 200 111 -127 76 151 -48 53 124 -115 248 184 -136 -1 188 -207
6589 -207 -223 78 -60 -106 92 -107 -219 296 -89 -8 -24 4 -132 47 137 -69 10 -32 -263 -141 164 8 -163
6612 -163 55 43 65 -8 -123 -244 86 68 -159 131 110 -68 -33 52 46 17 233 87 -94 245 -46 -153 -50
6635 -50 88 -82 -45 -25 -215 76 71 -264 -2 136 -169 -22 141 -158 17 52 -130 102 115 13 -106 -14 167
6658 167 2 146 76 29 113 93 21 121 120 -53 -269 107 54 -119 -96 29 -32 111 -74 -122 99 -13 -246 3
6682 3 180 -71 -98 1 -87 -56 31 -84 -28 53 0 -203 -37 42 -51 -60 -55 -98 139 183 -72 -148 122 76 -90 62 20
6709 20 -89 -40 10 74 -19 66 -126 -119 139 -197 23 -42 -101 253 86 -53 -125 140 -216 -60 187 -91 -61 87
6733 87 65 -18 -76 3 -77 92 171 -137 -109 237 34 -194 16 194 95 175 -169 -25 153 40 -231 -34 157
6756 157 -8 -19 225 9 -67 87 -213 -8 64 35 -196 37 75 -16 -54 -31 -94 75 -56 -209 173 231 -7
6779 -7 -23 163 0 -169 42 41 -88 193 25 0 -67 87 -15 -181 100 -61 32 -159 30 -30 172 50 -158
6802 -158 61 2 -36 45 99 -182 53 -64 29 121 141 -226 8 140 -34 -179 58 14 53 -3 -64 -91 15 1
6826 1 -94 100 -63 70 51 -20 -60 -124 117 30 103 111 -92 54 -16 89 -191 85 -141 -8 -22 119 -163 68
6850 68 87 -57 -16 229 -43 69 106 -44 -225 120 54 -61 6 -38 -159 22 10 -88 211 -5 -103 -109 224 -60
6874 -60 -172 127 40 -57 94 -55 28 18 3 -65 1 93 -19 118 59 133 8 -82 -86 13 53 -135 -11 -20 51 -122
6900 -122 -7 -9 -29 115 37 -133 -54 -41 -43 -7 86 -111 -54 85 -84 -8 105 -86 111 -28 -151 -151 34 72 -93
6925 -93 81 97 -96 29 17 130 -26 166 -214 -104 105 -8 -120 45 -113 -178 -75 284 12 80 -44 101
6947 101 -141 146 43 -156 153 -27 78 -1 -47 -42 -16 -52 -43 -5 97 -33 -155 192 -280 -118 91 -55 15
6970 15 84 -86 4 -77 -83 -82 92 138 69 -114 8 22 -13 70 4 189 162 -117 -63 174 -87 -147 40 -6 -121 -65
6996 -65 -90 -102 48 98 -101 48 -1 -16 -9 -52 -18 130 256 -97 -31 128 102 -221 90 49 -154 173 -60 -68 159
7021 159 4 -275 165 -37 -182 -191 145 -96 46 -9 -90 47 86 32 -220 -6 -22 -119 -27 -38 -89 -71 147 27
7045 27 -36 119 -184 -190 76 -85 -3 134 -55 -110 161 -61 -146 106 -139 -131 134 124 -30 5 79 -6 -32 25 -99
7070 -99 23 52 -10 -78 -50 -58 -115 85 16 -198 32 6 -155 58 126 -144 -99 158 122 29 -155 -137 -12 208 -160
7095 -160 -57 53 59 -21 109 278 -242 -52 -62 -137 143 169 -106 -7 258 -9 -190 9 -43 20 -24 -118 -107 -49
7119 -49 9 -95 27 253 -225 120 208 4 -52 63 3 -49 234 -14 -174 161 51 20 48 41 -50 -99 -26 -262
7143 -262 -62 188 -127 -290 102 10 -69 -29 -102 -148 173 -112 -236 -30 230 -138 -30 -43 5 88 35 30 -8 178
7167 178 -58 -44 336 3 -92 179 22 -126 -68 189 -130 35 260 -320 40 87 -137 -141 61 47 -113 290
7189 290 -83 -114 268 131 -200 169 73 -18 -52 -194 -233 135 185 -41 -27 30 -122 -113 102 13 -210 27 -115 -57
7213 -57 150 31 -103 -89 280 -101 -5 -23 18 -37 123 -109 -34 229 154 -15 -64 213 -88 -133 100 -14 161
7236 161 15 19 -195 11 24 -231 75 -44 -162 92 -46 -80 255 -24 -222 -116 31 -223 102 50 -66 -6
7258 -6 27 3 -54 37 -35 -148 183 191 -126 0 86 -82 -79 43 -110 -42 148 -36 -21 23 14 -38 -34 -24 -103 -75 -196 -47
7286 -47 24 91 -94 1 132 -203 -21 104 -198 130 72 -156 68 99 6 -85 13 42 -172 19 -42 -159 -8 -33
7310 -33 -174 79 253 -123 -18 4 16 -54 -9 14 16 101 111 -112 68 49 99 65 92 52 131 55 -7 -98 37 -89
7336 -89 -108 10 -41 7 249 54 -104 -113 38 68 173 89 -111 87 -122 34 34 86 -26 22 130 -25 24 151
7360 151 -53 40 -124 -12 -171 62 65 -131 138 145 -109 -14 93 74 -87 53 127 -35 -21 -22 -64 11 -57 -53 49
7385 49 -47 -100 26 77 -22 -7 15 -166 -99 35 -170 155 92 17 -83 156 106 -162 3 -42 -195 -27 56 -26 -5
7410 -5 -82 -60 105 82 -43 -21 117 77 32 41 91 -128 156 -11 -212 60 47 -12 -184 -61 -34 33 127 -167 -56
7435 -56 76 -244 73 107 -91 -87 43 -90 30 69 139 -167 65 62 -187 140 -1 -227 1 -96 110 -125 -42
7458 -42 -17 -63 7 -81 -100 1 -73 -123 79 -54 -82 -33 140 -43 11 136 -138 -155 124 71 6 83 159 -243 9
7483 9 180 -108 59 292 -92 15 137 -35 -15 37 -19 -67 114 62 79 195 11 -109 38 50 -239 -117 140
7506 140 -105 79 120 -83 -10 125 49 -292 30 43 -58 46 -46 -151 175 32 -156 78 231 -51 -217 -18
7528 -18 -160 5 103 57 -26 -40 -7 -160 335 52 -106 -47 44 22 -118 6 -91 102 150 -120 72 229 43 -121
7552 -121 89 98 -203 12 -26 -173 165 72 -256 23 94 -37 -50 18 -82 19 -15 -70 -24 31 -97 49 128 64
7576 64 15 -118 -127 -100 92 10 -153 40 192 -30 -48 179 64 -167 33 -2 -191 201 -54 -131 -42 -28 -226 131
7600 131 102 -106 153 34 -232 -8 132 -87 -42 33 8 62 -20 -101 15 146 66 -105 48 252 -236 -96 203
7623 203 89 -49 161 -284 12 93 -72 -18 10 81 -148 44 132 -117 173 7 -5 9 206 -52 -131 262 57
7646 57 -265 -40 -85 69 79 9 -181 4 98 -167 -82 127 91 -111 259 -94 -82 144 -236 15 120 -97 -263
7669 -263 222 178 -188 34 5 59 203 -97 -215 88 138 -153 -108 170 -185 114 125 0 50 177 -228 -110
7691 -110 94 29 -184 -55 11 56 148 7 -139 -32 177 -128 29 183 0 55 204 139 43 -22 92 -63 196
7714 196 109 -153 58 54 -106 -206 122 92 -9 178 -258 -75 145 -26 -79 260 202 -123 22 -89 -72 75
7736 75 106 -56 171 330 -12 -131 263 12 -64 -37 -121 42 84 -129 -212 13 24 -32 0 -101 -40 17 -64 7 88
7761 88 17 -53 -103 53 -47 -45 -122 93 19 135 -50 -148 62 19 -50 -152 205 81 -118 54 38 -95 186 -165
7785 -165 -64 244 -68 -77 -101 219 -131 -117 -72 35 -100 -6 -111 18 84 -4 -88 99 98 -114 -17 167 -22 -16 -51
7810 -51 -10 7 191 17 -69 49 -97 16 -91 -60 120 96 10 -165 40 -19 -115 -59 -41 -166 10 221 -59 31
7834 31 146 -76 98 62 -84 -40 -27 178 -150 -151 -7 30 -92 24 102 47 122 -35 -94 66 57 5 85 -13 172
7859 172 165 76 -69 31 146 -27 -13 93 97 110 128 -139 -19 -78 -142 -40 -53 -162 -64 -118 197 7 35 68 -56
7884 -56 112 -4 -110 -110 -98 -74 -45 -58 -47 -116 31 7 3 -132 -166 -52 131 -68 -133 -126 18 -129 -102 113 -58 162
7910 162 66 -124 -5 168 81 71 19 181 -134 146 -23 -117 56 -25 -109 -82 -66 -141 112 8 4 -185 70 -86
7934 -86 -34 85 -87 -219 22 -57 -80 30 -29 96 129 62 -101 127 126 32 -106 49 -60 -141 -2 -69 -26 -7 44
7959 44 -90 69 -56 -123 61 -22 -20 -8 -109 -2 -7 -72 -85 -2 29 -23 -72 31 -53 -30 -37 72 -20 56 -97 -64 9
7986 9 20 -159 -101 59 34 -108 69 19 -30 193 -164 -60 -77 51 33 -28 173 -19 24 -85 -84 -28 99 26 -136
8011 -136 178 -52 -181 -70 97 -81 -18 -4 -93 138 -12 -146 32 77 -68 -83 -65 -28 -109 25 25 -128 138
8034 138 37 -86 122 158 40 -17 -4 7 -22 -70 -143 95 -36 -153 -191 -68 146 -107 9 67 81 152 -116 -101
8058 -101 -18 103 -1 -16 89 -41 118 -25 -55 -49 26 -24 -124 41 -46 -127 52 -9 31 -31 -71 -64 89 132 -136
8083 -136 -14 48 56 -180 229 45 -73 -26 -132 -57 60 142 -174 -168 16 -36 -185 -98 -134 56 107 -11 -157 59
8107 59 -48 -60 59 9 -96 49 3 -52 80 41 -280 25 189 -60 -2 121 -112 168 18 124 -117 28
8129 28 -135 -145 151 93 0 99 117 -57 65 37 -69 -192 221 -89 7 137 15 -202 120 -18 -75 106 103 -183
8153 -183 -94 123 -125 69 -98 22 118 20 -82 -73 -12 13 -78 64 44 -148 -77 -79 30 13 -90 35 141 119 -195
8178 -195 -76 171 2 -87 156 -38 -134 -117 -271 -36 155 -37 -35
8191c5
##END NTUPLES=NMR FID
##END=
