##TITLE=1H_AT-45x
 CCl4+Py-d5
 64 sc, 
 21.2.2023
##JCAMPDX= 6.0         $$ Bruker NMR JCAMP-DX V2.0
##DATA TYPE= NMR FID
##DATA CLASS= NTUPLES
##ORIGIN= UXNMR, Bruker Analytische Messtechnik GmbH
##OWNER= root
$$ XWIN-NMR		Version 3.5
$$ Tue Feb 21 14:06:45 2023 Russian Standard Time (UT+4h)  she@DPX200
##.OBSERVE FREQUENCY= 200.13135
##.OBSERVE NUCLEUS= ^1H
##.DELAY= (6, 6)
##.ACQUISITION MODE= SIMULTANEOUS
##.ACQUISITION SCHEME= undefined
##.AVERAGES= 48
##.DIGITISER RES= 18
##SPECTROMETER/DATA SYSTEM= spect
##.PULSE SEQUENCE= zg30
##.SOLVENT NAME= DMSO
##.SHIFT REFERENCE= (INTERNAL, DMSO, 0, 15.7039)
##AUDIT TRAIL= $$ (NUMBER, WHEN, WHO, WHERE, WHAT)
$$ ##TITLE= Audit trail, XWIN-NMR		Version 3.5
$$ ##JCAMPDX= 5.01
$$ ##ORIGIN= Bruker BioSpin GmbH
$$ ##OWNER= she
$$ F:/spectra/data/she/nmr/H-F/1/audita.txt
$$ ##AUDIT TRAIL=  $$ (NUMBER, WHEN, WHO, WHERE, WHAT)
(   1,<2023-02-21 14:05:51.70 +0400>,<she>,<DPX200>,
      <continue with go, POWCHK disabled, PULCHK disabled
       configuration hash MD5:
       00 E9 B6 7A A2 85 ED C7 34 08 36 98 17 FE 4E 26
       data hash MD5: 16K
       DB 58 D6 FB 90 0A 41 76 C7 8B F5 39 3E 17 6E F4>)
$$ ##END=
$$ 
$$ hash MD5
$$ 71 E1 B6 B4 85 4D CB 67 8F 48 5D 9F 4D C3 90 0A
##$RELAX= 
##$RELAX= 
##$RELAX= 
##$RELAX= 
##$RELAX= 
##$RELAX= 
$$ Bruker specific parameters
$$ --------------------------
##$DU= <F:/spectra>
##$EXPNO= 1
##$NAME= <H-F>
##$PROCNO= 1
##$TYPE= <nmr>
##$USER= <she>
##$AMP= (0..31)
100 100 100 100 100 100 100 100 100 100 100 100 100 100 100 100 100 100 
100 100 100 100 100 100 100 100 100 100 100 100 100 100 
##$AQSEQ= 0
##$AQ_mod= 1
##$AUNM= <au_zg>
##$AUTOPOS= <>
##$BF1= 200.13
##$BF2= 200.13
##$BF3= 200.13
##$BF4= 200.13
##$BF5= 200.13
##$BF6= 200.13
##$BF7= 200.13
##$BF8= 200.13
##$BYTORDA= 1
##$CFDGTYP= 0
##$CFRGTYP= 5
##$CHEMSTR= <none>
##$CNST= (0..31)
1 1 145 1 1 1 1 1 1 1 1 1 1 1 1 1 1 1 1 1 1 1 1 1 1 1 1 1 1 1 1 1 
##$CPDPRG= <>
##$CPDPRG1= <>
##$CPDPRG2= <>
##$CPDPRG3= <>
##$CPDPRG4= <mlev>
##$CPDPRG5= <mlev>
##$CPDPRG6= <mlev>
##$CPDPRG7= <mlev>
##$CPDPRG8= <mlev>
##$CPDPRGB= <>
##$CPDPRGT= <>
##$D= (0..31)
0 1.2 0 0 0 0 0 0 0 0.06 0 0.03 0 0 0 0 0.0002 0 0 0 0 0 0 0 0 0 0 0 0 
0 0 0 
##$DATE= 1676973756
##$DBL= (0..7)
120 120 120 120 120 120 120 120 
##$DBP= (0..7)
150 150 150 150 150 150 150 150 
##$DBP07= 0
##$DBPNAM0= <>
##$DBPNAM1= <>
##$DBPNAM2= <>
##$DBPNAM3= <>
##$DBPNAM4= <>
##$DBPNAM5= <>
##$DBPNAM6= <>
##$DBPNAM7= <>
##$DBPOAL= (0..7)
0.5 0.5 0.5 0.5 0.5 0.5 0.5 0.5 
##$DBPOFFS= (0..7)
0 0 0 0 0 0 0 0 
##$DE= 6
##$DECBNUC= <off>
##$DECIM= 32
##$DECNUC= <off>
##$DECSTAT= 4
##$DIGMOD= 1
##$DIGTYP= 9
##$DL= (0..7)
0 120 120 120 120 120 120 120 
##$DP= (0..7)
150 150 150 150 150 150 150 150 
##$DP07= 0
##$DPNAME0= <>
##$DPNAME1= <>
##$DPNAME2= <>
##$DPNAME3= <>
##$DPNAME4= <>
##$DPNAME5= <>
##$DPNAME6= <>
##$DPNAME7= <>
##$DPOAL= (0..7)
0.5 0.5 0.5 0.5 0.5 0.5 0.5 0.5 
##$DPOFFS= (0..7)
0 0 0 0 0 0 0 0 
##$DQDMODE= 0
##$DR= 18
##$DS= 0
##$DSLIST= <SSSSSSSSSSSSSSS>
$$ [...]
##$SUBNAM2= <"">
##$SUBNAM3= <"">
##$SUBNAM4= <"">
##$SUBNAM5= <"">
##$SUBNAM6= <"">
##$SUBNAM7= <"">
##$SUBNAM8= <"">
##$SUBNAM9= <"">
##$SW= 18.05172834244
##$SWIBOX= (0..15)
0 0 2 0 0 0 0 0 0 0 0 0 0 0 0 0 
##$SW_h= 3612.71676300578
##$TD= 16384
##$TD0= 1
##$TE= 0
##$TE2= 300
##$TE3= 300
##$TEG= 300
##$TL= (0..7)
0 120 120 120 120 120 120 120 
##$TP= (0..7)
150 150 150 150 150 150 150 150 
##$TP07= 0
##$TPNAME0= <>
##$TPNAME1= <>
##$TPNAME2= <>
##$TPNAME3= <>
##$TPNAME4= <>
##$TPNAME5= <>
##$TPNAME6= <>
##$TPNAME7= <>
##$TPOAL= (0..7)
0.5 0.5 0.5 0.5 0.5 0.5 0.5 0.5 
##$TPOFFS= (0..7)
0 0 0 0 0 0 0 0 
##$TUNHIN= 0
##$TUNHOUT= 0
##$TUNXOUT= 0
##$USERA1= <user>
##$USERA2= <user>
##$USERA3= <user>
##$USERA4= <user>
##$USERA5= <user>
##$V9= 5
##$VALIST= <valist>
##$VCLIST= <CCCCCCCCCCCCCCC>
##$VD= 0
##$VDLIST= <DDDDDDDDDDDDDDD>
##$VPLIST= <PPPPPPPPPPPPPPP>
##$VTLIST= <TTTTTTTTTTTTTTT>
##$WBST= 1024
##$WBSW= 4
##$XGAIN= (0..3)
0 0 0 0 
##$XL= 0
##$YL= 0
##$YMAX_a= 2052707
##$YMIN_a= -2101273
##$ZGOPTNS= <>
##$ZL1= 120
##$ZL2= 120
##$ZL3= 120
##$ZL4= 120
##$ABSF1= 10
##$ABSF2= 0
##$ABSG= 5
##$ABSL= 3
##$ALPHA= 0
##$AQORDER= 0
##$ASSFAC= 0
##$ASSFACI= 0
##$ASSFACX= 0
##$ASSWID= 0
##$AUNMP= <proc_1d>
##$AZFE= 0.1
##$AZFW= 0.1
##$BCFW= 1
##$BC_mod= 2
##$BYTORDP= 1
##$COROFFS= 0
##$CY= 11.3945322036743
##$DATMOD= 1
##$DC= 2
##$DFILT= <>
##$DTYPP= 0
##$F1P= 2.36226072786647
##$F2P= -0.459571619588291
##$FCOR= 0.5
##$FTSIZE= 0
##$FT_mod= 4
##$GAMMA= 1
##$GB= 0.15
##$INTBC= 1
##$INTSCL= 1
##$ISEN= 128
##$LB= 0.24
##$LEV0= 0
##$LPBIN= 0
##$MAXI= 10000
##$MC2= 0
##$MEAN= 0
##$ME_mod= 0
##$MI= 1.114404
##$NCOEF= 0
##$NC_proc= 0
##$NLEV= 6
##$NOISF1= 3.799351
##$NOISF2= 2.8
##$NSP= 1
##$NTH_PI= 0
##$NZP= 0
##$OFFSET= 15.70392
##$PC= 1
##$PHC0= -19103.37
##$PHC1= 9.200781
##$PH_mod= 1
##$PKNL= yes
##$PPARMOD= 0
##$PSCAL= 0
##$PSIGN= 0
##$REVERSE= no
##$SF= 200.130013532006
##$SI= 16384
##$SIGF1= 3
##$SIGF2= 2
##$SINO= 400
##$SIOLD= 16384
##$SREGLST= <1H.CDCl3>
##$SSB= 0
##$STSI= 0
##$STSR= 0
##$SW_p= 3612.71676300578
##$SYMM= 0
##$S_DEV= 0
##$TDeff= 0
##$TDoff= 0
##$TI= <>
##$TILT= no
##$TM1= 0
##$TM2= 0
##$TOPLEV= 0
##$USERP1= <user>
##$USERP2= <user>
##$USERP3= <user>
##$USERP4= <user>
##$USERP5= <user>
##$WDW= 1
##$XDIM= 8192
##$YMAX_p= 0
##$YMIN_p= 0
$$ End of Bruker specific parameters
$$ ---------------------------------
##NTUPLES= NMR FID
##VAR_NAME=  TIME,          FID/REAL,        FID/IMAG
##SYMBOL=    X,             R,               I
##VAR_TYPE=  INDEPENDENT,   DEPENDENT,       DEPENDENT
##VAR_FORM=  AFFN,          ASDF,            ASDF
##VAR_DIM=   8192,          8192,            8192
##UNITS=     SECONDS,       ARBITRARY UNITS, ARBITRARY UNITS
##FACTOR=    0.0002768,     1,               1
##FIRST=     0,             0,               0
##LAST=      2.2672688,     0,               0
##MIN=       0,             -2101273,        0
##MAX=       2.2672688,     2052707,         0
$$ Real data points
##PAGE= N=1
##DATA TABLE= (X++(R..R)), XYDATA
$$ [...]
2275b24Q84m16o46j53N05K14K33j81o58L92l4P90n12L43n17j63K75p6M29n49q8
$$ -224 660 244 -402 -555 -50 164 397 216 -442 -50 -84 706 194 537 20 -143 132 56 485 -64 -152
2296a52l65J05K49J181p50j110P35L3O25r9n50M97n00Q12q65K56k9r1K05k24M28
$$ -152 -517 -412 -163 1018 268 -842 -107 -74 551 452 -98 399 -101 711 -154 102 73 -18 187 -37 391
2317C91n62K56m12L45k68J72j98P59N5r29K21J214M6j809K53L01J55m6m62k91
$$ 391 -171 85 -327 18 -250 -78 -276 483 538 -391 -170 1044 1090 -719 -466 -165 -10 -56 -518 -809
2337h09R46P22l84l04m35P48m59K57j20j119J48J208q4l07l58N84K06P3j14n16
$$ -809 137 859 475 171 -264 484 25 282 162 -957 -809 399 315 8 -350 234 440 513 399 -117
2357a17J30K20j83o76K60J805j349j85k65K11N42m28O5l44O26N52p27m00J47M29
$$ -117 13 233 50 -626 -366 1439 90 -95 -360 -149 393 -35 30 -314 312 864 137 -263 -116 313
2377C13M80p35j68j86O60j59m11K17r0M18J68n96Q3J52K56j62l17p8J06P31q41
$$ 313 793 58 -110 -296 364 205 -206 11 -79 339 507 -89 -6 146 402 240 -77 -155 -49 682 -159
2398a59K0k06K87O0k24o49J276L14j008K50O16l26k1j90n51K77j46N66p73N88
$$ -159 -139 -345 -58 2 -222 -871 405 719 -289 -39 577 251 230 40 -511 -234 -380 186 -587 1
2418Aj39N23k08m21P3K0K63M15n71j66L82j14J10n71J79j93L82L91n13k41k25
$$ 1 -138 385 177 -244 -171 -151 112 527 -44 -210 172 58 168 -403 -224 -417 -35 356 -157 -398 -623
2439f23M71L65m13j39K40L93l98K01p16J022l76j00O05j295R55M90j220O19k07
$$ -623 -152 213 -200 -339 -99 294 -104 97 -619 403 27 -73 532 -763 192 682 -538 81 -126
2458a26M33j51n24O89o56J055o3j033L50qL8j99K21L67J12N7j008J69O23L5r5
$$ -126 307 156 -368 321 -335 720 657 -376 -26 -34 4 -195 26 393 505 562 -446 -277 346 381 286
2479B86o30r7K63J315m89j427J100q59R72j74o35k34J242o94L16j70J67j77m76
$$ 286 -344 -441 -178 1137 648 -779 321 -538 434 260 -375 -609 633 -61 255 85 252 75 -401
2498d01L69m9J61l37O76k87p76N65Q0P2K78n24M23M90n41p73N23O6J19rk8k96
$$ -401 -32 -81 80 -257 419 132 -644 -79 1 73 351 -173 250 740 199 -574 -51 15 134 125 97 -199
2520a99Q10n74l26J82K38n95M2P19j33m83j92N29L36n48j7N20L74r40p8N68r65
$$ -199 611 37 -289 -107 131 -464 -422 297 164 -319 -511 18 354 -194 -211 309 683 -257 -335 233 -732
2541g32J34J010o34M72O68q00k90N34m13J19K02l70O91m87m7p36Q61K11o28N56
$$ -732 -598 412 -222 250 918 118 -172 362 -51 68 270 -100 591 104 57 -679 182 393 -235 321
2561C21l55L05j64N4K57p81k4J49Q45L7j248L79L9O5J63m89K16m14J212r85O2
$$ 321 -34 271 107 161 418 -363 -387 -238 607 644 -604 -225 -186 -121 42 -447 -231 -645 567 -418 -356
2582c56O92q2o06k54J95M01J60K07l42p01R13l01r16J085n93Q27p16K03K77n04
$$ -356 336 254 -352 -606 -411 -10 150 357 15 -686 227 -74 -990 95 -498 329 -387 -184 93 -411
2602d11Q31k81k25j019P27J016j42l18k86N47K39j114P65j43O28p82K28p31Q9
$$ -411 420 139 -86 -1105 -378 638 496 178 -108 439 678 -436 329 186 814 32 260 -471 -382
2621c82J98O57p61k19M77J63j66M95p65j72Q90l25l65j77L71N15j76M60o88m66
$$ -382 -184 473 -288 -507 -30 133 -33 462 -303 -475 415 90 -275 -452 -81 434 258 718 30 -436
2641d36P74m18k35K90L07l55q33L44Q11o29O65m93Q69o58L23P3n35n8R60p40k92
$$ -436 338 -80 -315 -25 282 -73 -906 -562 249 -380 285 -208 661 3 326 399 -136 -194 766 26 -266
2662b66%j20K29L66J66j149J273n52Q78j710P32K14Q2J85j122K14J068j74o7J0
$$ -266 -266 -386 -157 209 375 -774 499 -53 825 -885 -153 61 143 328 -794 -580 488 314 247 257
2682B57J63k09J45m09l75j37L97L29j11n47j60R84m62l70Q0P3j32M7K05k19K18
$$ 257 420 211 356 -53 -428 -565 -168 161 50 -497 -657 327 -135 -505 -425 -352 -484 -437 -232 -451 -233
2703b33N42n3K68r97O92k75l77M10L92r4k41m88J13L69j11K52o58O83m70R78m33
$$ -233 309 256 524 -473 219 -56 -433 -23 369 275 34 -454 -341 28 -83 169 -489 194 -276 702 269
2724B69n96l82J017j90K69q08o1P84l5o28R9N13q20K15L95n87J151q03M23l12
$$ 269 -327 -709 308 118 387 -421 -482 302 267 -361 -262 251 -569 -354 41 -546 605 -198 225 -87
2744h7M39m43l59J7N70j63N94n41Mk74o38P22O83m56K21j087P27M74j94j46q4
$$ -87 352 -91 -450 -433 137 -26 568 27 31 -243 -881 -159 524 68 289 -798 -71 403 209 63 -21
2765b1L66j37L63l00o48M92k64K16o93N19Q08m21q70L28M95K2n23o38J004o12
$$ -21 345 208 571 271 -377 115 -149 67 -626 -107 701 280 -590 -262 233 255 -268 -906 98 -514
2785e14N22m73K65l06L88m9j03r1P19r52M49K86r4O98o26j03n81K87J83L28J72
$$ -514 8 -465 -200 -506 -118 -167 -270 -361 358 -594 -145 141 47 745 119 16 -565 -278 -95 233 405
2806D05n04k41L39K01m96n34L46P82K01r24M06lK76l20J71n4J71K19m50O1j85
$$ 405 -99 -340 -1 200 -296 -830 -484 298 499 -425 -19 -22 254 -66 105 51 222 441 -9 52 -133
2827a33j86K06l8p6L23k24N66k41m16L66J57k05l17l02L95J11J89M7l85k45K84
$$ -133 -319 -113 -151 -227 96 -128 438 197 -219 147 304 99 -218 -520 -125 -14 175 222 -163 -408 -124
2848a24J51K15k75j52M2k80l2O93l03L10m2o35M20k41L02m4p14O83O03Q9l09p68
$$ -124 27 242 -33 -185 -143 -423 -455 238 -65 245 203 -432 -12 -253 49 5 -709 -26 577 666 357 -411
2870d11j41N99J16j07k43k80J93O09q11P11m07J32j3L35L4Q2m20L72l43K17r1
$$ -411 -552 47 163 56 -187 -467 -274 335 -476 235 -172 -40 -53 282 316 398 -22 350 7 224 133
2891A33J95j41l49M97k85N75o14o56J05O72K52j049O43O9Q48j290j28P14m58N37
$$ 133 328 187 -162 335 50 625 11 -645 -540 132 384 -665 -22 47 895 -395 -523 191 -267 270
2911B70l18M61n44j03N55q94P69J13j48r0m81M66L07j14l29j21k39N19J56o53
$$ 270 -48 413 -131 -234 321 -573 196 309 161 71 -410 56 363 249 -80 -201 -440 79 235 -418
2931d18M95k58L04J64k23J12L49n09m94L19m4l7O13j6r61J097L1n63l04J51J79
$$ -418 77 -181 123 287 64 176 525 16 -478 -159 -203 -240 373 357 -604 493 524 -39 -343 -192 -13
2952a3jM77o18p03J27M77N66n7j87o34N31m0J16J55K35l06N11j312M97L87L27
$$ -13 -14 463 -155 -858 -731 -254 312 255 68 -566 -35 -75 41 196 431 125 636 -676 -179 208 535
2973E35m65K49q02M69K37o97N82p3o3K5l07k00N88p88O73k62m86Q26L28J63n60
$$ 535 70 319 -483 -14 223 -474 108 35 -28 -3 -310 -510 78 -710 -37 -299 -785 41 369 532 -28
2994b8m38K37J54K81K32p05l5M18p07N65p28M44N09L31o27P42o02l03K16L78p60
$$ -28 -466 -229 -75 206 438 -267 -302 116 -591 -26 -754 -310 199 530 -97 645 43 -260 -44 334 -426
3015d26J72p1n53R59k18R36n60o0j18j09l87J03j14O24MJ33n54L13L55p80j94
$$ -426 -254 -325 -878 81 -137 799 239 179 61 -48 -435 -332 -446 178 182 315 -239 74 429 -351 -545
3036e45L03L26N0K23p93r2Q49N7l73N14p44P35o53J70K92n76k0jM76j166Q61K18
$$ -545 -242 84 134 357 -436 -528 321 378 5 519 -225 510 -143 27 319 -257 -277 -278 198 -968 -107 111
3058A11q7k8J41M43m56m7J07m95Q0J51O19n82M7P5L31j83m68N72p56P34j97q6
$$ 111 24 -4 137 580 124 77 184 -311 -231 -80 539 -43 4 79 410 227 -241 331 -425 309 112 26
3080B6K61j78j09N68n71J05q0j92l24O94j36j81L68J42p99N97K6k69k44k13J257
$$ 26 287 109 0 568 -3 102 22 -170 -494 200 64 -117 251 393 -406 191 217 -52 -296 -509 748
3101G48j94o04j49j52L72n3k83K66j55L5M25m14L94m34n74M87K31N56n50N21p60
$$ 748 554 -50 -199 -351 21 -32 -315 -49 -204 -169 256 -158 236 -198 -772 -285 -54 502 -48 473 -287
3122b87J13M07n36Q28n18J8j50MO51R2q0m59Q5j05l21N75j61n38K43j33O37j084
$$ -287 -174 233 -303 525 7 25 -125 -121 530 622 542 83 168 63 -258 317 156 -382 -139 -272 365 -719
3144g19O20N42M2p01j99L02O58q78QK41M88m82K45m31K30Q97q77M1j070J000j51
$$ -719 -99 443 485 -216 -415 -113 545 -333 -325 -84 404 -78 167 -264 -34 863 -14 27 -1043 -43 -194
3165a94N84n80j21J35M34k57O93j083Q22j98J30k66o96Q00j49J80l02M96j98j88
$$ -194 390 -190 -311 -176 258 1 694 -389 433 235 365 99 -597 203 54 234 -68 428 230 42
3185D2J24k39K54j80l63l3L34N36k52l16J04J61l38O73q59J4j13P86j74q71N71
$$ 42 166 -73 181 1 -362 -395 -61 475 223 -93 11 172 -166 507 -352 -338 -451 335 161 -710 -139
3206a39l93K46J46K93r88N99M20%o85M45L69M09r95J78M68o8o68L93J06m95K54
$$ -139 -532 -286 -140 153 -835 -236 184 184 -501 -56 313 722 -273 -95 373 305 -363 30 136 -359 -105
3227a05N04l10k99O98j90r73P59j57k20J01M55l13M23K2Rn54J6L78l9q8q93J35
$$ -105 399 89 -210 488 298 -675 84 -73 -293 -192 263 -50 373 395 404 -150 -134 244 205 117 -776 -641
3249f41J106K1k97J31q38P17L22q85L51q5K32M90k78P3l38P4j35j80l12J0N19
$$ -641 465 486 189 320 -518 199 521 -364 -13 -98 134 624 346 419 81 155 20 -160 -472 -462 57
3270E7K61k43N0J47oN46o73p07N91M03k03L81j34K6p31P4J87J14P1K92m90j4j38
$$ 57 318 75 125 272 266 812 139 -568 23 426 223 604 470 496 -235 -161 26 140 211 503 13 -1 -139
3293a39N85l75m72Q63o31J36R8j41K12l50Q49k88j009O22j60Q62p72O2m94O43
$$ -139 446 71 -401 462 -169 -33 65 -76 136 -214 635 347 -662 -40 -200 662 -110 -48 -542 101
3313A01M01k19k72M16l10j91l49P69j62p17j11O14K0K03k79M40o42Qk65L84K23
$$ 101 502 283 11 427 117 -74 -423 346 184 -533 -644 -30 -10 193 -86 354 -288 -280 -545 -161 62
3334F2K89j89o0K99r24k35N09L21o27N51k94p6J056o80J31o65K93K81pl61R4K22
$$ 62 351 162 102 401 -523 -758 -249 72 -555 -4 -298 -374 682 2 133 -532 -239 42 35 -326 -232 -10
3356a0N3j42L11l69j32J43k83l44Q40L32n6j015P02K53j14o71O73J04j14L03k62
$$ -10 43 -99 212 -157 -289 -146 -429 -773 67 399 343 -672 30 283 169 -502 171 275 161 464 202
3377B02l60j11K19l60R8R9K61J37L5p56J94Q3m47O82n22P86K11j121O06L1J02
$$ 202 -158 -269 -50 -410 -312 -213 48 185 220 -536 -342 -259 -706 -24 -546 240 451 -670 -64 -33 69
3398F9J26p01L98N39j071N82J52j16m67Q23l03j83K64L67k96J14n09n62R78m96
$$ 69 195 -506 -108 431 -640 -58 94 -22 -489 334 31 -152 112 479 183 297 -212 -774 204 -292
3418b92j9M88p91K93l73J54N81l2J88r3K65m45j74J13O1K67j04j05m26K89K76
$$ -292 -311 177 -614 -321 -694 -540 41 9 197 104 369 -76 -250 -137 -76 191 87 -18 -444 -155 121
3439A21l48Q1k57P46K83m59k17L98k86L9j35j30P6j99k49O80k66j63K87L7J46
$$ 121 -227 -146 -403 343 626 167 -50 348 62 101 -34 -164 -88 -287 -536 144 -122 -285 2 39 185
3460A85k70j75L70p42N17P77j028O22o61O25p47P54n95M24j01N8j14K16J36n09
$$ 185 -85 -260 110 -632 -115 662 -366 256 -405 220 -527 227 -368 56 -45 13 -101 115 251 -258
3480b58lP34o82K56K87l3K63l88k22P00L61p36n4M3K92p30L21P0j01m49q7O59
$$ -258 -261 473 -209 47 334 301 564 176 -46 654 1015 279 225 268 560 -170 151 221 120 -329 -416 243
3502B43Q7m37l01R4O56o79J48O5J85j99J76k24J52j02J59n20O03n11K68K04k4
$$ 243 330 -107 -408 -314 342 -337 -189 -124 61 -138 38 -186 -34 -136 23 -497 106 -405 -137 67 43
3523D3j24l36L65M68n2j68k52m20j77Q12j5M6j94N5L1j36J35k24K01j49P80n84
$$ 43 -81 -417 -52 416 364 196 -56 -476 -653 159 144 190 -4 51 82 -54 81 -143 58 -91 689 105
3545A05p32P33l02J82K76j9k68j36N00j87p9p89J264p61pk6p9M38N1j082J264
$$ 105 -627 106 -196 -14 262 243 -25 -161 339 152 73 -716 548 -213 -220 -246 -325 113 164 -918 346
3566C46l39M9m5l46M56l05L08l33%M64k1j10K15m54jm11P52j55J89n11O15l26
$$ 346 7 56 11 -335 121 -184 124 -209 -209 255 234 124 339 -115 -116 -527 225 70 259 -252 363 37
3588C7k46J64j5J60n95P58m52K36K13o32O88r64P88K13o17l55K84O87K84o54q0
$$ 37 -209 -45 -60 100 -495 263 -189 47 260 -372 316 -648 140 353 -264 -619 -335 352 636 -18 -98
3609i8N0J2l02J9M63k87J08P6m60M5O14j71p8k87K7L77m9l68N8L86l68J257q35
$$ -98 -48 -36 -338 -319 144 -143 -35 41 -419 -374 240 69 -9 -296 -269 108 59 -309 -251 135 -233 1024 189
3632A89p72R02RJ1J89o18k61M31J17j20l35j48L37M47q36K29L45o55N40j89R5
$$ 189 -583 319 328 339 528 -90 -351 80 197 77 -258 -406 -69 378 -458 -229 116 -539 1 -188 -93
3653i3Q14n99m62L89L90k93l08l09K24J80R8ro7L28L15j126P71n19O68j75L5l48
$$ -93 721 122 -340 49 439 146 -162 -471 -247 -67 31 22 -45 283 598 -528 243 -276 392 217 252 -96
3675i6K56P2K7p32L66Q84q61J6m4K2Q7M22j040K18N27j71n38O82l36K21j33J14
$$ -96 160 232 259 -473 -107 777 -84 -68 -112 -90 -3 419 -621 -403 124 -47 -585 97 -239 -18 -151 -37
3697c7M56m91j26L89n71N55L30n08qL88N3l57j326M68J248k83R1n21N55l83R8
$$ -37 419 -72 -198 191 -380 175 505 -3 -11 377 430 73 -1253 -785 463 180 271 -250 305 -78 20
3718B0J65j49L77o11j75N41q71M81Q3J19m96R6J85p7M82J17n53L91M39j078J037
$$ 20 185 36 413 -198 -373 168 -703 -222 -139 -20 -516 -420 -235 -312 170 287 -266 125 564 -514 523
3739E23l64L1r47N26p9L97O40o75K39n17M59r2k20N74n00L74l00j68l02l96M81
$$ 523 159 190 -757 -231 -310 87 727 52 291 -226 233 141 -79 495 -5 369 69 -99 -401 -797 -316
3760c16K71L03k67P38r34n72J157o19K21j22k0N3J096j067N93j205J059o79K51
$$ -316 -45 258 -9 729 -205 -777 380 -239 -18 -140 -160 -107 989 -78 515 -690 369 -310 -59
3779e9M07n51K35j28O7L64lj72m18J90J59m30L23m53M45K28k10K7K12j36k93j93
$$ -59 348 -203 32 -96 -29 335 332 160 -258 -68 91 -339 -16 -469 -24 204 -6 21 233 97 -196 -389
3801c89P5M39k14j63L9r8O18j6L38m61r7m63L55m52O29J64n6l85m3N62l65k59
$$ -389 -314 125 -89 -252 -213 -311 307 291 629 168 71 -392 -37 -489 140 304 248 -137 -180 382 17 -242
3823b42K47K44n10Q02o48j34R9Q63n61q8K26l81K28j13k81j94Q04m46r0K67J60
$$ -242 5 249 -261 541 -107 -241 -142 721 160 72 298 -83 145 32 -249 -443 361 -85 -175 92 252
3844B52Q9j56J29k32K45k54r4J43j37Q5n31L76nn97O17N21m11m97l10Q10M4k4
$$ 252 341 185 314 82 327 73 -21 122 -15 70 -461 -85 -90 -687 -70 451 40 -457 -767 43 87 63
3866F3l7p85R76m0k88J72N01j382J050j49l0m33J97N88p01K61l24O08n05N89l05
$$ 63 26 -759 217 177 -111 61 562 -820 230 81 51 -382 -185 403 -298 -37 -361 247 -258 331 26
3887B6m8l23N39k65K66j61J43J89l84j36P11L6j000k40P14j31N27r29K22M38n04
$$ 26 -22 -345 194 -71 195 34 177 366 -18 -154 557 593 -407 -647 67 -64 463 -466 -244 194 -310
3908c10M82n82J66L73M5k16n1rK95k94NQ1O59n79k45L15j96l02K24N65k70j51
$$ -310 172 -410 -244 129 174 -42 -93 -102 193 -101 -96 -15 644 65 -180 135 -61 -363 -139 426 156 5
3930Ej37N4r3K05k87Q1K69m94M90j03o99J73P54m8k21n63N82J49K42n87K70L96
$$ 5 -132 -78 -171 34 -253 -172 97 -397 93 -10 -709 -536 218 170 -51 -614 -32 117 359 -228 42 438
3952D38p71O43o44j14J14N23l11K62N8M7k42K9L92q37J57M06n8J49m14K98O88
$$ 438 -333 310 -334 -448 -334 189 -122 140 198 245 3 32 424 -413 -256 150 92 241 -173 125 813
3973H13j145N90nl40o3M76k16j70j16K66j2l08o9J00l25M89r4j09L75l59M79p7
$$ 813 -332 258 253 -87 -150 326 110 -60 -176 90 78 -230 -299 -199 -524 -35 -129 -238 137 -222 257 180
3995A80l84M43n53K57r1J61k4J71J55o48O29q30J029o87O02n04J2j50M50k12j68
$$ 180 -204 239 -314 -57 -148 13 -11 160 315 -333 296 -534 495 -192 410 -94 -82 -232 218 6 -162
4016a62l07N53M39n62k0%M63o06M87l49l17L39J20OL0Mq4n78J330p03K09q3J73
$$ -162 -469 84 523 -39 -59 -59 404 -202 285 -64 -381 -42 78 84 114 118 34 -544 786 83 292 209 382
4039C82p50L70j63J60K91J48K26q64L90k81M1J84n68M31N79n55rM81j80n08N12
$$ 382 -368 2 -161 -1 290 438 664 -200 190 -91 -50 134 -434 -3 576 21 12 493 313 -195 317
4060C17n43mK38l98P63n69p0L59m45L19M63l76N3o13R73k16L6L50m74l42K57q8
$$ 317 -226 -230 8 -390 373 -196 -266 93 -352 -33 430 54 107 -506 467 251 287 637 163 -179 78 -10
4082a0J42J19J3q07P01j24m4m90M84L33r5R5m98L53j32l14M13J61j116P45P41
$$ -10 132 251 264 -543 158 34 -10 -500 -16 317 222 317 -181 172 40 -274 139 300 -816 -71 670
4103F70m18k11K04L19r33M05j6j59o2j57P60n27k1K01Kk6k0J06R4l41j52JL01
$$ 670 252 41 245 564 -369 36 20 -139 -201 -358 402 -125 -146 55 57 31 11 117 211 -130 -282 -281 20
4126B0K88p17L12O01m99l59Q80n21P0m63J74K70L82l18l73Q09n40K72m54L08n9
$$ 20 308 -409 -97 504 5 -354 526 5 75 -388 -214 56 438 120 -253 556 16 288 -166 142 83
4147H3J1M9j030J356j117N84K0l44p3N65p75Q67l59k66M48J37n23N91J6o04R08
$$ 83 94 143 -887 469 -648 -64 -44 -388 -461 104 -671 196 -163 -429 19 156 -367 224 240 -364 544
4168E44r46M2P00m1m61M75L34o63L74m44k4O18m76k39R12q00L8j33J52j67L23
$$ 544 -402 -360 340 299 -162 313 647 -16 358 -86 -110 508 32 -207 705 -95 -57 -190 -38 -205 118
4189A18k40j79K25J100j212Q5M3J40Q7m34J12k55O74O85p92L29l34R00j446j14
$$ 118 -122 -301 -76 1024 -188 -103 -60 80 167 -267 -155 -410 264 949 157 486 152 1052 -394 -508
4209e08Q81l62L23R1j03j3l2l0n36K29O04m75M51k00m30m29R53l29l12R97j169
$$ -508 373 11 334 425 322 309 277 247 -289 -60 544 69 520 320 -110 -539 414 85 -227 770 -399
4230c99L32M16K37j72R4q64l32N21K92Kj64p42Q24m17M12j355J012j15L81K91
$$ -399 -67 349 586 414 508 -356 -688 -167 125 127 -37 -779 45 -372 40 -1315 -303 -418 -37 254
4250B54J1o66J29J229j195k40O03k69M72K54l53k31M41j54J04m6n65K35l13K83
$$ 254 265 -401 -272 957 -238 -478 125 -144 328 582 229 -2 439 285 389 343 -222 13 -300 -17
4270a7P69q93m43Q82j90K14Rn70Q18o31N1q3M72n44M24m47K59m34N6O0M25m91
$$ -17 752 -141 -584 298 108 322 331 -239 579 -52 -1 -84 388 -156 268 -179 80 -354 -298 -238 187 -304
4292c04K01L97J15k58L27m24k28q9J57L56j89Q2nK93m73M49j87o12O63J46k23
$$ -304 -103 294 409 151 478 54 -174 -263 -106 250 61 143 138 431 -42 407 220 -392 271 417 194
4313A94p40L01K83o07M94J58r50P31N8K43k85O49l22m08O94p22M18n61O83m99
$$ 194 -546 -245 38 -569 -75 83 -867 -136 -78 165 -120 529 207 -201 493 -229 189 -372 311 -188
4333a88K43k89N1K07Q0l92N29n7J81j136R64m74K96l8q7J42J04k89J31j26L47
$$ -188 55 -234 -183 24 104 -288 241 184 365 -771 193 -281 15 -23 -110 32 136 -153 -22 -148 199
4354A99K61K11p56M85n51K92j94L54p0m23M39n22l09J96Q23n46K22j76N45q64
$$ 199 460 671 -85 400 -151 141 -53 301 231 -192 247 -275 -584 -388 435 -111 111 -65 480 -384
4374c84N83l24K54n64K37L87o04o6J35Q3M25%j4n22M15m42L30l18R75J41q70l31
$$ -384 199 -125 129 -435 -198 189 -415 -481 -346 -263 162 162 148 -374 41 -401 -71 -389 586 727 -143 -474
4396d74N30K27J14j57r5N57n52J01n84M18m69L87m29K32M85j80L78n83K27r6L5
$$ -474 56 283 397 240 145 702 150 251 -333 85 -384 3 -426 -194 291 111 489 -94 133 37 72
4417G2l34P2K86l89J24N1J37L71m53K93K48j24m30m2J83m13J70J55M85j019N31
$$ 72 -262 -190 96 -293 -169 -118 19 390 -63 230 478 354 -76 -118 65 -348 -178 -23 462 -557 -26
4438b6J43k19L07K85m63j95l20K93j03J01M23j89K86p54M17l45L66M59n84K93
$$ -26 117 -102 205 490 27 -168 -488 -195 -298 -197 226 37 323 -431 -14 -359 7 466 -118 175
4458A75J05K2k68k98N41P8n11o27Q81K67q52K77M77o15k13M39N84m15N01j03o21
$$ 175 280 302 34 -264 277 355 -156 -783 98 365 -487 -210 267 -348 -561 -122 462 47 548 445 -176
4479a76Q72j464P33j04k54L96M7R2j14k90J87K56o70K50J61O59o37J84k92J17
$$ -176 696 -768 -35 -139 -393 3 50 142 28 -262 -75 181 -489 -239 -78 581 -56 128 -164 -47
4499d7K33m3l06K91q1k96O51o20L05K00J09n12J49m22O32n5o61M91k66L86P3p76
$$ -47 186 143 -163 128 47 -249 402 -218 87 287 396 -116 33 -389 243 188 -473 18 -248 138 211 -565
4521e65O58o20J101p42O60m31O4m65N64l94k92M01k77O5L73l86M44l10N33k27
$$ -565 93 -527 574 -168 492 61 125 -340 224 -170 -462 -61 -338 -273 100 -286 158 -152 381 154
4541A54L56p91R3o0l51M47J13j27j43N68k86j58P2P74p02K87j15m76M18o10L79
$$ 154 510 -281 -188 -248 -599 -152 -39 -166 -309 259 -27 -185 -113 661 -41 246 131 -345 73 -537 -158
4562a58O48o87q2M49n52N00r6k3O4K66m10J10R3J09l08p61P6R54N22j19m33k26
$$ -158 490 -197 -279 170 -382 118 22 -1 63 329 -81 29 122 231 -77 -838 -762 192 714 595 162 -64
4584f4K59L5K53p73M25n34R28k65J88K85p69L85p31M12j3J85N5m46k89L88K83
$$ -64 195 230 483 -290 135 -399 529 264 452 737 -32 353 -378 34 21 206 261 -185 -474 -86 197
4605A97l71L41k81O52J49m09p08N45L28j02q76N23o90R12K60n64m86P55k23J94
$$ 197 -174 167 -114 538 687 278 -430 115 443 341 -535 -12 -702 210 470 -94 -580 175 -48 146
4625A46M4m97P32K30o46K67k82L63m93M44l39K75o48J028k41k97L40m74K27K01
$$ 146 190 -307 425 655 9 276 -6 357 -136 308 -31 244 -404 624 383 86 426 -48 179 380
4645C80L74p94N39q64L56K49N18m09n55l45k70J237k22k04l73p25J178n3m14M46
$$ 380 754 -40 499 -365 -9 240 758 349 -206 -551 -821 416 194 -10 -383 -1108 70 17 -397 49
4665D9K06l5j91m31M92j99K91K75l91P1n82J49Q59p63K59m94M77L54R8p78j02
$$ 49 255 220 29 -402 90 -109 182 457 66 137 -445 -296 563 -200 59 -435 42 396 494 -284 -386
4686c86M95n84N44j77k20O89m61q8J45l2p5N49k54l36j09Q6J30j97O7K98m8j82
$$ -386 109 -475 69 -108 -328 361 -100 -188 -43 -75 -150 399 145 -191 -300 -214 -84 -281 -214 84 36 -146
4708a46L42o72M84j54N9J89k37K17J56M23j09k70o67k9K59j3O82j096L34P81n76
$$ -146 196 -476 8 -146 -87 102 -135 82 238 661 552 282 -385 -414 -155 -168 514 -582 -248 533 -43
4729d3L23l44o82M40k97J98K64k17k26J210q45l48J38M16m4L09n19j30K95P6J81
$$ -43 280 -64 -746 -306 -603 -405 -141 -358 -584 626 -219 -567 -429 -13 -57 252 -267 -397 -102 -26 155
4750A55R0n50k74L58k59O81k12J60j31k13k62L54l97OQ5M39M85m30l14L04L61
$$ 155 245 -305 -579 -221 -480 201 -11 149 18 -195 -457 -103 -500 -494 -409 30 515 85 -229 75 436
4771D36l31r52O00K59N5m28N26p11N77o5rK75n63m0Q96q89PP76r02K13L36l60
$$ 436 105 -847 -247 12 67 -361 165 -546 31 -34 -43 232 -331 -371 525 -364 -357 419 -483 -270 66 -294
4793b94L28R9m38L40m35N25o75R56k76j30k19Q57k10l86J50k56O3l66K57o02P70
$$ -294 34 133 -305 35 -400 125 -550 406 130 0 -219 638 428 42 192 -64 -1 -367 -110 -712 58
4814E8k8J26k24N9j6lK19j93k25k40L44j14J74M91j30k90k18K15j3J57N71j295
$$ 58 30 156 -68 -9 -25 -28 191 -2 -227 -467 -123 -237 -63 428 298 8 -210 5 -8 149 720 -575
4836e75j84Q24O50n68k16l26j27R78n00K12M9m55qL23k26K4J11P78j034K03k37
$$ -575 -759 65 715 147 -69 -395 -522 456 -44 168 217 -238 -246 77 -149 -125 -14 764 -270 -67 -304
4857c04k12L06M95m46J3J38J07o26l15j4O69M97o8j72J5k29m3M73j47n36L82L32
$$ -304 -516 -210 285 -161 -148 -10 97 -529 -844 -858 -189 308 240 68 83 -146 -189 284 137 -399 -17 315
4879C15o74J09K31k09K86k44N25J11n22J90m0l73N98j25l36Q02O2r03J089q47
$$ 315 -359 -250 -19 -228 58 -186 339 450 -72 118 78 -295 303 178 -158 644 706 -197 892 45
4899D5q3N0m6J94k38k8k80O30l11kL89J12p59M9K28J71j67j25L34K20q67J68K83
$$ 45 -38 12 -34 160 -78 -106 -386 244 -67 -69 320 432 -327 -278 -50 121 -46 -171 163 383 -484 -316 -33
4922c3k27J01j07O6M13j88K82o46N21K92o20p5N01n15L34N5J18k99L80n27l6p0
$$ -33 -260 -159 -266 -200 213 25 307 -339 182 474 -146 -221 280 -235 99 154 272 -27 353 -174 -210 -280
4944b80n28R76o80N28M76l31j34p51Q33L5p2K9K14J4L08q67k58O75m10J93j10
$$ -280 -808 168 -512 16 492 161 27 -724 109 144 72 101 315 329 637 -230 -488 187 -223 -30 -140
4965a40K02n68L48L21l17k06K72o6M53l28M06m61j32k34O7J55k04J238l50J52
$$ -140 62 -506 -158 163 -154 -360 -88 -154 299 -29 377 -84 -216 -450 -383 -228 -432 806 456 608
4985F08m63l05o3L42K03q79N06o52L02O99k93K24l17M29m84NL93m39J77J67p5
$$ 608 145 -160 -223 119 322 -557 -51 -703 -401 298 5 229 -88 341 -143 -138 255 -184 -7 160 85
5006H5k71o98O09K94K94j4J38k35m43J075r90R34q91J017r27N80p95p9R2p6K38
$$ 85 -186 -884 -275 19 313 299 437 202 -241 834 -156 778 -113 904 -23 557 -238 -317 -225 -301 -63
5027f3N5M73n15J28p58Q95k66M08k01k58j74N8M39l90M33j4r04Q73l82J25K22
$$ -63 -8 465 -50 78 -680 215 -51 357 156 -102 -276 -218 221 -169 264 250 -654 219 -163 -38 184
5048A84l68O06n69j29O91o06J07J39K55n68J99M71l67l13M81R50j383K40L81k33
$$ 184 -184 422 -147 -276 415 -191 -84 55 310 -258 -59 412 45 -268 213 1163 -220 20 401 168
5068A68J49J48j17m2m28O11m80j38M1L66j27m00L51P5Po15M39K98l7p5o06O10
$$ 168 317 465 348 306 -122 489 9 -129 -88 278 151 -249 102 177 184 -431 8 306 269 194 -412 198
5090A98K8k42K85m97J55l27Q2K71O5k07l11P35l27j76M66k57R6K06l49M08j60
$$ 198 226 -16 269 -228 -73 -400 -318 -47 18 -189 -500 235 -92 -268 198 -59 37 243 -106 302 142
5111A42j89P14Rr39m4N57n31jm57R64l96k57M3L50L1L39K8l37J95l0m20L32m98
$$ 142 -47 667 676 -263 -307 250 -281 -282 -739 225 -171 -428 -385 -35 -4 335 363 26 221 191 -229 103 -395
5134c95K54K44N9l62J16k77P3J24P6k87J37j52K78l93K02N94p96M32j7K01j15
$$ -395 -141 103 162 -200 -84 -361 -288 -164 -88 -375 -238 -390 -112 -505 -303 291 -505 -73 -90 111 -4
5155dJ1Q2R7p04L8J82M98L88o02o6j94o18P80n90O46L03L0l82j41J359j229m23
$$ -4 7 89 186 -518 -480 -298 200 588 -14 -80 -274 -892 -112 -702 -56 247 277 -105 -246 1113 -116 -539
5177e39M84M32ro96n50J033q48R33N8m96J11M57o36J31P41n16k0j38N70l58K05
$$ -539 -55 377 368 -328 -878 155 -693 240 298 -198 -87 370 -266 -135 606 90 70 -68 502 144 349
5198C49n26O3M59L61p50N48r0k73J41k75L58l81J28m1k7L60p72J12K09M17k70
$$ 349 -177 -114 345 706 -44 504 414 141 282 7 365 -16 112 71 44 404 -368 -256 -47 370 100
5219A00L20r93R54r41R68k08M59j123Q45j41k0p0n7K89l33M10p16M68q48%K18
$$ 100 420 -573 381 -560 408 200 659 -464 381 240 220 150 93 382 49 459 -257 211 -637 -637 -419
5240d19O69k91q9Q4L05r78J416k46m63R6k4n57M64j59o16R02QJ5M71j005L47l36
$$ -419 250 -41 -130 -46 259 -719 697 451 -12 84 60 -497 -33 -192 -808 94 102 117 588 -417 -70 -406
5262d06M77l82M8M13J82o7j25p32M41J098j228p3R68p82L89j81L9K46l26K45q67
$$ -406 71 -311 -263 150 332 265 140 -592 -151 947 -281 -354 614 -168 221 40 79 325 -1 244 -623
5283f23N11N6K24j23k55Q12l44j81L7m25L09J91k08k37K5K53n09N87m44K84k08
$$ -623 -112 -56 168 45 -210 602 258 77 114 -311 -2 189 -19 -256 -231 22 -487 100 -344 -60 -268
5304b68j0O83j030N92j62K03m87J02O77o66M49j2N55k54K0l93J4k41O08N29j359
$$ -268 -278 405 -625 -33 -195 8 -479 -377 300 -366 83 71 626 372 392 -1 13 -228 380 909 -450
5325d50L70J08l16m43O36p7J53l11m31j30Q62M89k41j27m00k02P44k05j43K61
$$ -450 -80 28 -288 -731 -95 -172 -19 -330 -761 -891 -29 460 219 92 -308 -510 234 29 -114 147
5345A47m67K98m66K95J32j71k10M74O26o83k22O65j73m14M24J23N3r04L91m79
$$ 147 -320 -22 -488 -193 -61 -232 -442 32 658 -25 -247 418 245 -169 255 378 431 -473 -82 -561
5365e61P70L99j067P07m94P82n15o0m4o0J64J7K31K04q52L02k7J70r0m2j64K93
$$ -561 209 608 -459 248 -246 536 21 -39 -83 -143 21 38 269 473 -379 -77 -104 66 -24 -66 -230 63
5387F3q97M91P42m82K75p4m00N21M66j40p29K80n7O49l47j59m58K1j21O09o15
$$ 63 -834 -343 399 -83 192 118 -282 239 705 565 -164 116 59 708 361 202 -256 -235 -356 253 -362
5408c62N22k76L91j79o4j2m38k41R81j18k15j59N21n32m14M41K67Kk38N94o52
$$ -362 160 -116 275 96 32 20 -418 -659 322 204 -11 -170 351 -181 -595 -154 113 115 -123 471 -181
5429a81M81P3J20p25M77n57Q39o22O1J72o01J077m56k76j51R7K11J40n37J09K55
$$ -181 300 373 493 -232 245 -312 527 -95 -34 138 -463 614 158 -118 -269 -172 39 179 -358 -249 6
5450Fm61R09o60j99K71m94M33K11P28j117j65K81p7K62L81K20j56k00m40P7M1
$$ 6 -455 454 -206 -405 -134 -628 -195 16 744 -373 -538 -257 -334 -72 309 529 373 173 -267 -190 -149
5471a49N8o7K6j7o0J47j46j39k35Q49O07r66N0j50Q93l01j292M70L85O0O33m44
$$ -149 -91 -158 -132 -149 -209 -62 -208 -347 -582 267 874 -92 -42 -192 701 400 -892 -422 -37 23 656 212
5493B12k37l94N64L74m35M72q20N54j58qRn0N75o00P6l6j0k75N97P0q55K19j35
$$ 212 -25 -419 145 519 84 556 -264 290 132 124 133 83 658 58 134 98 88 -187 410 480 -375 -156 -291
5516b91N3L0j85l08J075P3l21J24j81L8M77j237K76N09j77n55L52M31n75L51J87
$$ -291 -238 -208 -393 -701 374 447 126 250 69 107 584 -653 -377 132 -45 -600 -248 183 -392 -41 146
5537A46k18k67L00N23R0o07N42q27K39k31L17J54Lj25k85k02P19j013N87n04J420
$$ 146 -72 -339 -39 484 574 -33 509 -318 -79 -310 7 161 164 39 -246 -448 271 -742 -155 -659 761
5558G61o38K56n54m7K50L90p20Ln1K67j62pJ014q04K51m32k78L66J56R9K48j35
$$ 761 123 379 -175 -222 28 418 -302 -299 -350 -83 -245 -252 762 -42 209 -223 -501 -135 21 120 368 233
5580B33K84n08j68M74n39j60R91q83L28J16k15L30j34J13o57N84L0m60n51P67
$$ 233 517 9 -159 315 -224 -384 607 -276 52 168 -47 283 149 262 -395 189 219 -241 -792 -25
5600b5k96P91p73L11R0q05R79k48Q0m47L35k51L37k45j69P49j278N05p1O36J90
$$ -25 -321 470 -303 8 98 -707 272 24 104 -343 -8 -259 78 -167 -336 413 -865 -360 -431 205 395
5621C95o6j14l82Q77j022Q64j08ol02J41o9k52K91j26n8n12M35q8J53j01j64K81
$$ 395 329 215 -167 710 -312 552 444 438 136 277 208 -44 247 121 63 -449 -14 -102 51 -50 -214 67
5643F7pm03j83Q2N19M5L79j030Q99J70k92K40m57L15o53J25q0M00m57k31O99k36
$$ 67 60 -343 -526 -444 75 120 499 -531 368 538 246 486 29 344 -309 -184 -264 136 -321 -552 147 -89
5665h9l53K07m73R09k35k1LP9M7n87N49k53k63O20l90N32j09r9l11p34J134J6
$$ -89 -442 -235 -708 201 -34 -55 -52 27 74 -513 36 -217 -480 140 -250 282 173 74 -237 -971 163 179
5687A79M63J4j278N17L83l52k92J01j93J25N28lk80J19J29n8l45j27P30P68j269
$$ 179 642 656 -622 -105 278 -74 -366 -265 -458 -333 195 192 -88 31 160 102 -243 -370 360 1128 -141
5708a41N60p4n12N57o54K61K94q90J93Q66j1o88k97M41j59N65m15J48Kk74N99
$$ -141 419 345 -167 390 -264 -3 291 -599 -406 460 449 -239 -536 -95 -254 311 -104 44 46 -228 371
5729C71m24Q6P8P6m12M1O32p73P7L89k41o1J31m14M23j81K18p0o17R11p6k93K21
$$ 371 -53 33 111 187 -225 -184 448 -325 -248 141 -100 -161 -30 -444 -21 -202 16 -54 -671 240 164 -129 92
5752I2M5K10l60N62r3l06n94K43l86P31k8l32O79l65m47K02q7K22j66K38m38N23
$$ 92 137 347 -13 549 456 150 -444 -201 -587 144 116 -216 463 98 -349 -147 -234 -12 -178 60 -378 145
5774A45onj94m24J89M7J028j320N65P0o31K03k76O42M05l29o3k97K51n65Q08O
$$ 145 139 134 -60 -484 -295 -248 780 -540 25 95 -536 -333 -609 33 438 109 46 -251 0 -565 243 249
5796B49Mj25J68k92q80Q81n8K49j9K63n15N29m06j11K17M8M63o13m69Q96j88j48
$$ 249 253 128 296 4 -876 5 -53 196 177 440 -75 454 48 -63 154 202 665 52 -417 479 291 143
5818A43K85o21k50P02j44j35j56k01m0L01Q0j56L82Qj76l56J46N7M60l77J54J70
$$ 143 428 -193 -443 259 115 -20 -176 -377 -417 -116 -36 -192 190 198 22 -334 -188 -131 329 -48 106 276
5840B76J49n98N28k31l57K1P79j75n68K21l80O55o06Q10j86n56j29J96k8N87j50
$$ 276 425 -173 355 124 -233 -212 567 392 -176 45 -335 320 -286 524 338 -218 -347 -151 -179 408 258
5861B58m02J40l36K1k4o8k96M42R1L26j24m04M76J20q3j62o8j63R72n46l73j93
$$ 258 -144 -4 -340 -319 -343 -411 -707 -265 -174 152 28 -376 100 220 137 -25 -93 -256 716 170 -203 -396
5883c96O1K03M4J91l46O37L7l51j54L92k67r3j38N12L56q30r9rP25j96J17J59
$$ -396 -335 -132 -88 103 -243 394 431 80 -74 318 51 -42 -180 332 688 -142 -241 -250 475 279 396 555
5905E55p42Q00l98o58O13K5k26k66M21n86L86n5P37m34L6m74p6K24K38m17N41
$$ 555 -187 613 215 -443 170 195 -31 -297 124 -462 -76 -131 606 172 208 -266 -342 -118 120 -297 244
5926B44n69j06L04n2J20O08q40N72K71m80n51J25N24m40L69l18o07M64r5L36k18
$$ 244 -325 -431 -127 -179 -59 549 -291 281 552 72 -479 -354 170 -270 99 -219 -826 -362 -457 -121 -339
5947c39j49J085j30m64o82P39J06M47o90J56K77l52k62m92J173l62J3m29O56m
$$ -339 -488 597 467 3 -679 60 166 613 -77 79 356 4 -258 -750 423 61 74 -355 301 297
5967B97q4q01J188k60n96M84M34p67O1N11p9K70j528J631o89o0l61K60j84l11
$$ 297 213 -588 600 340 -256 228 662 -105 -44 467 388 658 -870 761 72 12 -349 -89 -273 -584
5987e84R0J345r49J55j43O5k92J66P42j079R19q33J86n5O98k85o33N84N3j55k34
$$ -584 -494 851 -98 57 -86 -21 -313 -147 595 -484 435 -398 -212 -267 431 146 -487 97 150 -5 -239
6008b39m5M40j61J24j05j52J92K14Q9M28j173K11j19O07q08O24k17j7L83p30J30
$$ -239 -284 156 -5 119 14 -138 54 268 357 785 -388 -177 -296 311 -497 127 -90 -107 276 -454 -324
6029c24J38L79O54r27k63k22Q73p6Q8j84K16K46n52J83j35l14m66L92K0L0K16
$$ -324 -186 193 847 -80 -343 -565 308 232 320 136 352 598 46 229 94 -220 -686 -294 -274 -244 -28
6050b8Q5K57o86M40j84j07K66L4m6j84O9j72K81k54j19l24R84l24L49k27k37L82
$$ -28 57 314 -372 68 -116 -223 43 77 31 -153 -84 -256 25 -229 -348 -672 312 -12 337 110 -127 255
6072B55p72L12O5p7O91r52Q32j66o12M27j30M89ql82p6oO3k47L51r48M10ON90
$$ 255 -517 -205 -140 -217 474 -478 354 188 -424 3 -127 362 354 -28 -104 -110 -47 -294 57 -891 -481 -475 115
6095A15j036P39QJ69L44J28q93Q60l15J85M5Q9n33L22Mn33R1M26J7k78o7N56p21
$$ 115 -921 -182 -174 -5 339 467 -426 434 119 304 349 438 -95 227 231 -302 -211 215 232 -46 -113 443 -278
6118b78M73k60N89l57K20k45J35m73K80o4m34J196p27j01j36K35r5m79O39m24
$$ -278 195 -65 524 167 387 142 277 -196 84 20 -414 782 55 -46 -182 53 -42 -521 118 -306
6138c06j59O68j92k63M62j50M22o25O32p80O30n37K53K30j8o15Q65k52n80O39
$$ -306 -465 203 11 -252 210 60 482 -143 489 -291 339 -198 55 285 267 -348 517 265 -315 324
6158C24j94K9m14p00O40J079p06k03K61m08K90J3p75O29L43r27M37j05Q13l37
$$ 324 130 159 -255 -955 -315 764 58 -145 116 -292 -2 11 -764 -135 208 -719 -282 -387 426 89
6178H9l13O46l44q2r9N51J69l5p28k75J73J348j399J18l75O85p21K23R97q80O69
$$ 89 -224 422 78 -4 -103 448 617 582 -146 -421 -248 1100 -299 -181 -556 129 -592 -369 628 -252 417
6199D17j1j07%L1L96j039K84l68M29n73K82J85J8J68J51P7j51k90O17j186L62
$$ 417 406 299 299 330 726 -313 -29 -397 32 -541 -259 -74 -56 112 263 340 189 -101 516 -670 -308
6220c08M23n88O71j37L26j89O7k36n8J70k94L52J95j133Q96k59K21N02m81J78
$$ -308 115 -473 198 61 387 198 265 29 -29 141 -153 199 394 -739 157 -102 119 621 140 318
6240C18n21k40N40K66k07o13L75M11p40L50l2j59K74M12k07k11o79Q9O28q48K41
$$ 318 -203 -443 97 363 156 -457 -82 329 -411 -61 -93 -252 22 434 227 16 -663 -574 54 -794 -553
6261e53q9K86j02Q10j83j61l5Pk76L48J3j82pk07L11J32L30p20J00L55j67l41
$$ -553 -642 -356 -458 352 169 8 -27 -20 -296 52 65 -117 -124 -331 -20 112 442 -278 -178 177 10 -331
6283c31K65L7j4l39M90k6L8M60n41n76R19o37l17L60N08l5K01l20k70k60M23m61
$$ -331 -66 -29 -43 -382 108 82 120 580 39 -537 382 -255 -572 -212 296 261 462 142 -128 -388 35 -426
6305d26Q57k96J68J0n65J82Q14n44m36M82m31m8L48j38n07P57n26M53m1r4j25
$$ -426 431 135 303 313 -252 -70 744 200 -236 246 -185 -233 115 -23 -530 227 -299 154 113 19 -106
6326a06k56N00R3l77m4Q18j45m87l07J54M94o21R81n35p17M01K61j61K48j64j4
$$ -106 -362 138 231 -146 -190 628 483 -4 -311 -157 337 -284 697 162 -555 -154 107 -54 194 30 16
6347A6j80j05N45r22N03R3K60n31M56l64L02j07j76K64l51Q68l83l02m84L21K79
$$ 16 -164 -269 276 -646 -143 -50 210 -321 135 -229 73 -34 -210 54 -297 571 188 -114 -598 -277 2
6368Bm10M59m7J07j71K9n6k67r3l59R75o4j89l60L9M73K88K64q18J84L67M96j3
$$ 2 -408 51 4 111 -60 -31 -87 -354 -447 -806 169 105 -84 -444 -405 68 356 620 -198 -14 353 849 836
6391H36p06j77J77k11o4M48k29O7o48M28M79j008K18O69j00J29l58j60J92O4L19
$$ 836 130 -47 130 -81 -145 303 74 141 -507 -79 400 -608 -390 279 179 308 -50 -210 -18 46 365
6412C65m31j20Q02k46r45P16j57j10m83N34q9L23o6j75L30J20q39M66J86p56M11
$$ 365 -66 -186 616 370 -575 141 -16 -126 -609 -75 -164 159 93 -82 248 368 -471 -5 181 -575 -164
6433a64K81p21J00L79k47P12J62n19J02k2K49o76Q2P47p05K05J37j46K03l16M58
$$ -164 117 -604 -504 -125 -372 340 502 -17 85 63 312 -364 -282 465 -240 -35 102 -44 159 -157 301
6454C01q2J20l91K63m56N07m34j28L44j10m94o6M65jk65L12m58P29ro6K54j8j40
$$ 301 219 339 -52 211 -245 262 -172 -300 44 -66 -560 -626 -161 -162 -427 -115 -573 156 147 81 335 317 177
6477A77j24j3j14o03P80R4n35N98r84P51J67J2l44O44p45K63K54o92K36K34j16
$$ 177 53 40 -74 -677 103 197 -338 260 -724 27 194 206 -138 506 -239 24 278 -414 -178 56 -60
6498f0M33l52M65m06l69J03PN39o28J06M35p46L15j48O99n22k26K75M20j094O22
$$ -60 373 21 486 80 -289 -186 -179 360 -268 -162 273 -473 -158 -306 393 -129 -355 -80 340 -754 -132
6519a32J74J31o62P81n19M25j07j56R31o64l82P5P07j132M38k01K98L17J57o53
$$ -132 42 173 -489 292 -227 198 91 -65 866 202 -180 -105 602 -530 -92 -293 5 322 479 -174
6539a74J81P8l4K24P20j400k30P21j43J12n66Q89q90O05N28l15m96O62p55k05
$$ -174 7 85 51 275 995 -405 -635 86 -57 55 -511 378 -512 93 621 306 -190 472 -283 -488
6559d88Q67QJ55p46J49l55L29L86m29k2q8J1Q64p36n1j15O91m46j35P08q68J41
$$ -488 379 387 542 -204 -55 -410 -81 305 -124 -146 -234 -223 641 -95 -146 -261 430 -16 -151 557 -311 -170
6581a70J18p4J050j238K04M84j78l16q1M05p05R97p04K85l6m23L72N1K99P9j73
$$ -170 -52 -126 924 -314 -110 374 196 -120 -201 204 -501 496 -208 77 41 -382 -10 41 340 419 246
6602B46j13Km36K22R9r9k25q2K75M01l55J59P27o32l27K74q2J78j81n76N94k07
$$ 246 133 135 -301 -79 20 -79 -304 -386 -111 290 -65 94 821 189 -138 136 54 232 51 -525 69 -138
6624a38L11k69k76K88N37p38r2K49J62k67K77J49m63Q1J90P6l91L54m0q2L44j12
$$ -138 173 -96 -372 -84 453 -285 -377 -128 34 -233 44 193 -270 -189 1 77 -314 40 0 -82 262 150
6646A50o5j95j65M50j79K10M21l80m73P6L38Q2r99J1K25Q69Rq16M10p0J41Q9J97
$$ 150 85 -110 -275 175 -4 206 627 247 -226 -150 188 270 -729 -718 -493 376 385 -431 -21 -91 50 139 336
6669C36n06j17J1K19l08o09J033M5k59l25pn02O74R92q67K6J157r48N02n31p5
$$ 336 -170 -287 -276 -57 -365 -974 59 104 -155 -480 -487 -989 -315 677 -190 -164 993 45 547 16 -59
6690e9L6P9M9l40R7r7K55J77m55L96m74j27k8N32p6l95P34j3j33k92J33J07j47
$$ -59 -23 56 105 -235 -138 -235 20 197 -258 138 -336 -463 -491 41 -35 -430 304 291 158 -134 -1 106 -41
6713d1J45j89L72l30l01M66No25K40j74J7J52Q26k53Nj54l18L32n50P87L13k83
$$ -41 104 -85 287 -43 -344 122 127 -498 -258 -432 -415 -263 563 310 315 161 -157 175 -375 412 725 442
6735D42k96m77K77J98l79k7j20M93Q2l09l29N71l90k3j80L46J80m36O10l28o7
$$ 442 146 -331 -54 144 -235 -262 -382 111 193 -116 -445 126 -264 -287 -467 -121 59 -377 233 -95 -162
6756a62m38M58k82L91J04q2l81j22P56K08m85Q7L69q05J09M89m42K81L62n87O3
$$ -162 -600 -142 -424 -33 71 -11 -392 -514 242 450 -35 52 421 -384 -275 214 -228 53 415 -172 -109
6777a09k21k35M65j35l58N69R5M01j6j43l13r8M43qj033K11K41j04L65J8p8K26
$$ -109 -330 -565 -100 -235 -593 -24 71 472 456 313 0 -98 345 337 -696 -485 -244 -348 17 35 -43 183
6799A83j09m3J13k73Q84j099O94p97J51j38O37j67O24o87k99O3o21M06K18N29
$$ 183 74 31 144 -129 755 -344 350 -447 -296 -434 203 36 660 -27 -326 -263 -884 -478 -260 269
6819B69n66M26l50m11J098l68J15m3O7L37q62L78Q0n11L53l62M52N29j147Q01
$$ 269 -297 129 -221 -632 466 98 213 170 237 574 -288 90 170 -341 12 -350 102 631 -516 285
6839B85k94j49K05j40M24o91L1k34O10J85o48N69k71K41l85K30K89m6n91O75j80
$$ 285 -9 -158 47 -93 331 -360 -329 -563 47 232 -416 153 -118 123 -262 -32 257 211 -380 295 115
6860A15j62O54m64o40P18l41n62N51k03K91M11n00L50K2l80p7J00o95R99j08j02
$$ 115 -47 607 143 -497 221 -120 -682 -131 -334 -43 368 -132 218 240 -140 -217 -117 -812 187 79 -23
6881b3L77J29o40J12m0j07l31P29K25j106K04K23N30n05M84M2J63K6n83l95R27
$$ -23 354 483 -157 -45 -85 -192 -523 206 431 -675 -471 -248 282 -223 261 303 466 492 -91 -486 441
6902D41p69M09K97o21Q11n63l36Q4M10j24L61Q49j600L28M22o73Q16k26j0l40
$$ 441 -328 81 378 -243 568 5 -331 -247 163 39 400 1249 -351 -23 399 -274 542 316 306 -34
6922c4o4M1l12J2K82Q1r7J88l78K53L00l03l02K90NL80j11j0r26P96K69m66K14
$$ -34 -98 -57 -369 -357 -75 6 -91 97 -281 -28 272 -31 -333 -43 -38 342 231 221 -705 91 360 -106 108
6945A08j15l04L49l82P8K87k40M32p32P33m14J54L57j2k05l65Q8N85k81q6k40
$$ 108 -7 -311 38 -344 -266 21 -219 213 -519 214 -200 -46 311 299 94 -271 -183 402 121 35 -205
6966b05m58K57P14k23j88l04K55Q5L22J5l23L64m81O37j60lK5p10K86r0L52n99
$$ -205 -663 -406 308 85 -103 -407 -152 -67 255 270 -53 311 -170 467 307 304 329 -381 -95 -185 167 -432
6988d32K69R2L09m07J98k69L5M80l89Q69j121O9P92k89O57r01j16N13l07l24N35
$$ -432 -163 -71 238 -169 29 -240 -205 275 -114 755 -366 -297 495 206 863 -38 -154 359 52 -272 263
7009B63l66J98l41J95O6L21n22k66O30K11l97Q02n95N76r14o0K20K36M15m57j7
$$ 263 -103 95 -246 -51 15 336 -186 -452 178 389 -8 794 199 775 -139 -199 21 257 672 215 198
7030A98J38l4n74M32n15N98o39Q14J98n96l84L44L7m54M34j05l43O14j5m71M69
$$ 198 336 302 -272 160 -355 243 -396 418 616 20 -364 -20 17 -437 -3 -108 -451 163 148 -323 146
7051A46k13K51n01j88M14p7J75K73O7l38j59k8L27r3j34j04J060m15r8j134N96
$$ 146 -67 184 -317 -505 -91 -168 7 280 347 9 -150 -178 149 56 -78 -182 878 463 365 -769 -173
7072a73L19l76K90m74M34M9m93K54p2k70J181n43J73j09L5m95j50L58L34l16k2
$$ -173 146 -230 60 -414 20 69 -424 -170 -242 -512 669 126 299 190 225 -270 -420 -62 272 -44 -66
7093f6j9l0J40o80J106k44j55m45O91k55L1m21N15l21K84N0K43l51K35l10n09
$$ -66 -85 -115 25 -655 451 207 52 -393 298 43 74 -347 168 -153 131 181 424 73 308 -2 -511
7114e11N05n92P39k92k3k29k4J07J91k10R52o46P7l6O3L47m00j06j8K3J06q7K59
$$ -511 -6 -598 141 -151 -174 -403 -427 -320 -129 -339 613 -33 44 8 71 418 18 -88 -106 -83 23 -64 195
7137A95j09m81O76o5k96j80O05o1o02O22m23m6M43p03Q67p24K21N3J40K19p7k85
$$ 195 86 -395 281 216 -80 -260 345 284 -318 304 -119 -165 278 -425 442 -282 -61 -8 132 351 274 -11
7159a1j4J6m43L23k66%P82n92K59l9m18N94q32K26L04k16O8l6L64J8N4j16k46
$$ -11 -25 -9 -452 -129 -395 -395 387 -205 54 15 -403 191 -641 -415 -111 -327 -259 -295 69 87 141 25 -221
7182b21L09k18M5J35n42J84L47j09l0K76j22J69p23O00K72m11N31K6o64J11j46
$$ -221 88 -130 -85 50 -492 -308 39 -70 -100 176 54 223 -500 100 372 -39 492 518 -146 -35 -181
7203a81k8M33K80q58Q59k50p07J216j371P36l26l7J59J21R7N49r87j27J167j039
$$ -181 -209 224 504 -354 505 255 -452 764 -607 129 -197 -234 -75 46 143 692 -295 -422 745 -294
7223b94M17m99Q18k75l51o46P33j30J27j35O97m39M1o94O63R67q62k29K47J08
$$ -294 123 -376 442 167 -184 -830 -97 -227 -100 -235 462 23 64 -630 33 1000 138 -91 156 264
7243B64o0k76J84j60K44K18o23L86n89N03K05l80K03L14p34M50Lj98P39p23m09
$$ 264 204 -72 112 -48 196 414 -209 177 -412 91 296 -84 119 433 -301 149 152 -46 693 -30 -439
7264d39R14p20m33P24j57K86n23L81L69p96M30P0N37k47r52P09k93L9o1P01m76
$$ -439 475 -245 -678 46 -111 175 -348 33 402 -394 36 106 643 396 -556 153 -140 -101 -162 539 63
7285F3O49p85p59M89O66n06m38N92k54j20l96J047k86L07K29J0l94q15L35K57
$$ 63 712 -73 -832 -343 323 -183 -621 -29 -283 -403 -799 248 -38 269 498 508 114 -701 -366 -109
7305a09l57L47Q0j32k2J45n50O32o46O14j40l43O91m35L37J34k69j07J62k67L84
$$ -109 -466 -119 -39 -171 -193 -48 -598 34 -612 2 -138 -481 210 -225 112 246 -23 -130 32 -235 149
7326A49l11J07N05J1l80K32j99Jk99N92o49qJ75m4L25l01J45J41j39o5m38M59
$$ 149 -162 -55 450 461 81 313 114 115 -184 408 -241 -249 -74 -118 207 -94 51 192 53 -12 -450 9
7348IL5n2n68R19m17m37P73R8l17n10O47K14m34K00m77n33J021J41j57O9J47p29
$$ 9 44 -8 -576 343 -74 -511 262 360 43 -467 180 394 -40 160 -317 -850 171 312 155 224 371 -358
7370c58L45K01P8j52j72K30l67K3M70r69J314j24j115O84K42n77M3Q9l2n9o0N89
$$ -358 -13 188 266 114 -58 172 -195 -172 298 -671 643 519 -596 88 330 -247 -204 -115 -147 -206 -266 323
7392C23L97j221L76L01L01r05K39k2L95m31K9K05o8j17n7N45l65n64J98j00L22
$$ 323 720 -501 -125 176 477 -428 -189 -211 184 -247 -218 -13 -81 -198 -255 290 -75 -639 -441 -541 -219
7413b19JR54o48j51N22j060P10r73P25K08j6J77n82J56P15r39J95L94j93N50r65
$$ -219 -218 736 88 -63 459 -601 109 -864 -139 69 53 230 -352 -196 519 -420 -225 169 -24 526 -439
7434d39M88k98q7P93o6m03m39Q22p79P91n9k56l43O3k2r7J048j30j106O01j43
$$ -439 49 -249 -336 457 391 -12 -451 371 -408 383 324 68 -275 -212 -234 -331 717 587 -519 82 -61
7455f1n6K90k43k91j35K59l15K76L83n7k25Q0K52m64j55Q58n11p9J68l2k60o89
$$ -61 -117 173 -70 -361 -496 -237 -552 -276 107 50 -175 -95 157 -307 -462 396 -115 -194 -26 -58 -318 -1007
7477a007Q81L28K68n94k2m73R79j94O6mk50m44L62L36k09J93j12J79j82L1k19
$$ -1007 -126 202 470 -124 -146 -619 360 166 232 228 -22 -466 -104 232 23 216 104 283 101 132 -87
7498h7K46J00n30l0M34J84R5N99n20n40J03L87r62q9P85r54M82K69J12N75o34
$$ -87 159 259 -271 -301 133 317 412 1011 491 -49 54 441 -521 -610 175 -779 -297 -28 84 659 25
7519B5P3P75r38j25K78q25P59j27k44p6M81K49j066Q14J55l29m00M34Q9r5qJ2
$$ 25 98 873 -65 -190 88 -737 22 -105 -349 -425 56 305 -761 53 208 -121 -521 -87 2 -93 -101 -89
7541h9L93k43n79J26O48M1m94lK77l1j21j52N8K60k64L13j63m5p7k60J45lP8m20
$$ -89 304 61 -518 -392 256 297 -197 -200 77 46 -75 -227 -169 91 -173 140 -23 -68 -145 -405 -260 -263 -185 -605
7565f05P15m69M89J84l42Q14j197R19q11N50n75K45K63nq3J36J50p23P35l6q68
$$ -605 110 -359 130 314 -28 786 -411 508 -303 247 -328 -83 180 175 92 228 378 -345 390 354 -514
7586e14L77p0M33m2N96n92k5j75K62k20j54j71L35K49r29P01m45P49k37K02k84
$$ -514 -137 -207 226 184 780 188 163 -12 250 30 -124 -295 40 289 -640 61 -384 365 128 330 46
7607D6K3n63P18J44m31L35p38N85j98N21p77O36Q9n71J32L46J4n8M11k94k48j36
$$ 46 69 -494 224 368 -63 272 -466 119 -79 442 -335 301 390 -181 -49 297 311 253 664 370 122 -14
7629a4M09L29m85k03n80J68L77N6rK15n68O6K7J28N00p22K88K95l87Rk50P23q16
$$ -14 395 724 239 36 -544 -376 1 57 48 263 -305 -239 -212 -84 416 -306 -18 277 -110 -101 -351 372 -444
7652d44N13K6Q7k47J2r2K57k47l67O02o15L53L70j47K36m5Q7q05K32K29K61k55
$$ -444 69 95 182 -65 -53 -145 112 -135 -502 100 -515 -162 208 61 297 252 339 -466 -234 -5 256 1
7674AJ3k02N69J16p92K32j02M77K04o16l43J246p64J29k07K00J3J78m81m4M54
$$ 1 14 -188 381 497 -295 -63 -165 312 516 -100 -443 803 39 168 -39 161 174 352 -129 -173 281
7695B81p37M83j09M32j73OM56j513J285k61Q1J8j14j6m27O0N26j67j28j12j0K22
$$ 281 -456 27 -82 350 177 183 639 -874 411 150 231 249 135 119 -308 -248 278 111 -17 -129 -139 83
7717H3m93m45P83o7N47k05j5k7j87J95N6j76j48J67M05R8r84J107n89m3m74M09
$$ 83 -410 -855 -72 -139 408 203 188 161 -26 169 225 49 -99 68 473 571 -413 694 105 62 -412 -3
7739cm8K75J35m7l2p97J044q43n7L19R7K77q2k02n48M0P32o2j37j41M83m44j4
$$ -3 -51 224 359 312 280 -517 527 -316 -373 -54 43 320 238 36 -512 -472 260 198 61 -80 403 -41 -55
7762e5J52lK42l91K83l70k32O63o06J71N54k50j10mn76N61M07n13j40M29m66m9
$$ -55 97 94 336 -55 228 -142 -374 289 -317 -146 408 158 48 44 -532 29 436 -77 -217 212 -254 -303
7784c03K14q11J305p57l43Q31n1K1l58j46K23oN47p29M00J84l77j1M63n07k2M64
$$ -303 -89 -900 405 -352 -695 136 85 106 -252 -398 -175 -181 366 -363 37 221 -156 -167 296 -211 -233 231
7806B31k67J92m21M16j82k45M30p96N22J26L1l84O48O0l23k68J44L4j47P25Jl00
$$ 231 -36 156 -265 151 -31 -276 154 -642 -120 6 37 -347 301 361 38 -230 -86 -52 -199 526 527 227
7828B27m73j06RO82k82o91M36J95M14p69L18J38m0o92L85Q90j080M8Q59n23L7
$$ 227 -246 -352 -343 339 57 -634 -198 -3 411 -358 -40 98 58 -634 -249 641 -439 -391 468 -55 -18
7849a8M38q57N20m65P57p42J456p83l56L59M47q66P4O4l49K46K89q0K7n57J076
$$ -18 420 -437 83 -382 375 -367 1089 306 -50 309 756 -110 -36 28 -321 -75 214 134 161 -396 680
7870F80n00K1q64P33N58o93k16N74n97K50q3j56K25l97O40J73K8p57P76r0q4j33
$$ 680 180 201 -663 70 628 -65 -281 293 -304 -54 -137 -293 -68 -465 175 348 376 -381 395 305 221 88
7892H8k94L5J63l27J172j259J70J4P2J3M2J49l2m10M45o46Q17J7K55j14p24N28
$$ 88 -206 -171 -8 -335 837 -422 -252 -238 -166 -153 -111 38 6 -404 41 -605 212 229 484 370 -354 174
7914A74j11L84o00K80J75r8k06J83k32j18J78m03J009q16Q32k88J05n49O8k42
$$ 174 63 447 -153 127 302 204 -2 181 -51 -169 9 -394 615 -201 631 343 448 -101 -33 -275
7934b75O2k3l95P90l30M1N3n58J125j453O90O86p50L86L11J51n54j16M31j79m06
$$ -275 -213 -236 -631 159 -171 -130 -77 -635 490 -963 -273 413 -337 49 360 511 -43 -159 272 93 -313
7955c13k47K72l82P30O8n03j92O47Rl7k00K95j91m01L00O90k88k41l31k52Q83
$$ -313 -560 -288 -670 60 128 -375 -567 80 89 52 -148 147 -44 -445 -145 545 257 16 -315 -567 316
7976C16K02O9l5O0l32n96J06R9o0j01L36K18o00N97j37N6m12J52N5l1O77j90j277
$$ 316 518 587 552 612 280 -316 -210 -111 -171 -272 64 282 -318 279 142 198 -214 -62 -7 -38 639 449 -828
7999h28Q41J10j26j73J70K58M9r18J17Q62N1n8o31J239r94l55N41o04m02Q67N5
$$ -828 13 123 -3 -176 -6 252 301 -617 -500 362 413 355 -276 963 -31 -386 155 -449 -851 16 71
8020G1M6q04O49N28k99p52M57K67l16l8o00M50k17N87r0l1O4L21q2m15K68j55
$$ 71 117 -687 -38 490 191 -561 -104 163 -153 -191 -791 -341 -558 29 -61 -92 -28 293 211 -204 64 -91
8042i1j35K0l49O77j1m05l23K98M58l52k70N08O4k77R53n18j4l73M84n83K64m34
$$ -91 -226 -206 -555 122 111 -294 -617 -319 139 -213 -483 25 89 -188 765 247 233 -140 344 -239 25 -409
8064d09N98q94J347n42q4q9K86q39R22k54K41o9J8m03j02J02l56Q84p74R1l25
$$ -409 189 -705 642 100 16 -73 213 -626 296 42 283 214 232 -171 -273 -171 -527 357 -417 -326 -651
8085f51M59K2k09J61K90J97l2j53J10k98J12j71M44m88k15N82J4j75J29k27o81
$$ -651 -192 -170 -379 -218 72 269 237 84 194 -104 8 -163 281 -207 -422 160 174 -1 128 -99 -780
8106g80M99J96k20R93l05o40J39l56Q42j00l6N14j065M28m36K71N43l88o54R27
$$ -780 -281 -85 -305 688 383 -257 -118 -474 368 268 232 746 -319 109 -327 -56 487 99 -555 372
8126C72n9n34j4N32r2o14N41m42M93m09M02o45P50n41r7N01l02k1K61K02m55j9
$$ 372 313 -221 -235 297 205 -409 132 -310 183 -226 176 -469 281 -260 -357 144 -158 -179 82 284 -171 -190
8148a90K7M63m10j6J24K19n38L66J86P20j203j4M6J74J27n61j14L82J74O13r00
$$ -190 -163 300 -110 -126 -2 217 -321 45 231 951 -252 -266 -220 -46 81 -480 -594 -212 -38 575 -325
8169c25M17m39n9M51rM10l96J4k72O62q16K09l4K0R7m27O18q56N91M14n61L7
$$ -325 92 -347 -406 45 36 446 50 64 -208 454 -362 -153 -187 -167 -70 -497 121 -735 -144 270 -291 -254
8191b54
$$ Imaginary data points
##PAGE= N=2
##DATA TABLE= (X++(I..I)), XYDATA
0@%%%%%%%%%%%%%k4O0q4R6r6R6j03J51j92K00k48K96l44M06m58N32o13O94p89
$$ 0 0 0 0 0 0 0 0 0 0 0 0 0 0 -24 36 -48 48 -48 48 -55 96 -96 104 -144 152 -192 214 -244 288 -325 369 -420
32d20Q98j019J148j292J445j613J807k017K245k498K771l061L382l738M118m535
$$ -420 478 -541 607 -685 760 -853 954 -1063 1182 -1316 1455 -1606 1776 -1962 2156 -2379
48b379N007n518O072o689P374q143R006r980J1092j2371J3872j5653J7802k0460
$$ -2379 2628 -2890 3182 -3507 3867 -4276 4730 -5250 5842 -6529 7343 -8310 9492 -10968
62a0968K3849k8333L4550m3777N8874q7734J61747o84808j524673J943911K210069
$$ -10968 12881 -15452 19098 -24679 34195 -53539 108208 -576600 -2101273 -157362 2052707
73B052707q55128k517363k39399J947638Q65043j394181j052650R04208J268404
$$ 2052707 1197579 -1319784 -1559183 388455 1253498 -140683 -1193333 -289125 979279
82I79279l33456j116150j45738P56129K23357n72414l21665M94118N68470j15374
$$ 979279 645823 -470327 -616065 140064 363421 -208993 -530658 -36540 531930 416556
92D16556n96479k43318L86476M49852k12092o70578j25218Q07274O79917n32335
$$ 416556 -179923 -423241 -36765 413087 200995 -469583 -594801 212473 892390 360055
102C60055j062000L9786J125590M17120j044970q55286P63627J210793k75256
$$ 360055 -701945 -662159 463431 880551 -164419 -1019705 -256078 954715 679459
111F79459j286231k11543J113493N35315q68909p37641O03020Q38735l24737q45105
$$ 679459 -606772 -818315 295178 830493 -38416 -776057 -173037 665698 340961 -504144
121e04144Q5348P67442O9204p05056k10498O64255M08801n24855o01042K55840
$$ -504144 -418796 348646 417850 -287206 -497704 166551 575352 50497 -550545 -294705
131b94705O52456L9807n64730k92261L68490M75544m0649m67641k96326K34486
$$ -294705 357751 397558 -167172 -459433 -90943 384601 343952 -123689 -420015 -185529
141a85529M58916O7850m37569l18464L06357N06514p3155n52446j61314M66809
$$ -185529 273387 341237 -96332 -414796 -108439 398075 324920 -227526 -388840 77969
151G7969K94989l70279l76861K97419M72554j87468n45280M6472N78526J00445
$$ 77969 372958 2679 -374182 -76763 395791 208323 -336957 -290485 288041 388486
161C88486n91346k85114N47945M92044l97324o59513J43971P08786J41040o17159
$$ 388486 -202860 -487974 59971 552015 154691 -504822 -360851 347935 488975 -128184
171a28184l73874M27070N15992j78877n47186r5032M22739K74177k11721l08514
$$ -128184 -502058 -74988 441004 262127 -285059 -380091 42648 316825 105104 -203410
181b03410L4882K66118R1733j86599j74880P5225J91568R152j78423n5618J94753
$$ -203410 -168528 97590 189323 2724 -172156 -96931 94637 103789 -74634 -130252 64501
192F4501J38445j88754k55572J07444L35118J4298l70923j57040L63647L36168
$$ 64501 202946 14192 -241380 -133936 201182 215480 -155443 -312483 51164 387332
202C87332k47631m70828M1540M84833J54939m07276k99850K81362M00493j08913
$$ 387332 139701 -331127 -289587 195246 350185 -57091 -356941 -75579 324914 216001
212B16001m14353p1105L30656J80353k13483k16479J15834K17913l5529k00656
$$ 216001 -198352 -269457 61199 241552 28069 -188410 -72576 145337 109808 -90848
222i0848k6878J71127P1529j45125j19114J10082J75342m0184k14852p2426J96336
$$ -90848 -117726 53401 124930 -20195 -139309 -29227 146115 105931 -108921 -181347 14989
233A4989J85837j10619k60137j6105K70537J57952k08660k68812Q1592L03730
$$ 14989 200826 90207 -169930 -186035 84502 242454 33794 -235018 -153426 150304
243A50304N7496k65967j57218J96394K20981j08228k54169P719K35181O8347j89903
$$ 150304 207800 -58167 -215385 -18991 201990 93762 -160407 -152688 82493 150840 -39063
254c9063j07403J61274J51262j22317k00559N2123K18971K5715k13079r9613J90083
$$ -39063 -146466 14808 166070 43753 -156806 -104683 114288 140003 -73076 -172689 17394
265A7394J90210j18083k61997r942K61247J40586j90994k34315P8209K74765N8975
$$ 17394 207604 89521 -172476 -182418 78829 219415 28421 -205894 -127685 147080 206055
276B06055k41914j79410J42280K36429k5373k28545o9186J82897J34305j21241
$$ 206055 -35859 -215269 -72989 163440 138067 -90478 -159664 23233 157538 36297
286C6297j66039N4775J67544n479j60306l2710J60997Q4320j48883j49695J00263
$$ 36297 -129742 -74967 92577 87098 -73208 -105918 55079 139399 -9484 -159179 -58916
297e8916K01189k0818k22444p2723K05518J74924j32159k53025J425K52546J31652
$$ -58916 142273 121455 -100989 -173712 31806 206730 74571 -178454 -177029 75517 207169
308B07169j71566k09503N9392K26923N1033j91026j41690J07276J77513j3210
$$ 207169 35603 -173900 -114508 112415 163448 -27578 -169268 -61992 115521 102311
318A02311j55064m1711J16585O7527r0280q4694O5382R7592m4494j14494K1997
$$ 102311 -52753 -94464 22121 89648 -632 -85326 -19944 77648 33154 -81340 -59343
329e9343J39635K8223j50569r7921J23016J58159o1811j95599k5042J97561J22442
$$ -59343 80292 108515 -42054 -139975 -16959 141200 79389 -116210 -141252 56309 178751
340A78751j39592j96964L4234K06979P0613j54752j39476P5527J60278P040j36865
$$ 178751 39159 -157805 -123571 83408 154021 -731 -140207 -64680 95598 102638 -34227
351c4227o8414Q3242Q8641l2124p2368J1579N5626j5480o7269J1941R5039K2717
$$ -34227 -102641 -19399 69242 37118 -35250 -23671 31955 16475 -50794 -38853 56186 78903
363G8903j08858p9767R2093J37202l9506j75674m5411J69443J35820j06067j94076
$$ 78903 -29955 -109722 -17629 119573 80067 -95607 -141018 28425 164245 58178 -135898
374a35898J0541J99374Q6066j52375j58605O6769J78709K2448j46462q1001R5414
$$ -135898 -125357 74017 160083 7708 -150897 -84128 94581 117029 -29433 -110434 -15020
385a5020J05808m5096j09233L7R2254K6603o9711l3740O7089M8598o9536q7733
$$ -15020 90788 45692 -63541 -63504 28750 55353 -14358 -48098 18991 67589 -1947 -89680
397h9680M5549J25307R692j34441p6588J08737J38072m8247j73937l8772J61014
$$ -89680 -44131 81176 90868 -43573 -120161 -11424 126648 78401 -95536 -134308 26706
408B6706J22248r9294j70842J5538J72735O7049j34947j25189O8772J46995j418
$$ 26706 148954 49660 -121182 -105644 67091 134140 -807 -125996 -57224 89771 88353
419H8353j29254n2605R3426P8360n3117q4123K2084P9643j240p2970j1828P1888
$$ 88353 -40901 -93506 -80 78280 25163 -58960 -36876 42767 41527 -31443 -43271 28617
431B8617K9435p5810o2800O1482J01309j7221j16818m1279J03012R3002o1406
$$ 28617 58052 -17758 -80558 -19076 82233 65012 -51806 -93085 9927 102929 41523
442D1523j29667o618J28398P6321q1061j13403J9853J11290L2598q8453o8320
$$ 41523 -88144 -94762 33636 109957 28896 -84507 -64654 46636 79234 -9219 -77539
453g7539N2744Q2758j4676p6740j3700O3664K6488n2273l5570M6580M9218l9508
$$ -77539 -24795 57963 43287 -33453 -47153 16511 42999 -9274 -44844 1736 50954 11446
465A1446o6968K3355Q2725O881r2563m4847Q2530Q7647m8165j15441l901J13954
$$ 11446 -55522 -32167 50558 57439 -35124 -79971 2559 90206 42041 -73400 -77301 36653
477C6653N7786q8820r8208M0251J16020J9199r7833o3448N6327P9760j7814p7979
$$ 36653 94439 5619 -92589 -52338 63682 82881 -14952 -78400 -22073 57687 39873 -38106
489c8106j4162O4271M0328l9719m8366J9210M5067j3088n1467m85O4696K9666
$$ -38106 -52268 12003 52331 12612 -35754 -16544 28523 15435 -36032 -36517 28179 57845
501E7845n8895o0281L9536Q4787r291j01894m3435R3442R5517m8316j20760j0045
$$ 57845 -1050 -61331 -21795 62992 53701 -48193 -91628 1814 97331 49015 -71745 -81790
513h1790J17239O2302q6302j02502L4486J11328J6561q8795m6665O2189N9210
$$ -81790 35449 97751 11449 -91053 -56567 54761 71322 -17473 -64138 -1949 57261
524E7261l5682o5983R083N8230O978m8682j2713M6813K7414m2069m6152K4945
$$ 57261 21579 -44404 -35321 22909 29887 -18795 -31508 15305 42719 650 -45502 -20557
536b0557O0482J956o4399l5061M7403O3182j1099p1315k7086N7815O0419k8062
$$ -20557 39925 41881 -22518 -57579 -10176 53006 41907 -29408 -56494 1321 61740 33678
548C3678q1443j7187P3071N6968m0508o8472R053O6383J3317n9081l3437M3276
$$ 33678 -47765 -64952 8119 65087 24579 -43893 -34840 31543 44860 -14221 -47658 -4382
560d382M1142k8576m1204K4869M7761j8515o1197L320O7531J8194o8375m4356
$$ -4382 36760 8184 -33020 -8151 39610 21095 -40102 -36782 30749 48943 -19432 -63788
572f3788N9528P3674k8626q7444j2417P4167M2976n1266n9143J9442O3462J5860
$$ -63788 -4260 69414 40788 -46656 -59073 15094 58070 6804 -52339 -32897 30565 46425
584D6425m4686l4474J2376L1508O228j7958j2290R324J3991n321j4778L370K0898
$$ 46425 1739 -32735 -20359 11149 17377 -581 -12871 -3547 10444 5123 -9655 -6285 14613
597A4613J049l2673j3653L7579L6678l3233o2341J1769Q2092K7390q0302o6792
$$ 14613 15662 -17011 -30664 6915 43593 10360 -51981 -40212 41880 69270 -11032 -77824
609g7824N5914R3651j8440j03402k3274R1014N8047o4069p6876L1502Q0824j46
$$ -77824 -21910 71741 53301 -50101 -73375 17639 75686 11617 -65259 -33757 47067 46921
621D6921p0779k2680N2374L4094l3760l7662J9372L6093p060l5923k564L1764
$$ 46921 -23858 -46538 5836 39930 6170 -31492 -12120 23973 16913 -19010 -21574 10190
633A0190J6873k3185k9587O670L3799J4595k9523l7573J2392N4655K0622n1677
$$ 10190 27063 3878 -25709 -19039 14760 29355 -168 -37741 -25349 29306 49928 -1749
645a749n1898K9786P0035k156p5974l2175O6610O1436l9522p2159R959O9901J0898
$$ -1749 -53647 -23861 46174 44018 -31956 -64131 2479 63915 24393 -47766 -37807 32094 42992
658D2992n9332k6665M5444L3063l3441l3977K8399L7460k3003m5675J2703N0744
$$ 42992 -16340 -43005 2439 35502 2061 -31916 -3517 33943 10940 -34735 -22032 28712
670B8712L672n0794k1976M2825L9654k2610m6341n056L7762K2673j6563k8462
$$ 28712 32384 -18410 -40386 2439 42093 19483 -26858 -31914 5848 28521 11958 -16504
682a6504l275K2354J9492q718k8277r182K4232K3872j2647l0285L723L0572L788
$$ -16504 -19779 2575 22067 13349 -14928 -24110 122 23994 11347 -18938 -15215 15357 19145
695A9145l0365j0991K8585J8774k8454k4686K6671L4295k2871m7067J2219N7941
$$ 19145 -11220 -22211 6374 25148 -3306 -27992 -1321 32974 10103 -36964 -24745 33196
707C3196O328o1263l0550N3470N4028l1747o7362J077O4731K4585m5730l9904
$$ 33196 39524 -21739 -52289 1181 55209 23462 -43900 -42823 21908 46493 763 -39141
719c9141K2466M1852p64l2474j5454J6746J7724j957j0706k896O125N006n553
$$ -39141 -16675 25177 24413 -8061 -23515 -6769 10955 8998 -1708 -4604 1521 6527 974
732I74q675K036J3042J257j6522p709K0624K1322j8888l7689N431M7702J5690
$$ 974 -7701 -5665 7377 8634 -7888 -15597 5027 26349 7461 -30228 -24797 22905 38595
745C8595m5476l8489L2210N5694q810n9618j8452M9200L6197l0503m1610J2033
$$ 38595 -6881 -45370 -13160 42534 33724 -25894 -44346 4854 41051 10548 -31062 -19029
757a9029L8491L299l0253j0824J9589J0111j3969q444J4040J1356j0522j6861
$$ -19029 19462 22761 -7492 -18316 1273 11384 -2585 -11029 3011 14367 3845 -13016
769a3016K802J8148L097j3524r825Q471J5241J108j5914j4076Q591K1092L963
$$ -13016 -10214 7934 11031 -2493 -12318 -3847 11394 12502 -3412 -17488 -8897 12195 16158
782A6158k0543j6563J6999K5868n074l1111j0162K6620J9723j6234k2720Q346
$$ 16158 -4385 -20948 -3949 21919 16845 -14266 -24428 2192 21915 5681 -17039 -8693
794h693K2144j347k0399l050J7928K692j9502m878K4679J4946k2591k6864J0868
$$ -8693 13451 12104 -8295 -11345 6583 9275 -10227 -15105 9574 24520 1929 -24935 -14067
807a4067L2694J882l1961j5572K5540K8213j0368l1686p164K4604J8319j3205
$$ -14067 18627 20509 -11452 -27024 -1484 26729 16361 -15325 -22489 2115 20434 7229
819G229k3250J377K3675R543j7281j6515O418J8665J685j8499n815J6140J2801
$$ 7229 -16021 -14644 9031 18574 1293 -15222 -8804 9861 11546 -6953 -12768 3372 16173
832A6173j3787j8758P835K3325j027k6488p742K5446K1035j7715l1982M060L3140
$$ 16173 2386 -16372 -8537 14788 13761 -12727 -20469 4977 26012 8297 -23685 -19625 13515
845A3515J1009k7837k3032J9230L0888m299l3126j0783K5777K0302j5225k4357
$$ 13515 24524 -3313 -26345 -7115 23773 19474 -13652 -24435 1342 21644 6419 -17938
857a7938M269K5206P741k0070j7705J0992J8716q74j6833l396J3809O864r667
$$ -17938 -13669 11537 19278 -792 -18497 -7505 11211 10337 -6496 -9892 3917 10781 1114
870A114j0970O552J1337k939j4712j3J6755R373j4788j8609O784K1182L842j9481
$$ 1114 -9856 -3304 8033 5094 -9618 -9631 7124 16497 1709 -16900 -10116 11066 14908 -4573
884d573j2827J2212K0888k751k0620p706J3741J2970o547j2190J813J1251J713
$$ -4573 -17400 -5188 15700 12949 -7671 -15377 -1636 11334 4787 -7403 -5590 5661 7374
897G374j0241m047Q125M274p553n082Q609R492o563j4842P76J5743O633j5494
$$ 7374 -2867 -6914 1211 5485 -2068 -7150 1459 10951 4388 -10454 -9678 6065 12698 -2796
911b796j2617J2155J8132k844k0927p570J6910J4336r766j7016J866J7872O490
$$ -2796 -15413 -3258 14874 12030 -8897 -16467 443 14779 5013 -12003 -10137 7735 14225
924A4225j4609j1097N987J2557j611j1965j281J0945P416r358j0228M943J0941
$$ 14225 -384 -11481 -5494 7063 5452 -6513 -7794 3151 10567 1209 -9019 -4076 6865
937F865q63j4134k939J5417J1556j2139j8639L687K1171O405k1089j6584J5360
$$ 6865 6002 -8132 -11071 4346 15902 3763 -14876 -11189 9982 16387 -4702 -21286 -5926
950e926K5123j915k7160j1784K0552J9748r351k2318o8J9519Q677j4835j2131
$$ -5926 19197 17282 -9878 -21662 -1110 18638 9287 -13031 -13099 6420 15097 262 -11869
963a1869Q798J0986m294j0997K130J2130J624j0530q557R785J0936m707j3192
$$ -11869 -3071 7915 3621 -7376 -5246 6884 8508 -2022 -10579 -794 10142 5435 -7757
976g757k110J3742Q893q954j4037K79J4706O711j0999j1267N468J4977P09j4543
$$ -7757 -9867 3875 12768 3814 -10223 -9944 4762 11473 474 -10793 -5325 9652 10361 -4182
990d182q347J0687J1034m269j1679J959J0281J770j0149n376Q453O188n985p632
$$ -4182 -12529 -1842 9192 4923 -6756 -4797 5484 7254 -2895 -8271 182 6370 385 -7247
1004g247O063R976k165j2704k271J1254N525r037r724P365J2538j586j3145m963
$$ -7247 -1184 8792 6627 -6077 -8348 2906 8431 -606 -10330 -2965 9573 7987 -5158 -10121
1018a0121J0482P382o385r360J918J1972L606q693p752L064P358L56p486j496
$$ -10121 361 7743 1358 -8002 -6084 5888 9494 801 -6951 -3887 3471 3827 -3659 -5155
1032e155O974M701n498p379K582R045k62j0882l928J0852J1525o668j5317j530
$$ -5155 1819 6520 1022 -6357 -3775 5270 5008 -5874 -9802 1050 12575 5907 -9410 -10940
1046a0940J5536Q454j2620j4265P046J7501Q05j7356p535J4232J1068q880j3480
$$ -10940 4596 13050 430 -13835 -6789 10712 11517 -5839 -13374 858 11926 3046 -10434
1059a0434L848J4884K676j3913q076R200J0594l694j1222o76R866M698o994p296
$$ -10434 -6586 8298 10974 -2939 -11015 -1815 8779 5085 -6137 -6813 3053 7751 757 -6539
1073f539J923Q493J199p296m321O184O722j776r646j877Q603O461o091r980K547
$$ -6539 -4616 3877 5076 -2220 -6541 -357 6365 4589 -5057 -6934 1669 8130 2039 -7941 -5394
1088e394J1786J782j0470p426P204J0179k263r819k378R982M369p370p230M080
$$ -5394 6392 8174 -2296 -9722 -2518 7661 5398 -4421 -6799 3183 7552 182 -7048 -2968
1102b968P028j436n316J708M526k78o298j320O480K697n766m571M505N999l50
$$ -2968 4060 2624 -2692 -984 3542 3264 -3034 -4354 2126 4823 -943 -5514 -1009 4990 4640
1117D640o910k667M322L626j483k815j157K296J907n86j840j065K681K2k445o55
$$ 4640 -2270 -4937 -615 3011 1528 -1287 -2444 -148 1759 1173 -667 -1732 949 971 -1474 -2129
1133b129K171K910k112m633N54N835K612o077o046N300Q224k661r489j060J0977
$$ -2129 42 2952 840 -3793 -3239 2596 5208 -869 -6915 -1615 6609 3948 -5541 -6601 4376
1148D376M654q906r336O635J1307k536j2696l045J0695Q349o870j0316K818J0004
$$ 4376 9030 124 -9212 -2577 8730 6194 -6502 -9547 1148 9497 2627 -7689 -4871 5133
1162E133J505q943m125N558O236k782o006P4N894K892o129m732K280O608J599
$$ 5133 6638 -2305 -6430 -872 5364 2582 -3424 -3350 2544 5436 -693 -5425 -3145 3463 5062
1177E062o295n079M322Q601j043j0168l283Q411Q350m383j2207K67J1414M497
$$ 5062 -1233 -6312 -1990 6611 5568 -4600 -7883 528 8878 4495 -7712 -7445 3969 8466
1191H466r306q014N735J0390j762r798j383Q015L220p371m298N869N861l420o993
$$ 8466 -840 -8854 -3119 7271 5509 -4289 -5672 2343 5563 -1808 -6106 -237 5624 2204 -4789
1206d789J150O890J032o559l065M264M643r30l297j876K244J800p12j605m68J513
$$ -4789 -3639 3251 4283 -2276 -5341 -1077 3566 2636 -661 -2537 -293 1507 795 -810 -1278 235
1222B35J426n46k029J094J238j01k467j016J760K852j559l269N03M588O08n454
$$ 235 1661 1115 -914 180 1418 1317 -1150 -2166 -406 2446 887 -2382 -1879 2709 3317 -2137
1238b137j905N112K726l417m508L133O432j894q381m06P506M270o985o024M482
$$ -2137 -4042 1070 3796 379 -4129 -996 5436 3542 -4839 -5245 2261 6531 -454 -6478 -1996
1253a996P602j905p116j665O511M352n363n514K811O103n70n399j595L628M001
$$ -1996 5606 3701 -3415 -5080 1431 5783 420 -5094 -2283 3820 3250 -2149 -3744 -116 3885
1268C885j517n309m83L998L326k367n522O42N415L356n239o150K948P125J134
$$ 3885 2368 -2941 -3424 574 3900 1533 -3989 -3347 2068 5424 185 -5965 -3017 4108 5242
1283E242p973l790O596O894l631q527R63P601J735p345m138O400N694k976p803
$$ 5242 -2731 -6521 75 6969 3338 -5189 -4226 3375 5110 -2235 -6373 27 5721 2745 -5058
1298e058J744O661K092o047m393L489M793o17m262p22K201J002l03j050k37J262
$$ -5058 -3314 3347 5439 -608 -5001 -1512 3281 2664 -1598 -2320 -119 883 580 -470 -707 555
1314E55lj501l8N50J212M50j202j853J755K993j087l919l69L004J865j686k677
$$ 555 552 -949 -987 -437 775 1225 23 -1830 -75 2918 1831 -2088 -2457 547 2412 726 -1951
1331a951J685K359r75k159o2K264o52k779Q10L333R36m081k319L505L354j633
$$ -1951 -266 2093 1118 -1041 -1103 1161 509 -2270 -1460 1873 2809 -1272 -3591 -86 3268 1635
1347A635m941J845L811N58l495l203L692L042j812l311J87M063Q14l283l051K367
$$ 1635 -3306 -1461 2350 2908 -587 -3790 -98 2944 1132 -2179 -1992 2071 2885 -398 -3449 -1082
1363a082L343j23k836j589K717K535j538m236m27L753L238k473l997L96M482K390
$$ -1082 2261 2138 -698 -2287 430 2965 1427 -2809 -3236 517 3755 1282 -2715 -2319 2163 4553
1379D553m273n414K861M880J06n109n95M586L623m433o025K851O074M56n343l627
$$ 4553 280 -5134 -2273 2607 2713 -2396 -2991 1595 5218 785 -5240 -2389 3685 4141 -1202 -4829
1395d829M549M880k367n381p61M562K155j979l432J393L022R60m059j947K975
$$ -4829 -280 4600 2233 -3148 -3909 653 2808 829 -2603 -1210 1812 2772 -1287 -3234 -259
1410b59K606o90l805q34L648K742k396l931N45L668J692k400l205J291K642Q88
$$ -259 2347 1657 -2148 -2982 666 3408 1012 -2919 -2374 1294 2986 586 -2619 -1328 1314 2202
1426B202l144o37J396J486j205j764J446J314k61k166N62J685P87j639j638J442
$$ 2202 -942 -1579 -183 1303 98 -1666 -220 1094 833 -1333 -771 914 1701 62 -1576 -134
1442a34J860q7l299M90J348M67r35j25O81Q08j130k58q0J796j320k028P82K990
$$ -134 1726 1639 -1660 -1170 178 645 -290 -415 266 1074 -56 -314 -394 1402 82 -1946 -1164 1826
1460A826K84k334j217Q50J818k02k420r64K602J643Rl065j312K687J700j508k320
$$ 1826 2110 -224 -1441 -591 1227 1025 -1395 -2359 243 1886 1895 -1170 -2482 205 1905 397 -1923
1477a923O35L065Q77k893l074K299L760o3m853r59M175L155l489l251J000L641
$$ -1923 -1288 1777 2654 -239 -3313 -1014 2746 2683 -2170 -3129 1046 4201 712 -2539 -1539 2102
1493B102J16l765q12K819K839k877k098Q46K911J033l587k545K205L532k84m003
$$ 2102 2218 -1547 -2359 460 3299 422 -1676 -830 2081 3114 -473 -3018 -813 2719 2435 -1568
1509a568k248L864K391q32k378j401K663J111k57k708m60J517J388p08j660O43
$$ -1568 -3816 48 2439 1607 -771 -2172 491 1602 1345 -1363 -1823 -306 1082 374 -1286 -643
1525f43J417P61j857j217J362J405r24k303J181K778n21k316m69J812J025j659
$$ -643 774 1535 -322 -1539 -177 1228 304 -1999 -818 1960 1439 -877 -1346 466 1491 -168
1541a68p47P55J173j62j848M94J086k25j417j94J765L36j361j033J286J462j447
$$ -168 -915 -160 1013 851 -997 -503 583 358 -1059 -1253 512 848 -513 -1546 -260 1202 -245
1558b45j140J609L66n10o08J16P08K16l84m38k02J216L10r56j482o9K531J087
$$ -245 -1385 224 590 80 -528 -412 296 512 128 -310 -512 704 1014 58 -1424 -1493 1038 2125
1576B125j546k326m11K973J430j853l616R56L871J110l574m43K113J159j420l637
$$ 2125 579 -1747 -2158 815 2245 392 -3224 -2268 1603 2713 -861 -1304 809 1968 548 -3089
1592c089J889L565l09m070o25M128J631k462l514J271K367P20j083k209J223K573
$$ -3089 -1200 2365 2056 -2014 -2639 1489 3120 658 -2856 -1585 782 1502 419 -1790 -567 2006
1608B006q0k433j894J563K152K47k648p59J841J555p86k135j10K205K062k424
$$ 2006 1926 -507 -2401 -838 1314 1561 -1087 -1846 -5 1550 764 -1371 -1481 724 2786 362
1624C62l056K021K656q29k740n01K576K167k159k251J135K040J53k735P5J521
$$ 362 -2694 -673 1983 1154 -1586 -2087 489 2656 497 -1754 -619 1421 1574 -1161 -1086 435
1640D35L64q57n23K43Q33p03l84k07L62O07l3P42j060m31J78P03P07p04j367O74
$$ 435 799 -58 -581 -338 495 -208 -592 -799 -437 170 137 879 -181 -612 -434 269 976 272 -1095 -421
1660d21J299J382k126q81k81J367P17p29l42p38J042K88n7p80r70J279N12q44
$$ -421 878 2260 134 -747 -1028 339 1056 327 -15 -753 289 577 520 -260 -1230 49 561 -283
1678b83m64L30N83K66j168n06J751J313k334j285J500J957m27k504n40J724K420
$$ -283 -747 -417 166 432 -736 -1242 509 1822 -512 -1797 -297 1660 1233 -1271 -1811 -87 2333
1695B333j765k039k42K597O31j298j696Q08J891m79j362j041J843J377P52k674
$$ 2333 568 -1471 -1713 884 1515 217 -1479 -671 1220 741 -621 -1662 181 1558 2310 -364
1711c64j413J283J854r0j898m56J461J439m76k911N78J868P33k039r66J267J130
$$ -364 -1777 -494 1360 1270 -628 -1084 377 1816 1340 -1571 -993 875 1608 -431 -1397 -130 1000
1728A000m66j083m91J937M56k166q06J533J281k33j983k33J648Q12n60k002K88
$$ 1000 534 -549 -1040 897 1353 -813 -1619 -86 1195 962 -1021 -1254 394 1206 646 -1356 -1068
1745a068K188K63o56r84o90P62J480m99j502K64k04J278o10Q8l94QL33j90j26
$$ -1068 1120 1383 727 -257 -947 -185 1295 796 -706 -442 -646 632 22 110 -284 -276 57 -133 -259
1764b59K13M09o19l87M10M2L77p24O02M56j095M20L28L40l51o84m85J378J248
$$ -259 -46 363 -256 -643 -233 -191 186 -538 64 520 -575 -155 173 513 162 -522 -1007 371 1619
1783A619p85j578M03J372l3j561K84P87K76j085p05J662L32j031o03k01J514Q55
$$ 1619 834 -744 -341 1031 998 -563 -279 508 784 -301 -1006 656 988 -43 -646 -847 667 1522
1801A522k080q60R82J492j85j817r33K202K202j405k275k80J163J763o99j457
$$ 1522 -558 -1418 -436 1056 871 -946 -1879 323 2525 1120 -1155 -1435 -272 1491 792 -665
1817f65o16R01J807j68k759P0J530J539k326q50J416J058J95j776l56J850M50
$$ -665 -1281 -380 1427 1259 -1500 -1430 100 1639 -687 -1537 -121 937 1132 -644 -1000 850 1300
1834A300j436r07K25J817k30p10j058J337L57o72j026J80J396k81P4q27j55J336
$$ 1300 -136 -1043 -818 999 769 59 -999 338 695 23 -1003 -823 573 292 366 -461 -616 720
1852G20l31p63p93J436P57J47j670n98Q09N68N52j403j91K73J359j59r08q45n
$$ 720 389 -374 -1167 269 1026 1173 -497 -1095 -286 282 834 -569 -760 -487 872 713 -195 -1040 -1045
1871a045P36P2Q25n60j35J20j82J77j87K16l63j7J202r31o10M02M23L09r89l13
$$ -1045 -309 -237 588 28 -107 13 -169 8 -179 37 -326 -343 859 -72 -682 -280 143 452 -537 -850
1891h50J255J62j25j457J050N0Oj123O46O56J207j694q80Q84L65L53l85r70K86
$$ -850 405 567 442 -1015 35 85 91 -1032 -386 270 1477 -217 -1097 -213 152 505 120 -850 -564
1910e64P54N34j516Q54j7O59r97j187O58J160N61o95j541J267J438o43j549q59
$$ -564 190 724 -792 62 45 704 -293 -1480 -822 338 899 204 -1337 -70 1368 725 -824 -1683
1928a683J282J625m52j614k65J082J960k286n40Q81J049K5j758J09P80N28j125
$$ -1683 -401 1224 772 -842 -1107 -25 1935 -351 -891 -10 1039 1064 -694 -585 195 723 -402
1945d02l91L00R70N00q99n26M9N76J21J72n52j02O52l53K95j209R11J95m51j80
$$ -402 -793 -493 477 977 78 -448 -399 177 298 470 -82 -184 468 115 410 -799 112 307 -144 -324
1965c24R89m22M88k89q58J55K88K46j327P93O27j2L36j367M95J39J1L47n93K74
$$ -324 665 243 731 442 -416 -261 27 273 -1054 -261 366 354 690 -677 -182 -43 -32 315 -278 -4
1985dk19N98l99K73p91k90J168P10k21j539J00M53Q20m01m46L1M42N04r23r7L35
$$ -4 -223 375 -24 249 -542 -832 336 1046 825 -714 -614 -161 659 258 -188 -157 285 789 -134 -231 104
2006A04N91l28q33j71N47Q87o24l89k98O35M12j00o52r1K03P52p67P8J30N69L77
$$ 104 695 367 -466 -637 -90 797 173 -216 -514 121 533 433 -219 -310 -107 645 -122 -44 86 655 1032
2027A032j506O1J099k45J47j334J255M80N0j729j185J762J573p95j418n68J282
$$ 1032 -474 -413 686 441 588 -746 509 989 1039 -690 -1875 -113 1460 665 -753 -1321 -39
2044c9R17n10j451l2J187J224j131j275P83J244l81k28j355O04Q22o0k63l81K66
$$ -39 878 368 -1083 -1115 72 1296 165 -1110 -327 917 536 308 -1047 -443 379 319 56 -325 -59
2063e9M67m6q56J96L83j7J78o70O58Q03j257k55J71R22j11m95Q42r01N10n10j50
$$ -59 408 362 -494 -298 85 68 246 -424 234 1037 -220 -475 -304 618 507 12 854 -47 463 -47 -197
2084a97l90J041J14m87l98J031l05p81P14k27n01m60Q16R98j61r94r59J384L47
$$ -197 -587 454 568 81 -317 714 409 -372 342 115 -386 -846 -30 968 807 -187 -1146 238 585
2103E85m76p94l54J265O31n16j54q24K60M14N9J45o23M77P4J037j566n94J627
$$ 585 109 -685 -1039 226 857 341 187 -637 -377 37 96 241 -382 95 169 1206 -360 -954 673
2122F73r38j29n20O99P54k63q28N2O56j56o32j03k81K125m49q68q82J647O01j332
$$ 673 -265 -394 -914 -215 539 276 -552 -500 156 0 -632 -735 -1016 1109 660 -208 -1090 557 1158 -174
2142a74l26Q6K02O21o11j58P63L63o47o82J3M9Q20K45o32o9j09N57K34p25m66
$$ -174 -500 -414 -212 409 -202 -360 403 766 119 -563 -550 -501 319 564 -68 -137 -246 311 545 -180 -646
2163f46K53J711j285k79r6P06J76q43j02m35J008q5p35J21J084k30n29o14R68
$$ -646 -393 1318 33 -246 -342 364 540 -303 -405 -840 168 83 -652 -531 553 323 -206 -820 148
2182A48L08r23L5P4O31j47m65P26j227L72P47k60M25j28n17P57n01M23p88N32
$$ 148 456 -467 -432 -358 273 126 -339 387 -840 -468 279 19 444 316 -201 556 55 478 -310 222
2202B22K24o63j84l90J351p12L20m38P36r3l06q2q2k70J81P25J69j289j27N2J118
$$ 222 446 -217 -401 -791 560 -152 168 -270 466 373 67 -15 -97 -367 -186 539 708 -581 -708 -656 462
2223D62J06m53q65R35J88M54r27m31J229O6j155m81P46O51o41qnM33J03l28n56
$$ 462 568 115 -750 185 373 827 -100 -531 698 764 -391 -872 -126 525 -116 -124 -129 304 407 79 -477
2244d77O80N03l06J43j047k46R94J98o2o30K12K41k23q4j99k33P40J32o92J4J91
$$ -477 203 706 400 543 -504 -750 244 442 380 -250 -38 203 -20 -104 -303 -536 204 336 -356 -342 -151
2265a51L80k57r32J089K16l34m26j28J13J341p75l36M64j78N78j034k06N8r7P15
$$ -151 229 -28 -960 129 345 11 -415 -543 -430 911 136 -200 264 86 664 -370 -576 -518 -615 100
2285A00K26k90k11k64Q97K08k19j134L26O39k93n32O95r2l7o46L86Q32n04J7l33
$$ 100 326 36 -175 -439 458 666 447 -687 -361 278 -15 -547 148 56 19 -627 -241 591 87 104 -229
2306b29o15P81L11j005P74j20J74k31L68l28m92K62K70l98K51rM72l85J31o64
$$ -229 -844 -63 248 -757 17 -103 71 -160 208 -120 -612 -350 -80 -478 -227 -236 236 -149 -18 -682
2326f82k10J326j17K46j108J219n71J31k70j08M73M60o34o04J0K35M86k85k47
$$ -682 -892 434 317 563 -545 674 103 234 -36 -144 329 789 155 -449 -439 -204 282 -3 -250
2345b50L7l1N63L63o71m07O5N99k75N7k86m2L89m39J80P28l06m84k96N6J002J56
$$ -250 -213 -244 319 682 11 -396 -331 268 -7 50 -236 -278 111 -328 -148 580 274 -210 -506 -450 552 708
2367G08j313L41J6M61N93j409q7Q80%Q99j589K31O33k00R6l72RM98j83p42j38
$$ 708 -605 -264 -248 213 806 -603 -690 190 190 1089 -500 -269 364 164 260 -112 -103 395 212 -530 -668
2388f68j57R25J48o40j50K50R33j59l64n13j26M35K48k82k00l60L51L20N58n74
$$ -668 -825 100 248 -392 -542 -292 641 482 118 -395 -521 -86 162 -120 -320 -680 -329 -9 549 -25
2408b5k39J65j91N71m21J85n81J067l29j96O08n3q47k8K2R04l40m65k2O35m02
$$ -25 -264 -99 -290 281 -140 45 -536 531 202 6 614 561 -286 -314 -292 612 272 -193 -215 420 18
2429A8L58p78L39j5j61K76k49r1k49N02K44ML91PJ76l07o87Qk9M84n55K17n4O73
$$ 18 376 -402 -63 -78 -239 37 -212 -303 -552 -50 194 198 589 596 772 465 -222 -214 -243 241 -314 -97 -151 522
2453E22k77o30K46M47m0k45p78M54P96j70n73k46k37P29j86J51r17Q35N85o77
$$ 522 245 -385 -139 308 268 23 -755 -301 495 325 -248 -494 -731 -2 -188 -37 -954 -119 466 -211
2473b11N93n82M09j68K33r5m74L65n76N11j32K18R85p78k40l35N84l56K3q0l86
$$ -211 382 -200 209 41 274 179 -295 70 -506 5 -127 91 1076 298 58 -277 307 -49 -26 -106 -492
2494d92M02k92R0J83L00l23M18j49l47K88L3M65o8j380J357J7k46L02j066Q10
$$ -492 -90 -382 -292 -109 191 -132 286 137 -210 78 111 576 508 -872 485 502 256 558 -508 302
2514C02N9J67o96J2J01K69k13K56Ro4K62n16L81k40k86k86O28Q8j98n84P27K92
$$ 302 361 528 -168 -156 -55 214 1 257 266 202 464 -52 329 89 -197 -483 145 233 35 -549 178 470
2536D70o49K09n28R41j35j020N20P89q25l55P2K62O43k41R9n50L40K57j007N69
$$ 470 -179 30 -498 443 308 -712 -192 597 -228 -583 -511 -249 394 153 252 -298 42 299 -708 -139
2556a39m44R35L19j51q96J174L12r54o44P51j05J76n37L84n85K03P69k41j232
$$ -139 -583 352 671 520 -376 798 1110 156 -488 263 158 334 -203 181 -404 -201 568 327 -905
2575i05P50k19J215p86K03m96N05Q5p05N52m87J82k46N24l18K68j72P8L14j94
$$ -905 -155 -374 841 55 258 -238 267 352 -353 199 -288 -106 -352 172 -146 122 -50 28 342 148
2595A48J84k83M2L86j23j66n91K96P0K32L54K97p39k55J34j28N65j62k99j81k5
$$ 148 332 49 91 477 354 188 -403 -107 -37 195 549 846 107 -148 -14 -142 423 261 -38 -219 -244
2616b44N88n13l7K38P11k67j009L97j39J77J33J24k47M21j96O5j85j05L96j01
$$ -244 344 -169 -206 32 743 476 -533 -136 -275 -98 35 159 -88 333 137 202 17 -88 308 207
2636B07l90N17k12m41P23N6n10J2m69P5J44M23j43l88J56j52K91O42m55m44M54
$$ 207 -183 334 122 -319 404 460 -50 -38 -507 -432 -288 135 -8 -396 -240 -392 -101 541 86 -358 96
2657I6r9M69k13k41K63m80K58R3k49j43J10N89K84k19q61J64Q85o90k3j30N22
$$ 96 -3 466 253 12 275 -205 53 146 -103 -246 -136 453 737 518 -343 -179 706 16 -7 -137 385
2678C85k92L24p17O14l45N2R1p66P07N57m23l99n26N42O85j50m15J19K72K84l04
$$ 385 93 417 -300 314 -31 21 112 -654 53 610 187 -212 -738 -196 489 339 -76 43 315 599 295
2699B95m94R22j13r95M74p49O61K67l38J34j36M9J2M7l18N79o35Q49p75Q6K0J5
$$ 295 -199 723 610 -385 89 -660 1 268 -70 64 -72 -23 -11 36 -282 297 -338 511 -264 -178 -158 -143
2721a43N5l78M21K8K24n23N48rL84n08L65K2l31l58k17N06m29QQ94n33L03l87
$$ -143 -88 -466 -45 -17 207 -316 232 223 607 99 464 486 155 -203 -420 86 -343 -335 559 26 329 -58
2743e8J76l31k77K85j00m3O21j31j28o6m78L53O53q54L03j44K47k56O27l67l76
$$ -58 118 -213 -490 -205 -305 -348 273 142 14 -52 -530 -177 476 -378 -75 -219 28 -228 399 32 -344
2764c44N46L84q23J19Q1k10N95l36M57l92L22k91r24J120M55m10k91l25L52L71
$$ -344 202 586 -237 -118 -37 -247 348 12 469 77 399 108 -816 304 759 349 58 -267 85 456
2784D56j40j24p95O47J45J65o36K02M26j36o39L16K5M98o44P59p18M85l61M86
$$ 456 316 192 -603 44 189 354 -282 -80 346 210 -429 -113 -88 410 -234 525 -193 292 -69 417
2804D17p52j05J82J140j90j238q0Q22J7m21O54p75L35K08n39j18K97K23n4p0O14
$$ 417 -335 -440 -258 882 692 -546 -626 196 213 -208 446 -329 6 214 -325 -443 -146 77 23 -47 567
2825E67m87l48l38J86Q36J96r0r74L41j00K27m49L70l5O69m87k03o5L96qM59n39
$$ 567 80 -268 -606 -420 416 612 522 -452 -111 -211 16 -433 -63 -98 571 84 -119 -184 212 204 663 124
2847A24l57K86M10o28j78nK93N78m86Q6n1J60l65j69O23m64J5N76p71N09j038
$$ 124 -233 53 463 -165 -343 -348 -55 523 37 123 72 232 -133 -302 321 -143 -128 448 -323 186 -852
2868h52P31P25j53k40j37l9K22n82K37oK28j45N32J91m85j26mL07n21R3N8PO95
$$ -852 -121 604 451 211 74 35 257 -325 -88 -94 134 -11 521 712 227 101 97 404 -117 -24 34 41 736
2891G36n17n85P02j055J253l84p58O03K30O2k16k24P11p15N69m45n82R88r70M71
$$ 736 219 -366 336 -719 534 150 -608 -5 225 287 71 -153 558 -157 412 -33 -615 373 -597 -126
2911a26k15N46r6R4j99k27P7M60o11p3K75Q1L01n95J77l04N93o16R64r30L21K20
$$ -126 -341 205 109 203 4 -223 -146 314 -297 -370 -95 -14 287 -308 -131 -435 158 -458 506 -424 -103 117
2933A17L68m18l11O7n89J104n67K91l64L02k09l21O87J20k43m43M90M3L70n84
$$ 117 485 67 -244 -177 -766 338 -229 62 -302 0 -209 -530 157 277 34 -409 81 124 494 -90
2953i0L77k80m57P22m21k29M50k92J37O37m85j29P4J98l53m4M81m99l34P04M2
$$ -90 287 7 -450 272 -149 -378 72 -220 -83 554 69 -60 14 212 -141 -185 296 -203 -537 167 209
2974B09p07P76j74k70N71L22n46j18J99j165Q01N79l82L20l75N19l19k87L60o60
$$ 209 -498 278 104 -166 405 727 181 63 262 -903 -102 477 95 415 40 559 240 -47 313 -347
2994c47l7O96Kn00N57m93O26o05p25R24j73k7M66r39M89n8L10j72j78L17M68k07
$$ -347 -384 312 314 -186 371 -122 504 -101 -826 98 -75 -102 364 -575 -86 -144 166 -6 -184 133 601 394
3016C94p32L56k45O05n84N04m31Q64o18J60l24K54p4l41J64nM01l05j16o5N05
$$ 394 -338 18 -227 378 -206 298 -133 731 113 273 -51 203 129 -212 -48 -53 348 43 -73 -138 367
3037C67j20J68l34l08L05l9k27K70KM97J53o96m46O12L51m97j39j93K08P44o84
$$ 367 247 415 81 -227 78 39 -188 82 84 581 734 38 -408 204 555 58 -81 -274 -66 678 -6
3058fn32O65k53J5O14o1r86M16P51q00O6K41p17M74K59l82Q6j13L88L34m7j054
$$ -6 -538 127 -126 -111 503 442 -544 -128 623 -177 -111 130 -587 -113 146 -236 -150 -263 125 459 412 -642
3080f42N20k49O11j20l58M50K78k17l08J14k46N84l80j0n57J68OO86o85J4lQ41
$$ -642 -122 -371 240 120 -238 212 490 273 -35 79 -167 417 37 27 -530 -362 -356 330 -355 -341 -344 497
3102D97o23n38J075R0m06n68oN53j21K12j082J071J58j72J69K36p28J43k81O26
$$ 497 -126 -664 411 501 95 -473 -479 74 -47 165 -917 154 312 140 309 545 -183 -40 -321 305
3122C05l18L7R0l11l06M66O34q88L07J14l72K81J99q7o85J007l36n40O18r27M70
$$ 305 -13 24 114 -197 -503 -37 597 -291 16 130 -242 39 238 151 -534 473 137 -403 215 -712 -242
3143b42P8k14O38j02J43L5n5j01j23j5K18q0k32j81N1N80R4p31j94R67p1P3n47
$$ -242 -164 -378 260 158 301 336 281 180 57 42 260 180 -52 -233 -182 398 492 -239 -433 534 463 536 -11
3166a1o5Q2l97Q3J59L4J78l28k69M49n72J242m53j104J121L67o83N73j58P4j98
$$ -11 -76 6 -391 -308 -149 -115 63 -265 -534 -85 -657 585 132 -972 149 516 -167 406 248 322 124
3187A24J80o97N61o59K03M96j76n44K08N86p18L59J21n33K16K37p5O4k12J315
$$ 124 304 -393 168 -491 -288 208 32 -512 -304 282 -436 -77 44 -489 -273 -36 -111 -47 -259 1056
3207A056j117k10P0L18m53O5L41P0j31O67k20j079M50j33N91p22R86p29M03J50
$$ 1056 -61 -271 -201 117 -336 -271 70 140 9 676 456 -623 -173 -306 285 -437 549 -180 223 373
3227C73k12N21o11R9k25L58J45n53L53l76J8k85K22K1j93M67m04J192j154l76
$$ 373 161 682 71 170 -55 303 448 -105 248 -128 -110 -395 -173 -152 -345 122 -282 910 -244 -620
3247f20M78j8L36q62P12n6m36M03J26n70N35l39L41k6O03q03N7k17M54j38K90
$$ -620 -142 -160 176 -686 26 -30 -466 -63 63 -507 28 -311 30 4 607 -196 -139 -356 98 -40 250
3268B50j008J197O7j06m04K13l37j65L11n74J088o69K37N8l02L7P34l03r7r30
$$ 250 -758 439 506 400 -4 209 -128 -293 18 -556 532 -137 100 158 -144 -107 627 324 227 -703
3288g03P72j25j04K56J29j11k75K82j53j14k46O59p18J385q76K09l78M39m07n8
$$ -703 69 -56 -160 96 225 114 -161 121 -32 -146 -392 267 -451 934 58 267 -111 328 -79 -137
3308a37P16q25kK7Q21r64L74j20N07k02o73N46O33m67j34m20K22N87o46P01l80
$$ -137 579 -246 -248 -221 600 -364 10 -110 397 195 -478 68 701 234 100 -320 -98 489 -157 544 164
3329A64P3J16q21j53P36K88p56Q35j106m15J066l36P79r65O8Q10L98m67J4n77
$$ 164 237 353 -468 -621 115 403 -353 482 -624 -1039 27 -309 470 -495 -427 383 781 314 328 -249
3349b49K96m29M11j06K01k61L18m88R1N52j97k18P38K35r96O81j139Q44n51M82
$$ -249 47 -382 29 -77 124 -137 181 -307 -216 336 139 -79 659 894 -102 579 -560 284 -267 215
3369B15p3p19j43R94M9l53j15M64r41R71k54J31n58R9L03j34K16o73M75n09O52
$$ 215 142 -577 -720 274 323 -30 -145 319 -622 349 95 226 -332 -233 70 -64 152 -521 -46 -555 97
3390I7l05M07p7m69N31K55l50j07K92o41L05p1J68M81o09L02m78N13Q7l26m6q
$$ 97 -208 199 122 -347 184 439 89 -18 274 -367 -62 -133 35 516 -93 209 -269 244 331 5 -41 -49
3412d9j175J183j45j81L76O3J65p7n9L09K43r11j4K04J01m68L25m48J55L63Lk1
$$ -49 -1224 -41 -186 -367 9 72 237 160 101 410 653 -258 -272 -68 33 -435 -110 -558 -403 -40 -37 -58
3434e8L18l34q2L89o17L16L23K48p08M52K80n47J61m5J58j47P28p67j00l93K46
$$ -58 260 -74 -156 233 -384 -68 255 503 -205 247 527 -20 141 96 254 107 835 68 -32 -425 -179
3455a79j07M1L04J91l80PK11J02j91J86K47m34r2l18K02L99k35J94k95K71J40
$$ -179 -286 -245 59 250 -130 -123 88 190 -1 185 432 -2 -94 -412 -210 189 -46 148 -147 124 264
3476B64p3k89n6M65n66j20N16J18J43m19m28K84K90L82O9q18J97k01L62K92k00
$$ 264 191 -98 -154 311 -255 -375 141 259 402 -17 -445 -161 129 511 580 -238 -41 -242 120 412 212
3497B12j75o0N78n96l66j64J185r00L89m7Q7k3K1l74L60k7n54O60n23N60p00R40
$$ 212 37 -23 555 -41 -407 -571 614 -286 103 56 143 120 141 -233 127 100 -454 206 -317 243 -457 483
3519D83j79n90K39K07K26m3n14K04L29N8o48L50k05M32J13p75M8O75O91j094j74
$$ 483 304 -286 -47 160 386 343 -171 33 362 420 -228 122 -83 349 462 -313 -265 410 1101 7 -167
3540a67L03J29o79Q64r1l74K33j09J76o94Q71M37q53n82J18N13j78q7J82j70K96
$$ -167 136 265 -414 450 359 -15 218 109 285 -409 462 899 46 -536 -418 95 -83 -170 12 -158 138
3561A38l43N11p00J056l80n98j82O23k08J57O41o52j90j57Q5k49M91m63K65n6
$$ 138 -205 306 -394 662 282 -316 -498 125 -83 74 715 63 -127 -284 -199 -448 43 -420 -155 -211
3581b11L25j41p0J90j64L24j39KL79m52L96l15J64J31n81m4L20q7J7p7n09P33
$$ -211 114 -27 -97 93 -71 253 114 116 495 43 439 124 288 419 -162 -206 114 27 44 -33 -542 191
3603A91k43K73J26q26K66Q3K24J01n27K48J9l41N02j97O3J286p79nq67P89J08
$$ 191 -52 221 347 -479 -213 -130 94 195 -332 -84 -65 -406 96 -101 -38 1248 469 464 -403 386 494
3624D94o12K95k22M77L47j281J97M31p8n81M52O94m15R7j10k53l13N76J61k8J55
$$ 494 -118 177 -45 432 779 -502 -305 126 48 -533 -81 613 198 295 185 -68 -381 195 356 328 483
3645D83J8p14J62L32l10j79M57j86m37L98N32m1j49p61L38L09n1K32j235P59j42
$$ 483 501 -213 -51 281 -29 -208 249 63 -374 24 556 515 366 -395 -57 252 201 433 -802 -43 -185
3666a85o2J84j25K32m86Q97k57k17j47N2J14L52j78K70l82J94o9j015Q45jj08
$$ -185 -247 -63 -188 44 -442 455 198 -19 -166 -114 0 352 174 444 62 256 187 -828 17 16 -92
3687i2L4P8N2L76m38l0K31p41R15k4j10m09J34l88J053q71K58pM02m5o04P20p14
$$ -92 -58 20 72 448 10 -20 211 -530 385 361 251 -158 -24 -412 641 -230 28 21 423 378 -226 494 -220
3710b20j8O11P9l95q66L38P12o2k69j09M68k94l71L08l67K49O2l28R6J025n56
$$ -220 -238 373 452 57 -809 -471 241 179 -90 -199 269 -25 -396 -88 -455 -206 -144 -472 -376 649 93
3731I3k03K56m33K33l5M74m77q6P02o89P30n99j49N12p39P42k29k77K66J37l81
$$ 93 -110 146 -287 -54 -89 385 -92 -178 524 -165 565 -34 -183 329 -410 332 103 -174 92 229 -152
3752a52j50j10N61j80L75k78K32l43M98q34J15o2J77o35L67L45M51l74K3Q67o28
$$ -152 -302 -412 149 -31 344 66 298 -45 453 -381 -266 -328 -151 -786 -419 -74 377 3 26 893 265
3773B65o71M75K49j429R21L36M82j057L42K60k39OL46J26n69k35N05k63N36r7
$$ 265 -406 69 318 -1111 -190 146 628 -429 -87 173 -66 -60 286 412 -157 -392 113 -150 386 289
3793B89j7n27P64n11M0l20J93O27p46l4O61j51l79P9N2l68K14L4M81k14m63L35
$$ 289 272 -255 509 -2 38 -282 -89 538 -208 -242 419 268 -111 -32 20 -348 -134 -100 381 167 -296 39
3815C9Q0k66j28L69L72o32r3K05p9L40q85Q60P3m37L23J07K16o95J41o0k80P08
$$ 39 119 -147 -275 94 466 -166 -259 -54 -133 207 -678 182 255 -182 141 248 464 -231 -90 -150 -430 278
3837B78K92j87M6k91k9k87m1Q20j157N11K7k09L31M43l81l85n8P86k75n96O79
$$ 278 570 383 429 138 109 -178 -219 601 -556 -45 -18 -227 104 547 166 -219 -277 509 234 -362 317
3858C17l43k0P93p24K14k01l61K81l99O75k60K97q6k8l54m08O78j7n8K35k38k22
$$ 317 -26 -46 747 23 237 36 -325 -44 -443 232 -28 269 183 155 -199 -607 71 54 -4 231 -7 -229
3880b29L07n35Q70k75p7p90J123l60p3n2N87m39N58r65J00Q21o58K99j40k49K17
$$ -229 78 -457 413 138 61 -729 394 34 -39 -91 496 57 615 -350 -250 571 -87 212 72 -177 40
3901D0O12m13N32m45k38J3O97p36l82P0Q27n78N3L52q40L34m6K18M2L23M0j11
$$ 40 652 239 771 326 88 101 798 62 -320 -250 577 -1 52 404 -436 -102 -148 70 112 435 475 364
3923C64m10R8N62j061M32N55m84l63J069q66R0p78P73J32R9N3r96Q70l3n94O28
$$ 364 -46 52 614 -447 -15 540 56 -307 762 -104 -14 -792 -19 113 212 265 -731 139 106 -488 140
3944A40K70m48O8J10j04J39n77P59j079R96k40j4K91n07p62P32N88p31O32l54
$$ 140 410 -38 30 140 36 175 -402 357 -722 274 34 20 311 -196 -958 -226 362 -369 263 -91
3964i1J37j4k14L34O1k98J41l37j31O58p93M43m3J66n57O48k62r49P22K06J57
$$ -91 46 32 -182 152 213 -85 56 -281 -412 246 -547 -104 -147 19 -538 110 -152 -1101 -379 -173 -16
3985a6j69j00R18o49J37%k69k57j78N71k16K66J06M21p05J0j78M12L23o32M52
$$ -16 -185 -285 633 -16 121 121 -148 -405 -583 -12 -228 38 144 565 -140 -130 -308 104 427 -205 247
4006B47P4K49l12q35O58n04Q60k04m96K62j60M75n07M8J79J8l2K36o60J60k54
$$ 247 321 570 258 -577 81 -423 437 233 -263 -1 -161 314 -193 -145 34 52 20 256 -404 -244 -498
4027d98M17R9J95R6k98M57m24m06O02l11L42q28Q84n70M58m40l09M12o9O16m01
$$ -498 -81 18 213 309 11 468 44 -362 240 -71 271 -557 327 -243 215 -225 -534 -122 -191 425 24
4048B4k21N48k2o08O58q27O57j88N94k28p01k20P56j36m87J15k93R94m55K53l91
$$ 24 -197 351 329 -279 379 -448 209 21 615 387 -314 -534 222 86 -401 -286 -579 415 -40 213 -178
4069a78N33l96L12p12O47O2j54N72j399L43K87K39o6p33O49K47n09O42l92k85
$$ -178 355 -41 271 -441 206 268 114 686 -713 -370 -83 156 90 -643 6 253 -256 386 -6 -291
4089b91K06N76o64o11R93n67mM76p0M85p97O58j017K03O98J29l19NK51j48n06
$$ -291 -85 491 -173 -784 209 -358 -362 114 44 529 -268 390 -627 -424 274 403 84 89 340 192 -314
4110c14Q6J37L8L2K11L33q51l50O50J1O7L29Po2k35j43K96k68J45QM3m53L94L65
$$ -314 -228 -91 -53 -21 190 523 -328 -678 -28 -17 50 379 386 324 89 -54 242 -26 119 127 170 -283 111 476
4134D76l44j63k38n5L38m9J48Oj66o9j02n1l73R19K77j410O61Qk89j89M00K25
$$ 476 132 -31 -269 -324 14 -35 113 119 -47 -116 -218 -269 -642 277 554 -856 -195 -187 -476 -665 -265 -40
4156d0n99Q35J88k51K39j064J074n17j73k5M96K11l27K87j89n09R5n75R61n95
$$ -40 -639 196 384 133 372 -692 382 -135 -308 -333 163 374 47 334 145 -364 -269 -844 117 -478
4176d78J096o27o3n3K10k76J086n57P3k37o7%L22o98M40J9L48o89J59K89p95R69
$$ -478 618 -9 -72 -125 85 -191 895 338 411 174 107 107 429 -269 171 190 538 -151 8 297 -498 471
4198D71m29J73M27m31q46J85k46J00M6M86Nqn29J98M43L37j124J116q3j28O8n68
$$ 471 42 215 642 211 -635 -450 -696 -596 -550 -64 -59 -67 -596 -398 45 382 -742 374 291 163 231 -337
4220c37M07j14p2K04J54L5p62O79K20p40M51l0K09l44J18j06n60K38J22j68N47
$$ -337 70 -44 -116 88 242 277 -485 194 414 -326 125 95 304 -40 78 -28 -588 -350 -228 -396 151
4241A51N5n74O86p44L7M74J79n51O3J00L0N79p07L05l72L09k90j66M20q3j7k28
$$ 151 206 -368 318 -426 -389 85 264 -287 -224 -124 -94 485 -222 83 -289 20 -270 -436 -16 -99 -116 -344
4263c44K43Mk42N79Q9m42K11lO0L20o11O23m12k13n10N39j36K06L72r7%n32M69
$$ -344 -101 -97 -339 240 329 -113 98 95 155 475 -136 487 75 -138 -648 -109 -245 -39 333 236 236 -296 173
4286A73J27o75R5J21M77O12j171L66L16m47L71j06M48p57N27n97N45o67K32M8
$$ 173 300 -375 -280 -159 318 930 -241 125 441 -6 365 259 707 -50 477 -120 425 -242 -10 38
4306C8k24q8M84L08r45M52m17Q37r82M01j44L46L07o68J12p17R99K8k22J59l75
$$ 38 -186 -274 210 518 -427 25 -392 445 -537 -136 -280 66 373 -295 -183 -900 99 127 -95 64 -311
4327c11P22j31j042Q73m34O98l92pK90m16L94k03l68M80l32L92j11M21p97j94
$$ -311 411 280 -762 111 -323 375 -17 -24 266 -150 244 41 -327 153 -179 213 102 523 -274 -468
4347d68J91j3O67J68k54n61q7j53M84j02k12J59l43K63N66m04j9K93l71N41k55
$$ -468 -277 -290 377 545 291 -270 -357 -510 -26 -128 -340 -181 -524 -261 305 -99 -118 175 -196 345 90
4368I0k23M97o93N70q09J16J121p25J77K45m39l85J90qJ278j484K92K72m61O34
$$ 90 -133 364 -329 241 -568 -452 669 -56 121 366 -73 -458 -268 -276 1002 -482 -190 82 -379 255
4388B55j0N76l32j271J499j598L63J41K99rm04P52n63O2P78o81n54R56m34J28
$$ 255 245 821 489 -782 717 -881 -518 -377 -78 -87 -491 261 -302 -240 538 -143 -697 259 -175 -47
4408d7N99n41N54n07o06K50L38l25L82p4L45o34L45J90o95N4J37K75o47Q66j33
$$ -47 552 11 565 58 -548 -298 40 -285 97 23 368 -266 79 269 -426 -372 -235 40 -607 259 126
4429A26k29J01L68n19r0j32Q17o85k20O48O96m93o33j23O03o04O00o83L24p9M8
$$ 126 -103 -2 366 -153 -243 -375 442 -243 -463 185 881 388 -245 -368 235 -369 231 -452 -128 -207 -159
4450a59K6L44m7Ql33K88m18O70q07j87L54l21Q89k3o36J33J74L70l0o13L33M34
$$ -159 -133 211 164 172 -161 127 -291 379 -428 -615 -261 -582 307 284 -352 -219 -45 325 295 -318 15 449
4472D49j027M31L45K35n14N2j19R74m88J57r46N36j68j55M2k68L47P0K49j78L66
$$ 449 -578 -147 198 433 -81 -29 -148 826 338 495 -451 85 -83 -238 -196 -464 -117 -47 202 24 390
4493C90n22L66J10R0m09m73P76k47k75M47n94k90L34N84R5m56n3L38n36K81m58
$$ 390 -132 234 344 434 25 -448 328 81 -194 253 -341 -631 -297 287 382 -74 -127 211 -325 -44 -502
4514e02R03q10J435q04l67O82j49n00L25m02M05m40L90m22l05J222q26J82K97
$$ -502 401 -409 1026 222 -145 537 388 -112 213 -189 216 -224 166 -256 -561 661 -165 17 314
4533C14k34q20J020L30n71J39Rk48m15J052j11j83L87o01q9K82k63J46m12J010
$$ 314 80 -740 280 610 39 178 187 -61 -476 576 465 282 669 68 -21 261 -2 144 -268 742
4553G42o51J71k49j44J22m04M49J76l84P9k25L06N91l15n03M0m02Q91p6j51k63
$$ 742 91 262 13 -131 -9 -413 36 212 -172 -93 -318 -12 579 264 -239 -199 -601 290 214 63 -200
4574b00K08J88J80R7m18m74K31K38M05q67K86K37n39M88K27k16m53J030o19m14
$$ -200 8 196 376 473 55 -419 -188 50 455 -412 -126 111 -428 60 287 71 -382 648 29 -385
4594c85q3J135o86Q90r58M34k2k12K31r00M37O76q49M99j31q00R22K51p8m05j5
$$ -385 -468 667 -19 871 -87 347 325 113 344 -556 -119 557 -292 207 76 -724 198 449 371 -34 -49
4615d9m63L94N15j12q00L67J81L47r60L92N62k72J16k79o69Q11k37P8J45L70o45
$$ -49 -512 -118 397 285 -515 -148 33 380 -580 -188 374 102 218 -61 -730 81 -156 -78 67 437 -208
4636b08J54L30n3q96Q29J23k85L29o93J28N29k1o32L21L22m22k2O08p2m29k20
$$ -208 -54 276 223 -673 156 279 -6 323 -370 -242 287 266 -366 -45 277 -145 -167 441 369 -60 -280
4657b80P65q89K75M88m32p2J15L05M8k78o51L24K69m50N08m02J26j67L87J94k6
$$ -280 485 -404 -129 359 -73 -145 -30 275 323 45 -606 -282 -13 -463 45 -357 -231 -398 -11 183 157
4678A57j22m24M94q3K43l5m66j92L70k76L15L18j68j17o13N44l99M80M53l57k68
$$ 157 35 -389 105 22 265 230 -236 -428 -58 -334 -19 299 131 14 -599 -55 -454 26 479 122 -146
4699a46J31j0L46J48j32l45O7K09k00j49M27n95O25l26k05L00N56q20J22J24n89
$$ -146 -15 -25 321 469 337 -8 59 268 68 -81 346 -249 376 50 -155 145 701 -119 3 127 -462
4720d62J206o75P43o10m19J17O91k64m73j71L29m66R09o96Q7m25M60L57j04j07
$$ -462 744 69 812 202 -217 -100 591 327 -146 -317 12 -454 455 -241 -154 -579 -119 238 134 27
4740B7J5K39j030Q25M5J97o62K54k46K28J027j262J0K82o04R27j63j72l32m6O52
$$ 27 42 281 -749 76 121 318 -344 -90 -336 -108 919 -343 -333 -51 -655 272 109 -63 -395 -441 211
4761B11m54M84n39M59J16q26J85k3O88l96N32q08N64n28M26J47K7l43k38K38k13
$$ 211 -243 241 -298 161 277 -549 -364 -387 301 -95 437 -371 193 -335 91 238 265 -78 -316 -78 -291
4782b91P1L49m92K09R2Q6j87OM07j85K2K63k7n19N30j233K96M80J36l10N5P79
$$ -291 -220 129 -363 -154 -62 24 -163 -157 250 65 87 350 323 -196 334 -899 -603 -123 13 -297 -242 537
4804E37k39n07M92j61L05q55J96j30N88l17j4q2M2M6J82L03n1n25P9K68l89K57
$$ 537 298 -209 283 122 427 -428 -232 -362 226 -91 -105 -187 -145 -99 83 386 335 -190 -111 157 -232 25
4826B5j58P86n14k05l41j56O06l58J147q65O04j89p64Q60o10J42K93j00l58n35
$$ 25 -133 653 139 -66 -407 -563 43 -315 832 -33 571 382 -382 478 -132 10 303 203 -155 -690
4846f90M35M63l15L70j49j13M81k77k99l21K70k2L9K8k43L19k92P9K77K37m6o6
$$ -690 -255 208 -107 263 114 1 482 205 -94 -415 -145 -167 -128 -100 -343 -24 -316 -237 40 277 231 165
4868A65m24P17r74Q78n10L29m05O16k36o7O7L91r84M06L2L08l8l00j33J74k14
$$ 165 -259 458 -516 362 -148 181 -224 392 156 89 156 547 -437 -31 1 309 271 -29 -162 12 -202
4889b02NJ06n30M99k73P54j11J8N7M31j163R05q14M06k22M30o19k29N19r9Rj22
$$ -202 -197 -91 -621 -122 -395 359 248 266 323 754 -409 496 -318 88 -134 296 -323 -552 -33 -132 -123 -245
4911b45QO21Mm04P1m31L49M77m74R48q05O83q90l97O02j96K90L8n50N0j93O93
$$ -245 -237 384 388 -16 55 -376 -27 450 -24 924 119 802 -88 -485 117 -79 211 249 -301 -251 -444 249
4933B49K29r27P41m56J5N04o93J072m31n58N43O9l00j73M84j018Q42N0J48k13
$$ 249 478 -449 292 -164 -149 355 -338 734 303 -255 288 357 57 -116 368 -650 192 242 390 177
4953A77J5q69K16Q85q33O89o95J1M64k10j25J61N34o57o46J114o84Q24l3m74q8
$$ 177 192 -677 -461 424 -409 280 -415 -404 60 -150 -275 -114 420 -237 -883 231 -453 371 338 -136 -224
4974b24l2J07M47j91j94j53N5j03M44J20k61J90j3m94K96M33r77Q48K27m27k15
$$ -224 -256 -149 298 107 -87 -240 -185 -288 156 276 15 205 192 -302 -6 427 -550 298 525 98 -117
4995a17j48J31M54K86n29k09m44J092K00o71Nn4J82m35O74j64k43j65k3K60q25
$$ -117 -265 -134 320 606 77 -132 -576 516 716 45 50 -4 178 -257 417 253 10 -155 -178 82 -743
5016g43P51k23K65k58J9l8M21K44m49J57L45n10K11p47N10M24m66j42j28K69L12
$$ -743 8 -215 50 -208 -189 -227 194 438 -11 146 491 -19 192 -555 -45 379 -87 -229 -357 -88 224
5037B24J99l2l03Q18j323N48r9q02Q26p66o9O96L34o5k01L40j32K19q53L10k54
$$ 224 423 391 88 906 -417 131 32 -770 56 -710 -779 -83 251 186 -15 325 193 412 -441 -131 -385
5058c85P82L1n00L03j34r90J058K61j86m43L9M95J69k76j81r0M3J79j01j40N59
$$ -385 397 428 -72 231 97 -893 165 426 240 -203 -164 331 500 224 43 -47 -4 175 74 -66 493
$$ [...]
8191I1
##END NTUPLES=NMR FID
##END=
