##TITLE=1H_AT-45bn
 CDCl3
 200 sc, 
 25.1.2023
##JCAMPDX= 6.0         $$ Bruker NMR JCAMP-DX V2.0
##DATA TYPE= NMR FID
##DATA CLASS= NTUPLES
##ORIGIN= UXNMR, Bruker Analytische Messtechnik GmbH
##OWNER= root
$$ XWIN-NMR		Version 3.5
$$ Wed Jan 25 13:58:12 2023 Russian Standard Time (UT+4h)  she@DPX200
##.OBSERVE FREQUENCY= 200.13135
##.OBSERVE NUCLEUS= ^1H
##.DELAY= (6, 6)
##.ACQUISITION MODE= SIMULTANEOUS
##.ACQUISITION SCHEME= undefined
##.AVERAGES= 200
##.DIGITISER RES= 18
##SPECTROMETER/DATA SYSTEM= spect
##.PULSE SEQUENCE= zg30
##.SOLVENT NAME= CDCl3
##.SHIFT REFERENCE= (INTERNAL, CDCl3, 0, 15.7039)
##AUDIT TRAIL= $$ (NUMBER, WHEN, WHO, WHERE, WHAT)
$$ ##TITLE= Audit trail, XWIN-NMR		Version 3.5
$$ ##JCAMPDX= 5.01
$$ ##ORIGIN= Bruker BioSpin GmbH
$$ ##OWNER= she
$$ F:/spectra/data/she/nmr/H-F/1/audita.txt
$$ ##AUDIT TRAIL=  $$ (NUMBER, WHEN, WHO, WHERE, WHAT)
(   1,<2023-01-25 13:55:42.81 +0400>,<she>,<DPX200>,
      <created by zg, POWCHK disabled, PULCHK disabled
       configuration hash MD5:
       00 E9 B6 7A A2 85 ED C7 34 08 36 98 17 FE 4E 26
       data hash MD5: 16K
       57 8D 8E 6B D9 2A E3 8A E5 A9 BC 32 89 EC 4A 8B>)
$$ ##END=
$$ 
$$ hash MD5
$$ 3F 79 20 38 C7 00 74 54 19 7F 99 AF 20 B2 84 CF
##$RELAX= 
##$RELAX= 
##$RELAX= 
##$RELAX= 
##$RELAX= 
##$RELAX= 
$$ Bruker specific parameters
$$ --------------------------
##$DU= <F:/spectra>
##$EXPNO= 1
##$NAME= <H-F>
##$PROCNO= 1
##$TYPE= <nmr>
##$USER= <she>
##$AMP= (0..31)
100 100 100 100 100 100 100 100 100 100 100 100 100 100 100 100 100 100 
100 100 100 100 100 100 100 100 100 100 100 100 100 100 
##$AQSEQ= 0
##$AQ_mod= 1
##$AUNM= <au_zg>
##$AUTOPOS= <>
##$BF1= 200.13
##$BF2= 200.13
##$BF3= 200.13
##$BF4= 200.13
##$BF5= 200.13
##$BF6= 200.13
##$BF7= 200.13
##$BF8= 200.13
##$BYTORDA= 1
##$CFDGTYP= 0
##$CFRGTYP= 5
##$CHEMSTR= <none>
##$CNST= (0..31)
1 1 145 1 1 1 1 1 1 1 1 1 1 1 1 1 1 1 1 1 1 1 1 1 1 1 1 1 1 1 1 1 
##$CPDPRG= <>
##$CPDPRG1= <>
##$CPDPRG2= <>
##$CPDPRG3= <>
##$CPDPRG4= <mlev>
##$CPDPRG5= <mlev>
##$CPDPRG6= <mlev>
##$CPDPRG7= <mlev>
##$CPDPRG8= <mlev>
##$CPDPRGB= <>
##$CPDPRGT= <>
##$D= (0..31)
0 1.2 0 0 0 0 0 0 0 0.06 0 0.03 0 0 0 0 0.0002 0 0 0 0 0 0 0 0 0 0 0 0 
0 0 0 
##$DATE= 1674640542
##$DBL= (0..7)
120 120 120 120 120 120 120 120 
##$DBP= (0..7)
150 150 150 150 150 150 150 150 
##$DBP07= 0
##$DBPNAM0= <>
##$DBPNAM1= <>
##$DBPNAM2= <>
##$DBPNAM3= <>
##$DBPNAM4= <>
##$DBPNAM5= <>
##$DBPNAM6= <>
##$DBPNAM7= <>
##$DBPOAL= (0..7)
0.5 0.5 0.5 0.5 0.5 0.5 0.5 0.5 
##$DBPOFFS= (0..7)
0 0 0 0 0 0 0 0 
##$DE= 6
##$DECBNUC= <off>
##$DECIM= 32
##$DECNUC= <off>
##$DECSTAT= 4
##$DIGMOD= 1
##$DIGTYP= 9
##$DL= (0..7)
0 120 120 120 120 120 120 120 
##$DP= (0..7)
150 150 150 150 150 150 150 150 
##$DP07= 0
##$DPNAME0= <>
##$DPNAME1= <>
##$DPNAME2= <>
##$DPNAME3= <>
##$DPNAME4= <>
##$DPNAME5= <>
##$DPNAME6= <>
##$DPNAME7= <>
##$DPOAL= (0..7)
0.5 0.5 0.5 0.5 0.5 0.5 0.5 0.5 
##$DPOFFS= (0..7)
0 0 0 0 0 0 0 0 
##$DQDMODE= 0
##$DR= 18
##$DS= 0
##$DSLIST= <SSSSSSSSSSSSSSS>
$$ [...]
##$SUBNAM2= <"">
##$SUBNAM3= <"">
##$SUBNAM4= <"">
##$SUBNAM5= <"">
##$SUBNAM6= <"">
##$SUBNAM7= <"">
##$SUBNAM8= <"">
##$SUBNAM9= <"">
##$SW= 18.05172834244
##$SWIBOX= (0..15)
0 0 2 0 0 0 0 0 0 0 0 0 0 0 0 0 
##$SW_h= 3612.71676300578
##$TD= 16384
##$TD0= 1
##$TE= 0
##$TE2= 300
##$TE3= 300
##$TEG= 300
##$TL= (0..7)
0 120 120 120 120 120 120 120 
##$TP= (0..7)
150 150 150 150 150 150 150 150 
##$TP07= 0
##$TPNAME0= <>
##$TPNAME1= <>
##$TPNAME2= <>
##$TPNAME3= <>
##$TPNAME4= <>
##$TPNAME5= <>
##$TPNAME6= <>
##$TPNAME7= <>
##$TPOAL= (0..7)
0.5 0.5 0.5 0.5 0.5 0.5 0.5 0.5 
##$TPOFFS= (0..7)
0 0 0 0 0 0 0 0 
##$TUNHIN= 0
##$TUNHOUT= 0
##$TUNXOUT= 0
##$USERA1= <user>
##$USERA2= <user>
##$USERA3= <user>
##$USERA4= <user>
##$USERA5= <user>
##$V9= 5
##$VALIST= <valist>
##$VCLIST= <CCCCCCCCCCCCCCC>
##$VD= 0
##$VDLIST= <DDDDDDDDDDDDDDD>
##$VPLIST= <PPPPPPPPPPPPPPP>
##$VTLIST= <TTTTTTTTTTTTTTT>
##$WBST= 1024
##$WBSW= 4
##$XGAIN= (0..3)
0 0 0 0 
##$XL= 0
##$YL= 0
##$YMAX_a= 3377294
##$YMIN_a= -2829493
##$ZGOPTNS= <>
##$ZL1= 120
##$ZL2= 120
##$ZL3= 120
##$ZL4= 120
##$ABSF1= 10
##$ABSF2= 0
##$ABSG= 5
##$ABSL= 3
##$ALPHA= 0
##$AQORDER= 0
##$ASSFAC= 0
##$ASSFACI= 0
##$ASSFACX= 0
##$ASSWID= 0
##$AUNMP= <proc_1d>
##$AZFE= 0.1
##$AZFW= 0.1
##$BCFW= 1
##$BC_mod= 2
##$BYTORDP= 1
##$COROFFS= 0
##$CY= 11.3945322036743
##$DATMOD= 1
##$DC= 2
##$DFILT= <>
##$DTYPP= 0
##$F1P= 2.36226072786647
##$F2P= -0.459571619588291
##$FCOR= 0.5
##$FTSIZE= 0
##$FT_mod= 4
##$GAMMA= 1
##$GB= 0.15
##$INTBC= 1
##$INTSCL= 1
##$ISEN= 128
##$LB= 0.24
##$LEV0= 0
##$LPBIN= 0
##$MAXI= 10000
##$MC2= 0
##$MEAN= 0
##$ME_mod= 0
##$MI= 1.114404
##$NCOEF= 0
##$NC_proc= 0
##$NLEV= 6
##$NOISF1= 3.799351
##$NOISF2= 2.8
##$NSP= 1
##$NTH_PI= 0
##$NZP= 0
##$OFFSET= 15.70392
##$PC= 1
##$PHC0= -19105.38
##$PHC1= 4.600791
##$PH_mod= 1
##$PKNL= yes
##$PPARMOD= 0
##$PSCAL= 0
##$PSIGN= 0
##$REVERSE= no
##$SF= 200.130013532006
##$SI= 16384
##$SIGF1= 3
##$SIGF2= 2
##$SINO= 400
##$SIOLD= 16384
##$SREGLST= <1H.CDCl3>
##$SSB= 0
##$STSI= 0
##$STSR= 0
##$SW_p= 3612.71676300578
##$SYMM= 0
##$S_DEV= 0
##$TDeff= 0
##$TDoff= 0
##$TI= <>
##$TILT= no
##$TM1= 0
##$TM2= 0
##$TOPLEV= 0
##$USERP1= <user>
##$USERP2= <user>
##$USERP3= <user>
##$USERP4= <user>
##$USERP5= <user>
##$WDW= 1
##$XDIM= 8192
##$YMAX_p= 0
##$YMIN_p= 0
$$ End of Bruker specific parameters
$$ ---------------------------------
##NTUPLES= NMR FID
##VAR_NAME=  TIME,          FID/REAL,        FID/IMAG
##SYMBOL=    X,             R,               I
##VAR_TYPE=  INDEPENDENT,   DEPENDENT,       DEPENDENT
##VAR_FORM=  AFFN,          ASDF,            ASDF
##VAR_DIM=   8192,          8192,            8192
##UNITS=     SECONDS,       ARBITRARY UNITS, ARBITRARY UNITS
##FACTOR=    0.0002768,     1,               1
##FIRST=     0,             0,               0
##LAST=      2.2672688,     0,               0
##MIN=       0,             -2829493,        0
##MAX=       2.2672688,     3377294,         0
$$ Real data points
##PAGE= N=1
##DATA TABLE= (X++(R..R)), XYDATA
$$ [...]
2963c82j694J250j421J379P3j078R4K954J54k008J373N4Q67q64n14P27o20J767
2981B111r59n21j71J161k047M96k47q16n39J378j542M64q01k98L11pJ708k360
2999b679J067M58Q99R19q09j62R75K72p16K117q40R20k89j193R69O44k25j364
3017I63q92j02j347K56p9j85r77j14l40O85M85N24l38k56K118k248J123O18K03
3036I7j482K237n42J229L2j23n07R08p15j5k69n45N26Q94l44j99j412m29j374
3055b033J464k04n94k56l4N34n01K20K09P67K07R1Q90N0k03l47R00o9J033n88
3075A536O18q96m96J393j959M28n81l66P87K1j665R79K80o44r7j342l40J188n97
3094a753K80p25J906K81m25P66r75K68J706m08R49k055J078L37k64L00L72Q19
$$ y = [-382, -2076, -826, -2247, -868, -795, -1873, -1779, 1175, 1329, -679, 694, 748, 1615, 751, 237, 964, 344, 2111, 1152, 631, 460, 1621, -426, 70, -177, -993, -1532, -154, -1696, -1232, -2033, -2331, -2020, -2027, -319, -2679, -1612, -1154, -255, 664, -145, -307, 668, 940, 224, 2341, 1501, 2421, 2132, 939, 1908, 2552, 2327, 963, 71, -31, -1378, -1122, -1201, -1386, -2363, -2477, -2817, -2132, -1647, -1123, -1461, -1717, 401, -1847, -724, -106, 97, -1385, 852, 310, 1539, 1571, 1448, 941, 1849, 1134, 1119, 850, 305, 831, 1725, 1381, 1182, -230, -659, -2033, -569, -773, -1367, -1623, -1657, -1123, -1624, -1404, -1195, -428, -221, -130, 760, 810, 607, 260, 1160, 1091, 2124, 1536, 2154, 1258, 762, 2155, 196, 624, 43, -323, 464, 485, -1180, -201, 79, -565, -662, -2004, -2344, -1156, -1753, -1473, -2198, -292, -11, -436, 330, -645, -377, 1329, 921, 1870, -185, 893, 1230, 966, 1266, 1638, 2457]
3112B457k055N52J32j530N92r97r65l64J748j240k94J16R91o29j72M5m09J570
3130d52P9o78N75L53N70J387q56m36K495j400N63K2l8p96J44j589J546M32k108
3149a87p93J092q17l11r80K222j179j18j302K137m30n34j152J130P72O7K323j838
3167A02Q76m77K405k859MJ733P62j827m02Q70j372J076J158j937n64K11K90n29
3185d80L39j989Q01j60L20J015k46j474Q13j16J005j248J818P54l60q19L50l1
3203B92P43j284K093j57n77K96j066J677k409j41M12N68k38l03q47L04k120K359
3221c98j271n04O86l63J170K34P90k004P02K008j947J448J99N2O71k7j186P74
3239A034K24MO68n94j204R9Q66j551j182J432j092l25L83m47q85J302m19J265
$$ y = [2457, 402, 954, 1086, -444, 148, -849, -1814, -2178, -430, -1670, -1964, -1848, -857, -1486, -1658, -1613, -2022, -452, -373, -1051, -476, -123, 447, 1834, 978, 542, 3037, 1637, 2200, 2222, 2184, 1388, 1532, -57, 1489, 1921, -187, -980, 112, -705, -1016, -1996, 226, -953, -1071, -2373, -236, -666, -1200, -2352, -1222, -450, -383, 1940, 102, 978, 501, 2906, 47, 51, 1784, 2546, 719, 317, 1187, -185, 891, 2049, 112, -452, -241, 49, -480, -141, -2130, -1329, -1489, -1169, -154, -400, -1874, -1061, -1177, -172, -1420, 398, 1152, 792, -27, 323, 292, 1035, -249, 1844, 1687, 1110, 1406, 340, 2017, -392, -533, -121, 447, 209, -94, -941, -637, -2757, -398, -1669, -2173, -1487, -1850, -680, -446, 344, -1660, -958, 1050, -897, 551, 750, 802, 1473, 1446, 260, 1034, 1258, 1262, 1930, 1336, 132, 231, 1097, -454, -1636, -204, -1296, -1621, -1238, -1685, -2570, -1268, -1687, -422]
3257d22l48o84L59J136L41j125J126P93l56M14j541R01J21k23J336k91j487J023
3275A073o39K54q90n25Q41L11j312P62j000q00P62j31j313J835n3j078R50N24
3293d29q39J27K263j182K093n72Q70j888R64L06l33j43l34K41L88L11p09j829
3311f95N95O15k596J572j055J071j505l12J095j095K287j211O57n12J367k051
3327a773J021N06J069j40J59N99p02r0Q55l48o3k156J557j078J687l05q41r04
3345i47M37l63O41k79j605k24J354R7k66N68r69L70J247N59o67p53N79J656q66
3364E69N05J35Q87o11k46k33M9j53p70P59k91m29N8o21K45j54j55j363J20q09
3384b508j65K357r80N4J084j462K002j353N95J169n3k39k26J004n71p7K51jR74
$$ y = [-422, -770, -1454, -1095, 41, 382, -743, 383, 1176, 820, 1234, -307, 594, 715, 492, 1828, 1537, 50, 1073, 434, 688, -202, -727, 114, 425, -887, -125, -1125, -1925, -1163, -1294, -2607, -772, -825, -1903, -953, -429, -1268, -1141, 1122, -60, 2033, 1461, 2331, 443, 1407, 1713, 1380, 1237, 903, 1144, 1532, 1843, 1134, -695, -100, 515, -2081, -509, -1564, -493, -1998, -2310, -1215, -2310, -23, -1234, -577, -1089, 278, -1773, -752, -246, 823, 683, 842, 1441, 739, 649, 1504, 1156, 1093, -1063, 494, -584, 1103, 798, -43, -947, -510, -873, -232, -511, -2116, -2340, -986, -889, -1155, -587, -1556, -1186, 61, 620, -47, -800, -221, 1435, 569, 1074, 1209, 2096, 1485, 1239, 1006, 1055, 902, 132, 891, 600, 171, 229, -392, -147, -301, -456, -1819, -1699, -2508, -2673, -316, -1296, -1242, -158, -1620, 382, -971, -376, 793, 740, 501, 275, 1279, 708, 631, 882, 881, 1855]
3403A855l11L60k328J782j485M61k25J558k045j438J373j714P00J10M7Q40m57
3420i17J15M17L57j334N01Q80O45m60R06J116j149j92J78R37j649J770o95J23
3438A549q74Q05j325l10j455O50J274r41p53L8l77Q33Q93j479J351j547K089p49
3456c28j85R93q99R18kQ59j096J262q71n28J074m05j160J081J45j638n28p9Q99
3475d88Nk77j651O91l35M69Q97l4O33o67J35Q74r97O53o90J239Q71j105O76j17
3495G82j119R33m79J305m12l85n58M45o81K3M58o4p11o16J041l2m54K64j073O22
3515g11n96l30Q79N5L67m57R44M67j235J646R86j083J056n80r88l15J959k381
3533c17R96o65Q26Q47j910m31L51q44o64J242J38j320k74r9K80k03P13J51O18
$$ y = [1855, 1544, 1904, -424, 1358, -127, 334, 109, 1667, -378, -1816, -443, -2157, -1457, -1347, -1300, -460, -917, -802, -385, -28, -1362, -861, 19, 664, 204, 1110, 2226, 1077, 885, 1063, 2000, 351, 2121, 1426, 1549, 675, 1480, 155, -155, -1610, -960, 314, -627, -1380, -1342, -1719, -886, 7, -1472, -121, -1668, 421, -328, -513, 480, -419, 499, 497, 1356, 260, 1522, 651, 123, 1197, 792, -368, 713, 858, -780, -1308, -1387, -488, -483, -760, -2411, -1720, -2055, -1586, -689, -723, -90, -757, -622, 252, -745, -92, -782, 457, 1328, 223, 899, 782, -337, 596, 117, 1422, 1010, 625, 67, 512, -169, -146, 312, 248, -463, -1079, -38, -70, -524, -260, -1333, -711, -1307, -1637, -758, -703, -336, -793, 151, 618, -617, 1029, 2015, 932, 1988, 1408, 420, 105, 2064, -317, 679, 14, 840, 1687, -223, -654, -303, -1147, -1811, -569, -431, -1751, -2025, -2124, -1844, -2047, -1334, -1183, -565]
3552e65m12K90j70J120p4O1k90nJ015k00j044J09j09J775l88o06l06J8j79r32
3572h92Q78o58p36L39N32n02j64o7P55J03j550K237k91q76L12P16O27o74K65N21
3592H75Q3p7O53k58n6L92q32K55j843J718j046l26R8j001k86Q40k9j267J820j497
3612a784j61J701n8j39o45J324j487R97O14P55j259O45K1L40L3J78J88j7n91M4
3632F99k55K37L27q29j080m47J405r90Mj317J444k25P92m23p11M78J63Q64l65
3651b29K08N20o60K07P53L83L10k14j82K69N5L16k069J735k201J434K99j249q37
3670a152P64m7j001n59O21Q4j233J645o0p7O22N99j446J305l78P63J124j801K061
3689A834l28j176J326j777J282k74l50k6L31J14o20R04k550O10N70r46k20J162
$$ y = [-565, -977, -687, -857, 263, 189, 250, -40, -45, 970, 770, -274, -165, -274, 1501, 1113, 507, 201, 219, 40, -892, -14, -672, -1408, -1069, -537, -1039, -1203, -1270, -515, -412, -1962, 275, -16, -892, -580, 136, 763, 89, 354, 875, 958, 881, 1534, 1276, 1220, 1612, 780, 1035, -808, 910, -136, -462, -364, -1365, -1651, -811, -840, -2107, -287, -1784, -1945, -244, -302, -441, -1086, 238, -1249, -252, 362, 1117, -142, 503, 524, 864, 897, 1075, 1263, 1246, 655, 699, 444, 681, 1008, 179, -901, -1348, 57, -933, -929, -2246, -802, -1027, -235, -658, -1369, -891, -728, 136, -229, -21, 499, -161, 46, 799, 1182, 1492, 1278, 1096, 1365, 1420, 1736, -333, 1402, -799, 635, 934, -315, -1152, -388, -435, -1436, -1995, -1374, -1290, -2523, -878, -938, -1015, -393, 206, -1240, 65, -313, 450, 1574, -227, 1834, 1506, 330, 1656, -121, 1161, 887, 537, 511, 842, 956, 336, 1240, -1310, -700, -130, -1076, -1296, -134]
3707a34j563p22K393l39r70J144j573N89O40J608j04j539N55O64m8J316n01o86
3725G30q41J896j639K72J2j125J210L54q75J353j433q18Q53l01j903R12Q60J26
3743c57L54r86L4l14K065m17J14Q0m50J071M6o42J623l06k144J836O39j17j774
3762C55p0M42p59k94Q3J466k394N92j00o61J84J78J28n37O73J237r24R61o64O18
3782E14j98p74J046j186J512J36k29q0P77j001R45j115K0o62J344j698k24J346
3800D73j085L31j169J89J067M44j428J53K120j237n95J241m66O11J50l54Q06j027
3818B24P57o94R67m77j344J254j656K174n24r07N73n40J676j410k211M70K30Q80
3836e58O08j163R11l85O33L15j257m54J322n76m48P66J259J13J42J464j263J001
$$ y = [-134, -1697, -2419, -26, -365, -1335, -191, -1764, -1175, -535, 1073, 969, -570, -15, 649, 601, 1917, 1416, 730, -111, 1785, 146, 418, 430, -695, 515, 869, -6, 1347, -86, -904, -51, -352, -2255, -1343, -483, -357, -3, -989, -955, -1269, 796, 379, 493, 573, 123, 1194, 1240, 598, 2221, 1915, -229, 1607, 2246, 2129, 355, 285, 727, -32, -326, -243, 1223, -1171, -579, -679, -1340, -1156, -978, -850, -1387, -714, 523, -401, 560, -104, 514, 316, -458, 588, -598, 914, 1050, 821, 741, 1518, 517, 1462, 347, 367, -295, 1049, -649, -873, 473, -612, -281, -1450, -1261, -194, 250, -1178, -1025, 1095, -142, -737, 504, 38, 649, 799, 445, 1251, 224, 981, 287, 1254, 777, -567, 687, -969, 1205, 681, -226, 347, -193, 1483, 73, -2138, -1668, -1438, -558, 50, -1113, -202, -587, 46, 361, -896, -1350, -28, -604, -1052, -286, 973, 1086, 1228, 2692, 1429, 2430]
3854B430l27l89r28J271j267k56j051J85p12j06J230o69L03q72J253j346m78L24
3872a405J218n87R21n25r41J293J492j917P98J202m80j289K219k08o71k01R6o41
3890C74Q80j500K67L73j547J315m13j209K042m39k102O92R91l76p15K72m38R00
3908f33k8m91M81K669j328J345j876R25p18Q26N26j894J154K99p61J019j405J331
3926A441j502j118J448j920n5Q4J170j753J975p24K87K80p4K05o95O08Q61j169
3944f51R23K84p6J329j740P72Q03n73o29J46j28P87j625R55r4l67j278O36m34
3963i60J617r29j639J760J05m77o29J025J28K82M46k210K00J143l78P80L73M17
3981A054j091J119j46O32j117j113J187o03l87K27j118M51N34j320K395k901R12
$$ y = [2430, 2103, 1714, 786, 2057, 790, 534, -517, -332, -1044, -1150, 80, -589, -286, -1158, 95, -1251, -1729, -1405, -187, -774, 147, -378, -1319, -26, 1466, -451, 347, 1549, 1069, -220, 1999, 1791, 1120, 919, 1015, 374, 1254, -246, 21, 394, -1153, 162, -251, -1460, 582, 143, -1959, -1267, -276, -652, -1367, -1095, -1533, -633, -661, -1152, -671, 1998, 670, 2015, 139, 1064, 346, 1172, 1698, -196, 958, 1257, 496, 1515, 110, 1441, -61, -1179, 269, -1651, -1706, -1622, -452, -2205, -230, -954, -667, -387, -461, -256, -951, -343, 518, -651, 272, 556, 480, 1809, 69, 841, 1644, 1071, 442, 588, 460, 1247, -378, 577, 483, 116, -1162, -526, -960, 657, -272, -1911, -151, -46, -523, -1152, -127, 1, 283, 729, -1481, -1281, -138, -516, 264, 637, 1054, -37, 1082, 936, 1568, 451, -662, 525, -78, -465, -238, -1356, -905, -371, -1691, 704, -2197, -1285]
3998a285J002J0P3O03j659R04n66k93K116r25R69M52l53j250J536r70L87p4k68
4017D09P95j198J161j160O72n79N61L8j274K71l48j160L82J136o96p3n98N99n71
4036a633l0O90L97j40J683r68j01O31j92j06Q31O03K234k787n92N33p08N67j759
4055h47J495k76k21r58P67k774J478K91L66L18N42k164l8J960r4p32O66L29j72
4074f4J594j160l26O99p43J436j983R39P00k97k41N26o52n52j31Q3j14j04K44
4093a46m52j050J194J054j143k2j75Q46j701K108p63j094K668j643K44M74k36
4110A63J352p36j122J902n82L59Jj569l87J495j504L94r03m43m53K189n49k75
4128f68M24j190O56N4K46j29J173j283j072K357o08Q86m53P35j110N12M38n24
$$ y = [-1285, -283, -273, -200, 403, -1256, -352, -918, -1211, 905, -20, 949, 1401, 1048, -202, 1334, 364, 751, 677, 409, 1204, 6, 1167, 7, 679, 100, 661, 699, -575, -304, -652, -1812, -1430, -294, -990, -1063, -1661, -1062, -1633, -1663, -973, -576, -716, 967, -1, -102, 529, 337, 231, 1062, 1665, 3899, 1112, 520, 1053, 345, 912, -847, 648, 372, 151, -807, -40, -2814, -1336, -1045, -679, -361, 181, -1983, -2021, -61, -155, -887, -221, 108, -64, 1530, 370, 44, 743, 0, 1436, -547, 392, 1092, 795, 554, 1080, 428, -124, -255, -172, -286, -390, -146, -598, -1648, -454, 600, -543, -565, -740, 106, -1595, 513, -250, -1344, 1324, -319, -75, 399, 163, 1515, 779, -343, 1559, 977, 1336, 1337, -232, -619, 876, -628, -234, -1137, -1580, -2033, 156, -393, -668, -244, -1434, -778, -724, -478, -607, 566, -717, -1789, 568, -40, 846, 393, 1128, 18, 530, 968, 444]
4146D44o4Q04r3n17j229J853j043M29J79q3L46j456N42r96o49J673M52j747J026
4165a29J557j623o73J78K34J178j166N93J214r02k11L28J30m27P98l73L72N46
4183A624r37P32q54m1o30l42o92j55l05J638p75p59r7P49J386j565R60n18L15
4202b66l09J530l55J18j140J004N5j59R27p41j074L43J15K63J023j080q11Q91
4220C34j135l78J598p87k73P0M07o22m21r64j42J218J95l12J146p74J935l45J017
4239A767j076j70O25P02j308J112j174J757k299K8N1P61j031P64k156Q17P23O70
4257E63k028K052j554J36P78j37k58N1K7O52n59k17J468p70J427jr76L47M00j281
4277A20J850j141r54J01k01O16K6p02N74L82n81o64m2r55J712o7j025j083J763
$$ y = [444, 380, 1184, 1091, 574, -655, 1198, 155, 584, 763, 680, 1026, -430, 112, -884, -1533, 140, 592, -1155, -129, 1428, -195, -868, -690, -456, 722, -444, 149, 1363, 461, 250, 578, 708, 281, 1079, 706, 1078, 1624, 687, 1419, 565, 524, -106, -448, -1140, -1295, -1600, 38, -737, -1496, -1593, -844, 542, -1023, -63, -581, -266, -575, 955, 600, 718, -422, 582, 637, 478, 1405, 664, -410, -67, 48, 311, 1334, 254, -557, 334, -801, -1179, 419, -368, -641, -571, -164, -786, -1207, -2171, -2313, -1095, -900, -1212, -66, -840, 1095, 750, 1767, 691, 521, 1146, 1848, 540, 1652, 478, 2235, -64, -36, 15, 776, -255, 509, -1647, -830, -107, 563, -1465, 587, -967, -831, -53, -190, -448, -397, -370, 282, -277, -494, 974, 204, 1631, 1630, 654, 1001, 1401, 120, 1970, 829, -125, -24, -225, 391, 417, -285, 289, 671, 90, -574, -616, -1571, 141, 74, -951, -2034, -271]
4296b71j131J772o46m41Q96M16K044k98l96j998N27nj38J663p68M22j541K033
4314B140j421J4j95N22q67k280K296l58k14q12j153K191n36j69l47J392n17j737
4332b051J979m45N90j64L64k6J1P43m63l22o37k08Q86J2J061J19j437M95j368
4351h61l91K64M22q91J697j61K2j126Q40J634k269N03N25O94r34N16p89m18J115
4370C92J069j395O65K41j500J344n97q70J118j034M29J86j149K515j562q52P12
4387b88n31J084p88p95J108j174Q40O68j04R57J11n08k95L84N62j031J192N55
4405A947j263R0j69n85r59J450k26k94j46N99j353N74q7j08n54P46p44K007l83
4424E42k183J43J028J880k041L97J31J051p40O17L31q3n92N67Q07k620L160j57
$$ y = [-271, -1402, 370, -276, -717, 179, 595, 2639, 2341, 1945, -53, 474, 469, 331, 1994, 1226, 1648, 107, 2140, 719, 733, 538, 1060, 193, -2087, 209, -149, -363, -1175, -2328, -137, -673, -842, -1189, 203, -314, -2051, -72, -517, 73, -91, 273, 247, 258, 1001, 538, 216, -421, -629, 257, 269, 1330, 1449, 12, 507, -861, -1252, -988, -566, -1457, 240, 79, 101, -1025, -185, 1449, -820, -317, 208, 902, -32, 484, -305, -723, 392, 1461, 66, 731, 972, -528, 816, 219, -651, 467, -567, -138, 48, -1101, 1414, -148, -1000, -288, -819, 265, -523, -1318, -210, -1384, -544, 124, 20, 977, 1088, 580, 285, 669, 1231, 200, 1392, 1947, 684, 774, 605, 20, -939, 511, 285, -9, -155, 444, -909, -335, -422, -530, -1084, -338, -1082, 925, 542, -1641, -1498, -470, 1410, -631, -234, -103, 948, 208, 825, 1156, 1073, 481, 1048, 1855, -765, 2395, 2238]
4442B238j850r36Q91m11j116J040J44n47N32l44K50n91M56j248O42l9L73M65k25
4461b76J68J550j123j10J31L52M23j750K529j458J128J106j829j354N05J78J690
4478A860r37j403NP30j933N31m48L87J210j36n44k65J679j606R90J3L65J53n70
4497H1J109j204J194P87m93p12K112k343Q05l95J24j238R46j193N75o46j306J792
4515eN8O15j548J16P15O3r16J511q6o6n12j97P96N85N2R93j902K02M28R64j078
4536G88J307o13k427K454j346J79j532J769j613N95j2J49j908J574j132J96K67
4553a305J229o94J116L76r37L8K20l65k25J055Q74m03J167j354P60J46j221j37
4571C40P1j017L76O70l73K089k536M65j316R1J918j595l54o4K92J473r22N62j060
$$ y = [2238, 388, -548, 343, -68, -1184, -144, 0, -547, -15, -359, -109, -700, -244, -1492, -850, -889, -516, -51, -276, -108, 1442, 319, 209, 340, 692, 1115, -635, 1894, 436, 1564, 2670, 841, -513, -8, 170, 1860, 923, -480, -475, 255, -1678, -1147, -1595, -1208, 2, -134, -678, -943, 736, -870, 120, 133, 498, 651, 81, 1190, -14, 1180, 1967, 1474, 762, 2874, 531, 1336, 941, 1065, -173, 773, -420, 155, -491, -1797, -5, 53, 668, -880, -764, -49, 14, -902, 609, 523, 457, -55, -252, 544, 1129, 1181, 2174, 272, 474, 902, 1866, 788, 2095, 1482, -945, 1509, 163, 342, -1190, 579, -1034, -439, -451, -302, -2210, -636, -1768, -1572, -1305, -76, -770, 346, 722, -215, -177, 43, -322, -547, 508, 1382, 979, 2146, 792, 1552, 1698, 477, 340, 411, -606, -230, 440, 67, 2156, -380, 85, -1231, -1140, 778, -817, -1171, -1235, -943, 530, -392, 170, -890]
4590h90R83M52J60q26J014m25k77J302j442R7O53j86p84j70K49Q88r11L59o14
4609c68j706J285K01N82o90N34r16N39L07l69J327j649J34P89k46M83L99q18P23
4628E41o71J458l99o74P12p07l8l62Q0L46P22k273K569k618J32J134j612O75o31
4647a616N4J078j673J491p9k91Q81K40O83j106M57L1J499n81j838J466J680k434
4665e8j49O38K95K2k71K72O4o76o83J74J044j101K96j39n62L84q05J250L99r53
4685e59J127j820L56J498n82J63R29j37j32R55L84l12r27n7p45L78M60M67j759
4704c13q0O96j842J067l75J845k536K047j538J59O24n26l38P82j837K779j180
4721e66J940j462P00L16m24J214j843J820n98j63j269J169r79j60P33n62l36r71
$$ y = [-890, 93, 545, 705, -121, 893, 468, 191, 1493, 51, 148, 801, 615, -169, -339, -90, 798, -113, 246, -368, -2074, -789, -588, -6, -696, -162, -1078, -539, -232, -601, 726, -923, -789, 0, -246, 237, 636, -182, 541, -130, 1328, 929, 255, 967, 260, 222, -140, -60, 286, 1008, -1265, 1304, -1314, -1182, -48, -1660, -985, -1616, -1562, -484, -2157, -666, -745, -1036, -155, 85, 768, -338, 119, 150, 1649, 1068, -770, 696, 2376, -58, -207, 431, 726, 748, 477, 749, 813, 137, -546, -372, 672, -429, -133, -272, -834, -450, -1255, -5, 394, -559, 568, -1252, -896, 602, 20, 183, 1112, 975, 843, 1798, 2182, 1870, 943, 886, 141, 519, 979, 1446, -313, -393, 303, -1539, -472, -847, 998, -1538, 509, -1029, -870, -246, -772, -1110, -328, -2165, 614, -566, 1374, -88, 612, 928, 504, 1718, -125, 1695, 1097, 934, -335, 834, -145, -305, 428, -134, -470, -1441]
4739a441Q58n97P73j329J758o64m33M11j66l12J426M62l70j95J272p14j203O36
4757A72M19J94j582K593j020P40k150M51n05J260j667R40pP90j965N60M28j7k13
4776e79k47J073j166n05K310q31j434J692M68K9L56j43j623K616k438NO96O60
4794I39P59j451l28J685j112J05j160O90J118j408O35j524L66P09r70N11j588
4811b024R77R52q31O13J179J160j740k59rJ041n24M14L02m18n45K88J419j505
4829D90j192J150n23k9k36O30p13j65k7L25M07n50j23J740o54N29j623L11Q36
4848E83p96M74M15j293L83J258N3R5n30j259J206J030l95m87m40N76j188N3l60
4867f22L12o20J387j466P80m07J278j099M65n43k90r8o98J460k75k81P78m00J378
$$ y = [-1441, -583, -1180, -407, -1736, 22, -642, -1075, -664, -830, -1142, 284, 746, 376, 181, 1453, 739, -464, 172, 591, 785, -797, 1796, 776, 1516, -634, -183, -688, 572, -1095, -155, -162, 628, -1337, -777, -349, -366, -579, -826, 247, -919, -1424, 886, 55, -1379, 313, 781, 810, 1166, 1023, -600, 2016, -422, -417, 279, 939, 1698, 247, -81, 1604, 492, 597, -563, 127, 1245, -163, 472, -1052, -686, 23, -947, -436, -2024, -1047, -95, -926, -313, 866, 2026, 286, 27, 18, 1059, 535, 949, 1251, 833, 288, 576, 1995, 490, -702, 448, -75, -104, -340, 290, -423, -588, -615, -290, 117, -433, -556, 1184, 530, 1059, -564, -253, 583, -213, 261, 676, -617, -234, 1024, 1077, 1172, 642, -617, 589, 1619, 1224, 737, 297, 873, -315, -262, -622, -310, -930, 457, -1009, -229, -636, 642, -457, 8, -535, -825, -923, -1621, -161, -436, -717, 61, -339, 1039]
4886A039q15Q25O5k04o63J953j887J096p02j559J130m3p24J86J37p1j124l49M50
4905a260k89M09r58J589L61O94n62O26q35K13n18J699n67n05J60P89Q16j278M23
4924A007Q41k499Q34O21j075o15J963l77j697k10O29l55j4K05J59k93R92o34J497
4943I79m01j582R30Q12l70o13L9O08K40p58J462j293P01K2m49n34J93j02p8R37
4963G43j253o64J837k550P40O40n99L79J051j458P61j007J181j088K598j849J053
4980E15Rp78J746o33j473J959q63Q31j35J17j710R40n66j83l42J124j117j157
4998a716J376k07Q62l72n42n60R9J439k132J195K54K19K09O38k66K53M1q27O30
5017E93N21n83L95N43j704R08N60m43p34J68j712J588q23J237k433J734K50N4
$$ y = [1039, 224, 1049, 1114, 910, 247, 2200, 313, 1409, 707, -852, 278, 235, -489, -303, -166, -237, -1361, -1710, -1260, -1549, -1140, -2098, -509, -148, 546, -16, 610, -225, -12, -530, 1169, 602, 97, 257, 1046, 1862, 584, 1007, 1848, -651, 183, 804, -271, -886, 1077, 700, -997, -1207, -578, -933, -947, -742, -583, -876, 116, -518, 979, 578, -1004, -74, 738, 368, -245, -206, 402, 642, -116, 1346, 53, 754, 776, 327, -207, -14, -116, -194, 743, -510, -1174, 663, -1887, -1147, -507, -1106, -727, 324, -1134, -373, -1380, -199, -1287, 1311, -538, 515, 524, -254, 1492, 859, -614, 1345, 482, 1313, 1178, 1295, -415, 525, -41, -224, -566, 558, -559, -1716, -340, -547, 315, -57, -599, -1159, -1060, 379, -1753, -558, -304, -85, 124, 762, 496, 749, 790, -37, 593, 1114, 531, 926, 1469, -235, 673, 1233, 790, 56, 224, -1488, 100, -723, 514, -1919, -185, 65, 119]
5035A19l66j957J903L84l11p01J484p32Q20k076J560J53L64K91j326J096O95M19
5053A819j800M65p25P2J009j053O36k84j124R36j550P8K175j029L41q49J044k21
5071f0L20j040J958j515M22Q15l92M69J11q40m92K181j859l71j47MJ404m93m54
5090B1O5q70J204j708O04K30L67r4k10j116J163M65r94l26J614j368J681j455
5108g27J779o02M48n71O00j261K331K21n73j431J140L05j533N29n0l48j073J160
5126C44m19k67q81Q7o4m76J305o14L7k03Q64Q31j009J29n15J466j384n2P32R26
5146H37k70J79m23J586j424j37J454j711q70J223r35m96J350q09Q5N07O5j753
5164a542k61J303j223J243N49M7j338J397L05o27j11J538k54j716K088j188P27
$$ y = [119, -247, -2204, -301, 83, -228, -929, 555, -177, 643, -1433, 127, 280, 644, 935, -391, 705, 1400, 1819, 19, 484, -241, -169, 840, -213, 423, 139, -985, -49, -1599, -1521, 654, -375, -34, -883, 161, -60, 260, -780, 1178, -337, 85, 900, 508, 977, 1088, 248, -244, 1937, 78, -293, -440, -436, 968, 475, 21, 86, -784, 420, -1288, -684, -454, -87, -181, -391, -1507, -344, 121, -873, -1199, 415, -953, 728, -727, 1052, 450, 898, 327, 927, -334, 1997, 2218, 1645, 214, 1354, 1659, 126, 655, 605, 257, -816, 344, -75, -342, -1223, -1136, -1200, -1676, -371, -985, -948, -1151, -287, 544, -465, -336, -851, 615, -769, -821, -89, 837, 567, 746, 323, 1909, 485, 348, 1802, 91, -779, 444, -491, -987, 363, -446, -361, 146, 211, -1542, -1803, -500, -1723, -480, 69, 116, -1222, 175, 480, -147, -258, 1280, 1026, -690, 1398, 210, 937]
5181I37l71m53J352j057O75j143R97r58J414k359n41N48N74o77L97j032N09K66
5199i22P64P30J77o95l34M91o56P91j029M38J561k51q80L26P95n02k05J159j845
5218h7n85J404r69O55P01k036j750K593K04o93K78j589J156J24J76J13j600K863
5236I58j445J054n09Q70p49N73J87kp31m49J351r27k08P26p79L59R2p11J74o22
5256g88J86r23O42L81m0j9O49j107K82L57j472J708N90k33N79J91q15J051R64
5275B183r99O4q54o16K087p63m95j231o30J920N3K56l07r98n32r2N53j388J308
5294d81m25M45K72o68J393L91k202J565J121k100J425M96r53K28j087K115l40
5311A195o73j276J68K030r51m48J827k364N83o32kJ60J75j116M92K87J270m99
$$ y = [937, 566, 113, 1465, 408, 1083, -60, 937, -21, 1393, -966, -1507, -959, -385, -1062, -665, -1697, -1188, -922, -158, 572, 749, 54, -280, 211, -445, 346, -683, -245, 1316, 1065, 185, 511, 1306, 804, 599, 1758, -87, -672, 732, -237, 418, 1119, -917, -2667, -74, 130, -563, -285, -1874, -718, -594, -418, -305, -1905, 958, -487, 567, 58, 928, 179, 752, 939, 937, 206, -243, 1108, 181, -27, 699, -80, 279, 371, -340, -166, -788, -602, -1525, -883, -502, -542, -561, 88, -1019, -737, -380, -1852, -144, 446, 213, 792, 983, 168, 1219, 2183, 1184, 1248, 394, -222, 1865, 1102, 607, -624, -1254, 666, 719, 975, 668, -330, -862, -954, -401, -1789, -481, -906, -461, -189, -857, 536, 927, -1275, 290, 1411, -689, 736, 1232, 279, 507, -580, 1535, 1195, 522, -754, -586, 1444, 493, 45, 1872, -492, 91, -541, -543, -383, -208, -1324, -832, -545, 725, 226]
5329B26o50R2l59J38R6K96j112J567L94K242k547L60j03k259L024q56l8j075m95
5348a059K371j094j210O48J539l001J566n84l74J495j404N57L83k23j39L20J467
5365A258j004j76J065q59j88O9J790r53K77j365J092o03O88q04R81j836j2N68
5383a2K56j066Q25r7n46J60k00M01n52j426J873q5K5o58J345q32l68N59j09P89
5403B82L43K15K64m36N5m08n78P99R6lp69j073J146j85j91M11j205J415P12j422
5423e32K8n6N74qq4j1J19k01L15K49n03L62n77R07p0Q67j664M61N30L21K69r66
5445C30p35K197k032K31N15J250j703p46J130j353j36Q5j87R00J85n92J117n87
5463a31P88n75j119J416r80J832Q6N30j760J494j517N42j169o41J453R54j171
$$ y = [226, -424, -332, -691, -553, -457, -161, -1273, 294, 688, 2930, 383, 743, 640, -1619, 1405, 549, 511, -564, -1059, 1312, 218, -992, -344, 1195, -1806, -240, -824, -1198, 297, -1107, -550, -167, -390, -529, -209, 1258, 254, 78, 1143, 284, 96, 165, 1955, 1002, 1279, -86, 1006, 403, 1091, 287, 1268, -568, -580, -12, 244, -822, 3, -94, -640, -480, -680, -279, -831, -2257, -384, -469, -444, -1102, 243, -589, -957, -398, -507, 282, 625, 840, 1104, 668, 723, 315, -263, 536, 632, 629, -140, -1213, -67, -252, -443, -32, -1237, 178, 890, -532, -504, -560, 14, 6, -78, -89, 30, -171, 144, 393, -110, 252, -325, 582, 512, 1379, -285, 176, 706, 1027, 1296, 330, -405, 1792, -240, -9, 506, 1756, 53, -693, 437, -916, -1052, -967, -1154, -254, -69, -661, 456, -131, 657, 82, -1037, 379, -601, 1231, 1317, 1847, 87, 1581, 64, 606, -563, -1204, 249, 1203, 32]
5480C2K40n06n45Q20p76l33K41O1o38M91J332N53k411J023N53J063j280l53r41
5499a374K656m39M5j339j65K216r59kk269K122P23j052j161R71q63l31J18O0J563
5518E20j038o38M4J330k382K602n17J273k460J545k95M01j13P90j378O85lJ194
5536A560j26p77M22j574J185l00M23k808J751N01K36j071n08Q33J79m68q6o45
5554a273J527j683L15K18L14P10l19K26R52L93j23j446J482k75J724k269o4M08
5572H17j373Q75p24J310j584J064N20j677j69L84J342j880j51Q00n76j81q6J639
5590C50j477J987o47m20N52n54M13m14R10l20j77r98J280l56o43J652j746J8J468
5609H78j325J744j460K17o84r96J636k10o30O62M01k46R0p75K100k672J347o7
$$ y = [32, 272, -234, -779, 41, -735, -1068, -827, -766, -1404, -913, 419, 972, -1439, -416, 137, 1200, -80, -433, -1374, 1282, 843, 888, -451, -616, 1600, 641, 639, -1630, 492, 1215, 163, -998, -27, -890, -1221, -1103, -1043, 520, -518, -1156, -1112, 218, -2164, 438, -79, 1194, -1266, 279, -16, 385, 272, 1062, -316, 369, 366, 1560, 1434, 657, 1079, -495, 690, 390, 813, -1995, -244, 257, 493, -578, -1086, -253, -74, -542, -628, -1273, 254, -1429, -1114, -896, -582, 128, -191, 35, 987, 1380, 1257, -189, 1293, 1018, 2742, 473, 409, 817, -556, 319, -405, 905, -679, 385, 905, -772, -941, -557, 785, -1095, -1246, -446, -1022, -1203, -1289, 350, -1127, 860, 213, -207, 345, -209, 204, -210, 700, 380, 203, -795, 485, 129, -514, 1138, -608, -590, 878, -447, 1297, -163, 54, -630, -1626, 10, -200, -830, -168, 233, -13, 77, -698, 1402, -1270, 77, 10]
5627A0l67J888o45k29o34J00R22j30P2o04j34M59r50J465j559M80j027J686j090
5646b87n75Q05q84J826j718Q84j771J764M3Q10%j341P90j091O30M79K60l77M33
5665F80o1j073J947j780Q32m24M29K34j114R10m12j012k93Q77j137o28J301M90
5683b34R23l92j146Q98k62q9O28J54J211r42j078M42j52O19m52m00L10M03q27
5702c86m3rQ90p65o70L8P16R95j784l30n62M93J318j82m49Q00j541K67R93J24
5722h7R66N10j232N70k046K048k156K479j82n84p8L80p72J020k59n72Q48j175
5740c22k10P81O36q55L25q50K60M83k25n76j269J098O32j093K263q46j07J089
5758A214n42J125o52p13j327Q30J839p56l01L35r91Q68j076O60q84L18M75J59
$$ y = [10, -357, 1531, 886, 657, 23, 123, 1045, 915, 987, 383, 249, 708, -242, 1223, -336, 144, -883, 803, -287, -862, -57, -941, 885, -833, 51, -1720, 44, 87, 897, 897, -444, 346, -745, -115, 364, 624, 247, 680, 619, -454, 1493, -287, 545, 121, 550, 784, -330, 580, 168, -844, -1137, -260, -1397, -2025, -724, -234, 689, 297, -849, 49, -213, -302, 326, 480, 1691, 749, -329, 113, -39, 580, 128, -272, 38, 441, -386, -429, -438, 452, -313, -983, -945, -229, 766, -1018, -1348, -1910, -1417, -99, -281, -730, 70, -1471, -1204, -211, -87, 879, 1389, 157, 727, -1319, 729, -1427, 1052, 870, 286, 208, 588, -184, 836, 577, 5, 853, -322, -532, 249, 885, 30, 355, -495, -235, 248, 23, -553, -1822, -724, -92, -1185, 1078, 232, 125, 1214, 672, 1797, 1145, 432, -895, -65, 1774, 1018, 717, 1052, 61, 929, -147, 513, -371, -53, 422, 581]
5776E81q51K92q9r77J205j40j055J541j269J514j078O5J17M50o60J269q61r0P07
5795F71k09N20j084J434q18l72j091L34J000p32Q2n25M56K93m40K45m73m9Q3k95
5815i70P66l56l66J577K4k68j194J502r06O83J65l03L2j27p42J759j684J58J038
5834G88p5q39O56j715J324J471k151k28K014k257r4J826q92j16P3l28Q63R6J114
5853A530k149J017K56K04j813J008J162j32o94k01q8P87q21O72l97j124O43O6
5871g4J43p27j034R48j54J061r32Q97j95j282J604K76M9m46M6J33J79j46o30P64
5891D80j193P11r65K349j565Q79r06J085p77o42m6O00k24J60J88j822N21R02n10
5910g75o6O39o38J898j786M11J87M69J074p28j02Q10j062K96j64J051r83j89P41
$$ y = [581, -270, 22, -67, -1044, 161, 21, -1034, 507, -762, 752, -326, -261, -144, 306, -354, 915, 54, -36, 671, 462, 982, -102, 1332, 514, 142, -949, -615, 385, -347, -265, -790, -334, -41, -481, -236, -709, -758, -675, -970, -204, -560, -926, 651, 675, 407, -787, 715, -191, 492, 657, 354, 386, 259, -483, 1276, -408, -250, 788, 713, -126, 530, -1185, 139, 1610, -541, -769, 1245, -1012, -1106, 720, -172, -288, -215, -543, 320, 416, 1530, -619, 398, 654, 858, -955, 53, 1215, 1083, 389, 188, 100, 887, 66, 738, 341, -783, -140, -74, 69, -658, -1692, -744, -898, 163, -769, 128, -67, -1349, 255, 531, 580, 134, 180, 313, 492, 346, -284, 480, -713, -2, -967, 1382, -183, 696, -210, 875, 98, -544, -590, 10, -214, -54, 134, -1688, -1167, -265, -775, -841, -202, -840, 1058, -728, -317, -130, 339, 1413, 685, 583, 1393, 331, 627, 463, 1514, 531, 342, 1083]
5929A083o97j071O57J01o43J114n79J07j047P96l18l18J379m21j49j035O10P17
5947B86j547J869l17P74R31j735N65k03N57J08j172K68O78j16j458P31K60l91
5965H8r94J40l39L80K94n60J026J8j581J345K35R38o36m33J70o18M78j787J965
5984A29K102j015j001j274L250j769m6j70N43n56l7P05r51P62n10j031J044o77
6002e02k2M29j96J002j659R15p72J911k1j493P25m42O01m86p14J982n16Q80j05
6021A517r87J817j90r51o68K3m00o73j73J131M25j365P6N43Q29k305J048p72R67
6040a08n2r89R61P08J86o73K98q73j63N44J58Q04Q29k823K424j462m55kN83P52
6060F47ol49P27j853J50j746O59L47Q07m36J597m32n85J07M36N99j502J165L11
$$ y = [1083, 386, -685, -28, 73, -570, 544, -35, 72, -975, -179, -497, -815, 564, 143, -6, -1041, -431, 286, -1261, 608, 291, 1065, 1996, 261, 826, 623, 1180, 1288, 116, 384, 1062, 946, -512, 219, 479, 88, -906, -766, -1105, -725, -431, -991, 35, 53, -1528, -183, 52, 990, 354, -79, 91, -527, -49, -1836, 129, 2231, 1216, 215, -1059, 2191, 422, 376, 206, 749, 193, 156, 861, -90, 672, 162, -869, 175, -502, -524, -95, -291, 711, -948, -33, -805, 1106, 1085, -408, 317, -125, 476, -10, -724, 1258, 742, 1622, 1517, 530, 2347, 2157, 1206, 538, 561, 161, -512, -685, 446, 871, -494, -418, 125, 954, -1351, -303, -1075, -108, -160, -1149, -188, 520, 706, 33, 331, -542, -705, -161, -3, 801, 1630, -1193, 1231, -231, -686, -688, -105, 647, 641, 292, 1019, -834, -684, -2430, -1771, -1424, -617, -1053, 544, 112, -473, -366, 70, 669, -833, 332, 643]
6079F43p75N30L85O83j057J427o13j247J58J211o01n26J726k336l11N22K91n36
6097d26j62N44m86j91K91m66K431j480P7K18O38q14Q98K76j06j280N48k78p34
6116e02Q43J33J84R3mJ30J54j073K68j152Q72M77n74k24N6k43N91l56j092Q76
6136e43p59J162J39L35o5m44O46r8j43L74m32J92J514j033m05J14L49L72j304
6155b9N68q14M64r67o95J916j243J050k83k19m12j40J59j412J114O95L08J61m5
6174A76N6K72K60j638L33P46Q78k254J090Q3N1j014J460j73R2q18M08j376K17
6193a151J158O26p91m95J61p87R14k32M49q03R89N67q77lQ36r14R21M63m77k04
6213C50L60J00K50j248O1J175j461P01j41q5Q2j210J415j109k69m47qJ073j005
$$ y = [643, -132, 398, 783, 1466, 409, 1836, 1223, -24, 134, 1345, 744, 218, 1944, -392, -703, -181, 110, -426, -588, -44, -530, -721, -430, -896, 1535, 55, 132, 350, 988, 174, 1072, 1348, 1242, -38, 510, 232, -502, 341, 474, 658, 751, 747, 877, 1031, -42, 226, -926, -54, 423, -151, -375, -319, -562, 29, -327, -1419, -543, -1302, -140, -1, 334, 269, -175, 471, 373, 230, 604, 172, 364, 1878, 845, 440, 554, 903, 1275, -29, 539, -275, 189, -778, -1473, 443, -800, 250, -33, -252, -664, -804, -645, -2057, -943, -248, 60, 221, 176, 232, 504, 764, -874, -541, 205, 1083, -1171, -81, 2, 53, -961, 499, 326, 418, -400, 8, -1368, -1151, 7, 633, -158, -653, -492, -1279, -365, -597, -148, -951, 38, 605, -272, -275, 561, -353, 568, 1031, 554, 350, 710, 810, 1060, -188, -127, 1048, -413, 288, 147, 62, 144, -1066, 349, -760, -1029, -1476, -1484, -411, -1416]
6232a416K153j22p02J32q15J184r9q91P70J46o47L8M61K94o71N67j559J037J691
6251A551K93j805K81j524M59Q67q03P53j015j53J50J597j16m23n40k21N91N09
6269D51q60M14N15K19q12J253l37m02m10N92R67l10q70J74j105L47K24r79J00
6288h29O46o58J66M72r33M04o87m95q8J652L45L7K98k99M96r81K47Q88p11j57
6308a87J97k6l12J374q98J391O8r26o07K82Q7j373J049J04N52k106Q6N16m5R59
6328A85j808M47J755k22j73j98r2N47k155K520q7j037M62q61K038j791J361k97
6346E94m56Q42j328j59J74K66J84N91k197J539n92J25J8j831J088qJ422k338K806
6365G40r96K67r23K126l53K83N3k87j191N18R2P09J20n70l74j388Q25J24P55r7
$$ y = [-1416, 737, 615, -87, 45, -770, 414, 315, -576, 194, 340, -307, -269, 192, 486, -185, 382, -1177, -140, 1551, 1844, 39, 320, -1204, -745, 122, -681, 72, -943, -1096, -946, 651, 535, 112, -428, -649, -58, 451, -409, 5, 520, 739, -73, 1180, 843, 441, 31, 623, 1590, 1280, 410, 584, -521, -174, 50, -929, -829, -183, -841, -675, -203, -1136, -732, -1419, -1914, -2002, -350, -5, 32, 330, 31, 527, -454, -207, 681, -30, -187, 10, -16, -328, 1046, 148, 1539, 1607, 681, 74, 356, 443, -930, 119, 223, 775, -1331, -1245, -729, -774, 185, -1623, -1176, 579, 357, 184, -14, -106, 441, -1714, 806, 719, -318, 144, -717, 1321, -470, 891, 594, 138, 980, -348, -507, -333, -67, 117, 708, -1489, 50, -542, -417, -399, -2230, -1142, -1150, 272, -2066, 740, -256, 11, -912, 1214, 861, 1144, 1197, 910, -281, 237, 329, 1038, 1158, 588, 214, -1174, -349, -225, 530, 433]
6385D33q74J055j946J689j617P01J656j768O66o85J507j829L04R14N64l64l27
6402G9K21j85J85P55r57J231r36p95R3J338j226r70O99M20n3o93R34j15q79q97
6422a751O91r19K104P8j153J17L43J028q50J106J17l07K16r59K27J463j162p78
6440c89O21K021k229J723j705J923k172k79Q05r44R77j450J252j289J456j481
6456a160M11K44N79k22K96l27m15K85J230q64Q22j19o06L99j8q32r9L45K69N86
6476H04r47N70j101J000J245k561J359j400R50n74P66n26N3k32Q69j004J474j502
6494g57N48Q01r24J033j383K277j626L5m9R48r35M76M88p3m67q77P66j21j506
6513a346J425M74j860J703J238l146K339j500N82m69N69k13o00Q15J31P69m90
$$ y = [433, -441, 614, -1332, 357, -1260, -559, 1097, -671, -5, -690, 817, -1012, -708, 206, 770, 406, 79, 300, 115, 300, 1055, 98, 1329, 393, -402, -309, 1029, -197, -1167, -468, -48, -101, -794, 140, 25, -854, -1751, -1060, -1979, 125, 203, -950, -833, -490, 538, -312, 794, 911, 604, 820, -139, 88, 1551, 389, -389, 232, 2253, 24, 1747, 42, 1965, -207, -486, 319, -625, 352, -1098, 154, -1135, 321, -1160, -749, -505, 74, -148, 148, -179, -594, -309, 921, 57, 879, 760, 154, 553, 535, -297, -396, -51, 218, 804, -143, 427, -674, 326, 1571, -990, 369, -1031, -81, -655, 111, -415, -362, -594, 275, -729, 745, -757, -209, 592, -332, 701, -682, 1595, -31, 4, -45, 903, -32, 444, 932, 859, 392, -485, 281, 160, -1346, 79, 553, -1307, 396, 1634, -1512, 827, -673, -91, -560, 9, -204, -804, 11, 142, 911, 421]
6530D21l86j68O13P70j876J205K57r28J552j75k353J929o53N02r7j893Q64o85
6548a101J838r37J094j765K8N93n78j158N38J754k229P72J307n44M19j568J504
6565c3L19j034J768o75P2r15Q14J090k100J140P99j029o84j067L169j402o66k41
6583f75j04J179j006l33R47M12j322J195Q77j643Q62j363J525j356J23J144q73
6600d11Q92O7lK60J194k776m30J611jj200j035R23P26J55m72O90J81q83P47k64
6620b9k56J204j094K05l04k85k39J367j402J135l1j270K485k26j920k61Q21N68
6638D68N73j590J464j621q88J321O31j845J779p42K51p87j39k7J054j997J271
6655h24j419J612J061J33l17K75L27j41j3L45K94o36j12j2l47P84K22r91p60J032
$$ y = [421, 35, -133, 480, 1250, -626, 579, 836, -92, 1460, 1285, -1068, 861, 208, 710, 613, -1280, -416, -1101, 737, -200, 894, -871, -843, -250, -828, -1986, -1448, 306, -1923, -1151, 156, -388, 31, -1537, -33, 286, -748, 1020, 345, 417, -498, 316, 1406, -694, 446, 1245, 216, -468, -1535, 1634, 232, -434, -675, -779, 400, -606, -939, 8, 420, -902, 293, 1170, -473, 389, -974, 551, -805, -682, 462, -411, 481, 548, 545, 805, 1999, -777, -1207, 404, 403, -797, -1832, -909, -183, -28, -500, 190, 371, -512, 235, -29, -285, 919, -175, 30, -274, -559, -798, 569, -833, 302, 271, -999, 1486, 1260, -660, -921, -100, 468, 1041, -549, 915, -706, -1594, -273, 358, -1487, 292, -450, -199, -986, -1125, -1152, -98, -2095, -824, -2243, -631, 430, 563, 246, 521, 848, 707, 694, 1039, 1333, 697, 585, 573, 226, 1010, 1232, 241, -519, 513]
6675E13o96o8o81K63J036J6j039J606j796R70j279J174l20J20j73L64J66J19r97
6694g02J64N31K70P35m29j425P28J628q28p57J6P04n98N86K32q58P27p69K74J62
6714C91l44j91r5l94M96o44J061L71m41k615J741K560j251j016R68j929K075m13
6732C30M03q01P32o37k71K50m02m42k82J372r99J164j244N95n75J242L02m03j291
6751i57R89P27Q6N85j976L63K62R42j268N33O6J79j870J474P80j615J543l31k53
6770B59n17P96p67q78J840r12j346J806L50j504O18O63j496J499p71R34q56L28
6788D6J66o20L53J358j812J229r91P8o12J085K26m61n12P73Q44j194o8N63J90
6807F41k306J558J045j144m03J14k79P8Q53n08k35J618q82n25J188j371K22K62
$$ y = [513, -183, -251, -932, -669, 367, 383, -656, 950, -846, 124, -1155, 19, -301, -181, -354, 10, 176, 295, -702, -538, -7, 263, 998, 569, -856, -128, 1500, 672, -85, -69, 635, 37, 623, 855, -3, 724, -45, 229, 391, 47, -144, -239, -633, -137, -781, 280, 651, 210, -2405, -664, 1896, 645, -371, 597, -1332, 743, 330, 733, -68, 664, 27, -244, 6, -396, -838, -1120, 252, -747, 417, -827, -232, -807, 435, 737, 334, -957, 32, 759, 845, 1430, -546, -183, 79, 1021, -247, 286, 352, 531, -1339, 135, 915, -700, 843, 512, 259, -258, 538, -229, -1107, 733, -179, -1525, 281, 631, -873, -255, 408, -1088, 411, -360, 574, -282, 46, 212, -408, -55, 1303, -509, 720, -271, -193, -805, 280, 506, 45, -467, 306, 1150, -44, -112, 451, 641, -1665, -107, 938, -206, -609, -495, -774, -696, 157, -351, -586, 1032, 150, -375, 813, -558, -336, -74]
6825g4N76p54M31R97k8j462K41J875j642O99J70o46O79j773L60Q2j5r3m5L85r41
6846i78J462m30j421N31R43j329k03N94J88J073j220N14Q75P82l03j047K62j019
6864g26J341n74r6l83j332K464k234Q64Q92k76n10j88J240r66j583K284k85n10
6882e78J433o53M51q71R32p62J433o53m65k18K96o19P52o82j87R29j696J126j45
6901a77o88RM2J204j440N07L95R57j803J030P43n4j88q24P22R60K66k995J852
6920E18J02j505R35N92o37J125M15n63q9j773J496p17o65k25N81J05J112Q2J32
6939A021j073p14l00M54o49K02J414j11j567K944j991QJ390j533l92J268j0n31
6957a70J582k54l93k71n61K97P13o11m54m07q4j81J539k02l76J029r48m28L56
$$ y = [-74, 502, -252, 179, 1176, 1148, -314, -73, 1802, 160, 859, 1029, 383, 1062, -711, -351, -269, -284, -377, -422, -37, -978, 484, 54, -1367, -836, 107, -1222, -1425, -831, -643, 430, -790, -276, 599, 1381, 1078, 31, 293, -726, 615, 41, -55, -438, -1770, 694, -1540, -676, 216, -60, -570, -758, 482, -484, -2067, 217, -68, -578, 855, 202, 653, -218, 714, -48, 1385, 732, 267, 49, 345, -274, 478, -204, -391, 538, -1158, -32, -177, -865, -856, -814, 390, -1050, -543, -148, 809, -994, 36, 779, 725, 537, -287, 435, 1395, 1661, -1334, 518, 620, -885, 50, 642, 5, 1130, 1545, 982, 893, -880, 616, -101, -766, -991, -410, -305, 807, 889, 1021, -52, -766, -1066, -612, -1261, -1059, 355, 244, -1323, 1621, -370, -362, 1028, -505, -897, 371, 361, -170, 1412, 1158, 765, 494, -67, 230, 943, 332, -122, -529, -613, -794, 745, 543, 167, 1196, 248, -180, 176]
6976A76o79M80n74N40M81j907M20K354j16n13p90q7J66r06M4J215p74N3L54R54
6996H91o39l81K94n27m70P60J88k96q24J702m0o12j71L67L22m16j0k01p75O7Q58
7017H7m16J395n0m86k92K58k39q99L07K8Q18o90P20r50J177j536N46n43K26l32
7037h71K88M42p75KKO38J394l40m37Q09j357J162j132J658j568K0P14j029Q28
7056D48R0o39k62K15q24r07K766j465r68j50J336n47R03l60P81Q80j406J93N23
7075F07j44o03o8J258o55K26l17m75Pl43l11J354n67Q79K46j337l36L27N84k137
7095a805K237r19l29L66m52N94J39j472K268j057N81M69q29r96J636Q84q89m37
7113a1L15l02n6J86q25J964j883K97M7R0l04n04J04M59J300j287O67j11N81j582
$$ y = [176, -503, -23, -597, -57, 424, -1483, -1063, 1291, 1175, 662, -128, -215, -49, -955, -911, 304, -470, -417, -63, 891, 252, -129, 165, -362, -832, -72, 116, -180, -1004, 698, 658, 46, -125, 242, 564, 148, 138, -63, -838, -771, 87, -329, 1066, 1016, 530, 238, 496, 257, -642, -335, -307, 511, -179, 541, -409, 768, -768, -222, -765, -539, -871, -583, -141, -916, -914, -912, -274, 1120, 780, 343, 1152, -205, 957, -175, 1483, -85, -65, 649, -380, 448, 538, -101, -363, -148, -972, -1879, 887, -578, -1546, -1696, -360, -907, -4, -364, 417, 1297, -109, 84, 607, 463, -140, -208, 1050, 395, 621, 304, -171, -164, -507, -818, 536, -31, 848, 1094, -243, -579, -252, 332, -1805, 432, -487, -816, -450, -902, -308, -169, -1641, 627, -430, 151, 620, -209, -1205, 431, 1315, 426, -11, 304, 2, -54, 132, -693, 1271, -612, -315, -268, -178, -482, -986, -882, -423, 877, -410, 257, 146, 727, -855]
7133h55J180r41L94K60J257j462m65N7K089j371ol89j53j59QJ130n09O28o88L87
7153C92K1m76J77M95j762K58J514m70M24j558n91J439l44n51K20M81j25m27M02
7172d81K020j618o94J007R42j318R29n07o94J714j053J002k82r15L42N37j005
7189g4r34J395m02p15N16j67J135m63n63L99J134j774P41q62P99O75r13Q16o06
7208A37J536j837k93j79M3oJ396Op51K38p38j18O96J6L17r72J238q16n02k31J050
7229B30K22k92Q9o96j066J731j319J56J957M1q02o32M76m86P73J45n54M4l49N89
7249B57K98J68j326J053Q39j242m55j89P00j41L64j966J707K44O7J8q59n58J248
7268B27k95R30K5j112N15L50J536j212q98J131k483J325K61n21K28J116j143j096
$$ y = [-855, 325, -616, -222, 38, 1295, -167, -632, -575, 1514, 143, 137, -252, -405, -564, -556, 574, 65, 693, 5, 392, 413, -63, 114, 609, -1153, -895, 619, 149, 573, -985, -1576, -137, -481, -1032, -812, -331, -456, -883, -481, 1539, -79, -773, 234, 1176, -142, 787, 280, -414, 1300, 247, 1249, 967, 52, 394, 931, -74, -1008, 387, -15, -730, -214, -381, 754, 291, -272, 127, 1261, -513, 228, -634, 165, 840, -73, 743, 137, 1673, -164, -457, -636, -593, -599, 797, 803, 52, 290, -448, -566, 130, 146, 463, -509, 729, -87, -589, -820, 230, 452, 160, 249, -447, -1513, 218, -1101, -945, 1012, 1053, 251, -381, 95, -391, 382, 527, -27, 17, -332, 257, 555, 723, -603, 450, 1289, 47, -408, -597, 103, -38, 326, -1640, 67, 311, 378, 396, -463, -1021, 227, -68, 862, 887, -225, 290, 640, 2176, 964, 66, 1197, -1286, 39, 300, -221, 7, 1123, -20, -1116]
7286a116N97k06l6m55R8M71k58k19J278n31K25k35J437j080P2M89n60P8J473j811
7306b89k27R71J134j189o74n89m44K032j046J174r21L70l27k30j24K4r95J237
7324a13l3J31j2J44J76j533O02j44J797p91q2q61J23J843j248J299N71j774q89
7343g94N79J69j286J756r08K05J248q86j138M09N89L02l02o17R14l42K10o27R88
7362D69m08j382J404Q37j239L00O91j59J79o01K28n50p8K3M62j69J055q72n95
7381d05l2J861k243O74Q23j493N98Q54o69N73j219L23L77j242J728j45q04m95
7399i36m44K016j095J438r12K19N49q22n75M04J335k547J459N1L3J15K01p4k02
7418B13k85k81N05n43l55N40m75L59p47K086p78m01J354k557J416J787j294J48
$$ y = [-1116, -519, -725, -761, -1216, -1118, -647, -905, -1124, 154, -377, -152, -387, 1050, -30, 42, 531, -29, 49, 1522, -289, -516, 455, 1589, 400, -274, -863, -1307, 725, -321, 853, -68, 302, -25, -255, -379, -355, -1350, -113, -146, -15, -27, 117, 293, -1240, -638, -782, 1015, 224, 142, -719, -596, 1247, -1, 1298, 1869, 95, -794, -215, -46, -1332, 424, -484, -279, 969, 83, -1055, -646, -57, 245, -57, -674, 240, -102, 108, -519, 469, 61, -1321, 83, 920, -319, -19, 672, 513, 692, 91, 319, -231, -309, -286, 176, 7, 1062, 190, -405, -437, 1424, -819, -145, 678, -815, -217, 637, -32, 541, -678, -355, 22, -1220, 508, 363, -441, -936, -1380, 636, -459, 979, 67, 286, 835, 13, -562, -158, 1177, -1370, 89, 140, 173, 288, 489, 415, 213, -72, -353, 152, -391, -746, -206, -681, -322, -1069, 1017, 239, -162, 1192, -1365, 51, 1838, 544, 692]
7436F92j641K249m80j867J359q12J060l08j348J778J1k49n36M00N92j042P56p23
7454a09L15r61K85P75n43K10k88Q59j431pL15J250J32j088N47m02Q66q0l50M96
7474G91j507k13K407j060k42K83m96m93q48J116Q95r97n94M61o52O76Q09O77j43
7493H70m82j375Q50J13K19J16J66p34J783j053r61R9J050q27P41m08J39m27N53
7512D32j37q24J249j282J329j082q13P46m44k74R89L8k78R32p08o02J046n11O50
7531D56R47q09Q2n0J16m05O34l34m30J667k447J529j198k314K643M17m60J147
7549A191q61l62m33m35o49J778j479J674p31n31J005l07R19j394M03j209J757
7566C36J01K0k75Q81k02j126L93N95Pj062m53J593r97O6L6P09r60p4m95l93P90
$$ y = [692, -949, 1300, 820, -1047, 312, -500, 560, 252, -1096, 682, 693, 444, -92, 308, 900, -142, 614, -109, 206, -755, -470, 305, -238, -28, -316, 543, -888, -895, -580, 670, 802, -286, 261, -141, 725, 645, 295, 791, -716, -929, 1478, 418, 176, 459, -37, -530, -1378, -262, 633, -364, -958, -497, -1149, -473, 336, 1013, 870, 388, -987, -137, -24, 195, 311, 477, -257, 1526, 473, -488, -389, 661, -166, 575, 167, 306, -121, 432, 295, -529, 720, -562, 767, -315, -1128, -382, -826, -1100, -111, -73, -351, 581, -127, -729, 317, -194, 456, 1403, 594, 676, 626, 742, 337, 971, 637, 207, 1874, -573, 956, -242, -2556, 87, 504, 44, 1191, 330, -32, -465, -900, -1549, 229, -1250, 424, -307, -838, 167, -140, 779, -615, -212, -1421, 336, 437, 457, 182, 1063, 861, -265, 128, 723, 730, -332, -785, 808, -189, -123, -87, 622, -338, -412, -907, -1300, -510]
7587e10P98r43J324j502L8J580m8j088n80J116j033R71L54o19L11l61k67J552
7605A093k58n3k1r21R58J62j455L30L03K86p57Q10P56k167O09N2J29j787J258
7624f73J196j229J367j011L3P79L94r34O04n43l76l75J396j344N81P98k77q18
7642d32L90N93m39r19O87m25P76nr16R77p67J668j603Q28p71l72l5Q84j50m20
7662d51J862l008J346L88M15o29L90qj587J944l50Q99k019J517m13r48N91P26
7680F65j964O27J508r57m19M75M39j869Q42N1J185n13L33l3j97l98J120n51m00
7699e6n54J058j058l1J335M12k57j078k89J16J777k007N6J803n6j169k05J59l62
7718d06J36l07N5Q91q7LM44j414O94Q70j326J454n3j320J378k310M07J973o90
$$ y = [-510, 288, -655, 669, -833, -795, 785, 737, -351, -931, 185, -848, 123, 477, -142, 169, -192, -459, 1093, 835, 782, 761, -160, 798, 960, -495, -165, 138, 424, -333, 477, 1233, -934, -325, -273, -144, -1931, -673, 523, -706, 661, -350, -317, 462, 856, -78, 526, -17, -393, -768, 628, -716, -135, 663, 386, -432, -42, 551, 112, -807, -120, -545, 231, 226, -690, 287, -480, 1188, -415, 413, -358, -730, -765, 119, -31, -451, 1411, -1597, -251, 137, 552, -77, 313, 305, -1282, 662, 312, 1211, -808, 709, 296, -652, -61, 665, -1299, -672, 836, -121, -540, -65, 374, -1495, -653, -602, 583, 70, 403, 370, 173, -225, 895, 344, -56, -610, 448, -610, -641, 694, 1106, 849, -229, -518, -402, 1375, -632, -576, 1227, 1171, 2, -203, -44, -406, -270, -577, -522, 369, 282, 285, 729, -685, 9, 879, -447, 1007, 954, -366, 1012, -1298, -891, 1082, 392]
7737C92L4K12o72p57J152j501J880n28J39M37J99j704k92R03l21L91l40Q68k93
7756A99o83O27O82M71J21l78n64l41K89n9M54K67L34j545P37j771K158o61j297
7775i60N00P37n84M67n97M96J552l108M17K548j482J047m07j527J182J293k074
7792e00n89J376l07Q5n36K46Q97p12R49n31j27n02J03l89Q39j057R38o05n74L92
7812f04J117j138L65j90m40o2Q34J00K45N46m5k89J20J89j46n08L82k5p27J647
7832A371p56n01M0J134r60k342J890M57q47K59L46O97k81j479J998j809J8J773
7850A008o97K0Q7n49M00N23q03p78P15j04M67j23l2R19L24j306N05j951O44Q74
7870A43q57J376k13p54N20j091M23M35N65j359Q83j70M32l82r7M42k4o62L88J051
$$ y = [392, 426, 638, -34, -791, 361, -1140, 740, 212, 351, 788, 987, -717, -1009, -106, -427, -36, -376, 492, 199, -484, 143, 825, 1296, 1417, 1039, 475, 134, 423, 364, 818, 1085, 1419, -126, 611, -1160, 998, 337, -960, -460, 277, -307, 160, -437, 59, 1611, -1497, -1080, 1468, -14, 1033, 626, -901, 281, 1574, -500, -1089, 287, -20, 65, -471, -225, 672, -40, 909, 378, 251, -251, -148, -537, 302, -755, 183, -422, -996, -604, 513, -625, -260, -450, -890, -952, -118, -18, 227, 773, 728, 439, 559, 748, 602, 94, 476, 451, -276, 1371, 615, 114, 154, 1288, 328, -2014, -124, 333, -514, -255, 91, 788, 507, -972, 1026, -783, -765, 1008, 311, 331, 418, -131, 269, 792, -11, -789, -74, -178, 289, 166, 134, 1053, 1377, 71, 576, -1375, -731, 143, -714, 662, 449, -305, 215, -876, -453, -18, 547, -812, 71, -99, 333, -49, -146, 296, 272, -390, -2, 1049]
7890A049m96J02o06J68l25J305q75P15j040J5J98k82Q0k14J046l078L058j052
7908b32m35o7M81Q12q11j70J335j376J34J464j751J335p84o68P65Q63K06q43j92
7927F6j430R72J031k40Q25r43J06j332K15n03M38P38j17l6l42Q69l20o17J356
7946G36r78J009j042o5k82J380p00Q06j145P60j81p72m30l27J412j59j57j340
7964a475J935j283J227m46j205J236j037O73j89l81J175M46q29l51j40O21r50
7981i73J344p58J134l96l76L28O12p20L53k72r83Q68L26l38Q3p69J842k778P05
8000g68J770j183j09K69J52q06J469j306K94n83J69n11J239J204k021jJ709K88
8018A275j852N80J452r10p92K22N53p00k9J083j225l12Q20p92R5N17j803L141
$$ y = [1049, 553, 655, 49, 217, -108, 1197, 322, 1037, -3, 12, 210, -72, 8, -206, 840, -2238, 820, -232, -667, -734, -253, 559, -252, -422, 913, -463, -329, 1135, -616, 719, -65, -733, 32, 895, 1101, 258, 66, -1364, -392, 639, 399, 1224, 281, 387, -945, -730, -1233, -795, -57, -174, -210, -552, 317, -3, -620, 736, -242, 767, -275, -340, -622, 758, 58, 864, -281, 479, 298, -474, -904, -1231, 181, 22, -135, -1475, 460, -823, 404, -42, -1247, -11, -1048, -375, -564, -945, 230, 676, -153, -504, -644, -23, -973, 371, -387, 747, 351, -25, 303, 915, 195, 548, 276, -707, 161, 487, 149, 232, -537, 1305, -1473, -768, 1002, -181, -290, -21, 131, -675, 794, -512, -218, -801, -632, -1143, 96, 1300, -721, -722, 987, 1275, -577, 3, 1455, 545, -247, -25, 528, -172, -201, 882, -343, -655, 165, -627, -532, -15, -1818, 1323]
8036A323o16j248J551n2q10N74k53J0O7j138Q17k23n89R29j457J490q11q49J428
8055A43P5n12j580J731L74j4m81J26r77J967j747J064n24m48r7M22O38j76P95
8074G79j411K76P71j18n71k70P83P12j66m49R0M82n61m25K64m82j289J816P87
8093A018j533J08J873k327K8J003l95J342q83m58K81L47o76p91J694O2j867k99
8111a473J537N59m12K43Q15j002O66o84N46p68L53q98JM34l2m60R98r48J431r22
8131a6J46q82J947m06m88q3j27j37M78M67L3N32j757l45J49J635j602L72j319
8150a403L098m98p43j729J281k57N2N8J248j974J381j402O50j023j70J514J626
8167A709k995P10J104m68j408J149k31k63R83M85j591MJ655o59L12n71J140k128
$$ y = [1323, 707, -541, 1010, 958, 148, 722, 469, 479, 546, -592, 225, 2, -587, 342, -1115, 375, -436, -1285, 143, 218, -294, -1874, -143, 231, 217, -264, -138, -1115, 852, -895, 169, -355, -803, -900, -478, 160, -16, 779, -632, -356, 415, 297, -274, -544, 239, 951, 785, 336, 426, 908, 347, -78, 186, -296, -1585, 231, 1018, -515, -407, 1466, -861, -833, 170, -225, 1117, 234, -224, 57, 404, -272, -1063, 631, 693, -1174, -1473, 64, 623, 211, 454, 1269, 267, 933, 249, 795, 27, 380, -518, -517, -83, -115, -575, 423, -525, 906, -16, 130, -752, 1195, 789, 301, 218, 91, -46, 432, 899, 932, 1464, -293, -638, -489, 1146, -456, -84, -1403, 1695, 1197, 454, -1275, 6, -251, -199, -141, 1107, -867, 514, -888, -238, -1261, -1431, 83, 1709, -1286, -576, 528, 60, -1348, -199, -430, -693, 290, 775, -816, -812, 843, 184, 496, -75, 1065, -1063]
8185a063R92R25j391k0r57J636
$$ y = [-1063, -71, 854, -537, -557, -1514, 122]
8191A22
$$ Imaginary data points
##PAGE= N=2
##DATA TABLE= (X++(I..I)), XYDATA
0@%%%%%%%%%%%%%%%%J69l69M00m00M00m00M63o63Q00q02R98j196J327j527J749
31I49j971K217k546K855l183L564l994M462m968N517o121O786p507Q284r135J0079
47E288j1116J2243j3477J4838j6351J8031j9905K2020k4415K7168l0353L4060
59A8031l8471M3848n0538N9081p0411Q6182j09584J47739k19502L96013j513626
70a251238j578255N406720j766013l519394M082724P47554m082311K105178K100168
79B245133l180997J79793K452176j862856q40400J940275n78318j183677J156456
88C27585J38983j030089L46252N85794n93541l34512O57549J46022q48307K89171
98c15093R46636r07018n14426J544175m10749j448416J575220N74055k108185
$$ y = [0, 0, 0, 0, 0, 0, 0, 0, 0, 0, 0, 0, 0, 0, 0, 0, 0, 169, -200, 200, -200, 200, -200, 263, -400, 400, -402, 596, -600, 727, -800, 949, -1022, 1195, -1351, 1504, -1679, 1885, -2109, 2353, -2615, 2902, -3219, 3567, -3940, 4344, -4791, 5288, -5828, 6415, -7062, 7776, -8575, 9456, -10449, 11571, -12844, 14324, -16029, 18031, -20440, 23408, -27130, 31951, -38460, 47722, -61862, 85877, -133625, 262388, -1251238, -2829493, 2577227, 811214, -2708180, 1374544, 2122098, -1960213, 144965, 2245133, -935864, -756071, 1696105, -166751, -1007151, 933124, 354806, -828871, 327585, 466568, -563521, -217269, 368525, -225016, -559528, 98021, 244043, -604264, -315093, 631543, -275475, -789901, 754274, 343525, -1104891, 470329, 1044384, -1063801]
107a063801R32173J619936k125127j69317K282391j485708j247836K323259m76690
116E89280j946334J793850N38467k083646R20918J213855j709863O4498J442289
125H23314j052697n30353J272499l69292q08443Q36976J79399p53694K90345M74809
135C62863m05724k03731M38097R7260m77857P7718N67685m09548m64204P89806
145C72365P847r43613O42760N82595j158862J70415J090961j002899m50546J338507
155F49530n25532r89920J235229Q5112j277320Q39991O39511j261060L09996R95483
165G01020r81430k20918J094398n29206o24834R25297k9236p96583N50294L79054
175D67856p01957Q6015N61320l84027l01268M71561K9759m70674J55856L79019
$$ y = [-1063801, -131628, 1488308, -636819, -806136, 1476255, -9453, -1257289, 1065970, 589280, -1357054, 436796, 975263, -1108383, -187465, 1026390, -683473, -618975, 823314, -229383, -759736, 512763, 143471, -664972, 172004, 351403, -402291, -111946, 362863, -42861, -246592, 191505, 288765, -189092, -111374, 456311, 46763, -417441, 372365, 380212, -563401, 79359, 661954, -496908, -326493, 764468, -238431, -688977, 649530, 123998, -865922, 369307, 454419, -822901, 17090, 656601, -604459, -294463, 701020, -280410, -501328, 593070, 63864, -560970, 364327, 335091, -461492, 88802, 467856, -234101, -148086, 413234, 29207, -272061, 199500, 229259, -241415, -85559, 293460]
185B93460l67071k45619N13932m3137n64071L93249L58341o68195O8808O71245
195D10942n33961l21278P94085k10996o47114O98153J87386q06781M10447N36022
205E16905p65803K4855P41051n28736l50757P44609j68177o03399N32245J97475
215C40268o46277J90424M55399m68953j61838N11632j53897m03541L55573J80302
225A99092m42317O5352M05867k75268k35859M34839P568m37917K84103K98148
235C03608m69901K3213M95717l35656k65991N33351r3673m82418M13536J89600
245C11386n58578J73067M17618m79374j16535N26777k59865l61064M74640K9082
255A57154m81543K76291K85629m41499L925M23044k46241k42730L98199K1086
$$ y = [293460, -73611, -319230, 194702, 151565, -412506, -19257, 339084, -329111, -260303, 410942, -123019, -444297, 349788, 138792, -508322, 189831, 377217, -429564, -19117, 516905, -248898, -224043, 517008, -11728, -362485, 382124, 213947, -389452, 142793, 340268, -306009, -115585, 339814, -129139, -290977, 220655, 66758, -336783, 18790, 199092, -243225, -177873, 227994, -47274, -283133, 151706, 159274, -278643, 5460, 303608, -166293, -143080, 352637, 16981, -249010, 284341, 190668, -291750, 121786, 311386, -247192, -74125, 343493, -135881, -252416, 274361, 14496, -346568, 128072, 157154, -324389, -48098, 237531, -203968, -200043, 223001, -23240, -265970, 132229, 153315]
265A53315l74876K28457K48394l58635j1622L73007k04390k33580L52650J3293
275A86013l71360K10345K25265l80053J179L63164k58767k12363L87478o3747
285H7154l63026K91192J57248m01352J04556L30154l10291j17242L93737j23329
295D8801k96416L25355J01051l62901J48016K78894k99426p2614L46405j31862
305H5303k55653K86305P3936l35583J24775K47227k95079p9581L29847j49838
315C1659k55468K97639M6377l43095J65898K32411l22837k6639L43299j92962
325b3718k12017L46668J72l29077K31348J94153l37556L7940L23837k30708j58122
336a57080L35852m5099k98226K28303J47946l23040M4688K75694k29924j46420
$$ y = [153315, -221561, 6896, 255290, -103345, -114967, 258040, 53650, -179930, 172720, 186013, -185347, 24998, 250263, -129790, -128611, 234553, -24214, -236577, 150901, 87154, -275872, 15320, 172568, -228784, -124228, 205926, -104365, -221607, 172130, 48801, -247615, 77740, 178791, -184110, -36094, 242800, -56626, -129240, 217165, 85303, -170350, 115955, 189891, -145692, -20917, 226310, -68769, -148350, 181497, 31659, -223809, 73830, 120207, -222888, -56990, 175421, -147416, -174055, 169244, -23718, -235735, 110933, 111105, -217972, 13376, 207529, -130027, -92087, 231750, 1042, -157080, 178772, 133673, -164553, 63750, 211696, -111344, -66656, 209038, -20886, -167306]
346a67306L00735n7762k79490K12038J27437l04683N2333K65904k21756j26105
356a98655L09168o3176k62116K45716J19319l10460J00522K63401k51422q2745
366a30448L19941j11453k38832K71677O8017l11427J29411K22209k75736n5381
376a12022K92063j48811k11147K55334K9499k85736J33195J85701k54798l2397
386a49119K63853j34318j77511K52499K9372k53815J48750J71646k38769l130
396i0542K56953j46594j49470K53806M53k43776J62837J41038k62248K4687K34967
407A82111j85851j26374K51991n2021k34269J83350R4921k59092N4158K12909
417A21833j95158q6600K48341p1274j92677J97630P4363k27874Q6526J88079j85943
$$ y = [-167306, 133429, 75667, -203823, 8215, 135652, -169031, -116698, 149206, -72550, -198655, 110513, 47337, -214779, 30937, 150256, -160204, -59682, 203719, -47703, -130448, 189493, 78040, -160792, 110885, 178902, -132525, -3114, 219095, -56641, -112022, 180041, 31230, -179917, 75417, 104916, -180820, -47625, 138076, -116722, -149119, 114734, -19584, -197095, 55404, 84776, -169039, -20289, 151357, -87412, -90542, 166411, 19817, -129653, 124153, 124606, -119170, 43667, 184705, -77543, -52856, 182111, -3740, -130114, 121877, 69856, -164413, 18937, 113858, -145234, -91076, 121833, -73325, -159925, 88416, 17142, -175535, 22095, 96458, -131416, -44890, 143189, -42754]
428d2754m9215K29701q0606j67845J93421M8496k20062R5827J59030j98996l5554
439f8557K09158j13341j53172J93768J6320k20515J09739J36402k09591j6500
449a16289K13593j27886j33135K14397k5k04797J43141J26710k09890K2391K10286
460A38496j42754j02746K23667k9252j93952J59741R5405k19683M8084J81338
470A58344j71472p7048K08483o8721j76082J64333N4262k12505O7583J52176j75423
481g6070m6537J97418p8087j45173J70005M2169j86435Q3983J47685j58989l4731
492h4762J95128p1298j39586J70789M4811j93802Q2731J46582j76696l6358J96639
503A34178r5946j47649J81378J7516k09051J03935J29344k03709n322J95490j37412
$$ y = [-42754, -91969, 137732, 57126, -110719, 82702, 131198, -88864, 6963, 165993, -33003, -68557, 140601, 27260, -125912, 67856, 84176, -136339, -26600, 109802, -99789, -116289, 97304, -30582, -163717, 50680, 50655, -154142, -11001, 115709, -94181, -71790, 138496, -4258, -107004, 116663, 87411, -106541, 53200, 148605, -71078, -22994, 158344, -13128, -90176, 118307, 49586, -126496, 37837, 92099, -120406, -52823, 99353, -76070, -122607, 74811, -3276, -148449, 21556, 63725, -122710, -38727, 108958, -50031, -84762, 110366, 39068, -100518, 70271, 115082, -78720, 4011, 150593, -26103, -62461, 134178, 38232, -109417, 71961, 89477, -119574, -15639, 113705, -90004, -95326, 100164, -37248]
514c7248j09240K04324k8929j78820J50480Q2817j90797N6490J57774j41854m7490
525h2493J80854n3120j25054J38670M0470j46537N0298J11624j14641m7364J30557
536H3264l3744j19410R0198N6399j42161J2078J29164j08609p7220J55552k2814
547B2697j54802J24031P9403j82243M6166J66154j52117n1790K08998p9418j42586
558a15507J94295J5836j91235J25523J08096j90925L1488J61018j43149o1699
568f6259J67023o3339j23943J26676J9260j39477N7602P4741j06672j5580R1632
579B1664l5266o5631O3586L8033p5749K867Q9199m2825o2111J03140K1745j16083
591e7431O9069R4954j34976k665J52643j05215q8283J74752l9419j64594J53162
$$ y = [-37248, -146488, 57836, 28907, -149913, 567, 83384, -107413, -50923, 106851, -35003, -82493, 98361, 45241, -79813, 58857, 99327, -47210, 3088, 114712, 71, -47293, 83264, 49520, -69890, 20308, 76707, -65454, -53376, 75788, -32821, -110041, 45511, 22697, -132105, -8074, 71329, -110914, -64748, 101406, -50711, -102501, 106497, 27079, -115507, 78788, 94624, -96611, 28912, 137008, -53917, -22429, 138589, -4560, -66259, 100764, 37425, -86518, 40158, 59418, -80059, -22457, 52284, -54388, -69968, 21664, -13602, -79233, -15647, 22386, -53363, -50496, 38703, -4122, -66233, 36907, 58652, -57431, 11638, 106592, -28384, -31049, 121594, 16379, -71904, 102848, 63429, -101165, 51997]
602E1997M6793k02206Q3857J27892j89716M92J75673j32569q3187J77306m8348
613G984j32938J35439L4475j37440O8246Q8567j02806j861R8223m1413m6583O4103
625C3996J9104n3940L653N9010k6332n9606N6073L2863r9910J8820R3676j01120
637b3713m9206J36485n8868j19979J41628J6875j68602J04168J00104j80626L5880
648f5854J63093j47761m3167J88934q2488j11931J71818m223j45767J15632O1516
659I9802j43693M3699R9569j04344k2211R6417m8148n8131O0167L500n7507Q960
671b1920L5656k2888l7866L1394K6240n7241m159P5450m5248n2451R9851j663
683B5155j03441R0504N7254j30306M7524J15868j26366j7115J52336r1058q4363
$$ y = [51997, 98790, -103416, -19559, 108333, -81383, -80891, 94782, -37787, -120974, 56332, 7984, -124954, 10485, 44960, -92480, -24234, 64333, -38473, -40334, 57889, 16476, -30107, 33996, 53100, -840, 2813, 61823, 35491, -24115, 31958, 64821, -35089, -16269, 77407, -23713, -72919, 63566, 4698, -115281, 26347, 43222, -125380, -21212, 78892, -101734, -65854, 97239, -50522, -93689, 95245, 12757, -99174, 72644, 68421, -77346, 38286, 99802, -43891, -192, 99377, -4967, -27178, 69239, 21091, -37040, 23127, 26627, -30880, -21920, 13736, -9152, -47018, -15624, 10616, -46625, -50784, 24666, -20582, -73033, 26818, 25155, -78286, 12218, 69472, -60834, -13310, 102558, -23808, -40923, 111413, 20355, -64008]
694f4008J52726l2588j32421J22018L1969j48514O6008Q1050j30209N055J03738
705E4824q4385m5106R9876k9730o7164O7990J5118o0186K4031L8638k4684j3365
717b4143L4546J4586l1366L638M9592k3962m1269O2075R987q0971M9792N0568
729G3073r9126Q212R2720q8107m7021J17351n0526r4981J13710L937j25158Q0859
741a5057O2328j26719L3411J01830r8785j8863J13408n3028n8276R8058O67p6145
753c7171N8146M1474o9958J1158N4033l8418k6573M0753K397m3591O415L3194
765C1859l3880l2496M5612k57o2513L1646M3203p2070j179P9482n5034m2908R2658
778B4123j2754p9132Q2650L2743r6445M5887P3864q9391j284R7092o0873m6021
$$ y = [-64008, 88718, 56130, -76291, 45727, 77696, -70818, -4810, 76240, -53969, -48914, 54824, -29561, -74667, 25209, -4521, -71685, -3695, 11423, -48763, -24732, 13906, -10778, -24143, 10403, 24989, -6377, -2739, 46853, 22891, -18378, 43697, 53684, -27287, 22505, 73073, -26053, -17841, 74879, -13228, -60249, 57102, 6576, -88405, 25305, 29242, -95916, -15057, 47271, -79448, -46037, 55793, -42992, -61855, 51553, -1475, -59751, 38307, 38974, -37171, 20975, 62449, -7509, 3649, 57682, 19264, -7309, 33444, 35841, -7750, -1335, 31859, -2021, -34517, 11095, 10838, -51675, -20029, 23174, -48896, -50075, 29407, -25627, -68535, 24123, 11369, -67763, 14887, 47630, -48815, -2928, 70936, -18455, -19739, 77353, 16480, -29541]
790b9541R0004j7415p6476O1985K3556q1007K0580N2942o1228k0801N6415k5139
802f125m5361M2018J5720n1352J1501M4045k9137k3881M9358K112m4266L4184
814a184L8324n0956J486O3575l7491l3843O6581o607o4241M9271L0651p3844J5109
827c169N7495o3532k2566O8460l5780n4776O2649M858o8497L5829L8515o1897
839d2411K218N9749l6639k7190N8620j824m7608M0027K9687m8169P060N2065l3719
852A1866k2868N0017n488m5145L0245K5370n2066K247M3983l8505k9307M8024
864A8373r533n3918L6842K2219n7402J0699M8010m1245j8685N7476j3846m4402
876d5412N0480J7492n1660K5217M5452m5664p284N5921k3167l6183M7207Q631
$$ y = [-29541, 60463, 43048, -33428, 28557, 52113, -28894, -8314, 44628, -16600, -37401, 19014, -6125, -51486, -9468, 6252, -45100, -33599, 10446, -18691, -42572, 6786, 8898, -35368, -1184, 37140, -13816, -12330, 51245, 13754, -20089, 46492, 39885, -24356, 24915, 55566, -18278, -3169, 54326, -9206, -31772, 36688, 908, -53868, 8781, 13639, -54858, -19029, 19486, -42411, -40193, 19556, -17083, -44273, 14347, 12523, -35085, 4942, 34629, -13540, -6480, 45585, 11866, -11002, 39015, 33527, -11618, 18627, 43997, -8069, -5822, 38161, -344, -29651, 18373, 8840, -45078, -8236, 13983, -43419, -32720, 15290, -25955, -44640, 12836, -1010, -45412, 5068, 22560, -29100, -3883, 41569, -4095, -11379, 44542, 21375, -14808, 32399, 41030]
888D1030n4240K6398L3777n2809n793M5569l3085l5107M6923l253n0826K9678
900a1738K5380n2349K842M8573l2850k4626N2150k467m2674L7448K5589m4420
912a9142R371M6501k9997j7868M7114m186m1632L1900K0624m7662O270L8128l7215
925B206k0581M1889j2511m4977L1242J5850n0945J1965M0049m0865j5478N1274
937I118j5249l9106M5869J2584m7087K8545L6126m0738k302N0051k3284k6383
949a1856M3837J783m3867K9907J9752m2471J592L3335k9586k0518L3918q204l6065
962b8443K0159J6075l5276j048L3245k2572j8990L6325n59l0547K3507K4412l3219
975a6931M808M0582k3836j8864M4762m525l9131L4291J8902m8071J3161L3768
$$ y = [41030, -13210, 13188, 46965, -5844, -11637, 33932, 847, -34260, 12663, 9410, -41416, -11738, 13642, -38707, -35865, 12708, -20142, -44768, 7382, 4915, -37759, -311, 25278, -19142, -9771, 36730, 6733, -11135, 35979, 31793, -9839, 22061, 42685, -4977, 1293, 39421, 2206, -18375, 23514, 11003, -33974, -2732, 13118, -37827, -25862, 14187, -26678, -42156, 9118, -6131, -45237, 632, 13216, -33871, -5326, 30800, -9938, -12240, 37811, 14527, -11856, 31981, 33764, -10103, 19804, 39556, -2915, -1323, 32012, 2426, -18092, 15826, 7622, -28443, -8284, 7791, -27485, -28533, 4712, -17860, -36850, -525, -1084, -31631, -8124, 16288, -16931, -12123, 28459, 4623, -14241, 30521, 25996, -13135, 21156, 40058, -8013, 5148, 38916]
987C8916l7473j2715M0570k2283l4015L6822J749m4933K1679K3071m1297J161
999b8748L5220k4596j7211L6903l585k7290K6008J8445k8353O808K9414j4165
1011H850j6065K8677J868k5284J6428J8822l0194m235L2155k0389k4277K8939
1023A5295L57l7189J6727K0755l9714k257L5886k9091j9366M1818p036l5810L6631
1036b994J4716m0444J7249L3814l2626l938M1832j6029k1748L6580R31l3072J9502
1049A3773J7455l0816J215K5084j9124j7157J9925j234k6892Q517J6363k4069
1061a6960o060K2949j0386k1188K3421Q193k8326J2491K6929k4170o113L9565
1073B0345j3969k2984L4609N639l3970K5723K0140l7025N140L2368k9035j5154
$$ y = [38916, 1443, -11272, 29298, 7015, -27000, 9822, 11571, -33362, -11683, 11388, -29909, -28748, 6472, -18124, -35335, 1568, -2017, -29307, -3299, 15146, -13207, -6399, 23015, 8850, -7215, 21462, 23330, -1954, 14474, 33296, 3102, -1133, 31022, 10633, -13644, 15295, 15652, -21537, -4810, 15945, -23769, -26026, 9860, -19231, -38597, 3221, -3815, -39625, -2994, 11722, -28722, -11473, 22341, -10285, -14223, 27609, 11580, -10168, 26412, 27343, -5729, 13773, 31228, 412, 1627, 26711, 7587, -9570, 10355, 9121, -17771, -9254, 7109, -16960, -23020, -71, -10457, -31645, -8224, -31, -28357, -15866, 11063, -13107, -19220, 20345, 6376, -16608, 18001, 23640, -10330, 15393, 35533, -1492, 3648, 36016, 6981, -8173]
1085h173L4744j4607l0255K6737L841l4977J3540J6960l0269k452K6828j6124
1097a4207j3630K2800P17j7665J2377J5652j5508J087K2248n781j0875J6867P101
1110B1183j8040N822J9177j6983j0985K4265p341k5427J9753N971l4138R939K0930
1123A4126l0323o193K9884j9672k0094L1067j716l0708K5771J5916l1337J0380
1135a2899K8269k5722l762L4442j1962j7765K9938J390k2704J4327J3525k3415
1147C662K055J5183j2145j2745J3269k286j6409L109J1384j5721p592J4211l701
1160g726j5222J1066J1619k0968L965K4342j7169q830K8929l339k1082K6597Q933
1173B1115k7615J4845K1484k7472k148L1572k0715j7815K7844o376k9951K3200
$$ y = [-8173, 26571, 11964, -18291, 8446, 12287, -22690, -9150, 7810, -22459, -24911, 1917, -14207, -27837, -5037, -4320, -21985, -9608, 6044, -9464, -8377, 13871, 8090, -2785, 14082, 21183, 3143, 8965, 28142, 11159, 174, 24439, 17098, -8329, 11424, 17395, -16743, -6804, 14126, -16197, -22390, 7494, -12178, -32272, -1205, -2921, -33629, -7858, 8058, -23279, -12899, 15370, -10352, -14114, 20328, 8366, -9399, 20539, 21929, -775, 13552, 27077, 3662, 5717, 20900, 8755, -3990, 9279, 6993, -9416, -6307, 5077, -10644, -18236, -4025, -7726, -22948, -11882, -263, -21231, -17266, 7076, -10093, -18923, 10006, 6667, -14415, 12182, 21115, -6500, 8345, 29829, 2357, 209, 31781, 11066, -6749, 21095, 14719, -15232, 7968]
1185G968M026l0053R721J5793k2500l200J9733j2949j2218J7506J680j4671R376
1198i788J2147r727q48J3802k614o207R840J0010r645j214J5995p784j1494J6507
1212A8980j370k1693J2223R774k5121P25J9389k1886j1070K5902j2460k1149K6207
1225a549K388k9601J8576J4136k5381Q147K3892k0426k197K6067r159j0911K0051
1238A4033J592j7007J2151J1965j5386J540J0244j0181o789O754l14j1144Q3N703
1252C244r503p945R095n43j5350P857J3101j7113N92K0134j2646r628K4189k802
1266B682j7526K1303J0572k2454J0646K0254k2910n79K4753j7716j1128K4036
1278B1933q116k1770J7140K098k2253M788J2922j9270k718J4502r322r631J1838
$$ y = [7968, 11994, -18059, -8338, 7455, -15045, -18245, 1488, -11461, -23679, -6173, -4493, -19164, -9788, 2359, -7368, -8216, 5586, 2972, -3235, 6605, 16615, 6970, 5756, 21751, 13967, 2473, 18980, 17610, -4083, 8140, 17914, -7207, -6482, 12907, -8979, -20049, 5853, -6607, -27756, -1549, 839, -28762, -10186, 3950, -21431, -13284, 10608, -9818, -12015, 14052, 4893, -6018, 14033, 15625, -1382, 10769, 22734, 7348, 8888, 19132, 8951, 2162, 8916, 8602, -2542, -2459, 3244, -6259, -14204, -5109, -5652, -21002, -13145, -44, -17157, -16565, 3569, -9077, -18705, 5484, 2682, -14844, 6459, 17031, -5423, 5223, 25477, 2567, 1988, 26741, 9025, -2103, 21933, 13817, -7953, 9187, 11285, -10968, -6180, 6742, -12528, -15246, -744, -10066, -19697, -7859]
1291g859O30r025M942Q084l461k812J0177M453j0604R419J2271j0930l594J7918
1305A9609n851j1823J6194o01j8156P863J0248k1263K33J8202j9489r751K0092
1318E507j0149j7987J8917P28k0327J1842J1376j6784M865J5997r621l288J4294
1331E370j240q562J2024N389j0089N061Q897q041k393P695j926q132J190N603
1345A0846j0165l991P528o969r488Q156J692j4830N169R974j4873j6J8055j0246
1359i158p481K0342l724j1184J5207N718j5515J0972J1514j3262P22J4611p870
1372A0892r021J2385l535j2036Q994L028j2956j12O929j0575m771Q940n153q242
1386a5233O928M433j0418J394R838m272m855J1839K097q326Q958Q286r467J316
$$ y = [-7859, -7229, -16254, -11312, -3228, -6689, -9501, 676, 5129, -5475, 3944, 16215, 5285, 1691, 19609, 13758, 1935, 18129, 17528, -628, 7235, 17483, -3780, -3547, 14655, -4834, -14585, 5507, -4642, -22629, -3712, -2984, -23311, -11469, -93, -16877, -12012, 3985, -5636, -8924, 5370, 4130, -4432, 7592, 12981, 2892, 7953, 16850, 8809, 6416, 14111, 12185, 4053, 5243, 10846, 681, -3310, 4218, -2751, -12239, -4083, -2391, -17221, -12052, -2078, -16951, -16967, 1088, -9158, -16639, 3703, -21, -11205, 4002, 9720, -5795, 5177, 16691, 3429, 4151, 18762, 10892, 1871, 14256, 10721, -1315, 7679, 10707, -2249, -2361, 4568, -6007, -10778, -1838, -6991, -15233, -8305, -3872, -14290, -12896, -3058, -7330, -12185, -346, 1751, -6575, 2383, 10669, 1202, 2518]
1400B518J3057q824m716J4261k490j2427Q450M749j5684K908R453j3923n286J3421
1414E467q424j2117J1061K322j5941N401J0708j2645P87J4878p164n357J2639
1427A615L282j1106R693Q729j0004J868J1329n860p155J1656P84j4330N999O980
1441A3480j2071l412Q870p893p930Q414k465r751L996O510j1951j973J3618n311
1455g869p330J4256O5p595P701P676r242L018J1398m952m868J0428R33j0717O876
1470I778M410j2841L176O873j2315k011P080n167q122N476P36j0779L643M847
1484e216o963N97P808m119k428Q326P0k363M324N932l472N0P738k029l292N743
1500A0706K990r903M896L187q213j957O921q538m503N976m010q540N706M295j2040
$$ y = [2518, 15575, 6751, 2035, 16296, 13806, 1379, 9829, 14578, -1106, 1802, 11255, -2668, -7954, 5467, -2957, -15074, -4013, -1691, -17632, -12231, -1523, -14168, -13381, 1497, -5667, -11024, 1615, 4897, -6209, 3484, 12213, 2209, 4077, 15406, 9546, 2391, 14047, 14831, 501, 6500, 13480, 1409, -2003, 6867, -1026, -8956, -542, -3007, -12758, -8762, -2252, -14203, -16176, -2558, -7869, -15199, -943, -878, -8473, -772, 6904, -2338, 680, 12078, 7126, 2258, 12686, 13619, 2902, 9778, 14188, 1347, 4523, 11396, -919, -2930, 4150, -1017, -9139, -3663, -2927, -13706, -10063, -5216, -12179, -11582, -3774, -7893, -10321, -1995, -1925, -4288, 36, 5968, 2496, 2546, 10284, 8255, 4963, 10706, 13696, 3793, 8689, 11876, 3663, 1706, 8627, 89, -4414, 1562, -2448, -10988, -5282, -987, -13027]
1515a3027L082Q714j0924q08J1749n806m016J1101R76p402J0225L012n931K663
1529C608Q939n798j479P077k741m912M505J135q901P1L565o271k064K873j055
1544a448q800J977M967r263k47J0526m971n906R952J498p858N564R267q982J533
1559b191J4402o080n639J1899j535j0670R568M841j2610K194Q750j3968p67Q070
1573F264n713r111P670M20r972L097N225r390J35O320k794r13K820M519m302J427
1589d298Q830k961l032Q356J286m004N079K746o812r70Q447p042o002Q916l101
1604E438r718O643L22j0136L238M367j0129J04O544n596k251O520j224l478N927
1619c429L069m386M519N295k863R9O643k925q14N053j2k775n89J407j527l336
$$ y = [-13027, -9945, -1231, -12155, -12963, -1214, -7020, -11036, 65, 1041, -6361, 3864, 6876, 945, 3608, 12547, 6749, 5270, 12347, 9606, 4694, 9199, 10334, 1433, 1504, 5069, -1202, -3266, -393, -1448, -10248, -8271, -3304, -12567, -12814, -2288, -7259, -13165, -3213, -1715, -9573, -4009, 5258, -3724, -2191, 12211, 6131, 492, 12391, 10856, 186, 9754, 14595, 1985, 4179, 12929, -1039, -1806, 6264, 551, -8560, -890, -470, -10442, -7345, -2120, -11510, -11375, -5055, -7849, -8762, -5942, -1423, -5725, -4298, 4532, 1571, -1461, 6895, 8181, 4177, 9256, 12002, 5190, 4220, 12667, 5625, -377, 8539, 5438, -4280, 2363, 2685, -7451, -4213, 154, -9975, -9871, -3327, -8923, -11174, -4654, -5878, -9356, -3429, -360, -4746, -227, 5068, 2205, 2304, 8947, 6022, 5208, 10261, 10249, 7474, 6885, 8292, 6765, 3429]
1635C429K30j034n060n80J559m630j565M035n187j516M579p19l927N450K208n150
1651g878L959N870m970K177P834m028k136R106k343m941O802O67o851K583K864
1666H715p306j508P485o554m423M557l322o801M303J610o219J133L086j884j295
1681h423M635K194m886N024L395k479L01O374j151l201P784J127o490J630O206
1696A2040r303n02Q049n259r010Q257k301r717N892J343q043J06N686m909m446
1711a2117P517r6n487O626L803o699K586P560k475j701P217l13l127M010L412
1726A0716o311O87M313j968n344M395r08o938J046L640p330k431M572l482k978
1741h321M045l82o957M261N079m543J260P351m166j179P382j032l237M364L825
$$ y = [3429, 3659, 2625, -2435, -3015, -1456, -6086, -7651, -3616, -8803, -10319, -5740, -6459, -10386, -4936, -2728, -7878, -3919, 1951, -3019, -842, 6992, 2964, 828, 9934, 7591, 2650, 9452, 10119, 3268, 5851, 8715, 1409, -99, 7386, 832, -3591, 966, -2356, -9157, -4854, -3244, -9463, -8330, -5244, -7128, -8423, -3788, -1594, -6480, -1456, 1939, -540, -239, 6135, 4984, 1783, 9567, 10694, 4204, 5834, 12040, 2737, 2235, 10284, 5025, -3985, 4272, 1971, -7746, -1854, -511, -8554, -8448, -2762, -7671, -12117, -4600, -4696, -10183, -3557, 246, -6453, -3867, 3693, 1218, -483, 6734, 6421, 3294, 7304, 10716, 4405, 5092, 9405, 7437, 2093, 6488, 5580, -1358, -312, 3328, -4002, -6433, -1861, -5343, -8321, -4276, -4658, -11615, -7354, -2275, -6818, -5558, 1793, -2373, -3552, 3830, 2798, -439, 3925, 7750]
1756G750l951K264K684l873l72L167k762l794L491k352l926Q87o64k212k624J633
1772d654k95k910J485J5n27J863J112j440L150N83R18J128K047K090k227J244
1788C582L923k674O05L174l786J12J488j872l758J579q7m386J600r40l779j997
1804g216L420l177k475N097n69l413M028K044n139N421M684m240J901M543j022
1819C887p25L292O32l578L096J944m092j094K857l385k757J610k56m535N05J19
1835b480k315l044M850j407n081L757J175l744L159N589m654J44Q004j309n134
1850b490P126K506o409M829M110m673j443N923m692m285O108k957m365J247J194
1865A729n937P2L517l875k660J662j61k258J912L457l068m50M304J048k829M812
$$ y = [7750, 3799, 6063, 8747, 4874, 4502, 7669, 4907, 1113, 4604, 2252, -1674, -787, -1451, -3663, -6287, -4654, -4949, -7859, -6374, -6359, -6886, -5023, -3911, -5351, -2201, -1618, -700, 428, 2475, 4565, 2338, 3582, 7505, 4831, 5436, 8610, 4824, 4936, 6424, 4552, 794, 2373, 2286, -2100, -500, -1440, -5219, -7216, -3796, -6973, -9448, -4351, -4920, -8333, -4305, -2261, -7400, -1979, 2705, -1535, 366, 4909, 3887, 3162, 6454, 7086, 3508, 6604, 8548, 4456, 3362, 6219, 2834, 77, 1687, 1431, -3104, -2599, -2480, -4795, -7839, -2989, -4396, -9477, -5720, -4545, -8289, -5130, 459, -4195, -4051, 3953, 2644, -2490, 4636, 7142, 733, 5562, 9672, 4999, 3556, 9479, 4787, 502, 6610, 3653, -712, 535, 1729, -4208, -4136, -619, -4494, -7154, -5492, -5653, -7911, -5999, -2542, -5610, -6060, -1756, -708, -3537, 1275]
1881A275J650j985K239M207j722k157M804j621l789L041l16l969N64J652l702
1896A71r46K43j022m145L978j469m456J793J310k242J671K201j945J556L067r26
1912a161M23L082P89o42K631N40n78R06Q93j346j862J287L08k449k91p47j656
1929A27p75K30k324k842K112k268j337J820L66j047J065K777j439m49M271j63
1945A24j835M900J912k273L233J259l631q71M430k287q74J828k195l255K226k833
1961a42k619J352j38l008j911L986j772k919K496K229l587P45M883k287p99N056
1977A565o93j066L963P82j683N69L228j073k077M605k172m621L158n83m849M58
1993d89K251l975k698L008k558k129K836N07n190K606N764l114k753N079q04j183
$$ y = [1275, 2925, 940, 3179, 7386, 5664, 3507, 8311, 6690, 2901, 5942, 5626, 1657, 2221, 3873, 171, -775, -532, -1554, -5699, -1721, -3190, -7646, -5853, -4543, -6785, -5114, -2913, -4858, -3302, -235, -1161, -738, 2344, 3133, 2491, 5122, 5662, 5084, 5990, 6883, 5537, 3675, 4962, 5270, 2821, 2530, 1783, 127, -648, -418, -2742, -5584, -3472, -5740, -7077, -5257, -4891, -5938, -4873, -2096, -3535, -3984, 287, 124, -1711, 3189, 5101, 2828, 6061, 7320, 3689, 2818, 7248, 4961, 4087, 5915, 3720, 465, 2691, -142, -2761, -1409, -1547, -4555, -6466, -2480, -4252, -7171, -4675, -2446, -6033, -5288, -405, -2692, -3491, 1565, 872, -194, 3769, 4551, 2868, 3437, 6665, 5592, 3515, 8120, 5948, 1327, 4485, 3902, -947, -489, 1762, -2213, -4911, -1903, -4461, -6590, -3754, -3247, -8437, -5831, -67, -3181, -5934, -855, -1659, -2842]
2009b842M248J199j36l67L574k341L7K368j080j012J557K95l186k38Q42k270j139
2026d91O85k962r86Q35J71k606N57J050l93j684K198J754l058L831J322k291L354
2043A286J088l50L73K245P89k098L343j218k696R58J329k626o30k00j274j445
2059a126L34j910o47K74p99j519R06o78Q53k83K001r31J047K398N09J217O86m38
2077A894Q86J891p69J056p14J834j177j269p78J401l541M96m37j296j085k49k81
2094b138l209K631J68n081L089J246l060J483K997j425N92M578o87j953L270J575
2110D076j379P79L289l486R42J474j078j659J314n4l839p63J851j450l789J626
2126b146J131n763J491J871k101m76L580k572M89L780J22j479J989K422j277O68
$$ y = [-2842, 1406, 2605, 2469, 2102, 5676, 3335, 3372, 5740, 4660, 3648, 5205, 5500, 2314, 2076, 2918, 648, -491, 194, -2768, -3754, -2919, -2748, -5354, -4797, -3747, -4140, -5824, -3626, -1872, -4930, -1099, 223, -2068, 1286, 2374, 2024, 2397, 4642, 5431, 3333, 6676, 5458, 2762, 3720, 5049, 2423, 1793, 1593, 319, -1126, -792, -2702, -3349, -3075, -3874, -5393, -4487, -5165, -4312, -4595, -2594, -3525, -2478, -80, 429, 1646, 2332, 1894, 2780, 4671, 3902, 4958, 4244, 6078, 4901, 3632, 2854, 4255, 714, 1210, 773, -523, -1608, -1857, -2138, -5347, -2716, -2548, -7629, -4540, -3294, -6354, -4871, -1874, -3299, -2707, 1871, 1184, -769, 2501, 4076, 2697, 3476, 6765, 3279, 4221, 5695, 4617, 2958, 4272, 4218, 379, -384, 1467, 17, -3772, -2146, -1015, -6778, -5287, -3416, -5517, -5993, -2413, -4985, -4496, -716, -594, -2073, -84, 2338, 1061, 1729]
2142A729L108j503R7M350l447k601L352J5k603k6L81k384k465J183j510j753J333
2159b744m97k192P87J456j159m52J280J377n28J173K360j575Q7K199J226L45K00
2176C343J809k279J740L0j491n4J324j258j682J87K53l518J152n88m025J798N54
2193b705j426p9J323l46O2J44R11k35N15J604J640j99L84J444j756K616n91J599
2211D905j367r3K83Q28l33k527r33r20l80j559N41j38k190R12j310o61J257J351
2229b334j906Q24K315k6j994L312N41j246J285J614j765J884J516k51q95K103
2245D977m41k332K151k576J20j631P18k348j040O73r73j282l01K55P20l67P54
2262b923q6l32J443J018o78L19K455m16J91K404q0J53K92J59j200K55K207k986
$$ y = [1729, 4837, 3334, 3431, 7781, 4334, 1733, 5085, 5100, 2497, 2471, 2852, 468, -1997, -814, -2324, -4077, -2744, -3241, -5433, -4646, -3190, -4349, -4801, -3521, -2144, -2672, -1499, 861, -714, -627, 1572, 2798, 3143, 3343, 5152, 2873, 4613, 4643, 3152, 3098, 4422, 3164, 1482, 1669, 1922, -1596, -444, -1032, -5057, -3259, -2705, -4131, -4210, -2887, -3233, -3171, -3027, -2116, -2351, -1836, -232, 1408, 1209, 1593, 3037, 1281, 3897, 3306, 4905, 3538, 3445, 3728, 4556, 4223, 1696, 763, -157, -537, -2096, -1555, -1693, -3883, -2971, -4281, -4942, -3685, -2334, -4240, -3416, -1101, -1127, -3121, 191, 732, -514, 771, 2385, 620, 2504, 4020, 3769, 2874, 4977, 4536, 2204, 4355, 1779, 1899, 268, 986, -1362, -2402, -1729, -2702, -3984, -4285, -4030, -3310, -3677, -2923, -3009, -3341, -1898, -880, -1558, -1239, 1216, 800, 991, 3395, 3315, 3468, 3760, 3919, 2719, 2974, 5181, 2195]
2280B195oP26j769j915J794k188j257j498K501k85l331K024m4k058J851J068j277
2297c469M54K918l01R1L014m23k16J52J776o8j015J418o61l75P53k196r31O53
2315A574j234p23n39o27j409J338j190l36k198J804j62P82o18J532Q12l20L39
2332a175j030L140J038k35P72P73M96j93L09J083j788m84O7j859J69M65j315k150
2350a917J213j403k70m0k70N26j516R93J82j117J096J736j84J50J656j405J616
2367A046J229Q67p49J555j600Q62R90K04j507L96j096j787L08r62L16j879R85
2384h22j633j163O84K37q75r2J039k84mJ335M39j172J511J362J066r41K411M18
2402C516j819J926N87j121N25n9k395J109K6j617q87N06l37j578l80O38j160m29
$$ y = [2195, 2189, 2915, 1146, -769, 1025, -1163, -2420, -3918, -1417, -1702, -5033, -3009, -3053, -5111, -3260, -2192, -3469, -3015, -97, -398, -307, 2707, 2284, 2068, 2220, 3996, 3928, 2913, 4331, 3670, 3295, 4048, 1852, 921, 1574, 340, -383, -922, -1549, -2958, -1620, -2810, -3146, -5344, -3540, -3702, -2920, -3538, -2006, -1194, -1514, -1175, -2205, 935, 1973, 1738, 2510, 3283, 3779, 3586, 3895, 4978, 3190, 2706, 2773, 914, 1083, 1548, 233, -1917, -704, -2107, -2377, -2417, -2687, -2161, -3677, -2684, -2502, -3619, -2523, -787, -971, -821, 835, -570, 1046, 2275, 3142, 2393, 3948, 2348, 3210, 4200, 4404, 2897, 3293, 2197, 410, 718, -244, 72, -1807, -822, -2455, -3618, -2934, -2697, -3572, -3664, -2625, -2909, -2913, -1578, -1139, -2311, -800, 562, 1628, 687, 3098, 3516, 1697, 3623, 4210, 3089, 3614, 3555, 1160, 2269, 2295, 678, -209, 297, -40, -1618, -1998, -1360, -2520, -2949]
2420b949j91n39N43J00J344j859J736J982l35p57J003K080q37Q68J293k238J249
2437B493J648j24j592L79o75j629P72K97r62j156k30n71n07p97J72Q1l68O38m68
2456b599k4L27P92n60K127k03j037K567k76J139P50j122K784j844J98j02L3k4
2474B926m49j915rr95j530J799j777J699k468j125K74k47K073l70r03J492P6k45
2492a694R88p6N82M71J565N02r00J087L67o6O43j65J01j378N6K09k428K38j361
2511a259P69j121P79k950J441m87j260j69K586J20j026l50J533M14J080Q35n87
2528C48O86J007J147j426Q96N94q97K71K02O75k694J448j587q14k86J07k195M35
2546b083J152j183j086J074j824J79K248j242O11L37J190M54p77K173O02n64J336
$$ y = [-2949, -3140, -3679, -3136, -3036, -1692, -3551, -1815, 167, -168, -925, 78, 2158, 1321, 2189, 3482, 1244, 2493, 4141, 4017, 2425, 2804, 2129, 500, 1272, 1569, 607, -549, -779, -1350, -1857, -2654, -2482, -2401, -2769, -2131, -2599, -2623, -2296, -1504, -2064, 63, -140, -1177, 1390, 1114, 2253, 3003, 1881, 4665, 2821, 3019, 2917, 2950, 2926, 2477, 562, 553, -442, -1972, -173, -1950, -251, -2719, -3844, -3570, -3817, -1744, -2114, -3017, -1525, -1449, -1694, -706, -782, -200, 271, 1836, 2338, 1438, 2525, 2892, 2826, 3469, 3304, 3405, 2027, 2083, 2292, -136, 102, -1259, -490, -1611, -832, -3782, -2341, -2828, -4088, -4257, -1671, -1551, -2577, -2927, -1394, -980, 100, 935, 348, 1034, 2041, 3188, 1762, 2658, 3252, 2355, 2626, 2828, 3503, 809, 2257, 670, -144, -430, -323, -2518, -2083, -931, -2114, -3200, -2126, -3950, -3771, -1523, -2765, -2154, -1817, -627, -173, -950, 1223, 1825, 1261, 2597]
2563B597p02J57O67j207J126n62J550j017j614J221j072j333k049K088j236p27
2579b113j77K05j469O28j23P64j481K215k33Q42k58J029J350n83Q94p84K158P9
2597B943q78j51N6J127j546m65R66j493N65j287J031j861r58R61k107O48m19J9
2615b849p86J315j050J851L60k38L87J001J39L36O30N14K51R64j042k01J135m78
2633B239O50k305J073M7j424k60p97p56M12o52q49P99L04p99r87Q01n92K54J193
2652a649M81n7L69J784q04Q47P41o77J842l34N91n39M24o41o03o1P69j431k130
2671a078O18N41j887Q27j314J35p72J005M46r18KO63k78J079K13k30J169J468
2689A689j199r5J270l09J130J00r3L55j553o6J527n06j697m6O49j163j633O95
$$ y = [2597, 1895, 2052, 2719, 1512, 2638, 2076, 3626, 2609, 995, 2216, 1144, -189, -2238, -150, -1386, -2113, -2290, -2085, -3554, -2926, -3049, -2285, -3766, -1551, -1784, -942, -1200, -171, 1179, 596, 1490, 706, 2864, 2943, 2065, 1914, 1970, 3097, 1551, 1086, 2052, 559, 1124, -163, 868, -993, -1951, -990, -3097, -2449, -2868, -2849, -3635, -2320, -3370, -1519, -1159, -1397, -1010, -9, 130, 466, 1096, 1610, 1861, 2825, 1783, 1582, 2717, 2239, 2889, 584, 1657, 1704, 280, 20, -777, -1533, -1121, -1773, -2622, -1823, -1519, -2318, -3305, -2504, -3096, -2842, -1649, -1168, -1225, -856, 928, 124, 971, 1712, 1035, 2877, 2543, 3134, 2595, 3019, 2378, 1775, 1714, 2483, 1052, -1078, -460, 81, -1806, -979, -2293, -2158, -2930, -1925, -1479, -2397, -2395, -1732, -2010, -931, -718, -948, 221, 1689, 490, 395, 1665, 1356, 2486, 2586, 2493, 2848, 1295, 1229, 2756, 2250, 553, 507, 1156, -7, -1640, -945]
2707i45r06j149J111q4j692L678j688m1K70j9N00M43L15p26J880J59M31Q93P43
2726C173j698j98J388p88O94o06N28m41j756Ol56Q5l8j319k25p34k08r2r69J403
2746b151j109Q64K7J316J97J938p30l07O87j274J634l8J933o27J72j10r37L75
2764A860J97l23r27L92j383o20J723k125j585J065J416j796K10Q51j162j75O24
2781a758j06p40N39R80J379j39K128L47j682M70M98J384k380J505j472R52l05
2798A600j201O91K10k221M31j69r43J640k972R44K24m74P14r29mj43J166M73Q67
2817i6l65J570q26J392K29J53j140Q71J100j141j68M56j147K24J33k76j621M0
2835f12m80M07N38k98k669Q77N64j163r8J144l52M40J763j94J330j166J299r09
$$ y = [-945, -1851, -3000, -1889, -1973, -3665, 13, -1675, -1716, -1446, -1465, -965, -522, -207, -933, 947, 1106, 1537, 2430, 3173, 1475, 1277, 2665, 1877, 2571, 1965, 2493, 2052, 296, 302, -54, 31, -7, -1326, -1551, -2285, -2493, -2585, -3554, -2151, -3260, -2396, -2369, -1053, -856, 1082, 352, 45, 732, -542, 1092, 1054, 2987, 2360, 2532, 2422, 1485, 1860, 2057, 1734, 807, 1199, -184, -804, 919, -1206, -2791, -1726, -310, -2106, -1896, -1045, -2207, -2382, -1758, -1864, -2604, -2065, -1085, 294, 155, 2283, 2630, 948, 1418, 1916, 3300, 920, 2425, 953, 1905, 1600, 399, 1090, 1300, -921, -490, -659, -1602, 38, -2934, -1990, -1766, -2240, -1526, -2455, -2459, -2602, -1436, -963, -96, -461, 1109, 283, 1675, 1904, 2057, 917, 1788, 2888, 1747, 1579, 2035, 888, 1112, 1245, 969, -652, -612, -1092, -685, -147, -445, -3114, -2237, -1673, -2836, -2934, -1790, -2142, -1702, 61, -133, 1197, 31, 1330, 421]
2853D21P62M48mj04J93r24R68K26m81l32l60k59q85R22j955N45m49j276J450n01
2873a595M62j245R11k26J72n61J355k04Q38J042o19K31J009l37j83Q70n6J088
2891B952p41j365j68Q02q33q3n77n15m11M11Q7k44r83j519O09K85L68P16l1O3
2911a177n19J267k87l90J574J5N56K84p82J500J4R11L18k038K35l22R04j295j89
2930E79k33j177k02N61l09m86j914J076j22K87J090q82J09P64m07J178K85J165
2948A362M56n31j69Q38M52m97j117J128R28k021M74p22j49K84P16l17m50k713
2966b048L7m7J63K17J46j11J048j026J86Q58j072J190o45K133J73p23k20K788
2984C047j625j49J494p67K75j959J210j045Q85j716P03j489Q77j818J130r26M27
$$ y = [421, 1183, 1631, 1627, 1523, 1716, 792, 1760, 1986, 1505, 1173, 813, 554, -331, 591, -1364, -819, -1268, -2544, -1094, -1595, -1133, -2378, -1467, -1693, -1521, -2082, -727, -931, -93, 949, 330, 561, 1570, 1233, 1050, 1920, 1864, 2952, 2211, 846, 678, 1480, 647, 564, -13, -528, -939, -528, -441, -685, -1668, -3187, -2578, -2293, -1925, -1209, -1240, -1177, -1696, -429, -716, -1106, 468, 483, 1039, 1323, 541, 2041, 2055, 2966, 3284, 1246, 1481, 1159, 2063, 768, 579, 346, -831, -1033, -472, -781, -1267, -3181, -2105, -2227, -1940, -850, -1732, -1623, -859, -1266, -88, 197, 1362, 1818, 1287, 1118, 1956, 2408, 1911, 794, 1922, 2850, 829, 1303, 581, 432, 716, 1432, 1115, 665, -2048, -2011, -2058, -1895, -1678, -1532, -1643, -595, -1621, -1435, -577, -1649, -459, -1104, 1029, 1202, 479, 259, 3047, 1422, 1273, 2767, 2000, 2275, 316, 1526, 481, 1366, -350, 353, -1136, -259, -2077, -947, -1873, -1446]
3001a446m55L61n24r84J074k37Q48J497j084q92J545O30O01o24K180j479Q02K73
3019B086L46j265K50J038p7j144j649Q40r77N73m88r30R91j511l49N32j82Q15
3037a101o14J084K41k000J650P2J005K71L19j508J359Q85M11p4l52J810k157R65
3055B266r56Q73k005J580j620j09J544j763p4r59m5j279R69n71P02J433k817J94
3073b637J911K49n84K80O52O33j44r54J636J259n66P92l38J039j543r93J451J22
3091B265j819p49J626j707n18l71Q34j514Q96r20J011k425K437J43p47J314r96
3108a240m54K315L10k9J091j09j144J123M32j729Q03l11k88L56K76j318M77p93
3126b32q2q97O75j865O42o20R81r12J011k11K3M77J128r14q75K609k96J485k120
$$ y = [-1446, -1901, -1540, -2064, -3048, -1974, -2211, -1363, 134, -950, -1842, -297, 333, 934, 310, 2490, 1011, 1813, 2086, 2432, 1167, 1417, 2455, 2378, 1234, -415, 425, -552, 21, -467, -1397, -406, -1917, -2266, -1734, -1916, -1101, -1715, -631, -390, -2390, -740, -668, 337, 608, 927, -581, 778, 1663, 2074, 2000, 1648, 3458, 1301, 2266, 1310, 2183, 178, 1758, 138, 29, 1573, -190, -264, -1223, -1268, -2547, -1578, -2149, -1447, -14, -2831, -2637, -726, -477, -1061, -781, -129, 504, 360, -594, 1042, 2301, 1735, 2527, 2189, 3228, 1685, 692, 2143, 2265, 446, -303, 1323, -384, -902, -1273, -439, -1953, -1057, -1977, -966, -3391, -954, -811, -1558, -244, -1240, -1694, 621, 931, 902, 1993, 1884, 740, 1863, 2295, 566, 1369, 1058, 770, 1126, 1402, 84, 561, -232, -314, -1211, -536, -2401, -1759, -2379, -1398, -2310, -1299, -1510, -1487, -1010, 118, -796, -1671, 938, 642, 2127, 7]
3145GJ312J688k404J087Jj441J342q67k15o26J665o06j404p94P23n6J362k360
3163a586M85j224R47K63l83J55J168p68K23J096n51J96Q62J966k103k57K03K629
3181C321k561J371k62j623O41L97q68m97O0l58J352k064m02Q74n81m04K16o70
3199b058O63k45n66Q27k38K48J772L99j366l09J922N00q57J040j70o26R70O18
3217B524j271m12P10j596k61j497K029l02n50m05k79j264K496j956J439n9K8r33
3235a559R01k44O95j57J47Q43o35K394j348J56q67K315p70l13p37j78r4M5l64
3254B30r58J60M96j052p04R02n81R46p29j43N4l89J171k83L45j280Q08J268N54
3273H15n96K05J213L23O53q87m00L49p68m12J228o43j901J181j611J839n27j553
$$ y = [7, 1319, 3007, 603, 1690, 1691, 250, 1592, 725, 510, -116, 1549, 943, -461, -1255, -532, -588, 774, -1586, -1101, -2325, -1378, -1115, -1498, -1343, -175, -943, -720, 376, -175, 21, 883, 2849, 746, 489, 692, 3321, 760, 2131, 1869, 246, 887, 1284, 416, -81, -21, -379, 973, -1091, -1493, -619, -1200, -1604, -1388, -2058, -1395, -1640, -2206, -1379, -1617, -1369, 403, 802, -564, -873, 1049, 1549, 692, 1732, 1562, 936, 1906, 2524, 1253, 841, 1551, -45, -306, -1803, 226, -76, -626, -1031, -1310, -2574, -78, -2034, -595, -654, -626, -1559, -658, -902, -207, -364, -217, 626, -9, 2385, 1037, 1193, 326, 2641, 1871, 1558, 821, 643, 549, 594, 230, -728, -568, -72, -1124, -1828, -926, -1507, -561, -1290, -1433, -1379, -1768, -597, -880, -535, -1815, -1007, 261, 815, 219, 424, 1637, 1960, 2613, 1726, 1326, 1675, 907, 495, 1723, 1080, -821, 360, -1251, 588, 61, -1492]
3291a492J71j016P96R18J015j510J265k515K602m21K39k50k2J79P38k47J389k66
3309A573M91j310N07n95m10K29m03R01j290K82J916k251L44L29N49j493n00j201
3327b332J410m2p87J47P80j369J512O60J17O83j02J04r29K202N69q21K77j199
3345H80J463k85k133K60o94O04j3r32M36K57j136J078J04k174J188k207J102J415
3363g87l80r46J725P85o83J094o20K84L02o00K68O28p67M22N39j71j131J658j438
3382A82M77J48j41j290L39l51j944J929q16p56L58L27N02R68q27N37O37L40m25
3401A94n28O37O53J062j299Q49k53o68K4J363j134L59j224M06j919J175K05r06
3419a004O27K76j155M50l13m23P21j262K020k787K927l16lJ155m0j98p53J570
$$ y = [-1492, -1321, -2337, -1541, -623, 392, -1118, 147, -2368, 234, -187, 52, -198, -220, -41, 697, 450, 1839, 1573, 2064, 754, 1261, 666, 256, 485, 82, 983, -307, -25, 1891, -360, -16, 313, 862, -631, -1131, -2332, -922, -964, -1751, -1604, -824, -2193, -681, -21, 96, 779, 677, 781, -148, 2054, 2623, 1802, 2079, 880, 2343, 2058, -75, 185, -509, 95, 82, -850, -414, -157, -1293, -215, -111, -2285, -1097, -3304, -2202, -787, -1167, -2113, -388, 397, -286, 808, 188, 472, 774, 174, 442, 1070, 303, 725, 1264, 1093, -38, 1620, 182, 659, 807, 666, -624, -285, -636, -2580, -651, -1467, -2223, -1865, -1538, -1036, -68, -895, -358, 279, 619, 194, -334, 303, 956, 2018, 719, 1568, 1315, 647, 671, 2034, 900, 1259, 35, 441, -1478, -303, -98, -1004, -377, -101, -1256, -806, -1119, -1542, -821, -2083, -63, -2850, 77, -239, -242, 913, 873, 675, -78, 1492]
3437A492L28l87J091j988J306N95j881j45P24k79j34k01j607J618j596j80L55
3454h89j411K524o37p9k79L05M2J92K33m80n91Q61J328K45J61j085J174l34L62
3473A642P67j465l19J069r02l6l84l4M8j393k48J39r84J141l25k93K10r41J198
3492a110M16k77Q78Q09o79j7Q1O39K8J686j886l61P68J248o32m39L70k11q50j59
3512C02p74o09J888j685j06o62J166p93m89j34R35K31K98j13J246j072J182k118
3530a307L4K125n92K76j61J014L80K86j12j048l58J29J33p64J073j634k97J531
3548G08n58o64J28J57k652J762K21k09O68j422J377R89j322J088r62R29N07L36
3566A081k98J09J43o76J300l86j89n75k09Q54k809J667R97k881Q88k24J310q34
$$ y = [1492, 1820, 1433, 2524, 536, 1842, 2437, 556, 411, 1135, 856, 722, 521, -1086, 532, -1064, -1244, -889, -2300, 224, -413, -492, -771, -466, -424, -232, 1, -479, -1070, -209, 1119, 1364, 1525, 440, 1614, 1280, 1642, 2409, 944, 625, 1694, 792, 756, 372, 338, 386, -1007, -1255, -1116, -2100, -959, -1284, -1577, -1367, -2308, -1110, -694, -971, -93, 716, 37, 20, 101, 740, 768, 2454, 568, 207, 975, 2223, 1591, 1152, 1522, 1311, 461, 302, -472, -1081, 807, -878, -984, -1646, -480, -1273, -1762, -1896, -961, -730, -432, -545, 701, -371, 811, -1307, -1273, 852, 260, 536, 375, 1389, 1769, 2055, 1943, 895, 537, 666, 799, 35, 1108, -526, -823, 708, 150, -514, -386, -229, -2881, -1119, -898, -1107, -439, -1861, -484, 505, -817, 271, -691, 238, 745, 1081, 783, 892, 1035, 359, 1659, 1273, 1084, 509, 300, 1154, -1655, 12, 1009, -1872, -984, -1208, 102, -732]
3584g32m6N31J82k077J983l10k40Q28l12J01J34M69L03N69m36K12j188J369p4
3603A266J22n66j258J522m99K06P16k806J474j58j379P93j622J838j185j14Q83
3620g67N9K58q15k64J574o83K148j216R5P19O16n48j216J858j359j237R18J209
3638A349j7m51j68M61j039P96j685L04j211K091j234p26J276j804J851M74k222
3655a955J379Q98r38L62j97J706j250j084J987l08M80l54R5J256j524J140k845
3672a152J322J371r94j544K195k139M56o88L28K75o83J002M2j778J390J41J73
3689b83p05J012Kr61K89J801R99j707J265j086M1K085k222k93p3l38L21K14j252
3708h91J281j935J200l62L80p31n18r1m03M30J085N09l07p14j080K440P70j217
$$ y = [-732, -778, -247, -65, -2142, -159, -469, -709, 119, -193, -92, 42, 511, 814, 1383, 947, 1159, -29, 1340, 1266, 1388, 822, -436, 1086, 587, 793, 1509, -1297, 177, 19, -1360, -567, -2189, -351, -1536, -1650, -767, -708, -450, -1265, -1529, 45, -638, 1510, 294, 389, 1108, 1724, 1176, -40, 1818, 459, -778, 140, 1349, 1332, 881, 713, 1174, 135, 931, -754, -450, -1661, 430, -804, -1530, -254, -2058, -207, 267, -1955, -576, 322, -616, -254, -451, 1255, 5, -1079, 908, 600, 1080, 726, 821, 2077, 553, 1693, -1152, 170, 1541, 547, -997, 1198, -941, -485, -1173, -845, -570, -1253, -251, -209, -1987, -597, -456, -283, -988, 24, 26, -935, -646, 1155, 2154, 447, 1712, 626, 667, 2752, 530, 237, 164, -174, 147, 361, -891, 390, -1545, -345, -707, -327, -1058, -1576, -1667, -2070, -1640, -555, -46, -353, -1067, -2147, 293, 1063, -154]
3726a54K056j04r77J17n6L95j015K359q13j417k24p07O77M04m87p52J021j396
3744a073k12N70k3n83r0N24P52j187J826j312M97J2r48K077j468J696j057J845
3762A846p79n99L04J43O03j623J862m47j754N28l89J556j253L49j834k80M27J807
3780D67j763n86Q98l40R57k18n03k87J001J615j016O66O76o58k39O38N3j720K51
3799a08J373l75j085P88j409K203j373l55j374Q76j5M78m28q61J171M06m66P08
3817A54L36K7j717R68J620j594N45m8J330O56j375j40L89q6K07j025N17j84l93
3836A87j63K01p92J299K68k176J024j039n26J067J20K78k116K157j058R12M28
3853G1m91L51R05k9N83j158l42K552j100r64L55J147k035J974p71j041j70J42
$$ y = [-154, 1902, 1798, 821, 938, 882, 1277, 262, 2621, 1808, 391, 167, -540, 137, 541, 54, -698, 323, -1073, -1285, -715, -738, -1321, -1411, -887, -135, -1322, 504, -808, -311, -299, -1247, 830, -638, 1058, 1, 1846, 1067, 468, 772, 915, 1518, -105, 1757, 1310, -444, 84, -305, 1251, -2, 347, -1487, -1767, -1340, 467, -1296, -1882, -984, -1324, -367, -585, -1088, -1375, -374, 1241, 225, 891, 1567, 909, 670, 1308, 1361, -359, -108, 1265, 890, -195, 593, -816, 1387, 14, -341, -1715, -839, -854, -376, -804, -1665, -494, -88, -554, 154, 490, 517, -1200, -232, 1388, -206, 339, 291, 1621, 2277, 902, 762, 1151, 1065, 1272, 247, 764, 580, 187, 24, 225, -567, 732, 1000, -1176, -152, -1191, -1717, -650, -530, -252, -2368, -211, -1269, -357, 71, -420, -69, 836, 807, 1390, 232, -110, 2442, 1342, 378, 733, 1880, -155, 1819, 1048, 7, -163, -21]
3871b1k68l38Q29j528J581n83J26o81j44k63J607j054N26n43l04J570J55L18k09
3890G76j40Q50r35m27J695j748L58J073j414o34O75P00k25p18n38j008P16M92
3908d52j93j394J136m6l10J777p13p15r20J439n99J057R76P65k211J245p68J029
3926A103k45N0O57j891R34j113Q89j130K82M65r43J260n60q77j44J047j188J733
3944C29P6j563k19J326N28r01J02q6L27m92P51J372K09k299J58Q01k06O65n60
3963C18j511Q52N39ql15n70O98p09nK26Q53L35r86K6j275J467L80o1l86l20J022
3984E70j16Q80j76j182k84J462p68j76R86q37L00m56J362p39r05K6q94J58R24
4003A35j112P51j373J151q51O74N00L91l82o50J24qR39K6j265K026P8o70p3O05
$$ y = [-21, -289, -627, 202, -1326, 255, -328, -202, -883, -1027, -1290, 317, -737, -211, -754, -1058, 512, 667, 985, 776, 636, 1486, 551, 124, 1819, 71, 429, 1502, 88, -546, 129, 829, 604, -114, -652, -1660, -944, -452, -645, -2039, -903, -949, -1259, 518, -195, -910, -1830, -391, -990, 67, 1043, 1808, -403, 842, 74, 1103, 858, 908, 1565, -326, 608, -505, 384, -746, -464, 1, -942, 318, -242, -1119, -1263, -216, -1404, 329, 405, -1158, -1377, -51, 477, -424, -322, -408, -81, -573, 178, 1550, 1759, -540, -382, 419, 213, 878, 318, -1193, -341, 198, 190, -125, -695, 3, -706, -711, -485, 368, 703, -283, -257, -1532, -65, 315, 254, -132, -452, 570, 454, 1334, 1158, -24, -308, 1154, 386, 210, 1196, 359, 659, 203, 1565, 826, -79, -53, -947, -789, 135, -977, -226, -1599, -448, -1299, -625, -125, 266, -116, -766, -642, -650, 289, 315, -950, 1076, 1154, 484, 411, 1016]
4023A016l6n05P01K66j907O85m35L77R45j710K12J20J46m39o05n37P08J044j832
4042a786K153j678j82L45O24J024j404J441m06o32R06N23r65J97o84L127j491
4059A112O11j817Q27J130j270n71j791J524q41K1L35k4j632J826L12O50k095P5
4077a618J264P40J63j75L59j650J700r63J022L66j761J867K57J37j075n40j11
4094a8J554q42j765J828j192p24J99j41j50J96M16p69K317r45J27J56j263J941
4112I25j057n55J181l38J017q62J421n14j357P42M48K92m39L32l55o17Q02j551
4130d85N86m21N33r1k340K044j215n50J969M84r23n52J302j624K554k104J076
4147B43p56J009o44O35J339k062K194q49P6L54l12j610J310j391L42m99P43j892
$$ y = [1016, 980, 475, 1176, 1442, -465, 220, -215, 162, 1107, -603, -391, -271, -125, -564, -1169, -1706, -998, 46, -1786, 367, -1311, -1493, -1148, -524, 500, -904, 537, 131, -501, 405, 928, -37, 160, -524, 2603, 1112, 1723, -94, 733, 1863, 593, 22, -1769, -245, -1086, -1065, -730, -754, -2386, -560, -248, 402, -1693, -1618, -354, 386, 549, 374, 733, -917, 783, -180, 842, 1208, -553, 1314, 1571, 1708, 633, 93, -18, 1536, 694, -1071, 757, -435, -1159, -960, -1101, -1251, -1055, -639, -1408, 909, -36, 91, 247, -1016, 925, -132, -687, 494, 156, 1173, 311, 1732, 1218, -139, 603, 1051, 1343, 904, 1236, 881, 264, 1066, -485, 101, -320, 213, 122, -2218, -174, -1389, -1939, 30, 514, -409, -961, 341, -1283, 1271, -833, 243, -513, 496, -148, 487, 1826, -236, 1958, 1109, 1185, 1539, 1227, -383, 927, -464, -122, -621, 122, -1770]
4165a770J88K611k312L89Q71L90j794J222j123J041K74N5K8P7N32J266j998R04
4183H51O31j119J581r18o04J14l77N31K64j294N24j600P96r5J029k589J996m34
4201g13O2L80j81r0J16P13j02n48J586k136R87P24J22j333Q68l13r1J188K39N8
4221A536p22Q88j358m3j036j64M87j664K623j465O55o54O53l73L88j118J055j511
4239a823R17J639k172K220o61O10o04R46l92j315J598N69q39K08m34J52J10m92
4257B37L12j088j032K61J174r37J610j304j493J285J104j516K389j466O49j282
4273a097J64J169R63J29j036J630r25N36K70p02n81N47j559j00J694r65l95p79
4291a037K319j480L53k61m20R18l93j231KP79Q4q4o71M91O58J072j650J128q18
$$ y = [-1770, -1582, 1029, -1283, -894, -23, 367, -1427, -205, -1328, -287, -13, 42, 70, 147, 679, 1945, -53, 851, 1482, 363, 1944, 1026, 422, 536, 159, 690, 954, -340, 184, -1416, -620, -715, 314, -2275, -279, -713, -651, -271, -452, -542, -426, 287, 185, -363, 1223, -913, 74, 798, 920, -413, 455, 142, 51, 1239, 1478, 1536, 814, 1702, 344, 301, -735, -899, -412, -2076, 547, -918, -263, -917, -264, -637, -249, -1367, -312, -1823, -906, 733, -1439, 781, 120, 730, 126, 1072, 680, -635, 963, 1532, 693, 901, 467, 619, 729, 237, 549, -539, -1571, -1310, -136, -1073, 537, -767, -2260, -975, 129, -1387, 1002, -464, 185, -1097, -933, 236, 1199, 1328, 292, 1922, 997, 1533, 1803, 1101, 520, 1067, -492, -592, 1102, 137, -258, -1037, 1282, -198, 155, -106, -526, 392, -1, -1232, -1230, -451, -367, -451, -1122, -631, 27, 1099, -551, 577, -241]
4310b41R06J107k252P40J246n50k80k54k30R2J347k242Q49J0p70J245q02m52Q87
4329C56j196KM68j176K1O41k61J118j143J501n98m23M60oR87j496J676j382J0
4348d41J218l07Q22j679J993k87j467k04J029j633n11O82J81p73J49Q74j616J340
4366f30K193k246q18K094P4k854K453k8k91K001j439k74j40M9K4J064j32j17n65
4385D18l89N04r79N55p69n1k96J251j569N71j344L28J429l9j195K182l71P04K73
4404A213o93P45m71j124m45J330M47L13n84m81J262j53j114J223j118J076n00
4421I26j243o30J114P6q8p8o70l25o28J55L72p86K198n99r70O46K56P88l22j370
4441a178J116M3j00J108m48p78J32J389K73j741Q8J79j896J623p34l53K363j617
$$ y = [-241, 665, 1772, -480, 260, 1506, 956, 676, 422, 192, 284, 1631, -611, 238, 248, -522, 723, -79, -531, 356, -840, -838, -370, -1546, -1525, -884, -1145, -27, -1170, 331, -267, -690, -230, -236, 751, -745, 931, -451, -441, 777, 470, 1292, -387, 1606, 1319, -148, -352, 677, -956, -1467, -785, -604, -1377, -1228, -354, -1970, -630, 1563, -683, -1501, 593, 667, -2187, 266, 238, -53, 1948, 509, 235, 95, 144, 168, 1232, 1100, 983, 418, 29, 533, -446, 109, -660, -711, -1007, 244, -1325, -754, -2098, -1770, -341, -380, -1575, 607, 236, 940, 1213, 520, 1265, 794, -330, -775, 555, 1002, 1315, 731, 250, 1512, 1359, 245, 1468, 350, 1426, 926, -317, -947, 167, 243, 155, 77, -593, -918, -1546, -1391, -1019, -1805, 393, -206, -1176, -530, -274, 514, 192, -1178, -62, -19, -119, 989, 541, -237, -105, 1284, 1557, -184, -96, 83, -1813, -190, -924, -1277, 1086, -531]
$$ [...]
8191E01
##END NTUPLES=NMR FID
##END=
