##TITLE=1H_AT-44x_T2
 DMSO-d6+CD3ONa
 108 sc, 
 25.08.2022
##JCAMPDX= 6.0         $$ Bruker NMR JCAMP-DX V2.0
##DATA TYPE= NMR FID
##DATA CLASS= NTUPLES
##ORIGIN= UXNMR, Bruker Analytische Messtechnik GmbH
##OWNER= root
$$ XWIN-NMR		Version 3.5
$$ Thu Aug 25 13:06:30 2022 Russian Standard Time (UT+4h)  she@DPX200
##.OBSERVE FREQUENCY= 200.1313499994
##.OBSERVE NUCLEUS= ^1H
##.DELAY= (6, 6)
##.ACQUISITION MODE= SIMULTANEOUS
##.ACQUISITION SCHEME= undefined
##.AVERAGES= 108
##.DIGITISER RES= 18
##SPECTROMETER/DATA SYSTEM= spect
##.PULSE SEQUENCE= zg30
##.SOLVENT NAME= CDCl3
##.SHIFT REFERENCE= (INTERNAL, CDCl3, 0, 15.7039)
##AUDIT TRAIL= $$ (NUMBER, WHEN, WHO, WHERE, WHAT)
$$ ##TITLE= Audit trail, XWIN-NMR		Version 3.5
$$ ##JCAMPDX= 5.01
$$ ##ORIGIN= Bruker BioSpin GmbH
$$ ##OWNER= she
$$ F:/spectra/data/she/nmr/H-F/1/audita.txt
$$ ##AUDIT TRAIL=  $$ (NUMBER, WHEN, WHO, WHERE, WHAT)
(   1,<2022-08-25 13:04:14.26 +0400>,<she>,<DPX200>,
      <continue with go, POWCHK disabled, PULCHK disabled
       configuration hash MD5:
       00 E9 B6 7A A2 85 ED C7 34 08 36 98 17 FE 4E 26
       data hash MD5: 16K
       82 F6 46 14 27 94 D7 FE 97 7B E8 B2 B4 92 66 85>)
$$ ##END=
$$ 
$$ hash MD5
$$ 10 BF 47 B3 01 98 BF FB 04 F4 C3 13 F8 BA 1C 0B
##$RELAX= 
##$RELAX= 
##$RELAX= 
##$RELAX= 
##$RELAX= 
##$RELAX= 
$$ Bruker specific parameters
$$ --------------------------
##$DU= <F:/spectra>
##$EXPNO= 1
##$NAME= <H-F>
##$PROCNO= 1
##$TYPE= <nmr>
##$USER= <she>
##$AMP= (0..31)
100 100 100 100 100 100 100 100 100 100 100 100 100 100 100 100 100 100 
100 100 100 100 100 100 100 100 100 100 100 100 100 100 
##$AQSEQ= 0
##$AQ_mod= 1
##$AUNM= <au_zg>
##$AUTOPOS= <>
##$BF1= 200.13
##$BF2= 200.13
##$BF3= 200.13
##$BF4= 200.13
##$BF5= 200.13
##$BF6= 200.13
##$BF7= 200.13
##$BF8= 200.13
##$BYTORDA= 1
##$CFDGTYP= 0
##$CFRGTYP= 5
##$CHEMSTR= <none>
##$CNST= (0..31)
1 1 145 1 1 1 1 1 1 1 1 1 1 1 1 1 1 1 1 1 1 1 1 1 1 1 1 1 1 1 1 1 
##$CPDPRG= <>
##$CPDPRG1= <>
##$CPDPRG2= <>
##$CPDPRG3= <>
##$CPDPRG4= <mlev>
##$CPDPRG5= <mlev>
##$CPDPRG6= <mlev>
##$CPDPRG7= <mlev>
##$CPDPRG8= <mlev>
##$CPDPRGB= <>
##$CPDPRGT= <>
##$D= (0..31)
0 1.2 0 0 0 0 0 0 0 0.06 0 0.03 0 0 0 0 0.0002 0 0 0 0 0 0 0 0 0 0 0 0 
0 0 0 
##$DATE= 1661417726
##$DBL= (0..7)
120 120 120 120 120 120 120 120 
##$DBP= (0..7)
150 150 150 150 150 150 150 150 
##$DBP07= 0
##$DBPNAM0= <>
##$DBPNAM1= <>
##$DBPNAM2= <>
##$DBPNAM3= <>
##$DBPNAM4= <>
##$DBPNAM5= <>
##$DBPNAM6= <>
##$DBPNAM7= <>
##$DBPOAL= (0..7)
0.5 0.5 0.5 0.5 0.5 0.5 0.5 0.5 
##$DBPOFFS= (0..7)
0 0 0 0 0 0 0 0 
##$DE= 6
##$DECBNUC= <off>
##$DECIM= 32
##$DECNUC= <off>
##$DECSTAT= 4
##$DIGMOD= 1
##$DIGTYP= 9
##$DL= (0..7)
0 120 120 120 120 120 120 120 
##$DP= (0..7)
150 150 150 150 150 150 150 150 
##$DP07= 0
##$DPNAME0= <>
##$DPNAME1= <>
##$DPNAME2= <>
##$DPNAME3= <>
##$DPNAME4= <>
##$DPNAME5= <>
##$DPNAME6= <>
##$DPNAME7= <>
##$DPOAL= (0..7)
0.5 0.5 0.5 0.5 0.5 0.5 0.5 0.5 
##$DPOFFS= (0..7)
0 0 0 0 0 0 0 0 
##$DQDMODE= 0
##$DR= 18
##$DS= 0
$$ [...]
##$SUBNAM2= <"">
##$SUBNAM3= <"">
##$SUBNAM4= <"">
##$SUBNAM5= <"">
##$SUBNAM6= <"">
##$SUBNAM7= <"">
##$SUBNAM8= <"">
##$SUBNAM9= <"">
##$SW= 18.0517283424941
##$SWIBOX= (0..15)
0 0 2 0 0 0 0 0 0 0 0 0 0 0 0 0 
##$SW_h= 3612.71676300578
##$TD= 16384
##$TD0= 1
##$TE= 0
##$TE2= 300
##$TE3= 300
##$TEG= 300
##$TL= (0..7)
0 120 120 120 120 120 120 120 
##$TP= (0..7)
150 150 150 150 150 150 150 150 
##$TP07= 0
##$TPNAME0= <>
##$TPNAME1= <>
##$TPNAME2= <>
##$TPNAME3= <>
##$TPNAME4= <>
##$TPNAME5= <>
##$TPNAME6= <>
##$TPNAME7= <>
##$TPOAL= (0..7)
0.5 0.5 0.5 0.5 0.5 0.5 0.5 0.5 
##$TPOFFS= (0..7)
0 0 0 0 0 0 0 0 
##$TUNHIN= 0
##$TUNHOUT= 0
##$TUNXOUT= 0
##$USERA1= <user>
##$USERA2= <user>
##$USERA3= <user>
##$USERA4= <user>
##$USERA5= <user>
##$V9= 5
##$VALIST= <valist>
##$VCLIST= <CCCCCCCCCCCCCCC>
##$VD= 0
##$VDLIST= <DDDDDDDDDDDDDDD>
##$VPLIST= <PPPPPPPPPPPPPPP>
##$VTLIST= <TTTTTTTTTTTTTTT>
##$WBST= 1024
##$WBSW= 4
##$XGAIN= (0..3)
0 0 0 0 
##$XL= 0
##$YL= 0
##$YMAX_a= 1438165
##$YMIN_a= -1799938
##$ZGOPTNS= <>
##$ZL1= 120
##$ZL2= 120
##$ZL3= 120
##$ZL4= 120
##$ABSF1= 10
##$ABSF2= 0
##$ABSG= 5
##$ABSL= 3
##$ALPHA= 0
##$AQORDER= 0
##$ASSFAC= 0
##$ASSFACI= 0
##$ASSFACX= 0
##$ASSWID= 0
##$AUNMP= <proc_1d>
##$AZFE= 0.1
##$AZFW= 0.1
##$BCFW= 1
##$BC_mod= 2
##$BYTORDP= 1
##$COROFFS= 0
##$CY= 11.3945322036743
##$DATMOD= 1
##$DC= 2
##$DFILT= <>
##$DTYPP= 0
##$F1P= 2.36226072786647
##$F2P= -0.459571619588291
##$FCOR= 0.5
##$FTSIZE= 0
##$FT_mod= 4
##$GAMMA= 1
##$GB= 0.15
##$INTBC= 1
##$INTSCL= 1
##$ISEN= 128
##$LB= 0.24
##$LEV0= 0
##$LPBIN= 0
##$MAXI= 10000
##$MC2= 0
##$MEAN= 0
##$ME_mod= 0
##$MI= 1.114404
##$NCOEF= 0
##$NC_proc= 0
##$NLEV= 6
##$NOISF1= 3.799351
##$NOISF2= 2.8
##$NSP= 1
##$NTH_PI= 0
##$NZP= 0
##$OFFSET= 15.70392
##$PC= 1
##$PHC0= -18056.2
##$PHC1= 29.00069
##$PH_mod= 1
##$PKNL= yes
##$PPARMOD= 0
##$PSCAL= 0
##$PSIGN= 0
##$REVERSE= no
##$SF= 200.130013532006
##$SI= 16384
##$SIGF1= 3
##$SIGF2= 2
##$SINO= 400
##$SIOLD= 16384
##$SREGLST= <1H.CDCl3>
##$SSB= 0
##$STSI= 0
##$STSR= 0
##$SW_p= 3612.71676300578
##$SYMM= 0
##$S_DEV= 0
##$TDeff= 0
##$TDoff= 0
##$TI= <>
##$TILT= no
##$TM1= 0
##$TM2= 0
##$TOPLEV= 0
##$USERP1= <user>
##$USERP2= <user>
##$USERP3= <user>
##$USERP4= <user>
##$USERP5= <user>
##$WDW= 1
##$XDIM= 8192
##$YMAX_p= 0
##$YMIN_p= 0
$$ End of Bruker specific parameters
$$ ---------------------------------
##NTUPLES= NMR FID
##VAR_NAME=  TIME,          FID/REAL,        FID/IMAG
##SYMBOL=    X,             R,               I
##VAR_TYPE=  INDEPENDENT,   DEPENDENT,       DEPENDENT
##VAR_FORM=  AFFN,          ASDF,            ASDF
##VAR_DIM=   8192,          8192,            8192
##UNITS=     SECONDS,       ARBITRARY UNITS, ARBITRARY UNITS
##FACTOR=    0.0002768,     1,               1
##FIRST=     0,             0,               0
##LAST=      2.2672688,     0,               0
##MIN=       0,             -1799938,        0
##MAX=       2.2672688,     1438165,         0
$$ Real data points
##PAGE= N=1
##DATA TABLE= (X++(R..R)), XYDATA
$$ [...]
2588A633j211l69l97L21q5N1k36L52r40K15M02MK81J75o29q1J440p06n15M94K08
2609D07o52k46J868j482l40O92L99j166M18m67K97L79k72R46j596J832j347Q56
2627E26j16q16k92N94r60O60O82j51P18k22K88q99j7m56M93k9o40Q22n23J07O67
2648D36p82P92r53K04o6K17J102n01o23K46M48o66J74m59K33O17m72r6l4p12Q08
2669h7M83rm33K02l62j07K30p5J80q46K07R26o55R54j656P47L49n43M76l08m43
2690g70M83n56Q28Jo5J64K48l28p74J156j32j70k37n33J098m16M32r15J086q93
2710b93N83J68L09J96r88L04M4j11N34q80M21m17J005j274K32Q34j516K32O85
2729F8j52lK27M1q99R54p06K37r6m73P49m00J99M92P8o63m21N33m52J508n77j22
$$ y = [1633, 422, 53, -344, -23, -108, -57, -293, 59, -881, -666, -264, -260, 21, 196, -433, -514, 926, 220, -295, 199, 407, -245, -491, 1377, -105, -445, 247, 646, -520, -102, -569, -272, 107, -165, 781, -815, 1017, -330, 526, 410, -406, -698, -104, -1064, -404, 278, 127, 845, 623, 911, 12, -5, -461, 32, 3, -637, 185, -338, -231, 436, -346, 446, -507, -303, -369, -152, 950, 449, -174, 72, 520, -146, 28, -431, -198, 419, -53, -149, -183, -895, -87, 396, 387, -46, 156, -206, -313, -83, -158, 22, -824, -617, 309, -346, 608, -1048, -301, 48, -495, -19, -327, -770, -287, -843, -15, -14, -79, 85, 333, 5, -769, 387, 255, 85, -152, -685, 413, -3, 429, -486, 600, -293, 290, 458, 767, 963, -25, 279, 323, 212, 746, -134, 287, -130, 875, -399, -167, 667, -849, -617, 68, -84, -87, 140, 181, -718, 236, -470, -233, -329, -802, -53, -453, -254, 238, 316, -347, -768, -235, -687, 821, 244, 122]
2751A22l56K41K65n41j246J413M45p9m64J58N79o45L42J17O39j323O55p44J276
2770H54k64p83r15J154k05O57k37q64O72J35Q64j344P23m21R1M30j92J038j257
2789A36j191P87K83r22J135m35J65L04m50N04o44J109j232K63l39J077j153n3
2807f56O96m52L32O20m43j001N08P34n44N55J51m46l49L34P69o58o80J242o86
2826B6o52n3J153q04N43o96L60J40l61M30O89r03O88k27j65j030J31J80J249J27
2846H25j012J94l55N9K92j121J60J605j501j15Q07K95m44L06j88O13m97K62r09
2865g24R12j55j61N10n26J061j103j81m96P50m03P8L2M92m38M03p7J34m56m2M15
2886B5O44o48K03N32l42p00K92m79J043m77m29M38J04l19P0o20Q08P66j131Q48
$$ y = [122, -234, 7, 272, -269, -1515, -102, 343, 264, -200, -42, 537, -108, 234, 351, 990, -333, 322, -422, 854, 590, -193, -1108, 46, -159, 498, 261, -603, 69, 204, 1068, -276, 447, 26, 117, 547, 355, 1393, 136, -1055, -268, 15, -907, 228, -207, -42, 262, -188, 316, -328, 781, -451, -188, -527, 550, -603, -656, 40, -412, -80, 540, 97, -904, -396, 338, -206, 349, 500, 54, -295, 39, 808, 150, -530, 712, 26, -626, -679, 474, -330, 213, -483, -123, 17, -344, 86, 775, -128, 560, 333, 168, -862, -731, -551, 698, 825, -187, 7, -348, -289, 3, -1118, -958, 647, -854, -969, -162, 133, -311, -5, -193, 420, -77, 185, -724, 188, 33, -128, 382, -144, 917, -186, -367, -863, -113, -516, -438, -406, 86, -352, 51, -26, 108, -348, -390, 25, 669, 21, 224, 756, 414, -286, 6, -473, 570, 93, -336, 102, 206, -113, -43, -663, 145, 911, -220, 628]
2906F28j74p03L85Q5r32O19R09p56o32j424J915R70j184J22l16L68O22o83r27
2925a108O24J71k5P2k40N47L62k55K37j57p46O38r78R32j29m3R00j648P04J138
2945I96q40K28o45j37L66k45K08M95j006J285p58O8n89Q73l39l55J39O34n91o74
2965h87Q71j7R9q00R07M9l50n8k35O85K70k04n75R84j107j05L19R04j122L93l36
2986c15K64r0q46J420l78K45j90K35p19j48J44J00o1O82M98j326K93O91o14J2
3006a03j156J367l87N40J60m18K87M70j243j97J728p13o27M56m32K11q14M38j58
3025e91J070j32l80o1J08p92J104M4j414J136j161J075J66m32m56O12j17Q56o79
3044d4P98j144m54Q76L0r46R79N93j302O64J29O39l66k51K55n66p68P04O31L14
$$ y = [628, 454, -249, 136, 221, -711, -92, 817, 61, -571, -1995, -80, 890, -294, -172, -488, -120, 502, -181, -1108, -484, -313, -338, -266, -506, 41, 403, 148, 385, 228, -518, 120, -858, 74, -55, -98, 802, -846, -142, 996, 156, 384, -261, -398, -32, -277, -69, 426, -580, 705, -53, 15, -574, 299, -40, -395, -256, 378, -213, -887, -16, -33, 66, -734, 173, 222, -128, -186, -421, 264, 534, 330, -245, 739, -368, -473, -154, 750, -372, 21, -315, -51, -141, -987, 433, 55, 300, 110, 345, -374, -522, -378, -278, -339, 343, 841, -485, -192, 499, -115, -103, -1259, 108, -279, 261, 421, 3, 290, 760, -483, -680, 1048, 335, -292, 164, -268, -57, -871, -433, -591, 479, 347, -33, -94, 14, -778, 326, 370, -1044, 92, -1069, 6, 172, -260, -716, -104, -221, 635, -44, 754, -390, -844, 32, 62, -884, 95, 688, -614, 50, 179, 818, 452, 201, 456, -110, -878, -174, 457, 771]
3064G71j027L15l15P93n66J46O44o49K1Q9j008Q75R2m63O04m58j60m95J413n26
3084I6j238J814j909J243k7o64J100j096r9Q58j94r07J831r02m34J057m37j45
3102e3L20l86q29J314k79j27O48Mj318N64P33Lq18N96r38J275n34o16k00K20N62
3123A41j35j63qP73j219J015j576O98P06K40m60J115j339q36J000M80K04n5j013
3142d32k01Q02M97l10n00N4q99Q34r52J226M05j536P43O21p15k42j56K09M57l85
3162d80J019r80P95j01J40r76M05J254m32k75o10k99N84M0k8j03L97k34n54L48
3182i0M15j092P50M01M92q95K08n8l36O17m42k9K87J19n46J442j597P0J31N1M56
3203C54l89k33N46%p6q2j24K09l71N40J27m24j78M76p28j98N88m22O35P1K79j031
$$ y = [771, -256, 59, -256, 537, -29, 117, 761, 112, 133, 222, -786, 89, 181, -282, 322, -136, -296, -791, 622, 96, -1142, 672, -1237, 6, -21, -685, 415, -681, -780, 78, -116, -1023, 808, -94, -528, 529, 92, -53, 267, -119, -948, 366, 87, -40, 608, 612, -706, -142, 591, 594, -224, 372, -566, 709, 175, -441, -641, -421, 141, 6, -157, -165, 608, -611, 404, -1172, -474, 232, 472, 12, 1127, -212, -1048, -48, 432, 636, 581, -432, -633, 169, 666, 356, -144, -90, -989, -155, -1107, 119, 524, -1012, -269, 352, -363, -605, -761, -552, -95, -480, 539, -441, 354, 253, 393, -583, -178, 1076, 644, 369, -241, -540, 44, 84, 56, -47, 350, 116, -438, -90, 325, -767, -17, 384, 876, -19, 189, 131, -205, 412, -30, -59, 228, 347, -199, 1243, -354, -284, -153, -102, 354, -35, -268, 278, 278, 202, 120, -4, 205, -166, 374, 501, 77, -101, 375, -353, -551, 37, -385, 250, 321, 600, -431]
3225d31L85m61J52R02J89l95k04l00K43p10J371p08m05J54M27p56O08k82K90P88
3245H57j644M92L48J84l62k23Q44R0q47q4J5J97j98K26O45j049k8Q74m26q01M29
3266d61R21m43k50N15m21L4N35k15j03j132J432o02r99N70P26q55J063O5l76l96
3286c92J90R88m89j59k63k08N98j436K033p56m68M13L32m79K36p2M43L04j310
3305d95j09R6M84N85n92M33k43M72l73k42j062O05O00l59L86O8j489K106n59q11
3325d99K93K21k4qN34M14j035q6pp67K12R92L18n41l98O79j8o7l72M33l61n34
3347f21J181j286N71m40Q39o78J026j694J470o23M15q8L38n23k77M69m29P82p38
3366c06K31J93l35K68j237R66M9P75m05j77N00r02J159p32j80J85O04N4n80P99
$$ y = [-431, -46, -507, -355, 547, 736, 341, 137, -163, 80, -630, 741, 33, -372, -218, 209, -547, 61, -221, 69, 857, -787, -295, 53, 237, -125, -348, 496, 586, -261, -345, -330, -133, -331, -105, 540, -509, -537, 337, -89, -890, -461, 460, 17, -233, 282, -139, -105, 430, 215, 112, -1020, 412, -190, -1189, -619, 107, -748, 315, 380, 4, -392, -202, 786, 297, 138, -125, -333, 265, -1171, 862, 106, -362, 51, 383, -96, 140, 68, 511, 815, -495, -604, -508, -24, 561, -31, 402, 159, 631, 258, 16, -1046, -441, 159, -200, 186, 254, -1235, 871, 312, -499, -206, 15, -9, -17, 517, 931, -104, -190, -197, -964, -752, 240, 558, 17, -381, 298, 280, 213, -159, 274, -87, -621, 560, -726, -155, -595, 244, -434, 592, -1102, 368, -255, 160, 72, 410, -113, -390, 79, -350, 432, -306, -75, 118, -217, 51, -1186, -220, -171, 604, 199, 22, 522, -380, 779, 47, -133, 52, 656, 710, 130, 929]
3386I29j174l00R80q06r6J546j886J168p38O66N38j020K61K87J90J72l48m60M45
3405C54k83q6r4N98j103N35o77R19p50K40N3J99m68L77M76L05p87O50M23n68j65
3426A48p74J161j223J498j061l02J057q94J037j049J316r30k49N2l40j84J080
3443C43o89J12N73N81n77q54O63k53m5Q9Rn45L68J10Q33j113M48p69J408p54L76
3464C14j450J560j98n59J39P69n58l91L26L92j71o3p4oj04L3j338Q37P21K61k1
3485D19n86l07L06O04j037N84l0m37J408j341O78L12r71J12o6P09%n55L43J11
3505B56q85J471n31j130P39K67n18L16K33m96J02O4k89M22R19o17l00n35K81M44
3525B13n56p7J7P49k08j34q19M49P65J5m20O3l68l90J496m69q08R9q86J208o26
$$ y = [929, -245, -545, 435, -371, -467, 1079, -807, 361, -377, 289, 827, -193, 68, 355, 545, 717, 369, -91, 354, 71, -15, -109, 489, -614, -79, -756, 163, -587, -347, -294, -95, -563, -186, 290, 595, -192, 458, 881, 313, 148, -626, 535, -688, 810, -251, -553, 504, -390, 647, -402, 914, -16, -265, -213, -553, -737, 343, -346, -234, 339, 920, 343, -511, 152, -101, -146, -57, -48, -593, -225, -115, 718, -395, 53, -716, 692, -62, 314, -1136, 424, 226, -333, -194, 575, 17, -374, -48, 344, 173, 110, 36, 30, -74, -41, -1379, -542, 179, 440, 419, -167, -474, -168, 436, -601, -17, -47, -484, 924, -417, 261, 573, -398, -286, -352, 357, 357, -198, 145, 256, -629, 842, 311, -819, -80, 187, -331, -15, 218, -278, -176, -112, -401, 21, 940, 323, 23, -512, -231, 213, -343, -420, -403, 346, 138, 4, -815, -366, 399, 414, -6, 57, -311, -701, 795, 326, -482, -383, -1269, -61, -687]
3546f87l3N72k85l81J634j433J183l74m17P88n98k82m42Q94l71R3j270J828m55
3565c6J04n4K78q31N15m20J529p73j017L15j12K75J12L21J07l2J95K7j165L77
3585b85R4j36l31Q79M8l11O19p28K43m30L65J53r1p30N96j95k46K47l07R53p75
3606c68N25L33K49n64k16n55K67K11M35l12m49l9p24J089l3K33j58r6P68p47N26
3627C75j04o70M60l05Jk7J53P18l46M36L1m33k47l35O64L79J23j504L70j64J441
3648A016j800P30M02j013J70K17L45L13m03N13L4l81J63m76n7q97J242O9M3k63
3668c3n35O38L97m29l57l30R64J85j060m84N50J012r12o52J623j021J41L99o97
3687f01J04J23K64l61N39k55r03P06KP06o76Q50r10OL21Q22n91J65r58R03N2n49
$$ y = [-687, -720, -148, -433, -814, 820, -613, 570, 196, -221, 567, -31, -313, -755, 139, -232, -139, -1409, 419, -36, 68, 14, 292, -539, -24, -444, 1085, 312, -705, -390, -502, -227, -115, 206, 313, 281, 476, 503, -662, -285, -191, -327, -658, 221, 269, -42, 577, -151, 92, -338, 27, 180, 89, -641, -45, -240, -486, -239, -546, 407, -368, 157, 490, 739, 175, -41, -596, -329, -118, 317, 5, -444, -483, -1207, -118, -151, 82, -76, -172, 596, -151, 375, 271, -399, 61, -244, -243, -270, -117, 601, 255, 691, 722, 289, 42, -293, 371, 750, 873, -631, -261, -425, 1016, -784, -54, 348, -665, -495, -278, 67, 380, -23, 490, 524, 143, 306, -170, -227, -1124, 118, 187, 230, -33, -568, 70, 467, 38, -319, -649, 315, 500, -560, -1044, -494, 518, -394, -1046, 577, -444, -303, 96, -601, -497, -374, -110, -471, 68, -187, -1090, -384, -382, 324, -352, 498, -412, -406, -85, 737, 146, 311, -647, 256, 308, -241]
3709b41J080j108Q8J23m71O06J08r06R94J91l38j9k15J028n92j147J117l89K4
3728f7L85p13J262m32j169o8R49K99J75q2j35j687J289J2o01Q2N00O68m84P7l72
3749a12N10L5p29M45r91L78J256j367O12L23k45O11k50l30M33q84J030p20j14
3768a09L78J69J8j88r19J48l07M48m3J548j403J188l88p01K39J41L04k24M23j57
3788E65o6j98J001k040R21J223j747N79m9q93O74L67j8n21K1P90r21k02P10k69
3808g3n70j69P23l64m6O26M28q26N69j03K08j16n90M23ll67m72N45L16P01q27
3829A3m82P66l32L27p75L58N61o10O91q24O05m48P0j76l27N09J273r27j10M72
3849F34m33r9K48o60l12J305j132O50o60N97r13M84N05M19j130L50O33q32j12
$$ y = [-241, 839, -269, -181, -58, -529, 77, 185, -721, 273, 464, 126, 107, -108, 920, 328, -819, 298, -91, -67, 318, -395, 867, 435, -734, -802, 147, 446, 621, 539, 404, -1283, 6, 18, -583, -501, -1, 667, 183, 260, -112, 398, 433, -296, 149, -842, -464, 792, -575, 37, 360, 115, 726, 476, 146, 579, -305, 725, 5, -109, 269, 438, 456, 268, -651, -503, -810, -362, -405, 1143, -260, 928, 540, -161, 78, 219, 523, 299, 722, 565, 499, 301, 1302, -738, 183, 1406, -341, 238, 189, -704, -30, 337, 319, -202, -181, 609, -312, -514, 196, -73, -643, -812, -89, -453, -499, 127, 555, -271, 298, 195, 403, 287, -303, 120, 117, -250, -722, -177, 139, 840, 13, -469, 297, -35, 292, -483, -125, 436, -174, 517, -307, 298, -150, -80, -256, -583, -74, 1199, 272, 162, 634, 201, 102, 350, -310, -622, 683, -449, 201, -459, 138, -775, -291, 214, 633, -497, -147, 486, -346, -458]
3868d58O70M82n34M4K0L55r71P04m98n18N93r3M58n17R36j192J224m83P42l23
3888F41n43J92j107J386o62j42L17k43k08Q53J60p13K59m12n61J727r93o5L96
3907B82J116j103m17n55R7N70j052Q79o54P45k55M75J95j032L41L27N97r58r5
3926d97O03o13J267P1q04J51q04M58M07m06m82K4N12L73n16j89R0P21L28R4l27
3947D61m66Q84j441J186j093L39j10nO69m28k07l74k3Q44k34N0L84o05k06J046
3967F71k32j71o10L92o74j15R23j66j87O11l97K66r47K59O63J07m79L20o06P7
3987b95K99K65P54j127k2k6L81m72J71n30N69K2L10M5j143M86O99p12J87j181
4007a320P51M20J277j201J43k44K07n92m92J891j796K049k25r40l86J07K08L1
$$ y = [-458, 212, 694, 160, 204, 224, 579, -392, 312, -186, -704, -111, -204, 254, -263, 673, -519, 705, 222, 964, 641, 98, 290, -817, 569, -93, -235, 82, -161, -369, 484, 644, -69, 190, -222, -783, 944, -49, -114, 282, 1398, 295, -122, -677, -580, -10, -1062, -183, -837, -92, -347, 128, 323, -709, -368, -41, 556, -402, -497, 106, -507, 760, 831, 27, 178, -626, -168, 239, -167, -649, -625, -113, 260, -256, -445, -355, 366, 694, 788, 461, -5, 879, -562, 624, -469, -130, -240, -245, 424, -4, -211, -585, -608, 236, 2, 52, 436, -169, -375, 671, 439, 268, -342, 50, -624, -739, 184, 18, -169, 442, 45, 311, -636, -377, 286, 393, -86, 234, -372, -295, 4, 269, 1023, -104, -126, -152, 229, -243, -72, -602, -33, -11, 299, 344, -799, -313, 386, -326, -139, -1320, -569, -149, 1128, -73, 70, -174, 33, -559, -1051, 840, -956, 1093, 868, -72, -458, -351, -143, -112]
4025a12K62n20N21K56q88q2J23J397j128P34r07L74L02j013J393q38p76K134j612
4044c80L55K08Mk59Q10r48k16J076M52k013J319j89r1r86R66M1k72m8r79J490
4064C40n83J47R23m53J03r81M40j68J5O66l57j29j41k93R77J16j162J206n61p2
4084C3j051P90M89p48o31J042K23K42r84P06o08P82o18L81K21K34j93j441Q57
4103b74N34n48M70m10m54J690o83o28n57M8Q16J2Q4K83K72j20k51l4j027M22P93
4124D38j152P86k81n75J237K07o54J78L69j78q5q95J279n19p00M84Kq33J112l42
4144a22j28R4n8M21k13L00o19J255j303J05N56r29O18m48mL67O2K73n13P52k15
4165B51r78O41L22l47L90M21j720P54M70m10J79J52j33m62P76P8P0L02j474P76
$$ y = [-112, 150, -370, 151, 407, -481, -563, -440, 957, -171, 563, -344, 30, 332, -681, 712, -126, -902, 1232, -380, -25, 183, 187, -72, 738, -210, -426, 650, 1102, -911, 408, 219, 128, -858, 108, 149, -123, -171, -1150, 340, -243, -96, 827, 374, 477, -504, -64, -232, -217, 449, 92, -37, -178, -471, 506, 622, -540, 666, 105, 33, -1018, -228, 261, -487, -1118, -76, 147, 389, -595, 111, -497, 285, -333, 48, 269, 503, 310, -1131, -274, 260, -288, 182, -228, -682, 1008, 325, -303, -860, -812, 4, 16, 100, 383, 655, 535, 284, 250, -777, -355, 438, -714, 72, -209, -784, 453, 660, 6, 184, 553, 375, 290, -605, 674, 155, -545, -61, -59, -892, 220, -122, -250, -156, -214, 207, -6, 294, -325, 930, -373, -268, 288, -641, -23, -471, -475, -108, -46, 227, -286, 466, 251, -727, -86, 236, -111, 279, 700, -1020, -266, 204, -206, -27, 125, -8, -470, 306, 384, 454, 756, -718, 58]
4185E8l01O46q90N99k12Q72j570Q82P38j185k6K0l48O37N43j93m87N64o39Q2l30
4206e40k16J098j485Q78Q67l13L85o97rk62K67N61q08m62O34k37J4N30J1n25M08
4227I9L61j298O8J238o65N06m07K29k4N8k00j71k17O14q3l76J59M26K34r27J014
4248F38j013J11L06L30r55R57p11R31R34r16mr07O45m00J401j779M15j042P52
4267c07N42n89m20K49P23J65Q5l01N14l85n30N49n90m57J776q30l60J04l38Q1
4287c19O58J84j387O89K73L07J50j035R57j104Q77m4o87L56Q4M4K80k05r48J023
4307A53j73l69J50J65O88q67N3Q85l27q51J20k5n77J020J143j031k64m18J226
4326G01j331J829j099m70q0L04N68o64L20Jj8K91p72K72L38L26j191K07P81n92
$$ y = [58, -243, 403, -487, 112, -100, 772, -798, 84, 822, -363, -389, -369, -717, -80, 463, 270, -217, 347, -292, -210, -540, -756, 342, -1143, -265, 602, 289, 674, -23, -32, -294, -27, 534, -274, -736, -102, -339, -325, 205, 216, -309, 99, 460, -838, -770, 468, -197, 309, -98, 131, 107, 165, -35, -206, -423, 191, 108, -268, -109, 317, 551, -376, 638, -375, -264, 42, 372, -583, 374, -337, 594, 1528, 612, 608, -299, 346, -54, 1347, -432, -17, -1059, -307, 235, -354, -774, -525, 198, 363, 448, 147, 661, 276, -254, 295, -295, -752, 1024, 194, -166, -62, -400, -319, 339, 523, -864, -175, 98, 405, 555, -480, 477, -627, 250, 206, -481, -125, -41, 3, 283, 78, -870, 153, -20, -389, -239, -74, 614, -253, -200, 685, 358, -493, -373, -398, -975, 45, 1188, 157, -107, -525, 701, -630, 1199, 100, -370, -450, -146, 422, -242, 78, 79, 61, 352, -420, -148, 190, 516, -675, -468, 313, -279]
4346b79J410j084k22m5P09j15l63R8j12m68Q09o01N12K72q70n69Q96m31O19L84
4366E50k25L39j047N00j95L97j098R65j18N72j152J8L19N74j88O53j255P28l36
4385Ap59L67j3P91j58M81j636O65K30k23P39n96J06j22N31M3q21P96M08m47q92
4406e09O33o98N22l00Q44k43l99J81N77p13J68k37l9R91o80n60J018O67j027n26
4426c30J29J107j075M39N17q08J183j964Q54l54j38N9m66J557N91n67j008l58
4444f32o04J649k77L35j133K52R94o40j20L82p08O04N72J35j798M32J123J67m74
4463B59k82M12J81p10k99N0K05J35m41N45K96p40M52J48o2J32M19o55k79k54R88
4484E00o86l1Q02l46k41j37j39l45P6l66J5P73J49q4N58j222Q78M53o82K53N15
$$ y = [-279, 1131, 47, -175, -220, 489, 374, 11, 109, -3, -471, 338, -263, 249, 521, -349, -918, -22, -453, 166, 550, 325, 664, -383, 117, -78, 319, -779, 186, 68, 640, -512, -494, -175, 399, 211, 864, -391, 337, 1, -758, -391, -404, 387, 229, 710, -926, -261, -31, -254, 485, -111, -5, -127, 404, 447, -374, 422, 830, 383, -509, 124, -574, -52, -352, 492, 249, -150, 31, 608, -105, 63, -174, -213, 778, 98, -462, 556, 1223, 196, -330, -201, 906, -169, 270, 787, -21, 1162, -802, 52, -302, -440, -381, -847, 710, 1301, 734, -274, -632, -1236, 413, 136, 471, -662, -410, 584, -56, -176, 206, -502, 102, 674, 809, -989, -557, 566, 733, 259, -23, 389, 570, -140, -439, -389, -184, -49, -490, 55, 351, -389, 63, 211, 149, 281, 700, 45, -234, -488, 500, -186, -217, 585, 239, -2, -139, -278, -623, -547, -913, -898, -125, 24, -60, 498, -724, 154, 607, -75, 178, 693]
4505F93q26j36J83Q8N08j120J039p71P37j90l41k76R96q05n01R10K4o65J61O07
4525C15m90J280j468N32j68n15M14o4M48j025L27n3P91K20q53P8P6n13Q99m71
4545b40K10N86j234N51M24m42N17N73p78p02N72n85J43m85M73K07j97m66J74J176
4565D77k11k47j012J423p13K20j152Q41L57J59o46P7P33p54P39m85J219o78k02
4584A45M48o51O2Pl26K81J87k71j05K28N78r04k77M85L29J53k18k16M98m43o9
4605g9j00n69N69Q03j28p28J51K64n05p17J400q41R78j135R65M04o44o83R03m38
4625a30j007J473o49Q73j10n3J39p99n88J406j485R26M8M1J013j144J165r59K84
4644D44j102p93K177j371M81L50j537J532O42r9k24n58P54j106rL76j23M34o2
$$ y = [693, -133, -269, -86, 2, 510, -610, 429, -342, 395, 205, -136, -412, 584, -221, -722, 188, 212, -453, -292, 315, -175, 1105, -363, 169, 1, -514, -100, -164, 284, -741, -414, -467, 324, 544, -309, -231, -155, -668, 231, -240, -30, 556, -678, -127, 297, -145, 372, 945, 167, -535, 37, -548, -405, -890, -417, -210, -407, -873, -699, 477, 266, 19, -993, 430, -283, -63, -1215, -374, -17, 142, -504, -427, 306, -448, 291, -194, 1025, 347, 145, 593, -58, 4, 11, -315, -34, 153, -118, -223, 5, 583, -321, -598, -113, 216, 369, 151, -65, 433, -10, -79, -179, -748, -179, 624, 496, -232, -81, 183, -322, -1039, 361, -480, 498, -637, 328, 732, 88, -595, 308, -130, -1137, 336, -313, 560, 450, 397, 536, -263, -851, 555, -930, -4, 44, 85, 1098, -46, 1119, 160, 444, -658, -1451, 726, -645, -164, 186, -1351, 181, 823, 724, 500, -58, 696, -410, -419, -43, -166, 268, 206]
4663B06l4N08p4N2l75O2j000R72l23N48r71O92o29j16O31J63r42k48J084n03K38
4684e9J247n13r38l21M41k51l48R92R48j442Q16m05k33O80n11J39L26Or13j87
4704e26N34J01J27P2l69n15P29j078Q22K00l21O21q93J69J12L91m05L40q49K1
4724g17R47L46l18L41k85l69J31N10k33O07r98O93r91M22l64J33Q23r70M40o27
4744d79Q37K4j121Q99r32J143J89l01j74l49R1N98k59K93k79p54J266j018P79
4763D53r09L18pO3M23L98q63L45K63q70R56n69R99j831J256k6p70J75O23r32j56
4784f61K27O62m82J74l44Q92R2l27J33j35J61q59N41L24q97r9Q0p79J789o26L7
4805i7o14J89P69m27K31o50M28K81m38Q33r28P74o13N73n19m2Q8P14j549M22J18
$$ y = [206, 172, 680, 606, 658, 283, 345, -655, 317, -6, 542, -429, 263, -366, -482, 149, 312, -630, -878, 206, -297, -59, 1188, 675, -263, -584, -143, -394, -742, 250, 1198, -244, 572, 167, -66, 614, 103, 242, 568, 574, -339, -526, 8, 109, 236, 308, -61, -576, 153, -925, -103, 97, -224, 397, -496, -327, -215, 176, -229, 111, -738, -717, 230, 576, 258, 599, 314, -55, 76, 586, 353, 960, -38, 655, -336, 86, -278, -145, 678, -292, 148, -479, 358, 382, -739, 160, -772, 371, 560, 259, 85, -264, -173, 425, 166, 459, 180, -574, 692, -326, 453, -456, -138, -145, -82, 341, 739, -124, 221, 484, -386, 570, 1, 1000, -831, 425, 399, -371, -196, 427, -505, -661, -434, 228, -254, -80, -424, 468, 560, 233, 366, 231, 392, -467, 74, 398, -499, -598, -518, -1297, 492, -134, -97, -711, -522, 247, -180, 51, -599, -171, 110, -328, 505, -423, 351, -262, 311, -208, -250, -162, 552, -997, -575, -457]
4826d57K96Q76k94r15l2J64r2J58j07J8Q8Q42j97J68j572J343o58P74j019J484
4846H68l87p18j98J044J27l95k73L58m00J13J02l17o81N79K14q33J016n16k87
4865e84J278j19m83J22o36L20L97n41r6O93o28L77l6n71J318m74o52L21l32R24
4885E98l69j18m3p92K4J138j104Q21p26L03J13R11j050m1m67Q73q0K27q51P44
4905A11n58P19J34O88n22o64L62r99O91O35jm17P6P67j41m91j397R66J25j020
4925i36J736j655J163m65l55J58K10l68N32l64P65L09j716J347m24m71K49N21
4943B36J93j60j0L4j39k8K2l02J6K22K94j114K77M33m32K39M62J50o19P11o11
4964a26N71k17k67K48l81l3N17p05p69P27k58J089o23l27J54N55R3L0k03n33j08
$$ y = [-457, -161, 715, 421, -494, -526, -362, -454, -296, -403, -385, -297, 545, 348, 516, -1056, 287, -371, 403, -616, 868, 481, -237, -435, 609, 736, 341, 68, 426, 26, 139, 241, -76, -757, -178, 36, -797, 219, -297, -584, 694, 575, 92, 214, -422, -102, 295, -246, -342, 351, -277, 100, 64, -507, 811, 337, -315, 6, -326, 598, 229, 111, 68, -724, -700, 438, -666, 155, -571, -268, -155, 756, -294, -335, -802, 71, -9, 218, -633, 111, -447, 272, 406, 1094, 572, -92, 270, -729, -38, 597, 596, 179, 255, 1022, 881, 390, -1007, -41, 84, -936, 800, -855, 308, -157, -512, -354, -144, -512, 20, -344, 421, 730, -986, 361, -63, -534, -285, 236, 429, 269, 259, 293, 154, 126, 148, -154, -138, 84, 378, -736, -459, -26, -458, -219, 243, 393, -226, 485, -126, 445, 228, -39, 209, -172, -205, 312, -393, -1162, -435, -693, 396, -227, -554, -400, 155, 248, 278, 75, -458, -566]
4985e66qM52L19K74r53J116M07r42j65J10J045n81l67P59j240NK21l18R2l7L53
5006b4K35O2j257J367l26N0j72K59j060P32k92L87j023Q76L45p50J50O40N20J75
5026H94q54n30Q81m77p70R87k95O96k66K29n10N41k78r19J153p79p7M44Q24l36
5046E58K50j009M28k47n9K58j74m73J204q68J54j117R80k52L0J24K04j326R98
5065c37L34M8j48J33O50q63o7j51N15p50N46N38J77j89o17P54n00j013K088m90
5085F58m31M45j115L7L15p74J033O76j298k67P8M55P30p90O45j28m48m77Q85j498
5105a269Q75L95J69m09k62k50M56J036j571J411j605Q81M9K44O94j053M21j67
5123D5J49k27O56n78m17P09L28j241O60j56N53o15J276j471O96J22m40R26p92
$$ y = [-566, -574, -122, 197, 471, -482, 634, 1041, 99, -66, 44, 1089, 508, 141, 900, -340, -335, -114, -432, -340, -377, -24, 211, 273, -984, 383, 57, 107, -65, 194, -866, -134, -426, -39, -1062, -186, 159, -591, -441, 199, 719, 894, 40, -490, 391, -86, -856, 131, -164, 532, 266, 495, -15, 526, 248, -671, 482, -297, -374, 70, 894, 558, 808, -201, 227, -20, -79, 179, 5, -468, 736, -132, 22, -1095, -115, -367, -337, -213, -9, -1335, -337, -3, 45, -103, 30, 680, -183, -250, -401, 114, -636, -90, 448, 625, 436, -181, 573, 73, -940, 1148, 658, 227, 672, -443, -406, -91, -865, 168, 844, -454, -721, -643, -188, 542, -248, 397, 269, -179, -656, 229, -1269, -394, 1, 170, -239, -501, -751, -295, 741, -830, 581, -1024, -143, -94, 150, 844, -209, 212, 45, 194, -33, 623, 45, -372, 337, 665, -576, 84, -72, 481, -134, 1142, -329, 367, 489, 49, 975, 183]
5142A83K0j85K20r5P1l74j018J546j74n14J77L70k89k76K37q30J300k03P98p77
5162A87L55o0k96Q48j057J92O38j322M52M60r44J426j482P88k17K1l90lj19j70
5182f93J177m5j076O96n89J120K39j957P47P42K79m79n03L45n78Q27o17L54l15
5201c26M95o23M23j04O05k4o45o75O15L28j070J382n88M16n41J157q66J24J24
5220B07J63j393P03J54K27P24j247q5O11M48l50k14K37o17J00O5L08l99k72J370
5240G40m88j4l43Q79k31j263J008k73R12j222Q51o57j19r4J28K68O6m69m30Q96
5260A45M58p74J62m00K48J063q51j77k72P57j500J544n57l41r12J224L89j74k18
5279a86P73p37P69m42M4p25J23J29N06r20O15q33J457j133J355j138K24j60J119
$$ y = [183, 203, 18, 238, 143, 214, -160, -1178, 368, 194, -320, -143, 227, -62, -338, -101, -931, 369, 166, 964, 187, 542, 482, 186, 1034, -23, 169, 807, -515, -63, 397, -547, 879, -603, 185, -32, -11, -401, -404, -523, -693, 484, 439, -637, 59, -530, 590, 829, -1128, -381, 361, 640, 161, -342, 3, -575, 252, -365, -11, -326, 169, -454, -31, -135, 470, 446, -199, -874, -259, 69, -1001, 381, -207, 209, -332, 825, -41, 83, 207, 370, -1023, -320, -166, 61, 785, -462, -547, 64, 512, 162, -52, 185, -432, -332, -267, 41, -358, -630, 740, 252, 238, -105, 774, 543, -720, 288, 15, 927, -295, 556, -101, -220, -314, -186, 82, 148, -321, -751, 145, 603, -171, -9, -409, -161, 902, 51, -126, -398, 359, -1141, 403, -154, -495, -1407, -183, 206, 32, -186, 587, -150, 619, 177, 221, -504, -381, -252, 254, -666, -51, -884, 573, -560, 795, -343, -119, -279, 840]
5298H40o51k86o57q9L78L85j94J8O35m31k75j32O79j57O88k002R39J43j32K3K45
5319c3n84K70K87m86K28N80l17O38j283R28j63m05Q65j338O22k66J076o2k32j522
5339a197J059J443r50n99L23L73L93m62j593P09L63L09J022n76o20n57J368j093
5357b85P2j156J643L26p13m1p32J193q98p2J06j16Q97j7Q96j581K16M19q59K135
5377A433p95j203K39P16J92j057P80J4l30K75n74p6j73j63R18p03N05L57N27l9
5397H43r90j19Q63j61l32j12m93L49j47M20J61k62K14R5j17J11n01N32O23j250
5417b73j0N20n11N62q10k04r6M14NQ93K80p84j09M79k13j64j47o33J307j135J148
5438E19o24k99P73L2r17QJ9Q23m11N44L0M07j079N83j98r07K08P50j044Q46k48
$$ y = [840, 189, -97, -754, -843, -465, -80, -274, -256, 379, -52, -327, -459, 220, 63, 751, -1251, -312, -169, -301, -278, -33, -617, -347, -60, -546, -318, 262, -55, 583, -700, 228, 65, -340, 525, -813, -191, -457, 619, 557, 325, -1197, -138, 1305, 355, -244, 79, 452, 845, 383, -1210, -501, -138, 171, 1193, 617, -3, -560, 808, -285, -213, -1369, 274, 600, -113, -154, -886, 307, -591, -663, -557, -673, 224, 207, 1103, -478, -262, 157, -702, 1433, 638, -565, -326, 390, 582, -475, 305, 319, -11, 264, -310, -386, -559, -722, 196, -507, -2, 355, 882, 843, -147, -266, 597, 436, 104, -8, -501, -152, -299, 121, 282, 20, 234, 329, 212, 323, -178, 354, 977, -273, -283, 237, -274, 288, -522, -726, -822, -408, -403, 490, 770, -14, -123, 356, 143, -21, -168, -801, 506, -629, 519, -105, -404, 369, 401, -516, -508, -489, 334, -77, 467, 497, 904, -175, 408, 210, -697, -489, 261, -783, 63, -185]
5459a85L39j80o72m3Q2J33Q28q71K19L28L57r1l25n44J670r6j461O21p21Q40J80
5480D08o40mj32O57j62j79n09M00j083K049j086K63l7K70k76m33J248n81k89O44
5500E28m05m81L27l08R63r52j94j05K62M12O98O2N2j339J65K23M4j57J053n51
5520B97n2l30O52j684J08J209K00q5j61L62n01p44M50M12m6m72P9M76j27k65P24
5541E02j140J281o55P69o55k32L30p28O79M64p74k40J5O71Q80j959O80L48J071
5560A307j300N00m13j054R93m81L04J366j797J61J17m51O77o60O90J80l42K61
5578E8L58m12J20l79O84n53N28j200J51N27N95k6j20p00N72m64n40R64o59K7M66
5599cJ86r84O08O54r49Q66p45k1j43O93l84J021o36k42j21p22L52J52J25K72Q65
$$ y = [-185, 154, -26, -698, -741, -659, -526, 302, -569, -350, -22, 335, 244, -81, -625, 1045, 949, -512, 109, -612, 228, 408, -232, -236, -368, 289, 127, -52, -561, -161, -1244, 805, -281, -18, -55, 215, -61, -494, 754, 173, -116, 528, 123, -358, -31, -339, 624, -328, -522, -627, -365, 47, 745, 807, 859, -480, -315, -92, -48, -205, 848, 297, 245, -85, 567, -1117, -1009, 200, 400, 315, 154, 516, 15, -729, -279, 133, 87, -385, -306, 170, 43, -222, 502, -638, 643, -12, 757, 102, -130, 200, -528, 151, 615, -159, -399, -384, 287, 1167, -792, -112, 236, 1307, 7, 507, 94, -960, 33, -448, -144, 1222, -575, -414, -297, -748, -71, -731, -41, 139, -203, 58, 416, 4, 124, -255, 429, -124, 404, -796, -645, -118, 477, 451, 331, -369, 203, -261, -801, 163, -496, -469, -3, 183, -801, -193, 461, -488, 378, -367, -388, -531, 162, -222, 799, 163, -79, -200, -922, -570, -418, -293, -21, 844]
5620H44l89P38j845N42l30k59J177q70K81K94M70j341J361r56Q13j49j76l96J97
5639Fm99N85o58K09J348j302P27m99N29N40j132l85j45Q10L73n30L29r25J403
5658G84j266k29O84p62P66j9m2M5P80l21j279J471j191L92K32J37J252j201K09
5677D42J9n84k79K02J413j098K14k78J68k5M94r73J016p35P1Q38r40J26k29N87
5697D49N12j89j492J351n73O69n92k70m17K57O01M88l27j034N08N93j66j321J472
5716E19j92j230J337o51J56M3K04m51Q09m79J72J03Q5m00Q42j087N41k51l01j58
5736c89N34n51Q63k00o91m69K63J018r09K78P04l91j283P41R58m18o35J779j056
5755A46o37R58o98P27Q0q54N29J58o33L52J66k90j62Mp6M61N44p10j94L57k97
$$ y = [844, 455, 1193, -652, -110, -440, -699, 478, -392, -111, 183, 653, -688, 673, -283, 530, 381, 205, -191, 6, -493, 92, -566, -357, 991, -311, 416, -83, 446, 986, -146, -531, -676, 134, 507, -23, 306, -619, 784, -482, -711, -27, -789, -23, -42, -84, -39, 741, 420, -859, 612, -579, -187, 45, 182, 1434, 233, 442, 461, -123, -402, -200, 1213, 115, 329, 51, 219, 194, 688, -285, 731, -4, 67, 905, -35, 91, -138, 449, 961, 772, -720, 631, 58, 727, 135, -135, -552, -295, 306, 794, 467, -567, -59, 534, 368, -953, 519, 327, -903, 434, -217, -61, -18, 186, -265, 544, 65, 237, 340, 425, 25, 867, -220, 321, 70, -231, -389, 145, -406, 457, 257, -434, -903, -640, 378, -531, -253, 451, 60, -1223, -482, 476, 58, -577, 1202, 146, -491, 467, -231, 496, 576, -278, 251, 409, -224, 128, 294, 4, -158, -154, -230, 231, 775, 65, -129, 228, -69]
5776f9K11m38J149q27Q9M08r45R55r86J94J44K29K94o6J18n65K01m10M50n19O97
5797C14q58J32O09O45k53n76L71M31j371P62j68k10M5N87o50R32p74q45Q57M13
5817C93l69Q38k79L16p74k84M23o21N84k64K87j018R64l68j64J27M81j69p4r9
5837g0J03j96O95j69m91K62l54K88r8l71P67P5q32L95K43r11N67j31p45P37j47
5858c83L99P90j452M32O02l95j310J351k73J427j215k58O25k04Q4l28m3R69p21
5877I7j75N10p39P2j11J043j095M75n15L86J1P85m58o64m59L64M93k64M38j020
5897h26J487j128M63m45O0J86N04k41l09P60n24N9L17m06j26L24m01j16R46m42
5917A42no65P5M71N35o30M34Q66j468k57J050l08j90M78j441N80n12Q96j35j133
$$ y = [-69, 142, -296, 853, 26, 115, 523, -422, 533, -453, -259, -115, 114, 408, 342, 460, -105, 96, -314, 136, -383, 314, -544, -412, 197, 842, 589, 13, 384, 815, -556, 206, 38, -172, -127, 460, -190, 742, -32, -877, -20, 393, 24, 862, 583, 899, 125, -159, 264, -357, 227, -37, 250, -768, 196, -172, -336, -209, 272, 103, 29, -70, 33, -163, 532, 363, -128, 134, -220, 68, -30, -401, 366, 441, -391, 4, 247, -664, -97, -228, -973, -236, -383, 16, 806, -646, -214, 388, -7, -1317, 34, -239, 1188, -27, -285, 340, 136, 220, -108, -151, 818, 97, -78, 432, -307, -235, -346, 697, -398, 77, -438, -52, -41, 744, 286, -378, -837, -473, 20, -244, 194, -826, 661, -467, -4, -449, -389, -203, 301, 60, -249, 511, -13, 46, 363, -43, -169, 155, -246, -362, 584, 142, 137, -528, -453, 18, 553, -77, 357, 1223, -245, -502, 548, 240, 50, 528, -913, -333, -845, 51, -84, -1217]
5937a217N48R78l31k02J43l03J089r03p2L09p61Q51J68P36j006j70k18o1O38l72
5957a56L47q27m05N86P83k52q65O70m75J043m29L08L76j66q8k73L24p59P94m77
5977E9k07P3n42Q02k19o37j14O34R82j092K18m84J69L27K16k60k88O41j287J231
5997B22k39K3J03k01K58K51p69P08J54n21P94o07L90m46O9l09j216J799K71o26
6017A08o36P78r68O02J248j326J240j593Q02j08o82K92O09K13l51j042j81J032
6035C7K75K29l83L48m17L47r6j09r58K21J176k46j51l16L85o91O54j25P9n50P
6056b84K69k83J061p31K28L22Mq38N21l42J108r25r9M0Q70j233o90J244K46j52
6076C36K86r40L96k23m87M0R32R7O7l63O0m56J28K85N6k46p9L89l21R34n66o06
$$ y = [-1217, -669, 309, -22, -224, -81, -384, 705, -198, -270, 39, -722, 129, 297, 1033, 27, -143, -361, -422, 216, -156, 191, -636, -1041, -455, 328, 76, -789, -119, -594, 449, 20, 328, 704, 538, 450, 177, 501, -258, 536, 59, -148, -75, -617, 185, -34, -671, -785, -151, 831, -261, -43, -527, -358, -31, 185, -75, -363, 278, -1009, 222, -17, 6, 109, -92, 166, 417, -352, 356, 510, -11, 783, 176, 566, 120, 189, -120, -1336, 463, 734, 108, -528, 250, -718, -116, 1132, -194, 1046, -547, 255, 147, -535, -243, 366, 579, 228, -814, -995, 37, 312, 541, 158, 506, 89, 436, 340, 231, -727, -506, 670, 424, 273, -43, 342, -349, 305, 180, 259, -291, -284, -15, -298, 763, 32, 260, 582, 586, -252, 269, -73, 1035, 110, 11, 51, 921, -312, -1002, 242, 488, 336, 622, -318, 78, -145, -632, -592, 340, 437, 504, 141, 201, -255, -127, 158, 214, -32, -111, 278, -43, 891, 325, -281]
6098b81J15L65m36Q50o49o60P12K63j004K00L62O2P50j470O08Q1j36N02m16J97
6118A5K8l46O82qm89m2N34q32M80j003J494l95L06j563P45j92J195j007M49j10
6138e9m33R00m68J01o90N04J12o11R23r7o62M57N97k72o27Q76q83M4N18L49j068
6159d89J348r33L8r4O48o69J03K16L26j510J534o4k03r0N51m02L06q22K18p37
6179g25M44k1N50k5r05J14P41m02m90J012j18K06n66l69R48q23K3N59r95N82p5
6200c35q16J461P2r33J54p28O00n02Q98P30n96O48o71M71m50m97P34l48N30r58
6220e36O10J71l46k19J62l20L31P33n81Q98j75q95N76q73J09O20l56k13L92M00
6240D88j186J067l19J16N09p64O7m44k18Q69k74O11K49q03P61o14j46Q73j272
$$ y = [-281, -166, 199, -237, 613, -36, -696, 16, 279, -725, -525, -163, -101, 649, -821, -213, -132, -268, 234, -182, 15, 43, -303, 379, 371, -118, -160, 374, -458, 22, -981, 513, 118, 424, -1139, -394, -586, 609, -398, 51, -59, -492, 408, -60, 41, -649, -145, -33, -644, 279, 182, -480, -23, 574, 302, -325, 551, -332, -288, 230, 579, -489, 859, -74, -36, -130, 518, -151, -48, 168, 494, -1016, 518, 454, 251, 161, 712, 310, 616, -206, 12, -725, -281, -302, 248, 223, -682, -568, 173, -229, -719, 293, 175, 381, -185, -554, 394, -429, -406, 153, -842, -260, -335, -1151, 310, 382, -551, -397, -1125, -525, -1027, -129, 601, 5, 653, -18, 453, 3, -494, 240, -108, 422, -536, 74, 245, -101, -320, -158, -478, -147, 586, 5, 903, 728, -167, 409, -464, -355, 265, -91, -304, 88, 488, -698, 369, 50, 166, 675, -89, -22, -466, -684, 185, -89, 522, 771, -32, 729, 115, -31, 842, -430]
6259d30O10l26l72J235p48M29M05n75m10J78J34L89q58L16J97j01K62q44O5p2
6279e16J364j091K73O74j434P87N15j292J053j68l23M44P38o05l61M50o37l69
6297d98K62R74j262q4N77N8J99k51j31O91n9J79J70o28K77p30J95J342n92j11
6317E78p91N10p89J068m96m12o02Q10K09r9j91j51N38l77J89M88j12n8j138O06
6337b20j24M68M08j476M52Q94j208J146j638O34M27O3J58J25m9l45Q23n99l31
6356c92J076j16j104M49m66N1o6L89j143P71j65N32l02P54J83J8J35j224R11n53
6376b62J019o48j04j44l67O43N53p15J58O70q49L64M86q53m94R10j9k91L55p49
6396c37k96N75K46m78Q43m33l85M8m87Q34m89q9M87K48l13j56L54m53K82K92l86
$$ y = [-430, 180, -146, -518, 717, -31, 398, 803, 228, -182, -4, 130, 519, -339, -23, 174, 73, 335, -509, -444, -516, 848, -243, 30, 704, -730, 57, 572, -720, 333, 165, -158, 286, 1024, 419, 58, 508, -129, -498, -236, 738, -524, -608, -31, 27, 226, -25, -156, 535, 476, 655, 825, 197, 474, -256, -61, 1281, 689, 578, -213, 297, -492, 576, 80, -332, -934, -124, 85, -14, -205, -356, 182, -195, -6, 482, 370, 312, -826, -220, -344, 124, 532, -944, -492, 402, -806, 340, -1298, -664, -237, -174, -16, 109, 60, -285, 538, -61, -392, 684, 568, -536, -87, -553, -502, -568, -179, -1322, -551, -716, -184, -486, 268, 451, 469, 604, -620, 291, -262, 757, 109, 5, -139, -506, 137, 690, -25, 133, 803, -46, 318, 804, -49, -543, 367, 348, 57, 412, -337, -633, -58, 188, -290, 553, 120, -265, -217, -704, 130, -359, -448, 39, 287, -26, -182, 172, -281, 1, 293, -93]
6417i3j7J6N00r3L6j101N57m89J110m12n42M82J393n40p06J27O09j39j308J066
6437D56j234j36J608j21m44k81m13P16l9k49j2O31p44M48k26p6%K13J2J40n82
6458c33J81l10K38K19J86j16o54P66o97M69K57m27P85l38O58j42p60K22o25K43
6478a78Q12p44L56K2K49m64M29N85j025J23J94j74j90N58o59j30K89n76M59l58
6498d22j51P81l48N97j38K8rn69p53J833r45J18K12J09n35O2O2K73L61j290P72
6519D8J3k74O6p81J084n06M0l0P83J2l15r12J107p3j04l21O00j4o05N64m28m60
6541e06J186r79P7L86j53M12r5p01K03j46l41L95M07K94n1o23K50l95J063o48
6561C5j096L54O14J91P23q02L40p29K37o23N21L34j66n19Q70k33j022J876p50
$$ y = [-93, -110, -94, 406, 313, 349, -752, -195, -684, 426, 14, -528, -46, 1347, 807, 101, 228, 837, 698, -610, 456, -778, -914, 694, 573, 129, -152, -565, 151, 112, -137, -149, 482, -262, 186, -40, -116, -116, 97, 109, 249, -333, -152, -462, -224, -5, 181, 65, -589, 177, -520, -51, 206, -221, 564, 226, 884, 742, -18, 204, -421, -178, 634, -110, 246, 268, 517, 53, 482, 1067, 42, 165, 359, 185, -5, 553, -106, -236, 53, -523, -64, -422, -573, 208, -140, 457, 319, 347, 338, -231, -984, 849, -96, 22, 234, 343, -192, -130, -68, 205, 566, -724, 48, 61, -213, -147, -928, 156, -350, -310, -340, 443, 455, 140, -772, 335, 262, 158, -163, 437, 423, -182, 382, -46, -506, 680, -299, -222, 164, 11, 423, 328, -373, -170, -316, -657, -262, 145, 439, 388, -235, 15, -380, 683, 35, -1061, -707, -93, 98, 821, 19, 359, -370, -133, -756, -235, 99, -67, -586, 284, 51, -971, 905, 155]
6580A55L40l00L69l77Q0rl44P1L46n14m73R76p93J224K5o3m33J56k6k3M6M05K15
6603A053j110n36k1N18n4n49K63O71p29J09m4Q13L29r51j18O90k05J32j334J270
6623A97m1k25K01k35R8L68k38j291J111l39K65k14J46M34o03M00m63N55J95j318
6643i97J267l19P61l85l1m53q21L00Q29N3J75j182J60M54J13l57J30L42M4q1O35
6664F37j50j374J824r57K21n87N42M62j318O95jk33p48J084J04J45m56J25N7j97
6684a25l57J692j651n40J234j047J520o23L65o08Q59J28p27j054J834q31LK7k00
6703a01N57l15l78N78qP7o65k52M65j47m57J481N8j357J021l02o74Q16J176j776
6723b03k9p7K39l64kR15k43K18l27j717Q96Q28p48M50j80P57j287R29Q09J64r74
$$ y = [155, 495, 195, 564, 187, 267, 258, -86, -15, 331, -183, -656, 320, -473, 751, 776, 713, 280, 436, 410, 387, 433, 838, 1053, -57, -593, -614, -96, -150, -699, -436, 235, -494, -385, -429, 384, 713, -238, -356, 334, 129, 261, -1073, 197, 156, -69, 132, -103, -5, 363, 125, -1166, -55, -394, -129, -343, -197, 237, -366, 34, -429, 126, 321, -997, 270, -49, 712, 327, 296, -157, -978, -678, 151, 204, 379, -803, -643, -189, -76, -433, -303, 39, 83, 2, 637, 487, -887, 937, -20, 201, -386, 156, 618, -700, -5, -6, -239, -987, 97, 201, 346, -110, 15, 72, -125, -482, 1210, -441, -981, 253, -794, 726, 103, 468, -140, 719, 847, 120, -934, 900, 69, 72, 99, -101, 456, 141, -237, 341, 333, 410, -255, -507, -42, -189, -646, 835, 893, -464, 557, 255, -419, 397, 1573, -203, -232, -309, -70, -434, -436, 479, 236, 454, 127, -1590, -694, 134, -614, -164, -344, 413, -874, 55, 864, 1028, 54]
6744E4k64M14J19j147N30J26L1J001n42L3k58n70L99J66j030J583l51m18K10K50
6764C36l78k16J04M63n8N61l93j074P97J49p61R67l96j21J04L68m41J0K46K41
6784E08K19k76o73J10n1j49J88N75M24j208N58n17O64m35L92O01j384q78R58o9
6804d43R56n21K16j55q5n9O0K11m83m66J17Q19M6K1j415J0J257K79k26o10P23
6825B52M85j169P30j6m84J41J572j357n94Q02n18r15R61M61n14L11l49m02J161
6844E58j305J388j084J37N04K17m02m43O1N8L86J28m99P89K4l6k90J96r16J80
6864c49J077j820j9O01J229p44P12j900J808m96q0l37R97m37j30k70Q74j298J171
6883E89J69p83L81N11k041P12K57Q41j175r2N22l4K37L63q10N42k82p20M10j00
$$ y = [54, -210, 204, 323, -824, -294, -168, -137, 864, 322, 355, 97, -473, -74, 92, -938, 645, 294, -124, 86, 336, -42, -258, -154, 309, 251, 812, 419, -655, 142, 291, -470, 497, 101, -20, 84, 452, 11, 21, 267, 508, 727, 451, -222, -112, -163, -312, -124, 451, 875, -333, 225, -292, 372, -63, 329, 930, -454, -1332, -374, -443, 513, -8, 208, 53, -32, -91, -31, 180, -303, -769, -652, 167, 213, 234, -1181, -1171, 86, 365, 139, -471, 252, 737, -432, 298, 282, -202, -61, 1511, 154, -440, 362, -156, -1071, -110, 351, -163, 148, -201, -603, 558, -747, 641, -443, -306, 198, 415, 13, -430, -369, -311, 75, 203, -296, 493, 517, 481, 191, 387, -529, -349, 728, -1092, -1111, -510, 719, -25, 687, -1213, 595, 99, 19, -318, 679, 242, 112, -158, 716, -582, 589, 758, -25, 356, 867, -1174, -462, -205, 636, -539, -631, -109, -143, 94, 457, -353, 189, -93, -813, -403, -503]
6903e03M00K86j65O41N8j188M41J57j16l29n4N54l7q1l54O32q11Q54n93k5L67
6924A34k78J5m6O71j228J028j81r1m70J271r69K15j70Q08j107n98K68Q93J73j351
6944a013J484l86m11m73J33q0L82J93j44L82l76j86J026j154O38m04Q42l1j184
6963g62R66j46N93q68n19P02K0j29j109O63J164p12j14O07L45j005m35J034l01
6982fL79o77O32L38N47j046K0L32o28Q53j359J115q28J181n66p74l7K24N53m38
7002a85J70J93K20j000M68l66L41L2M79j412J020J427o54q20M83o92n06N60k87
7021e29J365l30m1j137M05n52P6M46j43J031q64L30L84M0q61j55L46Pm93P50n95
7042e20O75m07n0L96Q0j8q56Q06p46l29R06n41M73j198J240P7l65P02n3j094P72
$$ y = [-503, -103, 183, 18, 659, 717, -471, -30, 127, 11, -318, -372, 182, 145, 64, -290, 342, -469, 385, -208, -233, 134, -144, -129, -175, 496, -732, 296, 115, 24, -446, 825, -144, 71, -99, 709, -398, -996, -728, 165, 338, -1013, 471, 85, -326, -799, -666, -746, -364, -171, -315, 67, -309, -495, 531, -623, 15, -389, 453, 422, -762, 204, 58, 651, -217, -736, -34, -14, -143, -1252, -589, 575, -137, -251, 356, 701, -304, -739, 295, -6, 373, -304, 328, 666, 1213, 167, 187, 519, -109, 744, -615, 500, -328, 853, 287, -487, -524, -300, 253, -185, -15, 178, 398, -602, -134, -500, -159, -127, 352, -1060, -40, 1387, 733, -87, 396, -296, -802, -242, -529, 836, 506, 465, -672, -267, -819, -743, -297, -440, 591, -273, 57, 441, 481, -380, -535, -189, -182, -675, 75, -520, 155, -252, -302, 94, 174, 156, -700, 106, -640, -969, -63, -604, -131, -1329, -89, -12, -377, 325, 272, -822, -50]
7063e0K11q5Q02j326N64j3K87n74K11N84j336Q79Kl9r17L45R87l97r6k07l19L32
7085a55n50N77l18N07k77Q69l69j92O71K9j081m68J08K140j647j11K32o87O67
7104e5O66q33n69L85J39K97o6J31k11Q69j198r5Q4P03M40k85n2q94J221N0K5j146
7126c94L92L61J53o37L10k44l3M50J49q50j15K97l1O38k58m94L2L95m26n45P06
7147a44j121J192N25q61k78J141J73p19l56L48o29J37J28Q12m63Q2k97N24j216
7166a022J739r3k25L17j92q76K20K84O1L58r84L72j32k05J71J5q4K81n75KM08
7187a60J22J26k4M44j173Q77J34J77l25o77l07QJ064p44K99L09k85L60J03M19
7207G47n53j18j201O07J035o85N17k81qj81l02L99K78O4j148O11M3L18O9n41J044
$$ y = [-50, 161, 76, 878, -448, 116, 103, 390, -184, 27, 611, -725, 154, 156, 117, -800, -455, 532, 135, 39, -168, -487, -155, -705, -128, -446, 61, -216, 653, 284, 92, 763, 792, -289, -757, -649, 1491, -156, -267, -35, -722, -55, 611, -222, -791, -406, -267, 30, -36, 95, -116, 753, -445, -540, -456, 247, 687, 402, 350, -544, 677, 727, 752, -394, -2, 359, 512, -125, 185, -59, -92, 358, 507, -343, -458, -161, -192, 446, 188, -306, -274, 121, -305, -850, -144, -1265, -73, 452, -409, -687, 454, 627, -92, -448, -100, -729, -592, -464, 348, -115, -33, -330, 194, -1022, 717, 624, 399, 716, 524, -352, -132, 152, 213, 571, -413, -41, -173, -378, -207, -192, -276, 5, -570, -568, -160, -38, 88, 64, 508, -665, 212, 346, 523, 198, -479, -786, -778, 286, -458, -159, 150, -135, 225, 328, 747, 194, 76, -1125, -518, 517, -168, 349, 68, 60, -121, -423, -24, 254, 318, -830, -219, -176, 142, 211, -330, 714]
7228G14J076k181N00Q04n22p17o83J174M95p86O98k64L01o69R24j099J17j63R84
7247G03j55o13L48j186j95Q54k52O75K56M59j046q95J299m75L05N51l38q05N24
7266A4Q73r30j26k81j16Q33Q03j098q5k51M41m46Q52n54K23j00K42m71O76j310
7286h11L1R24o54J141k03m92l96p0Q58p3K65j253R31q02n9Q20r72R85q11P09K94
7307C62j20J2r08J045j089K27P07j454J724K37m39j22J32n47K94l43n7K00K65
7326A26m33J166r57l69J058m3j187L28L70j077N42J94P1J506j734K67N50n51Q92
7345G19p83j36n28P39j344J142L77k35K41J17m10R87p92K34m78M18N1o16K58M0
7365AN20n95M39j85r35J015m06K64r53Q46j84m90j5M68o70J248q39K34J72p79
$$ y = [714, 1790, -391, 109, 913, 391, -326, -1009, 165, 660, -126, 572, 308, 609, -60, 864, -235, -118, -281, 703, 548, -65, 283, -903, -1098, -244, -496, 179, 435, 894, -152, -1047, 252, -223, 82, 633, 295, -510, 14, 887, -43, -169, -450, -566, 267, 1070, -28, -113, -364, 77, -369, 483, -71, 152, 52, 294, -177, 499, -811, -780, 144, -510, 631, 428, -64, -460, -530, 328, 255, 520, -733, 198, -604, -663, 157, -815, 170, -641, 68, 362, 242, 254, -654, 391, -698, -471, 236, -1218, 506, 743, 304, 182, 314, -233, 61, -282, -339, -139, 126, -307, 859, -98, -467, 591, 548, -639, -311, 59, -1018, -476, -282, -211, 1295, -439, -172, 378, -173, 719, -64, -200, -728, 11, -1333, -191, 186, -49, 192, 309, -101, 886, 94, 328, -150, 268, 319, -297, -39, 1, 521, -74, 365, 180, -755, 260, -146, 118, -835, 11, -173, -663, -678, -210, -880, 368, -471, -237, -65, -844]
7385h44O25J14K0Kl91L75r1Q73r86K99K81o72P70p65J127n81n6j014J140l45j3
7406a32J34Q0N77k93j97j051N04M9M66j09l95L04J43K25p84j1L15O2l90mJ70R81
7428F44r9j632J048j17Q66m68q55Q83n47M63j78o49Q73O85k5o38p24O09j67L88
7448C60m65p2m85K06P83P28j186P83j97j59j24J060j767N22o4L67o78j32P75r59
7468g04M34N15M88j565Q04l85p91J520j387J083K13J03j95L19J58j394L38J77
7486b69R11l77M3l54j24k03N00L46J25o34j4M72n13J044k42Mj303k69M55M75K91
7507C64n75m74J439r08Q1j096P57R80q75p1J224j36mm37M24j32j83J55k94K97
7527E36Q6n17k01M36n45M98m5J50m75j00R28O11j533J067j344n38L84J380m14
$$ y = [-844, -219, -105, -85, -83, -474, -99, -190, 683, -303, -4, 277, -395, 375, -390, 737, 156, 100, -914, 226, -119, -132, 2, 82, 659, 366, 169, -882, -378, -329, 137, 28, -367, -63, 80, 305, -479, -490, -175, -113, -503, -507, -337, 644, 545, -1087, -39, -156, 710, 242, -613, 270, -277, 186, 8, -641, 232, 917, 892, 254, -470, 139, -28, 360, -105, -177, -662, -456, 327, 1055, -131, 652, 455, 296, 172, 1232, -535, -13, -77, 290, -388, -520, 255, -704, -270, 245, 733, -832, -28, -413, -1204, 316, -1071, 12, 225, 328, 133, 452, 610, -784, -446, -269, 642, 265, 308, -46, -170, -373, 127, 473, 598, -36, -50, 422, -91, 953, 711, 715, -588, -857, -402, 73, 364, -211, -685, 754, -154, -73, -1169, -412, 568, -307, -378, 846, 710, 706, 269, 693, 561, 378, 533, 239, 536, 622, 105, -96, 340, -205, 293, 248, 398, -77, -177, 751, 1362, -171, 896, -448, -986, -602, 778, 364]
7546C64j243J216o28p21J596q24R05r35P35l94o4J1k00o38R65O81j287N05q16
7565g72M94M25o7m15J46N87j79O9k5p57M70l24Q11n96K66k87N10q05J8l6J38R21
7587E92p79J01P79q08N48j012R12p51M16J10l88OM23n21P65q98R86k57q6N9k86
7608h9m28R71J94o77J55N35j445J177J32j089J601j824M93M81k98k09M25k87k34
7627d16M94J65p60J100n31J9k41m21K99M89J45o74P0j141J145k83O53L42L6l76
7647A14L85l99J11p12j75Q94k44l44L47P27k42o9o57m2K73Q98J46j005J81J13
7667C00p34M26M65m79Q50o60o5N63m21L86j542N23O72J341j636o47J069j92M8
7686B67q39J188o29Q72o27K22n0m39o98O54K71L83m04n27R41j101L15q36R82Q42
$$ y = [364, -879, 337, -291, -1012, 584, -240, 665, -270, 465, 71, 7, 18, -182, -820, 145, 826, -461, 44, -772, -278, 147, 80, -335, -189, 398, 219, 288, 263, -494, -24, -348, 463, -133, 133, -154, 356, -449, -431, -467, -329, 592, -187, -86, 693, -115, 433, -579, 333, -418, -2, 108, -280, -274, 149, -372, 393, -505, 481, 224, 138, 197, -89, -517, 454, 648, -29, 126, 661, -784, 393, 525, -564, 1037, -787, -294, 187, -111, -320, 105, -182, -416, 78, 243, -517, 583, 52, 71, -170, -591, -292, 197, 342, -332, -262, -1403, -258, -541, 112, 454, 490, 114, 499, 100, 211, -501, -676, 218, -26, -370, -23, 704, 462, 393, -264, -306, -33, 865, 1011, 6, 187, 300, -434, -8, 457, -22, 828, 168, 103, 666, 245, 631, -911, -388, 284, 1625, -11, -658, 411, 219, 267, -572, 616, -13, 859, 232, 454, 404, -35, -733, -79, 192, 575, 171, -356, 585, -516, -201, -1037, -55, 787]
7706G87j300J47J206j149K79R41j193K73L98j334J333j023j35L96J028m90J076
7723A240k030J069m60M81l53l54j70J210j91M02j261J89P27J80l91J30m15n96
7741e93O40Q14j154R43j082J45N54p41R9l77J527q23P5o69J254l40q52P41m53
7760b92Q64r24J193j141J65Q57q92j16J18K29o62j20R83j61L90j070R63P9k10
7779B53n31M45o4O15j397M97O8P38m07q15R39J48o84q0J318k97r73L82j45l30
7799c20O19j4Qk90p21R65l61O16l0q34j85P74M01l89K05n04Q22j273M98q7N06
7820D06J60o66J01l5N33j152J205p71o10Q4L65M29R25n88q1L53j75r33O71j98
7840B3OK98k37j1l32L94j10L94k42l45K11L7k34LK67j00jm73L88m56K72P87k03
$$ y = [787, -513, -366, 840, -309, -30, 911, -282, -9, 389, -945, 388, -635, -770, -374, 654, 164, 1240, -790, 279, -181, 300, -53, -407, -577, 633, 442, 844, -417, -228, 499, 679, 288, 418, 3, -593, 47, 861, -293, 650, -432, -287, 267, -474, -375, -752, 775, -48, 27, -642, 612, 272, -580, 161, -292, 572, -352, 841, -300, -135, 722, -170, -286, -168, 61, -601, -721, 262, 101, 491, -579, 384, 463, 253, -278, 167, 103, 718, -679, -182, -114, 624, 217, -598, 341, 489, -195, -275, 1043, 746, -227, 155, 10, -320, 299, 285, 293, 3, -718, 247, -114, 502, 472, -362, -547, 227, 628, 239, 444, -60, 762, -511, -13, -100, 406, 566, -100, 1, -34, 499, -653, 552, -219, -829, -745, -380, 49, 974, 386, 305, 658, 483, -450, 221, 23, 29, 327, 90, 79, -253, 141, 31, 425, 183, -162, 49, 86, -148, -145, 122, 22, 21, -452, -64, -520, -248, 539, 336]
7863C36l23o54j99R06m73P20J9M62r71R20j33j109R36o17n1L76M83r80K71J77
7883I6o54J150j194Q32j465J636n89P40j184R93n60k7j93P19J0l2k49q27J89J228
7903F19n50q95J035q16J412l97m28o46J552j131L44K38l21L7l17N33k44L42q33
7922d66P67J77o82j017P2J508p00M25l57O23l07L97m50q46J615j232O60J17m34
7941a30k48J157j99o10P7K63o64O97n93m51K2P67j73n17j92Q05N55n55J031l05
7961G37q60k97N83m74J191j184R72k63r25n1L11m32L68Q51n43o30R04m88J44Q87
7981H01j101j8J159j775J447r70K27J752j462R54j544M19j98J014j39q27Q04r19
7999c76j01O06Q52q91J99m02K15k12N27M0j246L52L02o82P08Q26o86l74K50N45
$$ y = [336, 13, -641, -840, 66, -407, 313, 332, 794, -177, 743, 610, -499, 437, -180, -231, 145, 628, -352, -81, 96, -558, 592, -602, 230, -1235, 401, -188, 552, -632, 361, -199, -226, -419, 300, 310, 278, 29, -798, -609, 619, 69, -826, 209, -607, 805, 408, -20, -666, 886, -245, 99, 337, 16, 53, -264, 269, 25, 367, -466, 301, 478, -204, -1221, -1149, 359, -341, 84, -273, 350, 43, 440, -10, -856, 759, -473, 187, 304, -130, -378, 779, 580, -30, 47, 310, -354, 343, -250, -701, -679, 88, -85, -602, -794, 11, 566, 11, 1042, 737, -123, -420, 163, -311, 880, -304, 668, 405, -520, -571, -260, -692, -324, 527, -16, -646, 258, -230, -86, 801, -300, -318, 841, -934, 513, -457, -230, 1522, 60, 1014, -530, -111, -309, 705, 566, -261, 543, -376, -477, 129, 981, 90, 289, -113, 102, -110, 417, 457, -789, -437, -135, -817, -109, 717, 31, -343, -93, 452]
8019D52p20K92k3p30K93J105j039R13l43p06J056m78n14L15m06m69L9J245L97
8038F79l70J1J63j075J78R62j179L75N56n67J22j23K11k1q21J047P53o34j62O9
8058A74m32J096r04j47M58j91p46J218k32o82R28r44N64l01J002n16R46j397O72
8077E66k79j013J070m07l15O51L13m57K51o06J474o03p25J21o84M96J74J249m90
8096G86q47M79k34k80Q65r83O28l46L52k29L53q12Q76o65K51J31K07J4P3p67M63
8117C15L31j288J427j208N80n56oJ293r02M16j404J085Mn27o7M09O35q70O31L10
8137F08k19l04K12j011M22O31J98j19J28l59m13O65o3n59l68J212p91j67J40R2
8157f5P94l9j023Q04Oj044R92j007R63n67J59K63M16k50r15k6Q13Q08q50k19M8
$$ y = [452, -268, 24, 1, -729, -436, 669, -370, 543, 200, -506, 550, 72, -442, -127, -533, -1002, -963, 282, 679, 309, 320, 483, -592, -414, 548, -631, -256, 300, -267, -145, -268, -57, -78, -899, 148, 901, 267, 105, 174, -258, 838, -66, -213, 245, 54, -692, 526, 294, -388, 540, -404, 160, -141, 861, 345, 1291, -106, 566, 287, -726, 344, -63, -378, 273, 586, 129, 380, -226, 1248, 645, -80, 41, -643, -147, 27, 1276, 786, -61, 418, 184, -96, 769, -214, 414, 68, 420, 191, 544, -268, 608, -57, 194, 325, 532, 546, 619, -148, 315, 646, -642, 785, -423, 157, -399, -405, 888, -14, 402, -1002, 83, 87, -440, -507, -98, 537, -333, 298, 608, 389, 85, 297, -714, -292, 339, 537, 418, 546, 187, -226, 439, 376, -183, -551, 661, -130, -297, -157, -65, 729, 690, -333, 471, 477, -567, 425, -582, 381, -186, -27, 236, 652, 402, -513, -539, 274, 1082, 232, 13, 61]
8178F1k27K53O21n78n98L14k31l65J037j451J454O78r99
$$ y = [61, -166, 87, 708, 130, -468, -154, -385, -750, 287, -1164, 290, 968, -31]
8191c1
$$ Imaginary data points
##PAGE= N=2
##DATA TABLE= (X++(I..I)), XYDATA
0@%%%%%%%%%%%%%%Lj11K16k16K16k16L24m32M32n32O40p23Q31r71J109j223J412
31G59j626J847k088K371k677L003l362L756m187M662n183N745o365P039p770Q571
47D495r455J0422j1476J2640j3933J5355j6944J8730k0741K3034k5660K8720l2340
60a7153L6683m2021M8763n7560O9590q7104J14998j66127K89040j103889q85158
71a799938L144750R3353k204596J30771J467167n27103p05859L71593K15996k89563
81a03429J57162k7964l91326K66804Q12266l67819j054771L18874J151726m18086
91C43437j154819M68476J198381m69116j207027L41332J181915k29381j054065
100e80867J66398Q40542k04626o05978J57599L33715P0910R6255l05116m44993
$$ y = [0, 0, 0, 0, 0, 0, 0, 0, 0, 0, 0, 0, 0, 0, 0, 3, -108, 108, -108, 108, -108, 216, -216, 216, -316, 324, -399, 432, -539, 570, -653, 759, -867, 980, -1108, 1263, -1414, 1589, -1773, 1983, -2204, 2458, -2725, 3020, -3345, 3694, -4076, 4495, -4960, 5462, -6014, 6626, -7307, 8048, -8896, 9834, -10907, 12127, -13533, 15187, -17153, 19530, -22491, 26272, -31288, 38302, -48802, 66196, -99931, 189109, -914780, -1799938, 1344812, 1438165, -766431, -635660, 831507, 304404, -401455, -29862, 186134, -103429, 53733, 25769, -365557, -98753, 713513, 345694, -709077, -390203, 761523, 343437, -811382, -342906, 855475, 386359, -820668, -479336, 702579, 473198, -580867, -414469, 426073, 221447, -384531, -226932, 106783, 177693, 273948, -31168, -476161]
110d76161N28801O00416p90540o21611R74044N51363j058861m61837J034382M38230
120G18226q69925m16702O44181L71969m55301l58597K44418L43182k4803l17719
130a21071j82432L23406L97604k97039n76193K25889O55544j61709p00203J08904
140c27300P75440k6272q16179j6188Q18528p619p82369L3723O44006n6557m37466
151a98253J4108J99908J31987P4563k95284k89926M43993M05697n82728m65018
161e60953O50663M70963o55155m40771O13645M18657n25587m05345L82544L75944
171C24605k31533l49574Q5245L23824N1813k82854j51529K41512K44414j87967
181F7956l48649R5576M49038O100n37825p6966O30238J30273o77002j39341O67643
$$ y = [-476161, 52640, 653056, -137484, -759095, 214949, 766312, -292549, -754386, 279996, 718226, -151699, -568401, 75780, 447749, -7552, -366149, -121731, 221451, 196648, -121071, -303503, 19903, 417507, 120468, -455725, -229836, 425708, 263999, -436204, -327300, 448140, 421868, -394311, -410499, 408029, 400410, -381959, -348236, 295770, 239213, -198253, -184145, 15763, 147750, 222313, -72971, -362897, 81096, 486793, -95935, -560953, 89710, 560673, -94482, -535253, 78392, 497049, -28538, -433883, -51339, 324605, 93072, -256502, -171257, 152567, 204380, -78474, -230003, 11509, 255923, 67956, -280693, -185117, 263921, 270021, -267804, -344770, 285468, 415741, -261261, -400602, 267041]
192B67041J11185n97859q3453M52609O3450k72308p0103R6577J30404O4497k19780
203e7740k02871K92105K95190l47819l51462L69388L76526l63813l82017L40134
213c2379L87970k85968l88997J99571L71059r8763l33763P047K91035P5535k36077
224d3730j47871J64331K01838q6522k55872J806L09919P1354l62838j21105M24990
235A56300J47406m56989j53304M44975J41592l89279j25476K94371J21076j75689
245D983j27742N7719J54382N6789j89015j55693K14004K30111k28905k76829K21944
256c8252K96959j99209l01380J63460K94319j18198k89788O9848K80037k2685
266A35111k61638j7568K33884N1335j83171r0824J11321J31763k7551j80748n4308
$$ y = [267041, 378226, -219633, -303086, 149523, 212973, -59335, -129438, -32861, 97543, 162040, -57740, -260611, 31494, 326684, -21135, -372597, -3209, 373317, 9504, -372513, -32379, 355591, 69623, -319374, -119803, 251256, 152493, -181270, -174223, 116812, 192347, -43730, -191601, -27270, 174568, 88046, -167826, -166020, 143899, 215253, -147585, -268690, 156300, 303706, -153283, -306587, 138388, 279980, -109299, -234775, 59596, 180672, 4983, -122759, -65040, 89342, 146131, -42884, -198577, 15427, 245538, 16633, -260196, -38252, 258707, 59498, -241882, -78422, 215897, 97699, -192089, -122241, 157796, 135111, -126527, -144095, 89789, 141124, -42047, -132871, -21550, 110213, 82662, -98086, -152394]
277a52394K34875J23325k82931j62178L19307J75684l32362j69177L14100J49554
287B17803k66704j29161J95240J10339j12940j03310L1658J10066M3720j19662
297b2951j06501J29912J58348j30353j96596J15646K23814q9793k42093N6153
307a04414K53648j9769k56035j0438K45439L2890k20707m7153J80285N8542j29621
318a7333p2404O8469R0367o550j16927n2432J43348R8249j70584j27427J91971
329B8747J41888j97383j44813J85510J41024j55444j30395J04873J20791m7013
339D7785j11579q211J07101N9185j00468r6839R3399J23156q1447j39980O1743
350d6155J49334l8175j58182J1900J67351J1022j70095l0024J66924L7790j51672
$$ y = [-152394, 82481, 205806, -77125, -239303, 80004, 255688, -76674, -245851, 68249, 217803, -48901, -178062, 17178, 127517, 14577, -88733, -57075, 52991, 96711, -22951, -129452, 460, 158808, 28455, -168141, -52495, 171319, 81526, -160567, -104414, 149234, 129465, -126570, -137008, 108431, 141321, -79386, -126539, 53746, 112288, -17333, -89737, -21268, 69099, 62549, -54378, -106810, 36538, 134787, -35797, -163224, 28747, 170635, -26748, -171561, 13949, 154973, -471, -130866, -25993, 94798, 47785, -63794, -72005, 35096, 94281, -6187, -103026, -9627, 113529, 32082, -107898, -46155, 103179, 65004, -93178, -81278, 86073, 97095, -73000, -103024, 63900, 101690, -49982]
361d9982m3220J21805M7787p7633n5097K8184O5310K6485q3585p1946R9191J05297
373A12596j13604j24174J25483J29220j28319j20340J17818J06905r8215r3868
383h6498O5560Q2770l0958p6721m632P4630L5001o7604n9953N6149P6143l5404
395B8483q8287R410J01765J8569j15729l7985J26233N0125j26732n5289J23205
406C3768M9958j06979m2202Q2975L7357n3596l5230K0634L6042J3573m5227m5457
418e4384N1355P2371o2302r0658P0342R7838o8953r3315N9700Q2519m3246p2206
430e0939J7794O5514N870o1271k3154N7818L1793m8085l6436L4876M0705j3639
442B0846m8478q309N9610K5964p0321l7447P8903M1513q2960m4936P8064M7792
$$ y = [-49982, -93202, 28603, 76390, -1243, -56340, -28156, 37154, 63639, -19946, -91892, 7299, 112596, -1008, -125182, 301, 129521, 1202, -119138, -1320, 105585, 7370, -86498, -20938, 61832, 30874, -45847, -50479, 24151, 59152, -8452, -68405, -12256, 63887, 28483, -59804, -50394, 51371, 69940, -45789, -83774, 42459, 92584, -34148, -89437, 33768, 83726, -23253, -65455, 17520, 54877, 1281, -33949, -13315, 22727, 36300, -8927, -54384, -3029, 69342, 7040, -83618, -13276, 84562, 15609, -77706, -18006, 64513, 21267, -50939, -33145, 32369, 38239, -23032, -46186, 11632, 43425, -4660, -41096, -6220, 34485, 20846, -27632, -35941, 23669, 49633, -20688, -58135, 20768, 62281, -20679, -65615, 12449, 60241]
454F0241o6922m3668N1059L6528k9166k7955L804K2142K3890k2602n0639K9535
466a3753O4486l8121o7211M5561O2046m4129n0671L1006M1448j1681l9383n074
478b5476M0918J4640m3103j9476M0786K1939k7720k4060Q772K7419R899l4798
490a0260k1991M1095K8482m3937l6208M4456L8610m5905l7599M6616L5320n0124
502a1445k4353M5097J3171k7977q43N784o973J7987K688l3415P274M1843j5175
515A3663l8855J5685L3393r202k8816j843L2566Q065l7853j2886M0221P515l5894
528a4241l087K6527k43j8540p40J0016P565n23j1445r120J3716J7510j4421k7443
542b4469K1011L3212k7975l4323L3483K7181l1120j2502K1705J058n238P29j4003
$$ y = [60241, -6681, -50349, 710, 37238, 8072, -19883, -16079, 6063, 29953, 7351, -43288, -13753, 50733, 12612, -54599, -9038, 53008, 8879, -41792, -10786, 30662, 18981, -20402, -25476, 15442, 30082, -13021, -32497, 8289, 30228, 2508, -21552, -12780, 14639, 24538, -10260, -32251, 8844, 37326, -6611, -42819, 1637, 40247, -5658, -43257, 3359, 38679, -11445, -35798, 9299, 22470, -5507, -6350, -566, -7539, 10448, 13136, -20279, -13005, 28838, 13663, -25192, -9507, 23886, 14684, -14132, -15975, 16591, 24656, -13197, -26083, 14138, 21653, -14241, -17328, 9199, 8956, -9584, -10324, -308, 7257, 6734, -4711, -13831, -115, 17395, 2974, -24469, -3458, 29754, 1779, -32544, 939, 28120, -3000, -15502, 6203, 7261, 2023, 2752, -11251]
555a1251M382K5516j3531k5883J7060J9255j9005j1208J3277J1248k281j6682
567i103n464K2087J0696k4251p380K0737N789j6742m584Q734N291k942k976j400
581a508Q48N169J205j3685L65K5232q033l2731J3272L3863k3628k2594K7219P953
595A2947k2889K288J3456p177P42M447q073K687Q253m887o608J222N466O648p709
610H13j1638P989J3640j0963r556J3979N846j4032m577J2465M856j1581l622J2330
624E949j7j3767M566R153r637k73J2773r859r623J7191J00j8137R843J3743j2085
639h0q442J0330J26k969M7P19K63L012n313j515O409M55l303o46J39J434J265
656A931l146j905L166J699j807k268P96L877j227n874O112N889j0367k850R845
$$ y = [-11251, -6869, 18647, 5116, -20767, -3707, 15548, -3457, -14665, -1388, 9860, 7579, -9103, -14567, 7520, 18216, -6035, -13415, 7322, 13111, -3631, -8215, 519, 5810, 2868, -108, -1508, -660, 4509, 5714, -7971, -7606, 17626, 9593, -23138, -9866, 23997, 369, -22225, 4994, 12947, -9942, -7654, 5802, -1375, -633, 3814, -4259, -1572, 6681, 1794, -4814, -3592, 1874, 8522, 813, -10825, -2836, 10804, -159, -9715, 4264, 10110, -3922, -8499, 3966, 8822, -2759, -6381, 5949, 5932, -7835, -3269, 5884, -3753, -4026, 8747, -1112, -10735, 6456, 6556, -11581, -1738, 12005, -80, -8522, 1808, 1934, -1035, -988, -269, -6, 3006, -2307, -3822, 2587, 3042, -261, -907, -768, 666, 1931, -1215, -3120, 46, 1745, -62, -2330, -1534, 2343, 1116, -4758, 1354, 7243, -3124, -5974, 3871]
671C871k829n860Q871j91j0460N749Q530j1433q39J2453n943q742Q380N798r965
686b610j499O361J863l449k916J602n7K15N16K636k884k717L822l95j244M28R02
703E74k20k119l77L312M16n031K07Q496m215p273Q917K537j0981L687R598p559
719c1o974R423L40p769M710P532q125l493P371k66m814N79N016j395n654L025
735e25K371r75k565J010K254J83j458k440L080n51k894L867K407m387l632O432
751B177j77o352M956L743o909j218P629j418o351M530K360m756Q34K963j687k513
767b189L287K48m333L902R4l372J976K907l518j266L305m96k870J012M300l833
783h46j31J941l74j659J434J622k266l2M13O79n52k71j747K471K340m577j389
$$ y = [3871, 1042, -4818, 4053, 3862, -6598, -849, 7681, -3752, -4591, 7862, 1919, -6823, 1557, 7355, -2610, -4109, 2252, 4115, 666, -2250, -648, -705, -490, 26, 2662, -222, -2939, 883, 488, -756, -328, 574, 354, -1765, -2142, 1170, 1586, -3445, -3238, 5258, 1043, -6230, 2687, 5224, -5757, -2070, 7528, -31, -7005, 2418, 2758, -5011, -301, 7231, -894, -4387, 2984, 2718, -2096, -1517, 3499, 2104, -3550, -525, 1846, 871, -1694, -684, 1570, 1753, 295, -2145, 935, 384, -2510, 1357, 3764, -623, -4255, 2177, 2000, -4352, 604, 4347, -2562, -3780, 3849, 2431, -3920, 610, 2970, -1786, -952, 2011, 324, -2189, 1098, 1346, -2987, 915, 1009, -2363, -387, 2520, -998, -2264, 1041, 545, -2325, -1313, 2987, -846, -977, 964, 590, -1069, 365, 1987, -279, -311, 102, 781, 229, -42, -1789, 682, 3022, -1555, -2944]
800b944N113n45o143L859N179n160l682P545q92o009K620N293m751k836N645N07
816B799n101J317M020k649j212R50K677k675k239K290J656j197j800J01L042j996
832a7m082M617K431m812r09N056p98l510J689K878l748p68L970m07l738K864J833
849B549l775Q79J818j464j631K043M81j174L03J73r44O09J124j084j452K134k02
866C87l383L690J129k510j695L389p67j18O24j146m35K992j733k324K869J016
882A985k224j844K841m95M9L88p00j535J570J382l570M30L459j16l787J299L887
899C019k789k646K935J122k601O03J652j105m42K009l125j27K776l68k438P71
915g54J927j48j437m40N7J392K15k685J199L838l617k489L205K355l882j005K980
$$ y = [-2944, 2169, 1624, -4519, -660, 4519, -641, -4323, 3222, 2330, -3679, -1059, 4234, -517, -3353, 2292, 2799, -2302, -985, 3035, 386, -826, 124, 2801, 126, -2113, 177, 1833, 636, -1164, -1063, 1979, -17, -4099, 518, 2949, -1863, -2772, 2284, 1486, -2024, -335, 2543, -1205, -1973, 1997, 1590, -2148, 716, 2549, -1226, -347, 1471, 7, -1624, 419, 900, -274, 29, 202, -742, -133, 991, -93, -1545, 589, 387, -2996, 694, 1823, -687, -2382, 1007, 240, 122, 746, -400, -835, 2157, 424, -1900, 969, 1985, -239, -2083, 758, 263, 312, 700, 0, -1535, 35, 1417, -2153, -1723, 1736, 1620, -2167, -868, 3019, 230, -2416, 519, 1641, -960, -357, 1295, 190, -252, 1757, -1368, -1495, 1281, 913, -1525, -754, 1173, 1025, -412, -852, -795, 597, 812, -1873, -674, 3164, -453, -2942, 263, 2618, -1264, -2269, 711]
932G11q65o98J541k62q74J04K845k520k177L409Q18l498r43M365m98l727J123
949a146K122n21l44m8j90J862o57l411K906J644k972j044K459k75o40J561j880
966e74o95K761Q52m251J162L064r84l858k2L465k69k515K97K906n52j049j27m36
984h25J265J702l103l11L870r02l872O53K637r07K6J619k552J091J342j968j86
1001d21J866q31j891Q43J138j99M03j996K63K859j122l393J076M197k986k445
1017b639L962R38k223k018J524K317k206m25J519J46k671K719m73k617K909K109
1033B871m638j592N832n72l876J677K529j363j534k077K013K596j672l267L372
1048B99J901m333n28L094K63m52l57o05j152J735N85j198M63J350J637k733j955
$$ y = [711, -154, -852, 689, 427, -447, -343, 2502, -18, -2195, 1214, 2032, -1466, -2409, 1956, 1458, -2269, -1146, 976, 455, 111, 63, -127, 1735, 1078, -2333, 573, 2217, -755, -1799, 660, 385, -255, 1306, -574, -1269, 1492, 2344, -1907, -745, 2319, 1335, -2523, -2545, 920, 651, -1864, -1567, 1339, 787, -262, -389, -825, 440, 2142, -961, -1272, 2598, 1696, -2176, -1523, 1114, 207, 233, 1852, -700, 391, 1733, -235, -421, 1445, 614, -1277, -434, 704, 505, 908, -1088, -825, 2034, 912, -2481, -1405, 2792, -194, -2639, 1323, 2261, 38, -1980, -456, 1861, -345, -770, 749, 895, -1776, 943, 470, -2147, 762, 2871, -1767, -3359, 2473, 1901, -1975, -298, 2231, 868, -666, -2743, -730, 1866, 194, -3073, 299, 2200, -2133, -2661, 433, 696, 244, -113, -718, -1870, -135, 450, -748, -285, 1065, 2702, -31, -1986]
1065a986L719N93l406J20L380j245k833N93K92K120L94l332K01K904p73k372J644
1082A3K968l081m85O96j222J698k78j985P88K085j060j949J929K48o38L50p80
1099g03J440o92p51r7K027K65m60j737j065K804M52k904J00L129p29k692K351
1116G38J092k444J135M34j624M95L57m51j320K715k9j100p30L45O84o7j726J300
1134a96J491k013k060K278K559k280k99J242O20m32j573O27J389j271k79J584
1150A387j955l71J539j428L90J695k97k911R78K548j282j806J764Q60j042q32
1166g63l99J68J946Q3j856J252L17O74k099M48O29J83K79q45J26j84j076K57Q14
1185d6J404j89k685J516Q68j71q89K19L93j557J429k6n20L73l47q11M12J238n72
$$ y = [-1986, 1733, 2326, -1080, -960, 2420, 1175, -1658, -1065, -773, 1347, 1741, -1591, -1390, 1514, 741, -1631, 13, 2981, -100, -585, 111, -1111, 587, 309, -1676, -888, 1197, 137, -1812, 117, 365, -273, 77, -703, 737, 45, -706, -803, 1224, 1489, 1029, -708, -1773, 1031, 1483, -1421, -1321, 1808, 1079, -1613, 738, 1830, -614, 521, 955, -669, -174, 183, -268, -1588, 1127, 1098, -2, -732, -387, 297, 230, -1496, -196, 1295, -718, -2778, -500, 2059, -221, -520, 722, 1342, 910, -663, -36, 1353, 82, -197, 1387, -568, -939, 600, -828, -438, 1257, 960, -1951, -973, 1575, 293, -1513, 251, 1111, 69, -763, -1162, -994, 952, 1035, -821, 431, 748, 1422, -677, -229, 400, 583, 862, 17, 143, -41, -1117, -860, -46, 1358, 1169, -1516, 0, 868, 697, -192, 27, 420, -1137, 292, 266, -254, 119, -228, -1039, -627, 611, 39]
1204C9j573J486J287r17n26K16Q29j599J127L22m00p66O57j206n7J828Q8j058
1222b23q60J614k50l6j087O64P88J64q61K47m63L78j87L42k94k44K24J019j081
1241a46n3J55J64j328J505L83j292o0P38J343k494R74Q27m59l19q52J206R71j422
1260a59N07O12m42r44k49J699q28j65k49N44j255O51Q82r83o19R22O83j190j549
1279b132K040P21n93j91M12k89P47k87Mm49J74%n84L19q86O57N1R90j086N87L86
1300E91k18r64N63m77L96M52l31J75j222K15J717q19J5J3L08n31L47P61q1m60
1320D50j165M75O94j43j061L12L34l49R99K63o08j499R14J401q93q47P23K39m24
1339a85l85k21J678j559k88R12J26j21l7Q77r06J7K98r45Q62j474P81J126j061
$$ y = [39, -1534, -48, 1239, 322, -204, 12, 841, -758, 369, 691, 291, -475, 182, -1024, -1081, 747, 835, -223, -1083, 531, 281, 245, -842, -178, 610, 774, -87, 160, -303, 75, -112, 230, -64, -308, -84, 935, -146, -199, -44, 120, -1208, 297, 680, -612, -672, 66, 1409, -1085, -111, 716, 257, -62, -914, 292, 1263, -159, 348, 960, 518, -426, -675, 1024, 196, 31, -218, 326, -929, -278, 604, -379, -998, -76, 607, -583, -2132, -92, 629, 36, -155, 257, -32, 715, 428, 432, -17, 157, 157, -427, -108, -994, -337, -286, 704, -382, 205, 591, 373, -591, -28, -505, -109, 343, 12, 187, -1035, -820, 897, 78, 93, 106, 414, -117, 230, 991, 910, 450, -715, -240, 454, 311, -750, -438, -104, -453, 546, 809, 201, -1298, -384, 1017, 124, -723, 0, 239, -185, -570, -791, 887, -672, -960, -48, 78, -43, -80, 797, -109, -92, 206, -739, 123, -1351, -570, 556, -505]
1358e05K27K62j295J536L55Nj045N14P63j504R7O6Q88k04p05k90J873o85k54N00
1378E99j9L9k83m47L49j004j03J158l66J17j134R75N66q77k42J460m83p87P06
1397B24K79j239J097j71k60Q4M15K04m15k93Q1M59l85Q35k137J229l64m71L46
1416d82J71J643j873P64l44J77l71k75J297j41r52J460j694P73O51q65j75k00
1434d36J385j514J089j046Q55l13Q46j020L82n88M86L69m5l76m49L85R5k60n56
1453g11K92l26R08J03o04o09R03k60R71k592J300J823k019N2J188J64l10j675
1471a402K281k44r51M82j178J661R8p62k43M12O3m65m6K55L33l32o81M22M93K240
1491B436l145k99J529M63j088o4J034k94m58o27L75K95j210N85M6J245q42m65
$$ y = [-505, -278, -16, -1311, 225, 580, 585, -460, 54, 817, -687, -590, -524, 364, 160, -545, -835, 1038, 353, 99, 599, 580, 619, 336, -111, 238, -766, -869, 289, -77, 40, -1094, -119, 447, -430, -672, 788, 305, -482, 224, 503, -736, 361, 190, -70, 14, 429, 633, 218, -75, 6, 465, 80, 915, -1222, 7, -357, -828, -482, -311, 1332, -541, 223, -121, 56, -315, -590, 707, 566, -386, 1074, -620, 153, 804, -61, -236, -436, 949, -565, 524, -522, 333, 20, 866, -154, 228, -360, 126, 495, 450, 74, -375, 10, 105, -155, -711, -419, -745, 163, 266, -338, -947, -44, -304, 667, -1925, -625, 1198, -821, -769, 419, 583, 273, -1402, 879, 635, -316, 166, -1012, 649, 747, -15, -258, 154, 217, -248, -294, -39, 294, -38, -719, -297, 196, 2436, -709, -1008, 521, 984, -104, -168, 866, 572, 114, -513, -138, 157, -1053, -468, -422, 823, -19, -484]
1509d84O09m74R18j266Q75L93j76J5m7j481J324j40m20k24M80R54j427L44Q21
1528E94p20M10j415R08J806j068j251N85J896j189q24K99L02J83n36n97Q96j56
1546A23p19P23L63l04O94n32r97k3J109r28l02J159K37m84j470J392L61o64L26
1565F4j30L30p80n74K16J909p64o35O73J52k79L26j200N37K24M36j176j06K83
1584d94J924o68j669J748j75q60p79Q78J534j260q40J59oJ289j460J57J630j091
1602A7m46O16P13m47m66o91q5J163j71j59p15J283n0j049L0J087n17r82K23R46
1622C00O58j320K75K31K360j587j741M6O65Q24j763P14P61O48j392j061J308O62
1640E88j592N45Q42Q34P0j914l26J607o59O37j427L45J231p72n17R3J122n16o71
$$ y = [-484, 125, -349, 569, -697, 178, 571, 395, 410, 363, -1118, 206, 66, -354, -578, -98, 856, -571, -227, 594, -126, 284, -1131, -223, 1583, 515, -736, -151, 1745, 556, -268, 31, 333, 516, -20, -617, 279, 123, -596, 127, 490, 186, 880, 348, -649, -672, 437, -491, -793, 366, 603, 119, -1351, 41, 402, -262, 64, -66, 264, -516, -1090, -874, 1035, 271, -364, 309, 461, 182, 508, -692, -155, 69, 505, -671, -777, -494, 1430, 762, -907, 841, 666, -194, -973, -95, 1439, 179, -661, -502, -508, 781, -679, -522, 1108, 17, -429, 187, 900, 453, -13, -704, -789, 374, 203, 44, -671, 612, 562, -487, -457, 630, 113, -869, -646, 300, 958, -362, -87, 144, 2504, 917, -824, -778, -113, 711, -1052, -338, 423, 1071, -321, -1382, -74, 588, -1004, -459, 383, 1217, 1287, -627, -953, 654, -5, 632, -795, -450, 781, 9, -508, -415, 707, 191, -480]
1659d80j1J269l59m67m40M31R33K4j129o87J618p56n22L56j83J805j343n25J154
1678F88P52j437m76J585N65j879p69P50Q37Q8q49K62k76R30o36p33J529M35j520
1697a54m39J5K242j992j09Q49M59N56j864j51R15J074j822p94J607R93k348j41
1715a104J013M41l79m77P32L37R43j589r34J841O84j970m45J253O5j92j023q9
1733h93J555j59q58j387K703M96k379j25J206R87j275j754K318N13o19j092P27
1750c6R41Pj551j08M09J300m82j718J084P04L64k517Q36K218j714j14n72N71J914
1769A536j787m91J525N89j566j251J771N83o02j539N16J004J42k709J101J391
1785B13N58r55j373J891O39n27j970P93J093P42j424j101J881Q92k104JL36R22
$$ y = [-480, -491, 778, 419, -48, -488, -57, 876, 900, -229, -916, 702, -54, -576, -220, -403, 1402, 59, -466, 688, 1440, 3, -473, 1112, 1677, -202, -971, -221, 616, 704, -145, 117, -159, 771, 135, -598, 931, 1366, -154, -593, -578, 1664, -328, -437, 412, 871, 1427, -437, -588, 327, 1401, -421, -1215, 392, 1385, -963, -1104, -91, 350, -29, -506, 226, 563, 1506, -83, -1017, 824, 1508, -462, -907, 346, 411, 219, -804, -893, 662, 503, -355, -1742, 961, 1457, -922, -1047, 159, 1146, -129, -1883, 435, 948, 329, -763, -36, 905, 912, -639, -747, -338, 962, 480, -1238, -154, 550, 914, -1603, -767, 1451, -263, -377, -949, -378, 1536, -251, -742, 783, 1372, -194, -1445, 326, 909, 307, -1232, -716, 288, 430, -2279, -1178, 213, 771, -184, -1557, 334, 973, 446, -1524, -731, 362, 1104, -320, -1421, 460, 1352, -752, -751, -415, 507]
1803E07j33j995J791J372q67k713J295J819L08k044r17K282J090k103j448K200
1819D44M58q97j034O27J213K02j562p14J665O04j656n36K300L6j463q66J339J205
1837A365j003j513K96K301J9k517L12J004Q38j420J02N50M35N43j969j76K194
1854A361k47k132k80K224p28M31j841J260J911k933j560K481J721j263j838J657
1870B24L01J197k849M79R22k14o50r01J571J408q78j007j52J045L60j321o45J291
1888A81Q21k204P61N49L88L8l072K119J317p56r09n80J844r29N73j210O35P11
1906B77j384J90N05R16J39k102J118J206k97k216O04K735q34j568m39J061J389
1923A300j171j356J624J580j194j280M35J392r77k05j059J409J258j498r82M75
$$ y = [507, 374, -1621, 170, 1542, 675, -2038, -743, 1076, 1384, -660, -1577, 705, 1795, -308, -1756, 444, 902, 5, -1029, -402, 811, 1013, -549, -1263, 402, 1006, -650, -1186, 1114, 1150, -313, -1179, 160, 1365, 362, -1151, -855, 1446, 1465, -1052, -740, 264, 1102, -318, -216, 334, 769, 1312, -657, -833, 1361, 1114, -1018, -1298, 926, 198, 629, -1212, 48, 1959, -974, -2534, -53, 1668, 405, -1433, 224, 525, 1722, -1127, -648, 274, 60, -590, -1491, 80, 1488, 610, -397, -549, 496, 856, -465, -1110, 181, 1002, -1202, -441, 108, 496, 534, -2538, -419, 898, 142, -767, -1347, 497, -432, 141, -1069, -434, 277, -1107, -917, -412, 504, 643, -1459, -341, 865, 568, -1648, -1044, 1691, 857, -711, -1150, -89, 1300, 129, -1227, 397, 1977, 783, -497, -62, 1330, 353, 148, -911, 498, 1756, 258, -724, -249]
1939b49J326j106p83P38J327l85j381r9J352r8j397nJ382j58l84j203K99K149
1957A325o93j459L53Q78l2j907L78K176M41k319M13O88J107q15j214l23J608n20
1975H5l88p4J98N91o37l12J236K16n19j922J763J312j681p65P23K123k088o11
1993g50N42R21j48j906N14L76N76j80o01o7J934j149j856Q68J379R94j974n52
2011a079J296j61l8j107J339L12J8j445M43J230J65j005p93J673K91j334r14K053
2029I44j33l27o70o07J203O95j905O48N77k79q53J77M65Q28l33j229O69R52r32
2048a10j82k50Q01j86l4L74p93O40p19N22N28p7j425N47O02R27j234K91k94M32
2068C60j72p13j3O59J41j010J08O43J569j101l38k16R85j087k97j33K350j953
$$ y = [-249, 1077, -29, -812, -74, 1253, 868, -513, -612, 740, 642, -755, -760, 622, 464, 80, -1123, -824, 1325, 632, -827, -474, 404, 372, -1535, -1157, 1019, 1460, -859, -446, 242, 1349, 534, -680, -1003, 605, 85, -303, -377, -179, 412, -225, -537, 699, 915, 396, -1526, 237, 1549, -132, -897, -174, 1949, -139, -750, -208, 713, 565, -1341, -827, -451, 125, -55, -656, -723, 1211, 62, -1794, -926, 453, 1447, -527, -1079, 217, 56, 18, -1089, 250, 562, 580, -865, -422, 808, 973, -32, -825, 848, 1139, -195, -1109, 944, 811, 484, -186, -793, 410, 1105, -800, -152, 425, 146, -707, -530, -65, 763, 430, -799, -130, 822, -110, -292, -542, 259, 73, 39, 413, -380, 260, -459, 63, 591, 514, -911, -364, 238, 1165, -69, 222, -72, 360, 188, -525, -538, 121, 262, -748, -640, 3, 1572, 471, 133, -83, 902, -185, -482, -615, 1735, -218]
2086b18L79m31n56R35K28p99N65Q97o68k45J28k2k71k71j311J327L07P0r03J169
2106C10k91n72n63J017R39j046j0p71J600r6o45m14L02L44n65j47Q0K233k282
2125e77l62P34M06k42J78J5O77J22r03j018K072l66j747J67O68J106n43n26O40
2144E01J38k9J93q88N28M27r37j49j4O33p63Q14o25P23l20j276K298l70m19j094
2164f29L67K47J379q59o87l4J005%j467J95K78J17J52l17K54P14p98q66J352n29
2184a26L40q2n16R39j33j002J20Q85p09m17M44L27J48oM04m12L70j507O96J4P57
2205E34r44Kl88K99q7L02r8M30K63p94J292m39M68q90P3K49j68P08n00n47R38
2226G03p94M03o33K2O19O57j803n47J988j187j70K07m51J078n15q68J810k19N59
$$ y = [-218, 161, -270, -826, 109, 337, -462, 103, 1000, 332, 87, 215, 193, -78, -349, -1660, -333, -26, 44, -859, 310, 19, -553, -1116, -99, 840, -206, -216, -987, 613, 517, -128, -542, -240, 104, -461, -608, -528, 1705, -577, -939, -205, 201, -41, 137, 152, 829, 951, 48, -970, 1102, 736, -1011, -844, -176, 930, 387, -139, 501, 639, 610, 803, -85, 443, 870, -67, -216, -230, 403, -360, 454, -171, 552, 232, -1044, 1254, 884, 465, -629, -262, -15, 1364, 505, -182, -216, 789, 789, -678, -483, -205, -88, 64, -253, 1, 715, -83, -949, 403, -126, 214, 132, -384, 555, 422, -580, -460, 425, -284, -701, -257, 70, 218, 212, 616, 204, 574, -933, -237, -223, 534, -410, -408, -796, -497, -584, -282, -380, 50, 313, -481, 811, 372, 840, -50, 23, 272, 104, 812, 312, -235, 703, -91, 312, -321, -299, 320, 977, -826, -1373, 615, -572, -742, -535, -986, 92, -423, -1291, 519, 300, 859]
2245H59j294J19O58m39k47M40k86j21o5J212l46R20q02q89Q1M76J55o37k2R5N79
2266D46o80M90q24N37l82O63M86l85M84j212o8P04r94M00J53J94n7n47Q43j6J2
2287B47l19k98Q51r8o40l11J167P93j775R30o57q60J358j019K7J232M89j186k90
2306c59M31N24j343K45P71P9n50N15j419N21N98n08k05Q77P97p67r25K68J427
2325I77j786L80M76n24j35Q04m95M57P44o98l82N32L82j081P53j411J381j58k19
2344cn67O27J20j24q3l74P44r90K30j9M14M82q12M36M8l06N49p17R36n99LJ99
2366A94k44Q12j106K38P35j097O10j40m2M58j284P20N65n46J23J10j058J831j081
2385b02k23J90M25M30j188J187o26M50j38q9o66Q20o5K5n33K16n79J400j456J356
$$ y = [859, -435, -316, 342, -97, -344, 96, -190, -311, -376, 836, 490, 1410, 608, -281, -200, 276, 431, -206, -228, -133, 446, -234, 256, -568, -31, -413, 250, 736, 351, 835, -377, -445, 259, -735, -335, -182, 12, -45, -592, 251, 235, 247, -72, -370, 481, 383, -257, -568, 599, 1392, -383, 547, -110, -970, 388, -631, -604, 628, 1117, -69, -359, 72, 596, -747, -502, 269, 348, -202, 313, -1106, -585, 13, -495, -700, 177, 974, 207, -718, -450, 977, -809, -429, 47, -477, -612, 192, -303, 154, 898, 200, -182, 350, 732, -349, 404, -1007, 374, 216, -3, -570, 57, 177, 53, -30, -404, 340, -650, -420, -439, -25, 457, -355, 81, 129, -177, 372, -345, 591, -8, -5, 194, -50, 762, -344, -106, 629, -468, 142, 2, -40, 418, -866, -146, 419, -127, -4, 106, -952, 879, -202, -425, -235, 190, 620, -568, 619, -7, 443, 305, 216, -450, 370, 305, 330, -203, 13, -566, 834, -622, 734]
2405G34l88o11k2L56l22Q61l75j147M37K96Q13j125Q83n09L6p84L91J041j175
2424f10P95J29j422J132O4n63L99l1M35J22r64Q2N66L00r19J152j519J442k21
2443C69p6L9k6J19j194R56k25M21M80j215M5Q00p50l25R73j259J103O3m83J89
2463Dn37R67m10M38o24K23r7o71K83J76k24P54r29O72m70K55J76r09J469O1q08
2484b01N39J18p31O75j099J039j64O2N90j304l49Q05m4K59m56m71Q30l26N35m36
2504a29j054J233L13n89m80O12L80l04K17j176Q45M4P1j94R20p55j58o6q2L12
2524d0LR70m93k0o61l12J136q6k30L14rn06o34R78j309J009r2M05o74J8o3J07
2546a89l2o10J929l54k87L11j115m56k72J066Qn84Q52j501J605L74j60k58k53
$$ y = [734, 346, -265, -287, 69, -253, 608, 233, -914, -477, -181, 632, -493, 390, -119, -83, -867, -476, 565, -610, 185, 314, -1108, 24, 88, -475, -76, -107, 328, 450, -514, -432, 134, 434, -485, 667, -852, 590, 369, 293, 332, 306, 425, -769, 187, -38, 383, 863, -352, -307, 493, -257, -582, 391, -868, 235, 298, -185, 4, -533, 434, 24, 462, -162, 61, -36, -707, -424, -248, -472, 282, -647, 25, -445, -190, -14, -923, 546, 607, -201, 338, 456, -275, 400, -699, 340, 176, 238, 828, -476, -825, -20, -64, 195, -261, -732, 98, -228, 307, -129, -1183, 50, 363, -226, -706, -94, 286, -18, 199, -977, -132, -88, -17, -211, 709, -46, -204, -270, -352, -40, -37, 933, 440, 420, -241, -553, 583, 497, 267, 581, 572, 66, -568, 410, -899, 110, 18, 423, -251, -233, -296, -189, -221, -831, 1098, 744, 457, 768, -347, -803, -1075, -9, -1, -585, 267, -1234, 371, 745, 585, 327, 74]
2565G4l54K93K8m62M01k53O36j006R23o06k8K99l00M94M27q83O88j68m68J52L78
2586B65p51k64Q15r54Q96K96r7l56k93O06M11l54n7Q90n26M32j044J56J50N3J20
2607C94j340N29M99j89L58q89Q97r9n05P73r63J475o26m26o65J087L63o32k04
2626a63M01K29n58M47j550P12O32J93L35k69J41k26l01Q52j446P20n83L88L8o51
2646f59J209k43k55O31p43K93l90r24M08N56n21L51M75n76Q2P38j023P61O8q18
2666e80J23J48J052o64j31j17L09N43L97j550P95q83l47J274o19j78P88j322R63
2685Ap86Q87m4L6n68J282o30J183j331k68Q1J499j786n86R73J13O18j024K45n99
2705g04j8K96J086l47o6o75J012j072M20j030K15J057m91J13J75O19r57j66J046
$$ y = [74, -280, 13, 41, -421, -20, -273, 363, -643, 280, -326, -354, -55, -355, 139, 566, -317, 371, 203, -265, -113, 265, -486, -750, 65, -889, 7, 303, 206, -150, -443, 163, 574, 220, 163, 1053, 527, 959, -85, 71, 221, 274, 394, -946, -417, 82, -107, 251, -638, 259, 160, -345, 428, -535, 940, 314, -112, -777, 310, 673, 41, -163, 238, 467, -91, 356, -1194, -482, 150, 343, 678, 409, 550, 324, 23, 875, -571, 149, -434, -46, -8, -659, 550, 307, 52, 683, -60, 233, -157, -1081, -673, -117, -638, -287, 188, -388, -306, 432, -591, 170, 238, -580, -457, -309, 743, 79, -52, -169, 140, 683, 1080, -470, 325, -558, -905, 369, -250, -428, 360, -962, 1, -785, 102, 58, 94, -474, 808, 178, 1361, 30, -238, -157, 1342, -444, -1030, -57, 56, 674, -350, -105, -704, -722, -426, 660, 313, 247, -428, 584, -488, -68, -1098, -883, 174, -317, -204, -29, 590, -367, -533, 513]
2724E13o70J3m1K40R24m66j902J521N58j483M65n99J127j46P55n11J22p46k41
2743e67R73L4l50j88M36N81q36k85J042j645J040M29j015M0p87J143K52n86M18
2762A29l35P96o74J36N20k89j4k56n66L62J04O94j089J184l72m09K93o08J123
2781G29o16K98J92M8R58j581J15K73o60O01l56L05o74J304q24q32K10K24l27J30
2801d83K26j1n86J74J872j200k70N42q26Q6M23j94l80K65N13j72J71j76q93J273
2821C54p6L39o20O87j011MN84O1p81K44L0j30P56J31l39l83O32l08n83J9N13L41
2843D64j154O23l48N09O85k80k15m71R79p53j6o43O93j49J85L21l48j42J42m21
2863c39L74Q03q28m87J08J202j304N89j95Q5N74j644Q47Q26l43m09n0O4R25q82
$$ y = [513, -157, -144, -185, 55, 979, 513, -1389, 132, 690, -793, -328, -927, 200, 54, 809, 298, 420, -326, -567, 406, 440, 90, -98, 338, 919, 83, -202, 840, -805, 235, 664, -351, -311, -1098, 45, 297, -289, 129, -206, 590, -84, 52, 572, 283, 269, 13, -553, -191, -87, 607, -482, 702, 330, -79, 214, -394, 729, 113, 411, 603, 651, 1609, 28, 143, 416, -244, 357, 1, 306, -368, 936, 112, -720, -510, -286, -613, -483, -257, -268, -854, -680, 1192, -8, -278, 264, -562, -476, -53, -247, -627, -362, 151, -21, 150, -26, -919, 354, 278, 617, -3, 684, -327, -323, 261, 322, -459, -215, -185, -315, 441, 572, 233, -150, 482, 174, -409, -390, 123, 464, -690, -67, -415, 94, 779, 499, 284, -187, 792, 39, 23, -620, 73, -76, 109, 430, 82, -60, 82, -339, 35, 838, 10, -477, -369, 833, -471, 118, -77, 8, 582, -1062, -215, 611, 268, -141, -191, -127, 798, -84]
2883h4j69N43n22j95Q54k85J22n64o09M42J37J55j082P93R31q85K24M85j104J600
2903G87m15j076R90J56l42K3m77J68N08q00k31P10o02l72Q79n21J094j007M41
2922h7q42J30M98J560j517j43R59p21n32n21P42j51P24j18k76K51o92J29N17q6
2942a76P47r73J29O64q64J024j138O68J20k40R27j398N59N53n26m45l92O55n60
2961f66j77L63O26k14M15L87n31p52kJ119r79l96Q46N34p88M0O4j51n03J444m35
2982B44j69K8k11M57j004M88q29J792p69K3P72o32k71l16M9m35J435p46N92r72
3002d74P03N16j579N27k43P96r8j792J674j32PP77j292R38k85M39l66j032O24
3021b92P69j012j06k36J483j055p30J264Q1MP0o36L17M88j75k83N1l05M7m37Q37
$$ y = [-84, -253, 290, -232, -427, 427, 142, 264, -300, -909, -467, -330, -175, -1257, -464, 467, -418, -194, 291, -813, 787, 372, -704, 286, 442, 100, 123, -354, -186, 322, -478, -709, 1, -601, -973, -94, -615, 479, -528, -87, -929, -799, -301, 1259, -258, -401, 558, -163, -695, -1216, -474, -625, 99, -19, -295, -44, -736, -607, -90, -176, 571, -402, -273, 391, -473, 551, -587, 81, 201, -39, 888, -510, 49, 602, 76, -369, -761, -106, -666, -843, -480, 146, -68, 347, 734, 203, -549, -551, 568, -411, -807, 39, 573, -215, -175, -111, -262, -765, 679, 244, 75, 103, -108, 349, -655, -167, -996, 796, 27, 50, 822, 190, -81, -397, -348, -783, 652, -94, 498, -474, 229, 745, -834, -307, -550, 246, 148, -1644, 30, -102, -95, 682, -610, 328, 43, 482, 116, -916, -292, 477, -535, -641, -877, 606, -449, -1179, 85, 166, 170, 240, -396, -79, 409, 234, -49, 2, -303, -256, -693, 144]
3042A44J331j402l14J76j171R80M18o43p62J345j81R6m5j011P04N42K78l59l58
3061b32n90%n59J359j12p38Q4O10k56N34l90n42P72J92l89L12k60j00n7q0M07
3082c5L22M45j852Q65O24j057j74J88R76n27N67j53j684J483K22j08J86m41o34
3101g87L74j08m6M56k76M71M81o80K51l80M41J71j303J22J472p72L52K2O1o61
3121c39O59j55l38K3K55J20k40k6N33M48k65q64m7k09K27l77P58o7N01q31K48
3142A4j17k47L10m68O27j84q89K04M90K63J24j011O62Q45m76M60k93l99R42q36
3162B1J62%k46K46n19K31K85o82J60K91k36N93m0m65N38p71R74q54K03J014q28
3183G7k44k6j16R97j145P73l96k20J247l47o23K09M93m18n09K67o04O76m08k41
$$ y = [144, 1475, 73, -241, -65, -1236, -256, 162, -481, -1243, 102, -79, 17, -28, -1039, -335, 207, 485, 126, -232, -822, -822, -1381, -22, -134, -872, -788, -178, -434, 100, -290, -832, -60, 132, -257, 55, -205, -305, -362, -442, -35, 287, 732, -1120, -255, 369, -688, -862, -674, 302, -225, 342, 189, -1495, -12, 210, 102, 288, -153, -787, -413, -521, -567, -111, -387, 84, 565, -115, 136, -244, 197, 368, -935, -813, 659, -113, 239, 261, 322, -339, 320, 165, -173, -150, 105, 225, -15, -41, 492, 940, 675, -189, -236, -445, -218, -595, 163, 96, 597, -234, 14, -103, -350, -40, -508, 119, -65, -954, -750, -260, 3, 127, -884, -222, 623, 147, 607, 314, -85, 857, 21, 183, 183, -63, 183, -336, -105, 180, -502, -342, -51, -287, 306, 266, -199, 339, -432, 542, -312, -109, 905, 77, -167, -193, -309, 688, -457, 316, -80, -300, 947, 600, -23, 186, 679, 261, -248, 19, -585, 91, -317, -558]
3203e58J152j510P90j83O15l01P60q12N72j018O77M96n70J90n83O30K96K09o66
3222A86j6J48n66o4N88n18K34N5N07j084Q14l40o12m1J524j069j5m01j22K44k22
3243g70q8Q16k96N30q0m50J412r78Jk74L76l53p53Q83L40n41N06n01J282j643
3263e81K88l25O10k80O26K59q62J20k53N66m64P38p88Q97j013Q83n12Q26j038
3282c03O22k10l93P97j91l52J50j192J625j396n2J039L53M03p56J58n05N4k82
3301d31O76m61J840j857L65J02m0m75K31L09l20L05j192N56n2L79k00K37J88R
3321A69k14O43j188R8O74N64n05L72n55n75N35k9L67L33q29M26n05j13N10k12
3341c4k67J030n35m42O75j061J124j077J342k45O3o06J34j22o50J151rM33j220
$$ y = [-558, 594, -916, -126, -309, 306, 5, 765, -47, 525, -493, 184, 680, 110, 300, -283, 347, 643, 852, 186, 170, 318, -248, -312, 276, -242, -8, 47, 554, -530, 284, -56, -668, -709, 815, -254, -269, -670, -792, -548, -770, -858, -42, -338, 192, 112, -338, 1074, 96, 97, -177, 199, -154, -907, -24, 316, -225, 281, -220, 1062, -581, -293, -618, -8, -288, 338, 597, -265, -145, -398, 168, -296, 442, -346, 551, -462, 421, -91, 735, -303, 319, 109, -284, 513, 322, -30, 120, -1072, 553, -843, -895, 144, 497, 900, 144, 302, -203, -149, -431, 245, -216, 1624, -233, 132, 234, 194, -281, -50, 259, -61, 244, -948, -392, -444, -65, -265, -28, 160, 169, -45, 598, -590, -492, 182, 746, 241, 613, 58, -517, 18, -11, 356, 689, -140, 286, -219, -332, 178, -34, -301, 729, 194, -248, 427, -634, 490, -587, 755, 510, 573, -33, 101, -21, -671, 480, 471, 904, -316]
3360c16P26l44O39m49r67M23j9l86l39R40J56M41l91l95O88l25L79j504O07Mk8
3381d60Q33j111O20N30l28L25p46O40K5j03p2k27R18r38K9n33K89N35l56l4L73
3402B09K02n35Q47n70m4k34j82P98J12p81N72n75Q2p6J4K44o34P6J407r80J80
3423A32j154M11J150l76o67P25m10j85J89N62m56K31k13k5J36N7J60N8l11J2J77
3444B03K80o10J148j968K47P86N70p67p6Q70n45m96q59J248M50L06p02m68j53
3463e36O55o61J224r22L08j40k42l60J39j88K99J241l68p3M73M8o09o83j20o87
3483a202P76J013p16m42Q74k12m61Q26p15K36k18N29P12j247Q20M83r50K97o26
3502b23m2K83p71o1M44k56M13O84k93j28l62P92l6n75N16K13l54m56M26K61j67
$$ y = [-316, 410, 66, 705, 256, -711, -288, -307, -693, -1032, -92, 64, 505, 114, -281, 407, 82, 461, -1043, -436, -432, -460, 373, -738, -118, 412, 84, 409, -337, 303, 328, 225, 153, -74, 844, -94, -65, -598, -309, 226, -130, -164, 209, 411, -124, 723, 153, 109, -125, -307, 491, 603, -178, 394, -181, -99, -175, -161, 83, -551, -475, 932, -48, 132, -1022, -611, 539, 163, -504, 221, -189, -374, -185, 377, -79, 152, -61, -86, 50, 107, 267, 325, 14, 26, 203, 483, -127, 1021, -947, -700, 86, 656, -111, -187, 683, 138, -358, -1217, 31, 481, 787, 85, -383, -536, 119, -542, 682, -240, 68, -72, -314, -674, -535, -723, -424, 817, 449, 376, 849, 897, 288, -395, -515, -1202, -426, 587, -129, -571, 303, 91, -370, 456, -259, -23, -241, 288, 1000, -247, 573, 1056, 106, 403, -223, -265, 18, -753, -814, -370, -626, -213, 471, 178, 50, -312, 480, 444, -131, 385, 598, 244, -212, 214, 475, 308]
3523C08N77j33j832P27O67m20M83n09K9l00L91N98m44k71K1M59k71J06L21p55
3543b48l14N93K00p43O85N80k59j196J315k77K91n17k06k09n15P99m28L19J054
3562I24j122m24N33K14k43Jj82R36o75J70J15n99j64O75k41J348r38n33kP77m13
3583A57k69o78k40J716j110L25Q69j371J0K31N29o51N4M59m03J66j142K122l41
3602D33j32q70L86L79n20J88l92L43j339J488n89K24K74Q4r54O02M92J04j27j005
3622i31J254l84k21Q60k15j135J176o06O99j091J070q50k70N32j85N70P76j975
3640i26N60P54m51K29j329J100k70N74o28K84k48L06N4J12k16N98n96m94J007
3659D20L32o46l12L36p87P14j37P76j058M86j0l32N34o6J03k3j180L88Q3M54L88
$$ y = [308, 885, 752, -1080, -353, 314, -106, 377, -132, -103, -403, -12, 586, 142, -129, -108, 351, 80, 186, 507, -248, -562, 31, 231, -512, 173, 753, 494, -702, 613, 336, 627, 110, -96, -305, -820, -21, -449, -130, 924, -198, -622, -89, 125, -118, -117, -299, 637, -38, 132, 247, -352, -516, 159, -82, 1266, 328, -205, -207, 570, 157, -112, -790, -1030, 686, -424, -99, 770, -601, -591, -360, 169, -482, -428, 31, -372, -206, -1348, 774, 433, 301, -569, -183, 196, -324, -136, -528, -185, -1524, -36, -625, -401, -127, -43, -997, -395, 97, 201, 74, -931, 323, -61, -282, 578, 363, -772, 404, -202, 497, -594, 476, -374, -644, -112, -297, 273, 1049, -926, -366, 388, -63, 166, -1163, -63, -333, 241, -387, -103, -351, -45, 9, 121, -95, 503, -93, -587, 420, 752, 106, -206, 130, -657, 57, -80, 696, -362, 124, 114, -218, 316, 250, 353, 330, -850, -462, -379, 75, 463]
3680D63j132O44L34j251J634n44o7m87R8O07l16K03L55n85M04p2o63P44o56L42
3700E5l90K75K25n51M86K19m11O95o92l04R87o34M49j126J416n24m7P7M32p83
3720a46P07j355Q84m2K97O49j142n51J861j83j269J02j9K26o66l34J223m4l85
3739a87N42k54J08j114R50L41k52k13Q95l85q98J060k52L66k31K27j444J009l60
3758i2K59m70j88K01k10Q12j11p92J101m45K16o71J142j027r1Q81q04j00LJ07
3778b79N37P20o47n70l72R82j60K34l66Q12j693P83M11n95R9k57O79o68J9k6Q49
3799D92r76K43l35K08Q51N2o98O64p26r27N49P18p51J190p18o7J87l01j68P76
3819B63k67m87Q55k02P5O89j324M91n42M97m27P36q82L25J80K38o87Q1P18j082
$$ y = [463, -669, -25, 309, -942, 692, 148, 81, -406, -308, 299, -17, 186, 541, -44, 360, 288, -375, 369, -287, 55, -335, -60, 165, -386, 100, 319, -92, 603, -89, -393, 594, -40, 409, -717, 699, 175, 128, 205, 637, -146, 561, -794, 90, 48, 345, 994, -148, -699, 1162, 979, -290, -188, -207, 19, -647, -981, 242, 198, -187, 355, 101, 209, -905, 45, 386, 134, -79, 816, 431, -467, 593, 341, 707, 476, 703, -741, 268, -92, 167, -303, -491, -290, -500, 312, 201, -591, 510, 65, 281, -390, 752, -275, -366, 515, -289, -389, -386, -279, 258, 978, 331, -239, -611, 371, 211, 445, 79, 891, -802, -19, 392, -203, -104, -361, 318, -350, -331, -357, 492, -484, -241, -576, -368, 483, 535, -163, 501, -225, -1152, -603, 115, -636, 554, -164, -231, -44, -345, -513, 263, -4, -491, 364, 162, 237, 926, -398, 93, -449, 48, -379, 357, -525, -200, -20, 218, -469, -388, 330, -752]
3839g52O56m11P07J82k28N81J30m55k41M14n46M41k44l95N23QK0j461J304L75
3859F08k40J0j061J286m79N2j021M16N85o43L37o28Q97M62j86l15K77j030R70
3878B97m01P58n56N65m39O16j486J205q90k0R27QL25j223r1J032p02l65K89m25
3898e76J73L92r8k62m4O61N40m33n91J040l62q40o19j60M63P96P97r29J68Q0l10
3919a14m13j27Q65J18M82j229R73p87L30n3p5q2O33j410J585K76j930J490J72
3938G04j336j2N89O25o88L17l62j44j78M38M06k91m53M04r43Q54j42K63k56j03
3958c08J17l24O66O20j120P68L9o67j91K11Q8L71o86M44n57K45N96K11n08n34
3978e19O65P01j301O18L50p47P34K53j8o61J69o97J01O19j161R80M67q96Q6K49
$$ y = [-752, -96, -507, 200, 382, 154, 735, 865, 410, 169, 583, 37, 478, 234, -161, 362, 370, 390, -1071, 233, 608, 368, 378, -683, 603, 124, 176, -845, -429, 156, -487, -150, -778, 119, 581, 395, 80, 357, -673, 297, -104, 654, 98, 663, 224, 840, -646, 559, -331, -351, 576, 584, 909, -314, -405, 627, -75, -440, -151, -576, -403, -11, -109, -371, -415, 246, 786, 353, -238, 802, 440, -400, -1019, -1179, -716, 80, 877, -52, 116, 196, -114, -527, -654, 211, 329, 811, -418, 555, -232, 98, 45, -30, -112, 521, -889, 696, 972, -958, 532, 704, -632, -644, -55, 570, -118, 199, -163, -307, -485, -47, 359, 68, -385, 19, -924, -70, -212, 51, -205, -308, -191, -515, 151, 771, -349, 419, 458, -209, -400, -189, -101, 270, -416, 28, -529, -284, 312, 523, 15, -519, 146, 847, -454, 164, 514, -233, 501, 754, 736, 75, 244, -453, -352, 267, -894, 86, 553, -343, -257, -8]
3998hLo1O21m94p56Q92r0o17L56K06j97O06r6l96O41p78N84o35O68k10o40J108
4020G07m84K55j017P41k60k36k39j2O09o00J067j51o74K42O9P6q6J10q50Q26j50
4041e7k72J06k76K28K33L26k70R6n1l40M18n63M71l68N29R71j832N38k50J471
4061A108j320N15R5o99R26j054M2L64p00P37k8N63j50L79q9j308N58n48J41L50
4081a18J62k18j22P20j54n52K80P6L70o03N45M52j126K47L19M36j310Q25m90O0
4101b01L36J11p26Q22J09R4Q7j044N06n78L46J65Jr67P74P41j306J48N39M80j49
4122B88o26Q53l41M73J6j50k63r20M77l06Q3L44L61l43M98l30JQ30o54p46J006
4143E51K43j182P7j30N36M0l27N76l76p50M51k33K63K12n56P62l52j84M38j101
$$ y = [-8, -5, -66, 555, 61, -695, 197, 107, -510, -154, 52, -145, 461, 365, -31, 610, -168, 416, -219, 449, 239, -401, 707, 223, 478, -539, 202, -58, -294, -533, -545, 64, -536, 531, 380, -294, -52, 17, 93, 7, 117, -733, 93, -57, -329, -223, -499, -271, -38, 288, 18, 114, 63, -277, 141, -422, 49, -319, 210, 1181, -651, -113, -363, 1108, -212, 303, 398, -301, 625, -429, -387, -23, -723, 14, -14, 549, 399, 778, 689, -619, -61, -609, -468, -118, 44, -174, -296, 424, 270, -282, -2, 74, 444, -159, 386, 838, -288, -41, 278, 714, -596, 229, -261, -201, 135, 246, -480, 342, 451, 545, 632, -412, 94, -484, -138, 27, 28, -939, -165, 576, -730, -582, -43, 437, 288, -338, 515, 174, 647, 663, 513, 250, -670, -193, -499, -416, -72, 289, -54, 444, 114, 115, 945, 291, -455, 551, 794, -388, -311, -441, 95, 135, -192, 384, 8, -742, -291, -524, -261, -49, -605, 157, -195, -379, 59, -1042]
4163a042O34j49n34P97O16p0K96J50q52R8p5k55L15N27Mj7o83N49j43K35O3l71
4185I3J68m25NR53j199O05M20r39K74N6j56K2J50k25j3P60r44j15J036k82l5l48
4207a39j27L15Q57k306K82J167o74O08k09j4N48n54J226r47N01l63L96o34J024
4226I57j101O70l1m13m09K78L20n75N72k56O8R0p66J246q04O54k95m65L74m20
4246c06J077n11l08N64j18P11o28o02K09o03J32L37J20J4Q54q44m36P30l60N27
4266E59n59j1Q12k55k38p34R8m39P3L73N97P8k52k53o21J242j144J67K35q40J325
4287B13k37O49o11m12J138q9q45j6k61J130k07o09m16N50N11j355Q08l91J087
4306F37j23q60O14J96o92J005K04j206n25K30N50J33M43l23j068m1N83L03J028
$$ y = [-1042, -408, -557, -1091, -294, 322, 252, 548, 698, -154, -56, -131, -386, -71, 456, 460, 443, -240, 309, 166, 401, 464, 93, 261, -164, -159, 794, -405, 200, 620, -319, -45, 11, -145, -123, 27, -198, -211, 549, -395, -510, 526, 244, 209, -139, -266, 49, 906, -1400, -1118, 49, -625, -17, -226, -240, 308, -246, 980, 33, 534, 171, 567, -67, 957, -144, 526, 495, 82, -327, -49, 271, -304, 268, 12, 80, 170, -596, 650, -154, 500, 205, -260, 114, -306, 771, 260, -48, 516, 398, 1109, 481, -121, 88, -515, -383, -46, 74, 88, 942, 98, -338, 392, 32, 559, 0, -11, 801, 546, 308, -426, -328, -767, -694, -321, 276, 354, 102, -151, -772, 470, -674, -507, -272, -1112, 213, -24, 625, 14, -398, 740, 651, -194, -210, -471, 659, 452, -157, -573, -23, 488, -867, -59, -450, 637, 514, -346, 268, 464, -228, 777, 981, -225, -750, -520, 30, 163, 606, 283, -785, -826, -243, 60, 1088]
4325A088K27j118n02O19k88j53Q45r17l87J108p05N96o77K9K98m6J28o00Q52p2
4345C25J03n45n23J347o16L59r61J548N2k680J598p95P08l83R37L14K48l23j571
4364h58J110m86J191j406j50O60l97j90J67L23M03o53O50n35L35j09l52Q05l47
4383A61k0n15O23l96L88k82L48N20p78k46Q31p9M6o21J30N88Lm51p48J08L09j44
4405b25M51l18K15q63O47J661j472l57Q56m78r03J115o93K29K3Q9L24l23p90O73
4425a39QJ73P97q05K77k39l65n11K40P33n46J239m88o39J176k62m25j496Q78P19
4445C25o11J405j407O48j13k80l44J715j163r73N39O56j062m37J216m29l8K08
4463a45M50j101J546j376J348j413M58N26j059M63KL9Q11j93p55O38p5j35N10
$$ y = [1088, 1315, 197, -305, 314, 26, -127, 718, -199, -586, 522, -183, 413, -264, -235, 63, 17, 145, -455, 397, 325, 428, -117, -640, 707, 91, 450, -511, 1037, 1089, -1591, 7, -788, -80, -463, 474, 788, 1036, 713, -858, 252, -234, 957, -449, -599, 61, -336, -526, -359, -36, 367, -286, 364, -171, 164, 55, -297, 508, 161, 141, -374, 249, -147, 241, -41, 307, 827, 49, -197, 634, 555, 601, -20, 110, 698, 701, 250, -498, -390, -81, -225, 226, -92, 123, -740, -93, 1568, 96, -261, 595, 117, -786, 329, -364, -135, -112, -23, 301, -22, -812, -139, -131, 42, 839, 34, 311, 72, -293, -804, -564, 169, -377, 862, 374, -265, 911, 649, 224, -1272, -394, 325, -286, 1119, -288, 360, 247, -33, -377, 1338, 175, -798, -259, 397, -665, -1102, 114, -315, -353, -145, 305, -796, 750, -626, 722, -691, -233, 293, -766, -303, -301, -262, 549, 356, -399, 239, 164, 29, 539]
4482E39J91K70j055M50m94k18l36J055jl12M04J22q58R4Q83m6l83L71o16m40M59
4503G9M39j29K07r09n56J437J02k02K16L67o78k10p73N3j9J005r60O94k44j80
4523b61R1R10m44Pr12Q41K87j76q51O21j35l27N1M4p67P25o64P72L41r53L53J195
4545G48r30m60J089l23N40p65m3j10O56K31j023l74M91O5R60j126L62q6m50J244
4565F96n09r09J233k81M2j79N81n51n47J390n11M16j450L08N16J5o26j33P03m0
4585A64J004j376o6l8o1p12J408k30j31RL09k84K02k29J40R9k55k19Q2Q49j574
4606i09J282l51R13p89q37L21j68K28J15Q8O78L97o19Q8n92k0n00R98p88M0N91
4627A66K04k65m6L95q07p22N72L17p15M59J013j562J534j039M24j01K46J74j37
$$ y = [539, 730, 1000, -55, 395, -99, -317, -653, 402, 401, 89, 493, 615, -243, -149, 734, 688, 305, 676, 60, -380, 79, 518, 389, 596, -313, -869, 568, 670, 468, 684, 1051, 373, 163, -610, -557, -576, 429, -531, 163, -81, -261, -170, 740, 296, 303, -609, 232, 519, 343, -508, 113, -22, -349, -298, -254, -1021, -296, -960, -188, 153, -800, -447, 748, -182, -642, 447, 124, 664, -101, -144, -254, 402, 633, -390, -764, -273, -208, 752, -374, -12, -98, -548, 696, 187, -722, 511, 230, 272, 93, 674, 123, -424, 966, 455, 871, -579, -271, 245, 260, -366, -499, 204, 164, 1168, -208, -274, -312, -373, -1085, 323, 93, -38, -29, 280, -4, 198, -31, 109, 208, -47, -266, -184, 665, -909, 373, 22, 935, 146, -691, -370, -538, -310, -195, -107, 571, 968, 349, 437, -155, -175, -675, 323, -465, -425, 166, 370, 105, 59, 454, -353, -1075, -503, -186, -901, -442, 571, -991, 543, -496, -72, -173, 73, 247, 110]
4646A10k63O65p86L59J81Q80p71n46n13J294r97K9P8q0J644k107Q56j007O97K22
4666e5J63r6K31m17J222j558L44j261J370j85P82r81M67N60j194J175p42K99r74
4685h50J045j006M18P44r93N31O86q51MO54rm30m68M39O05r04M99J026j47m99
4705D94j3L43r33M9j94J055q05m20K49p84M27J264r01M89k52J72m77k22L47P90
4725F78r28Q22K59L31j256J57o06N38o72J226p01m5J110j307N85p70l12K36P31
4744G6o66k11M78R22p82J69L54J91o43m71m87K356r48j097J611j166J147p65M40
4763E08o05k53P18o67M74J38O3k36j30l64P6R00q88O42m51K02j87Q18r08O70p50
4784b30Q37l52K4j22K74n13l0p4M23N0n58k46K49l24J269L27j503O70k53Q07n11
$$ y = [110, -153, 512, -274, 85, 266, 1146, 375, -171, -684, 610, -387, -358, -280, -360, 1284, -823, 33, -974, -277, -55, 108, 12, 243, -174, 1048, -510, -166, -1427, -57, -242, 540, -441, 26, 586, -608, 567, -175, 124, -850, 195, -811, -393, 351, -642, -111, 575, -276, -272, 382, 373, -57, -525, -86, 519, -385, 114, 1140, 993, 494, 481, 824, -109, -60, -254, 801, -4, -424, -175, -959, -532, 732, -169, 320, 68, 240, -237, -459, -112, 678, -250, 572, 831, 1162, -94, 63, -543, -5, -677, 549, -152, -197, 913, -394, 191, -579, -891, -655, 76, -590, -801, -323, 599, -183, -14, 340, 531, -112, -583, -1070, 1286, 338, -759, 852, -314, 833, 68, 508, -97, -350, 368, -299, 175, 313, 376, 140, 10, -354, -278, 622, -266, 376, -75, 127, -60, 758, -150, 520, -230, 607, 255, 279, 157, 431, -82, -112, -186, 237, 287, -271, -517, -268, -592, 677, 1004, -499, 171, -82, 725, 214]
4805B14o5M41p77M29N78n52o55O09k47m57P95j80j17L07p69M37P9k93j50J484
4825A111p90p2n36o62K17N68j71O56m15M92r0r82Q47o26M56n39Q72m98O89O23
4845A150j859R59k96O81n07m18O26q05L13m49L81M60l43M5J83r5M30n88J49m42
4865d25O83m56O25p85L74k9J46M25m18m75P05J055j536N90n98L74P41k72o72L3
4885H5k88N23j42n15ML93N99j494P54k27Q24j041L77M51M15R7j516M79N16n08
4905b14K24k72M42o47L64P95r93K9n00M58R17p37j64J29J033n3m64N01p88M24
4925D84m58m58O00m69p1n6P02k58pN77j46q14M10m28J166l46n77K98m05j86k04
4946f46m07J480j417J271l49M09k44q91R85J15m57p15J03k09P97K87%o69j48P33
$$ y = [214, 149, 590, -187, 242, 820, 268, -387, 222, -25, -482, 313, 133, 16, 323, -446, -9, 70, -223, -373, 1111, 321, 249, -287, -949, -732, -164, -335, 321, -94, 398, 308, -674, 173, -453, 3, -536, 336, -162, 527, 1150, -709, 250, -46, 635, 128, -290, 336, -469, -156, -605, -224, 236, -107, -62, 121, 26, 456, -132, 17, -425, 258, -198, 427, -358, 16, -13, 133, 558, 140, -335, 370, 1425, -111, 479, -119, 255, 996, 724, 52, 85, -203, 320, 178, -337, -333, 60, 659, -835, -81, -308, 516, -525, -148, 303, 718, 815, -701, -222, 294, -214, 10, -262, 180, -467, -103, 692, -301, -272, -772, -314, 603, -134, -298, -169, 864, 811, 347, 848, 60, 484, 26, -432, 168, -301, -372, -428, 274, 16, 9, 586, 440, -374, 36, -392, 774, 428, -149, 149, -256, -442, -646, -1053, 427, -990, 281, -68, 341, 97, -794, 191, 306, -151, -866, -763, -972, -175, 112, 112, -557, -705, 28]
4966B8n46M35m15M64j59l33K86P83n4j061P32m56K27K24L0N75r38n86J638j774
4986i00J345j159J149p14l23P56L8L6k06K05j55m07P10l60q31N68Q77j579J754
5005H04j119M27J6j000M68k30P51M80j442P2O31K34K36p83k15J010l00J337j090
5024B87l34Q6K5k68J86k18m99k26P06J72m67K61Q01m18JM80o25L66n20J33J078
5045A007j121R2J416j340J380j832l96M68p2Q36l85n81L9O66p16P11m06J414j728
5064e48M55N83r93J33m4N18n41kJ083l05j84k69l55L94l89O81J65j46j67lm10
5085c44K04l35k80J046O2L25r42K66L44j9Q8p46K65p14J100J2R5m94k24N53J63
5106D25p84P6N47l79K47ko4J06q5j12r33R52l14K94J81k40l46K02J02k5K62M25
$$ y = [28, -518, -83, -498, -34, -193, -526, -240, 543, 489, -572, 160, -296, -69, 155, 185, 760, -178, -764, 874, -900, 445, -714, 435, -279, -602, 154, 192, 228, 22, 227, 72, -335, 375, 15, -816, -248, 629, -950, 804, -315, 112, 128, -872, -404, -634, 117, 597, -845, -773, -142, 92, 328, -455, -670, 340, 40, 1377, 287, -47, 39, 64, -204, -18, -236, -735, -961, -255, -83, -550, -289, 512, 94, 95, 575, -50, 316, -204, -71, 1007, -114, -22, 1394, 54, 1434, -398, -794, -326, -398, 438, 53, -528, -489, 177, -539, 172, -234, 1180, -548, -93, 490, -503, -370, -414, 104, -437, -439, 644, 339, 155, -114, -469, -75, -464, 217, 382, 236, 69, 66, -344, -140, -475, -755, 291, 353, 678, -264, 2, 346, 327, 415, -331, -66, -780, 320, 332, 427, -67, -291, 262, 425, -359, -283, 264, -115, 132, 130, 66, 172, 87, -25, -958, -6, -320, -26, 155, -85, -431, -229, -127, -152, 110, 535]
5128E35m97J43p77J047j07o66K8J22l01Q53l76l0j012J461j42j088J594j436J315
5147F66k96n06Q35j178j46R78j123M28M11R25j314L42j072N97J11J553r66K32
5165D77K24j022K51N83o63M15k56M28q23N74J71K04j62q8l73m5k6M22j97k64J68
5186bO99m48k32J62p51R55N6N3j180J244m06l31l74p4p1M29O05m76j99l44N05
5207a80m33O69m21N78K54l33n68K93N88k91K54o70L60r7M88l93j142J42P55J07
5227d0n17L11L04J35p32M26L45r7M56m35k08p2q43J964M33k247J112M30k67q25
5247c67J108K37p90J21r88J35k64j1P95j85K50l26p97Q96O41k31m59O66m16N07
$$ y = [535, 38, 181, -596, 451, 344, -322, -294, -172, -473, 380, 4, -26, -1038, 423, 281, -807, 787, -649, 666, 370, -136, 699, -479, -625, 353, -770, -342, 69, 994, -320, 22, -1050, -453, -342, 1211, 245, 477, 701, -321, -70, 513, -150, 265, 9, 437, -386, 188, 359, 563, 401, 313, -60, -105, -131, 291, 94, -170, -2, 697, 249, 17, 179, -572, 383, 439, 492, -688, 556, 150, -181, -555, -629, -700, -271, 334, -142, -341, -685, -180, -613, 56, -365, 213, 467, 134, -434, -141, 447, 156, 410, -260, 100, 3, 491, 98, -1044, -902, -147, -40, -557, -246, 58, 193, -539, -113, 232, 135, 591, 156, -52, -124, -967, 997, 1430, -817, 295, 725, 458, -367, 741, 978, 188, 309, -679, -544, -808, -819, -24, -209, 41, -285, -1082, -186, 455, 224, -235, 431, 15, 522]
$$ [...]
8191a86
##END NTUPLES=NMR FID
##END=
