##TITLE=1H_AT-40_2
 DMSO-d6, CD3ONa
 124 sc, 
 22.08.2022
##JCAMPDX= 6.0         $$ Bruker NMR JCAMP-DX V2.0
##DATA TYPE= NMR FID
##DATA CLASS= NTUPLES
##ORIGIN= UXNMR, Bruker Analytische Messtechnik GmbH
##OWNER= root
$$ XWIN-NMR		Version 3.5
$$ Mon Aug 22 12:20:03 2022 Russian Standard Time (UT+4h)  she@DPX200
##.OBSERVE FREQUENCY= 200.1313499994
##.OBSERVE NUCLEUS= ^1H
##.DELAY= (6, 6)
##.ACQUISITION MODE= SIMULTANEOUS
##.ACQUISITION SCHEME= undefined
##.AVERAGES= 124
##.DIGITISER RES= 18
##SPECTROMETER/DATA SYSTEM= spect
##.PULSE SEQUENCE= zg30
##.SOLVENT NAME= DMSO
##.SHIFT REFERENCE= (INTERNAL, DMSO, 0, 15.7039)
##AUDIT TRAIL= $$ (NUMBER, WHEN, WHO, WHERE, WHAT)
$$ ##TITLE= Audit trail, XWIN-NMR		Version 3.5
$$ ##JCAMPDX= 5.01
$$ ##ORIGIN= Bruker BioSpin GmbH
$$ ##OWNER= she
$$ F:/spectra/data/she/nmr/H-F/1/audita.txt
$$ ##AUDIT TRAIL=  $$ (NUMBER, WHEN, WHO, WHERE, WHAT)
(   1,<2022-08-22 12:17:37.37 +0400>,<she>,<DPX200>,
      <created by zg, POWCHK disabled, PULCHK disabled
       configuration hash MD5:
       00 E9 B6 7A A2 85 ED C7 34 08 36 98 17 FE 4E 26
       data hash MD5: 16K
       0F 7D A4 0D 95 A4 57 2C 73 D9 4D CD 55 DE C0 12>)
$$ ##END=
$$ 
$$ hash MD5
$$ 01 65 3B 61 C1 17 C8 79 A6 A5 BA 65 23 B0 40 6F
##$RELAX= 
##$RELAX= 
##$RELAX= 
##$RELAX= 
##$RELAX= 
##$RELAX= 
$$ Bruker specific parameters
$$ --------------------------
##$DU= <F:/spectra>
##$EXPNO= 1
##$NAME= <H-F>
##$PROCNO= 1
##$TYPE= <nmr>
##$USER= <she>
##$AMP= (0..31)
100 100 100 100 100 100 100 100 100 100 100 100 100 100 100 100 100 100 
100 100 100 100 100 100 100 100 100 100 100 100 100 100 
##$AQSEQ= 0
##$AQ_mod= 1
##$AUNM= <au_zg>
##$AUTOPOS= <>
##$BF1= 200.13
##$BF2= 200.13
##$BF3= 200.13
##$BF4= 200.13
##$BF5= 200.13
##$BF6= 200.13
##$BF7= 200.13
##$BF8= 200.13
##$BYTORDA= 1
##$CFDGTYP= 0
##$CFRGTYP= 5
##$CHEMSTR= <none>
##$CNST= (0..31)
1 1 145 1 1 1 1 1 1 1 1 1 1 1 1 1 1 1 1 1 1 1 1 1 1 1 1 1 1 1 1 1 
##$CPDPRG= <>
##$CPDPRG1= <>
##$CPDPRG2= <>
##$CPDPRG3= <>
##$CPDPRG4= <mlev>
##$CPDPRG5= <mlev>
##$CPDPRG6= <mlev>
##$CPDPRG7= <mlev>
##$CPDPRG8= <mlev>
##$CPDPRGB= <>
##$CPDPRGT= <>
##$D= (0..31)
0 1.2 0 0 0 0 0 0 0 0.06 0 0.03 0 0 0 0 0.0002 0 0 0 0 0 0 0 0 0 0 0 0 
0 0 0 
##$DATE= 1661156256
##$DBL= (0..7)
120 120 120 120 120 120 120 120 
##$DBP= (0..7)
150 150 150 150 150 150 150 150 
##$DBP07= 0
##$DBPNAM0= <>
##$DBPNAM1= <>
##$DBPNAM2= <>
##$DBPNAM3= <>
##$DBPNAM4= <>
##$DBPNAM5= <>
##$DBPNAM6= <>
##$DBPNAM7= <>
##$DBPOAL= (0..7)
0.5 0.5 0.5 0.5 0.5 0.5 0.5 0.5 
##$DBPOFFS= (0..7)
0 0 0 0 0 0 0 0 
##$DE= 6
##$DECBNUC= <off>
##$DECIM= 32
##$DECNUC= <off>
##$DECSTAT= 4
##$DIGMOD= 1
##$DIGTYP= 9
##$DL= (0..7)
0 120 120 120 120 120 120 120 
##$DP= (0..7)
150 150 150 150 150 150 150 150 
##$DP07= 0
##$DPNAME0= <>
##$DPNAME1= <>
##$DPNAME2= <>
##$DPNAME3= <>
##$DPNAME4= <>
##$DPNAME5= <>
##$DPNAME6= <>
##$DPNAME7= <>
##$DPOAL= (0..7)
0.5 0.5 0.5 0.5 0.5 0.5 0.5 0.5 
##$DPOFFS= (0..7)
0 0 0 0 0 0 0 0 
##$DQDMODE= 0
##$DR= 18
##$DS= 0
$$ [...]
##$SUBNAM2= <"">
##$SUBNAM3= <"">
##$SUBNAM4= <"">
##$SUBNAM5= <"">
##$SUBNAM6= <"">
##$SUBNAM7= <"">
##$SUBNAM8= <"">
##$SUBNAM9= <"">
##$SW= 18.0517283424941
##$SWIBOX= (0..15)
0 0 2 0 0 0 0 0 0 0 0 0 0 0 0 0 
##$SW_h= 3612.71676300578
##$TD= 16384
##$TD0= 1
##$TE= 0
##$TE2= 300
##$TE3= 300
##$TEG= 300
##$TL= (0..7)
0 120 120 120 120 120 120 120 
##$TP= (0..7)
150 150 150 150 150 150 150 150 
##$TP07= 0
##$TPNAME0= <>
##$TPNAME1= <>
##$TPNAME2= <>
##$TPNAME3= <>
##$TPNAME4= <>
##$TPNAME5= <>
##$TPNAME6= <>
##$TPNAME7= <>
##$TPOAL= (0..7)
0.5 0.5 0.5 0.5 0.5 0.5 0.5 0.5 
##$TPOFFS= (0..7)
0 0 0 0 0 0 0 0 
##$TUNHIN= 0
##$TUNHOUT= 0
##$TUNXOUT= 0
##$USERA1= <user>
##$USERA2= <user>
##$USERA3= <user>
##$USERA4= <user>
##$USERA5= <user>
##$V9= 5
##$VALIST= <valist>
##$VCLIST= <CCCCCCCCCCCCCCC>
##$VD= 0
##$VDLIST= <DDDDDDDDDDDDDDD>
##$VPLIST= <PPPPPPPPPPPPPPP>
##$VTLIST= <TTTTTTTTTTTTTTT>
##$WBST= 1024
##$WBSW= 4
##$XGAIN= (0..3)
0 0 0 0 
##$XL= 0
##$YL= 0
##$YMAX_a= 2038343
##$YMIN_a= -2314371
##$ZGOPTNS= <>
##$ZL1= 120
##$ZL2= 120
##$ZL3= 120
##$ZL4= 120
##$ABSF1= 10
##$ABSF2= 0
##$ABSG= 5
##$ABSL= 3
##$ALPHA= 0
##$AQORDER= 0
##$ASSFAC= 0
##$ASSFACI= 0
##$ASSFACX= 0
##$ASSWID= 0
##$AUNMP= <proc_1d>
##$AZFE= 0.1
##$AZFW= 0.1
##$BCFW= 1
##$BC_mod= 2
##$BYTORDP= 1
##$COROFFS= 0
##$CY= 11.3945322036743
##$DATMOD= 1
##$DC= 2
##$DFILT= <>
##$DTYPP= 0
##$F1P= 2.36226072786647
##$F2P= -0.459571619588291
##$FCOR= 0.5
##$FTSIZE= 0
##$FT_mod= 4
##$GAMMA= 1
##$GB= 0.15
##$INTBC= 1
##$INTSCL= 1
##$ISEN= 128
##$LB= 0.24
##$LEV0= 0
##$LPBIN= 0
##$MAXI= 10000
##$MC2= 0
##$MEAN= 0
##$ME_mod= 0
##$MI= 1.114404
##$NCOEF= 0
##$NC_proc= 0
##$NLEV= 6
##$NOISF1= 3.799351
##$NOISF2= 2.8
##$NSP= 1
##$NTH_PI= 0
##$NZP= 0
##$OFFSET= 15.70392
##$PC= 1
##$PHC0= -18042.77
##$PHC1= 11.60068
##$PH_mod= 1
##$PKNL= yes
##$PPARMOD= 0
##$PSCAL= 0
##$PSIGN= 0
##$REVERSE= no
##$SF= 200.130013532006
##$SI= 16384
##$SIGF1= 3
##$SIGF2= 2
##$SINO= 400
##$SIOLD= 16384
##$SREGLST= <1H.CDCl3>
##$SSB= 0
##$STSI= 0
##$STSR= 0
##$SW_p= 3612.71676300578
##$SYMM= 0
##$S_DEV= 0
##$TDeff= 0
##$TDoff= 0
##$TI= <>
##$TILT= no
##$TM1= 0
##$TM2= 0
##$TOPLEV= 0
##$USERP1= <user>
##$USERP2= <user>
##$USERP3= <user>
##$USERP4= <user>
##$USERP5= <user>
##$WDW= 1
##$XDIM= 8192
##$YMAX_p= 0
##$YMIN_p= 0
$$ End of Bruker specific parameters
$$ ---------------------------------
##NTUPLES= NMR FID
##VAR_NAME=  TIME,          FID/REAL,        FID/IMAG
##SYMBOL=    X,             R,               I
##VAR_TYPE=  INDEPENDENT,   DEPENDENT,       DEPENDENT
##VAR_FORM=  AFFN,          ASDF,            ASDF
##VAR_DIM=   8192,          8192,            8192
##UNITS=     SECONDS,       ARBITRARY UNITS, ARBITRARY UNITS
##FACTOR=    0.0002768,     1,               1
##FIRST=     0,             0,               0
##LAST=      2.2672688,     0,               0
##MIN=       0,             -2314371,        0
##MAX=       2.2672688,     2038343,         0
$$ Real data points
##PAGE= N=1
##DATA TABLE= (X++(R..R)), XYDATA
0 0 0 0 0 0 0 0 0 0 0 0 0 0 -113 124 -124 124 -124 248 -248 248 -372 372 -496 611 -650 764 -906 1079
28 1079 -1239 1401 -1613 1844 -2093 2370 -2682 3022 -3395 3806 -4255 4750 -5290 5883 -6523
43 -6523 7239 -7999 8834 -9752 10756 -11859 13058 -14385 15848 -17477 19269 -21283
55 -21283 23547 -26127 29077 -32495 36510 -41325 47174 -54511 63990 -76781 95106
66 95106 -123622 174539 -293463 1226552 -400337 -1448695 2038343 815091 -1402261
75 -1402261 -164703 1170888 -208907 -302650 423307 -62430 -586571 382982 625277 -272630
85 -272630 -299694 841564 369512 -1203827 -710832 1151549 592470 -1093029 -381833 1159009
95 1159009 192699 -1159043 -57183 1162381 -5525 -967254 -77330 192223 -550890
104 -550890 -1460 607722 -322089 -310703 939768 143266 -1257672 95590 1296133
113 1296133 -448615 -1284890 539180 882048 -926923 -891923 852329 805325 -481514
122 -481514 -296670 493666 91167 -336421 112407 99173 -329153 124142 446303 -391843
132 -391843 -496201 727012 672018 -764791 -574388 852649 417916 -972995 -327596
141 -327596 965344 209066 -818990 50021 766844 -95541 -434460 291978 223358 -295221
151 -295221 45059 107492 -564622 -190653 737387 57055 -874637 131697 996856 -208289
161 -208289 -896243 380651 776897 -543251 -713050 479499 438042 -493674 -257655 350587
171 350587 2536 -212977 192917 39524 -317301 181426 406836 -413988 -490687 561969
181 561969 496133 -644481 -379264 791212 359670 -786941 -284157 683511 120345 -597143
191 -597143 -13825 401349 -140304 -214204 269042 89801 -190029 225411 205061 -424593
201 -424593 -113140 612799 -3050 -750457 82360 729790 -258369 -730159 340053 658003
211 658003 -332051 -461920 353118 288005 -310254 -105194 234145 -45102 -98637 191666
221 191666 -65221 -343678 177349 404326 -304837 -421002 407844 353707 -552954 -321538
231 -321538 620045 265837 -610824 -165788 561848 75017 -429710 48682 280266 -142313
241 -142313 -117812 154860 -123890 -202245 292269 175347 -422005 -80286 542767 -1842
251 -1842 -565213 141175 597238 -204656 -544412 235323 406653 -295905 -309124 269375
261 269375 167895 -228630 -47226 140681 -62689 -5605 206735 -83820 -284390 190998
271 190998 337302 -284137 -344391 371231 331197 -422491 -277841 438479 185829 -437275
281 -437275 -96340 389000 -5302 -317021 71378 196677 -102934 -11529 162363 -126023
291 -126023 -151917 267027 106686 -394628 -56590 453847 -38504 -503970 95496 481244
301 481244 -136988 -384530 206474 307457 -212951 -195885 197522 71485 -169707 19311
311 19311 82259 -140296 -30058 193711 -65636 -236382 176107 276898 -263654 -294765
321 -294765 318600 273505 -347147 -209624 364445 137714 -343474 -55742 286158 -25018
331 -25018 -192653 92042 66989 -161534 31149 159891 -150771 -119243 279585 93993
341 93993 -334579 -10616 386275 -48277 -379280 109001 332757 -168313 -293849 165849
351 165849 208564 -144405 -95607 136725 15393 -92413 76512 56634 -131931 11550
361 11550 190043 -79847 -243943 121913 241364 -184618 -215875 257929 193624 -296569
371 -296569 -155160 287184 76407 -259966 3754 210133 -63850 -127340 100956 18179
381 18179 -126674 85530 121430 -190301 -119129 228738 52565 -284105 -8146 296070
391 296070 -35043 -268871 91690 247784 -109488 -183434 128717 117053 -147607 -77308
401 -77308 108402 2143 -71990 83148 45299 -136355 5289 188099 -54833 -201484
411 -201484 131275 224006 -174796 -201702 203999 142520 -226049 -69998 235479 20677
421 20677 -187942 37087 120010 -99188 -63448 118259 -3361 -101503 96764 105800 -149457
432 -149457 -73081 197855 36859 -230581 -6811 222839 -43883 -222539 55229 170271
442 170271 -86455 -117406 108487 73494 -103306 -16833 90304 -44113 -82397 70381 20816
453 20816 -136210 6165 164506 -46882 -163717 103780 150361 -157601 -137530 178770
463 178770 104240 -159105 -29862 156095 -21043 -132698 52847 90886 -64546 -10322
473 -10322 104084 -43597 -127659 66391 96314 -108941 -44644 174058 34552 -174965 10697
484 10697 175667 -38764 -149045 67924 112742 -96085 -88198 89031 44549 -73962 11175
495 11175 69354 -61909 -60097 94134 34603 -112860 12954 123440 -78585 -154378 90082
506 90082 125868 -105518 -71272 130189 17621 -163868 -18453 122548 -16554 -74991 66503
517 66503 45364 -90366 -10150 92780 -38081 -78955 92093 67811 -130925 -59201 126765
528 126765 15630 -123870 28171 121514 -48018 -97407 75498 94191 -58348 -44447 65718
539 65718 -426 -78470 31942 79943 -45800 -37979 85912 1196 -121358 20565 121315
550 121315 -45432 -96018 82576 69395 -111346 -56631 107039 28905 -87406 14847 71247
561 71247 -59350 -71371 64304 31022 -79068 7586 78862 -46692 -68757 83057 58424
572 58424 -94574 -33761 88470 -7873 -98488 23604 90402 -37735 -73921 46368 41121
583 41121 -66210 -15169 84524 3874 -66720 32858 49964 -70096 -33703 93300 18557
594 18557 -82779 23689 78236 -59514 -68957 78911 55185 -83532 -29901 80307 -52
605 -52 -67705 35176 63749 -50740 -39271 64286 6971 -73972 14490 61927 -46130 -55118
617 -55118 56318 26904 -70080 -4965 82366 -692 -72071 14980 54785 -38579 -45229 55915
629 55915 32229 -64752 -14417 60675 -15372 -53971 43509 41815 -60658 -19741 72014 -1233
641 -1233 -71208 26133 65768 -42692 -47766 59420 29883 -66996 -8358 64848 -19242 -64184
653 -64184 30570 43322 -47330 -16243 62145 -124 -58091 23329 51860 -35526 -37171 46862
665 46862 17062 -58194 -8851 57114 -3330 -50196 22212 43371 -36931 -30248 51084 15754
677 15754 -56957 3300 51102 -25392 -44266 40302 28335 -51906 -8977 53611 -13286 -57719
689 -57719 25998 48555 -33982 -27856 48164 12521 -51093 11355 57224 -21116 -43991 31405
701 31405 22060 -46390 -8481 46865 -8863 -45266 19912 37843 -29460 -23044 41264 15314
713 15314 -42067 -1806 39975 -15994 -42169 26660 33227 -37079 -21350 39178 -1273 -42731
725 -42731 16577 40713 -28280 -32172 34951 17439 -37770 3351 44933 -13123 -39555 23176
737 23176 27732 -34929 -16844 40165 2654 -42674 11589 37248 -20457 -24462 35773 17867
749 17867 -36631 -3532 35984 -9228 -31933 21914 26114 -33169 -22082 31832 6942 -31982
761 -31982 10598 34497 -20166 -31189 27362 20340 -30790 -5945 35802 -6575 -35080 15879
773 15879 25943 -26003 -18098 31605 6141 -35092 2060 30465 -13404 -23037 26200 17341 -30743
786 -30743 -9287 32973 -1276 -29582 13520 21818 -24897 -19181 28581 10520 -25018 5059
798 5059 28705 -13432 -24470 20607 19376 -21609 -5135 29753 -2681 -31630 6483 22953
810 22953 -18747 -17125 25718 9255 -28430 -2881 26778 -8362 -21378 17764 17290 -24038 -8873
823 -8873 27584 -113 -27910 7467 21300 -18823 -19335 22283 10418 -23444 -454 23911 -8692
836 -8692 -20467 15299 17698 -16217 -5941 22304 -1577 -24473 4036 19286 -13049 -14358 20196
849 20196 9943 -24097 -4633 22408 -3402 -19069 13242 18774 -16357 -10594 17618 972
861 972 -22290 4107 18534 -11634 -13247 16670 8111 -21213 -1822 20662 -6853 -20338 12825
874 12825 17683 -15353 -9389 17244 525 -21958 1889 16823 -8309 -11159 13544 6158 -18361
887 -18361 -4386 15575 -2602 -12756 11954 16157 -13997 -11553 14655 2660 -20476 1674
899 1674 19508 -5755 -14808 11111 9389 -15073 -3134 18129 885 -13537 9747 11745 -14864
912 -14864 -10579 15989 1211 -19801 3933 17909 -9592 -13595 14375 8540 -18027 -4823 15954
925 15954 -258 -11811 8019 11028 -9337 -8447 8424 230 -14109 4465 15270 -6580 -12812
938 -12812 11014 7286 -17282 -2295 19956 2181 -15449 7398 12416 -11235 -10241 11747 4281
951 4281 -11750 -125 10635 -6174 -10389 10071 6497 -13321 -93 16272 -2781 -13986 10751
964 10751 12873 -13689 -10364 12028 5073 -12813 1485 13333 -1785 -9616 3886 3880 -8505 -1891
978 -1891 13154 286 -11415 5126 7876 -14554 -9607 15833 5168 -15533 32 13256 -6843
991 -6843 -13482 6686 8106 -5594 -3090 10255 1051 -8925 3886 8352 -7745 -5460 11031 202
1005 202 -15494 2257 15466 -5028 -10188 9444 8861 -9865 -3848 12736 3136 -9910 514
1018 514 5565 -5836 -6995 8232 3968 -8410 1755 9837 -9082 -11361 10233 7519 -11491
1031 -11491 112 14079 -2682 -12433 4221 9724 -4146 -4841 6735 3263 -9044 -1393 7471
1044 7471 -2244 -6412 7169 5637 -7921 335 11595 -2625 -11861 6491 10140 -9574 -8672 7880
1058 7880 4403 -10086 -1179 9422 -2213 -10455 3979 7668 -5320 -2099 8368 -2954 -9742
1071 -9742 5552 7906 -9317 -5545 12167 1109 -11961 2920 9891 -6283 -8549 6717 8159
1084 8159 -5929 -4896 4173 803 -5429 2601 5978 -7148 -5722 7507 2422 -11138 534 10318
1098 10318 -5746 -9910 9030 8852 -10055 -6210 10813 2973 -9826 -127 7931 -4392 -6449
1111 -6449 7242 2942 -8808 1138 8416 -5975 -7668 9632 5881 -11535 -2128 12130 -368
1124 -368 -8991 4194 7162 -5660 -5170 7054 3708 -7157 -2673 6445 -385 -5871 4566 4512 -8322
1139 -8322 -2472 10200 1459 -11195 2095 8942 -7183 -7781 8780 4084 -11369 -3013 11220
1152 11220 -285 -7212 5070 5751 -6515 -1969 10219 -581 -10899 4463 7649 -7367 -4532
1165 -4532 11590 1109 -12160 1301 11870 -1823 -8855 3649 6121 -6961 -3525 7957 533
1178 533 -8302 1417 8045 -4314 -7026 6272 2124 -9857 1208 10343 -2544 -10261 6725 7910
1192 7910 -8245 -4322 9985 2789 -10829 710 10267 -4992 -8159 6801 4734 -9191 -853
1205 -853 11164 -3478 -10649 6495 8134 -8662 -3159 9703 -501 -10039 2797 10688 -6146
1218 -6146 -8347 6551 6100 -8125 -1905 9890 -1424 -8158 5637 8667 -6659 -5769 7874 3289
1232 3289 -8448 1386 9590 -6278 -9739 6662 8145 -8201 -3383 10815 -863 -10949 3724
1245 3724 9988 -7303 -9235 8275 4218 -10344 236 10532 -5142 -9508 7602 7654 -9198
1258 -9198 -3128 11656 22 -9375 4314 8563 -7298 -6761 9253 5555 -8341 -2162 9354
1271 9354 -2712 -9455 5296 7733 -7070 -3572 9573 1525 -9969 2587 9590 -5651 -7445
1284 -7445 7263 6678 -10005 -3953 9411 -1502 -10922 5725 8948 -8245 -5936 10657 2651
1297 2651 -10182 1442 9355 -4891 -7511 7994 6342 -9573 -2570 9781 -966 -9388 3545
1310 3545 7841 -6149 -5760 8301 3465 -9853 -1140 8984 -2492 -7458 5835 5708 -8762 -4237
1324 -4237 9053 1031 -9542 3075 9850 -5288 -6897 8705 4751 -10210 -1366 10998 -3512
1337 -3512 -9134 5973 6674 -8998 -4004 10149 658 -9843 2698 8959 -5618 -6256 7409 4196
1351 4196 -9099 -513 9298 -874 -7786 4781 6803 -6641 -5141 7305 2341 -8795 1034
1364 1034 9857 -2828 -7680 5417 5859 -8855 -2073 9673 -261 -10248 3201 7447 -6717 -7230
1378 -7230 9801 3314 -9641 1649 8930 -4569 -7626 5346 5875 -7297 -1501 9684 -140
1391 -140 -8240 3736 7764 -4562 -5416 7021 3139 -8710 -991 8829 -2631 -6397 5180 5393
1405 5393 -6757 -2876 8324 909 -8409 596 8359 -4132 -6838 5736 5424 -7887 -2096 8642
1419 8642 -2224 -8424 5209 6748 -7364 -4797 7746 960 -8337 2568 6808 -4139 -5964
1432 -5964 6157 4390 -7320 -1936 6951 -2042 -7434 5216 6647 -5254 -4860 7701 1643 -8389
1446 -8389 57 7449 -2407 -7440 4077 5968 -6387 -2603 6112 703 -7095 2377 6456 -5689
1460 -5689 -5255 6500 3722 -8248 804 8489 -2911 -7848 4981 5491 -6496 -3164 6437 297
1474 297 -6887 2108 6506 -3978 -4575 4920 1973 -5688 400 6844 -2135 -6883 5263 4880 -6190
1489 -6190 -3569 6933 1249 -6379 1262 6916 -2859 -5954 4628 4579 -5505 -2800 6203 -525 -4906
1504 -4906 3042 3960 -4826 -3184 7915 702 -7364 1276 7389 -3055 -7267 5343 4354 -6770
1518 -6770 -2198 6996 -78 -6810 2005 3861 -3547 -2243 6080 1145 -5220 1817 5486 -4537 -4928
1533 -4928 5506 4131 -6946 -2151 7475 724 -6969 -233 6598 -1913 -5712 2733 4563 -4025
1547 -4025 -2239 4761 -933 -5466 3114 2925 -6066 -2109 7603 -499 -8099 2777 7397 -4354 -6000
1562 -6000 6643 4571 -4854 -3049 6022 330 -4453 1866 3948 -3436 -953 4422 -1671 -6043 3019
1577 3019 3701 -4662 -5138 4539 3317 -6917 -2066 6274 2493 -6732 -919 5615 -424 -6086 3247
1592 3247 3564 -3276 93 3925 -1416 -2697 4934 2072 -6414 -138 7603 -2423 -8094 2820 7280
1607 7280 -4666 -6492 4669 4926 -4653 -2784 4034 931 -3332 319 2746 -3147 75 3073 -2474
1622 -2474 -5252 2785 4772 -4606 -4685 5762 3186 -5847 -2631 6808 2157 -6285 951 7096 -806
1637 -806 -3396 1665 1323 -2174 272 2923 -3014 -2774 4109 1126 -6074 58 7326 -2500 -8271 3036
1653 3036 7107 -4081 -6255 3559 4819 -4136 -2375 3606 573 -943 374 -11 -2080 926 2892
1668 2892 -4077 -3638 4594 4978 -4474 -4382 5701 4768 -7156 -3451 7042 1184 -5800 -560 4464
1683 4464 -273 -3416 1029 1317 -1558 1839 818 -4731 -1103 4497 211 -8349 -54 7837 -2222
1698 -2222 -7701 2699 7127 -3270 -6138 1629 4998 -1875 -2710 630 1136 -1599 885 -1202 -528
1713 -528 2565 2234 -3994 -4254 4014 4095 -5616 -5085 5981 4095 -5856 -3457 5396 2723 -4381 -1373
1729 -1373 3622 1264 -1512 -402 -160 425 2792 -706 -4901 416 5884 -299 -7512 1543 7240
1744 7240 -1852 -6650 2612 6783 -2323 -5956 1087 3538 -487 -2713 -816 314 1600 486 -2714
1759 -2714 -1401 2459 2356 -3704 -2198 4775 3931 -6423 -4847 7098 4173 -5424 -3430 5441 3235
1774 3235 -3750 -1227 3103 1097 -563 -1343 -725 919 3034 -1220 -6227 989 6951 -1216 -6923
1789 -6923 1800 7780 -812 -6429 744 6288 -647 -6509 -300 4612 266 -3387 -783 1297 2370
1804 2370 -10 -2679 -1182 3941 2192 -4267 -3161 5367 3725 -4911 -3457 6321 4374 -5296 -4984
1819 -4984 4077 3841 -3796 -3141 716 2356 242 -1965 -2099 1493 3382 -1178 -5786 1685 7215 -1930
1835 -1930 -7646 1494 6716 -1456 -5752 443 6881 -408 -4144 -247 3120 900 -2162 -2025 36
1850 36 3442 1008 -3543 -2295 4336 3545 -4609 -4074 4735 4132 -5611 -5415 5074 3971 -4530 -2994
1866 -2994 3565 4173 -1717 -2630 -371 3023 2125 -2228 -3220 945 4847 -1354 -5164 499 6715 -965
1882 -965 -5898 302 6691 -479 -5166 -1650 5342 1493 -4711 -1926 3248 2401 -856 -1378 -128 3587
1898 3587 1878 -3514 -3256 4946 3747 -4867 -4644 5035 3813 -5060 -5499 3895 3740 -3048 -4689 2235
1914 2235 2928 -239 -2532 -768 2922 2123 -1882 -3242 2074 4786 -1267 -5794 1357 5206 -1032
1929 -1032 -6598 -185 6403 623 -5600 -389 4824 2239 -3478 -1912 2344 3082 53 -2819 -1170
1944 -1170 3973 1932 -3490 -2523 4613 4196 -4743 -4347 4235 5176 -4369 -4347 3172 4285 -4038 -3797 874
1961 874 2799 -1039 -3045 -1262 1731 3060 -505 -4217 1226 5237 -617 -6413 303 6117 552
1976 552 -6264 -745 5857 1041 -4503 -1319 3542 1285 -2688 -3085 1535 2647 -83 -3055 -951
1991 -951 4097 3514 -3564 -3711 3931 3878 -3927 -4898 4706 4875 -3725 -3559 2960 3220 -2183 -3394 -960
2008 -960 1821 1191 -3337 -2010 1242 2806 -403 -4708 418 5292 -682 -4611 565 5977 1333
2023 1333 -5241 -2103 4068 2033 -3753 -1698 2377 2178 -2048 -2322 513 1639 568 -3200 -1849
2038 -1849 3275 2993 -3888 -4246 3403 3769 -3262 -4687 2826 4888 -3117 -3724 1851 2972 -1390 -3215
2054 -3215 -616 2314 1648 -1797 -1539 1514 3344 -180 -3603 -416 4488 -98 -5099 35 4397
2069 4397 1190 -4715 -1702 3597 1390 -4035 -1297 1936 2214 -586 -2262 -222 2766 837 -3063
2084 -3063 -821 3123 2619 -2263 -3267 2685 5332 -2942 -3376 2559 3716 -659 -4195 1575 3378
2099 3378 337 -2603 -974 2351 2525 -680 -2392 10 2812 884 -2730 -386 3616 555 -3828
2114 -3828 -623 4167 1338 -4015 -1801 3076 2087 -2078 -2337 1019 1382 -915 -2323 -276 2346 2163
2130 2163 -2408 -2643 2833 3696 -2153 -3454 1573 3716 -1105 -3341 1099 2915 -148 -1889 697
2145 697 2088 377 -1278 -587 1021 2467 278 -2177 235 4103 480 -3227 -973 3065 1881
2160 1881 -3679 -1236 4004 511 -2323 -1237 2502 2363 -1798 -2488 107 1566 -321 -1477 -965 1788
2176 1788 1701 -1517 -1529 1826 3542 -1561 -3712 1075 2125 -1398 -3019 1064 3488 -252 -1807 60
2192 60 562 668 -1620 -579 57 1353 -665 -1702 -358 2834 1351 -2686 -303 3209 104 -2839
2208 -2839 -1842 2301 1526 -2417 -348 1630 751 73 -859 381 878 792 -625 -605 1153 2411 -1217
2225 -1217 -1883 1727 4572 -915 -3367 763 1594 -741 -1748 1031 2675 186 -1769 106 1590
2240 1590 1541 -572 -111 499 1755 697 -1411 -987 1101 678 -1930 -829 1545 669 -2342 -1233 2148
2257 2148 1055 -1305 -1585 1068 1310 -626 -1330 377 423 120 -423 -1564 727 1364 -613 -2609 243
2274 243 2687 -293 -1681 1129 2273 481 -1238 832 933 -1341 -1021 253 737 894 -577 -1566
2290 -1566 -404 1022 673 -1275 -1273 2031 352 -875 -977 1670 619 -1603 -1855 1739 863 -583 -285
2307 -285 1077 340 -242 -479 75 620 385 -287 -1212 391 672 82 -1048 85 2248 -121 -1475 378
2325 378 1112 -654 -240 -49 -13 -255 -338 -903 185 558 279 279 -798 726 1164 -1017 -304 873 845 -211
2345 -211 -116 692 1866 -1400 -885 1592 1085 -355 -1075 404 1265 643 619 -746 707 1017 284 -438
2363 -438 -164 1408 -109 -117 -173 934 511 -696 392 702 582 -801 -1043 834 -126 298 -470 72 574
2382 574 146 -408 -372 111 1444 -1558 -1135 400 1395 -257 -1024 1611 1075 -399 167 944 -371 -1280
2400 -1280 -1071 176 -51 647 -209 -677 -635 -3 493 -407 -117 882 -56 -670 355 324 -667 -939 606
2419 606 1100 -715 -759 -753 -678 96 269 -769 34 545 195 -1258 -717 1552 39 -1741 -780 1277 611
2438 611 -1083 -364 270 473 108 -226 61 -1303 1212 -886 121 560 436 544 329 -436 403 253
2456 253 -1110 462 899 584 -1462 233 1044 -574 -1383 260 1039 183 151 3 728 392 91 807
2474 807 1934 782 -61 -594 303 978 246 798 -473 486 121 -451 -214 244 370 -67 -809 880 1254
2493 1254 19 620 -684 461 472 521 -777 360 -185 680 -1118 681 496 247 -594 -144 681 -1027
2511 -1027 266 -187 415 -955 -237 160 352 -199 -181 -483 -209 -602 795 -203 48 -242 -290 -594 -537 -407
2531 -407 979 -240 1046 519 330 -255 -716 356 36 -919 358 403 84 -77 464 130 -96 293 -173
2550 -173 -216 634 865 -152 -599 356 -156 -214 -140 99 -29 -214 71 465 371 -22 -292 638 -520 451 286
2571 286 530 -1156 -915 -423 133 -60 443 -31 -778 -99 -244 -185 -626 -951 -257 358 -269 273 1376 -145
2591 -145 415 20 533 893 85 -992 627 195 -226 11 -199 60 -132 -342 -1053 -324 396 399 296 744
2611 744 -790 -355 267 565 -265 -136 -349 228 -90 -38 -284 -485 756 -693 260 332 -68 1219 -85
2630 -85 66 -199 399 254 370 8 -338 -420 -319 183 -47 687 16 342 -603 493 -354 940 230 -172
2650 -172 -277 -215 -340 608 -442 -448 720 1493 -518 -59 -183 279 426 -214 -631 357 464 762 452 -15
2670 -15 569 -150 -243 400 471 191 105 148 117 -128 -227 -601 211 -38 28 369 -467 -302 -168 53 -279 334 470
2693 470 775 -887 -676 -172 -84 -268 -267 -520 811 -203 -219 555 -880 -576 123 -157 37 1417 -887
2712 -887 320 269 1023 1 584 326 280 -283 -392 583 -448 1031 727 -242 142 355 142 -47 94
2731 94 -330 -671 456 -35 -281 8 830 -449 -369 -790 -765 72 -385 539 -169 182 -92 460 -125 -365
2751 -365 610 650 417 216 162 -206 -347 -434 229 -131 -566 600 -1029 -756 1041 415 567 -41 486 1074
2771 1074 -39 -363 236 -1387 437 -261 305 310 -57 45 -506 437 62 -8 775 -454 385 788 957
2790 957 -309 -637 -329 -136 -126 -1085 -870 333 1079 -282 -206 -501 28 410 -393 120 407 -359 -916 272
2810 272 -849 787 181 10 -566 -56 -161 -527 308 -81 589 571 669 733 -113 -1177 -7 748 -619
2829 -619 585 76 -439 379 39 12 66 1227 -686 -563 877 996 -915 70 738 -18 105 152 249 57
2849 57 115 373 484 -264 -581 -577 418 399 -167 -276 -605 1028 -476 446 968 505 -401 195 -491 -275 271
2870 271 256 -4 -832 33 141 -508 681 -527 820 1025 -48 412 -145 836 438 183 -510 -462 146
2889 146 794 220 738 -63 -133 536 -650 -472 836 -209 49 739 -324 -12 24 -109 779 528 289
2908 289 690 75 -201 78 513 -10 -90 -203 29 457 -23 75 615 652 310 -98 501 1019 185 801 328
2929 328 162 221 93 339 -1245 -145 50 -373 -327 -188 -701 -377 -83 -582 -59 343 939 581 114 37
2949 37 -375 465 18 222 141 155 712 -180 -14 -1005 -472 369 290 -558 -196 -283 -146 95 179 -126 -9 253
2971 253 381 -1262 642 -34 -582 -486 -674 -630 -1196 497 -70 -245 1000 614 527 -195 393 -139 -553 -382
2991 -382 -473 -257 290 -67 -303 309 483 95 -606 344 813 570 -205 -242 41 -425 -354 161 -490 228 576
3012 576 404 312 -445 -190 -549 294 -656 -303 -22 -594 348 -117 -132 668 124 -189 -161 399 102 531 -521
3033 -521 -418 877 -429 -589 -201 -257 17 -238 435 535 155 -222 197 -309 345 1147 -162 -323 254
3052 254 17 590 -629 570 -240 -912 19 -545 304 91 -603 -321 -768 -325 -277 193 -74 208 318 -1451
3072 -1451 -338 -305 476 -1153 630 537 100 -275 -27 -366 -451 831 87 -719 275 -491 778 -423 -290
3091 -290 -407 246 45 -672 -426 -159 -473 -820 -900 -1089 14 461 -523 488 -862 -1032 275 -5 -41
3110 -41 55 566 -41 -545 -334 186 990 318 258 -363 34 -74 675 39 519 64 -102 -1059 -589 -293 8
3131 8 -650 98 -687 -702 213 224 -419 6 -352 -150 503 -310 -23 449 -734 -305 -114 -66 -528 217 -191
3152 -191 -767 522 635 -341 65 -217 771 -1399 -317 -1025 -578 -80 -7 1073 262 -882 176 -113
3170 -113 -94 1213 -22 -462 -775 34 -632 681 148 25 -843 -270 -811 1251 327 239 154 368 53 -298
3190 -298 445 358 -281 -228 -270 -480 418 226 424 214 -648 8 733 395 1089 250 -628 123 165 458 28
3211 28 -18 356 -501 -518 255 781 573 -449 -735 161 -1109 -654 8 -224 -699 -799 -374 -26 -440 214
3231 214 -906 211 -1077 -471 183 -22 -616 -266 767 -227 -699 -13 -292 -285 487 617 455 762 45
3250 45 -717 10 247 516 -588 -512 -590 -172 -37 -667 -187 -240 -596 -959 -938 506 -79 720 61 -81 1061
3271 1061 755 -791 -835 549 -379 400 570 -1025 -966 296 159 133 -799 -156 13 -154 -499 364 400 530
3291 530 -557 575 -506 -29 -535 -485 -68 29 200 -1077 -1017 -274 1086 899 -235 -197 -372 114 -102
3310 -102 27 -387 415 1043 -278 211 -1149 -291 -325 421 -961 -303 59 -106 297 -193 -204 -179 171 269
3330 269 568 -331 -374 -678 842 -181 -404 -225 -383 -1165 696 -8 250 -758 -373 -315 -820 374 813
3349 813 277 -737 344 -639 -26 457 -54 5 88 571 987 -126 -94 2 198 -579 -74 -320 -338 -97 -28
3370 -28 382 -309 504 624 -426 -505 100 -232 784 412 -448 342 -493 -77 -819 161 -656 821 868 -180
3390 -180 291 240 -115 -577 263 647 -805 813 523 -717 -913 288 226 92 -212 -825 291 118 -374
3409 -374 -244 368 -504 -454 274 305 -170 -16 -18 -284 111 502 184 472 -198 413 -301 -266 -800 763 -357
3430 -357 -168 491 -159 239 142 -216 -181 790 -11 252 -493 598 863 418 371 39 338 -657 284 325 283
3451 283 315 -140 551 1604 -562 -337 229 -56 -1039 921 123 114 -799 1220 262 -682 320 -1107 440
3470 440 -236 -252 -65 -48 -579 -407 -120 1047 -95 348 1265 320 -608 -319 -434 -384 -161 -855 -312 -130
3490 -130 384 585 84 813 -263 149 10 -319 142 -489 514 -301 -643 -931 -434 -702 633 -378 536
3509 536 -205 -114 -186 -150 234 160 432 4 1550 -575 323 623 -775 -988 793 -519 -139 -513 426 244
3529 244 -247 421 -483 959 -110 184 -61 72 -655 -138 44 -4 -443 343 248 -938 860 718 -480
3548 -480 -1296 -36 -408 -1077 179 467 179 274 -256 -249 763 90 40 880 1023 -1231 25 1243 777
3567 777 -314 215 -128 -444 400 453 182 95 -93 -24 -736 -10 91 584 -502 141 -251 321 -1411 -57
3587 -57 198 668 -732 126 -443 -211 148 402 -179 64 412 -417 147 -186 -586 206 727 -399 737
3606 737 104 634 -1148 507 -903 121 120 -500 173 236 -24 344 607 159 -68 519 -458 -27 121 -56
3626 -56 -72 453 682 729 909 -351 -338 188 98 389 92 -443 236 -793 100 267 494 288 354 -101 1050
3647 1050 259 804 454 -56 159 -23 -818 -440 -95 257 586 -858 -701 -72 -1072 -297 22 301 -499
3666 -499 -150 -622 929 1026 465 330 -686 165 -217 54 560 121 -219 -601 -830 968 -778 545 56
3685 56 -825 38 97 263 207 328 846 211 352 -270 -289 603 448 -524 352 307 -140 -1122 -280 -157 336 -119
3707 -119 -299 612 -537 -225 276 90 -1019 174 269 54 -490 -142 -637 -442 -499 77 -19 364 -241 -311
3727 -311 540 348 303 401 -434 -1416 113 934 -410 474 165 229 471 22 -184 -108 -190 -224 868 -305 242
3748 242 437 -495 1212 -300 -607 -342 -672 -389 -518 240 -836 -136 493 -1214 -443 -237 -307 -411 -354
3767 -354 709 654 -73 322 535 14 -158 -552 1091 -958 -792 378 -324 195 -530 -85 -122 40 -556
3786 -556 453 37 -364 -478 -310 941 101 -2 -358 747 -945 -668 551 -1701 -652 1702 285
3803 285 727 -309 203 -100 -97 569 -686 -641 637 -90 414 379 -200 -394 -648 460 245 294 -615 -847
3823 -847 22 265 -394 -35 14 278 -159 76 704 -785 746 167 -562 126 -249 190 -1183 651 1093
3842 1093 -471 91 -643 1103 455 611 -616 352 594 -481 954 -529 198 -1162 408 -51 -193
3859 -193 781 15 384 -131 160 -904 857 -262 308 -333 -51 -204 -753 110 494 605 -690 123 -305
3878 -305 -140 1103 -419 -687 954 -738 457 249 399 -255 -719 464 -153 -825 -644 -20 81 -283
3896 -283 388 279 -574 31 887 897 -277 -692 -583 749 -265 -265 -570 -792 271 25 -198 -578 254 526
3916 526 111 -275 382 483 29 385 408 80 34 733 214 1014 577 900 209 -347 43 131 -821 156 -797
3937 -797 419 301 969 -298 805 300 151 -98 329 141 -279 294 -340 151 399 -315 191 212 712
3956 712 950 -491 -487 -147 -658 -1130 190 -124 -401 112 -203 -4 -203 -745 145 171 -243 -127 -858 -821 -64
3977 -64 484 1139 80 -361 -794 -346 -505 142 -536 -402 520 298 -149 457 85 40 840 -92 -551 516
3997 516 -389 -364 -553 -267 118 750 939 -429 647 -272 1436 1045 424 -46 -1028 -289 -571 1274 -145
4016 -145 5 -176 -134 549 -330 -129 297 314 410 304 -95 -340 200 -347 439 1006 -352 -54 -112 -97 -464
4037 -464 -235 734 380 -63 -38 -86 763 -142 -73 -148 -394 551 -722 182 469 561 -406 -52 -33 515 -365 149
4059 149 -785 -370 74 480 414 -51 -20 -549 918 923 17 -421 -412 476 -334 -761 230 1185 436 -304 -79 238
4081 238 306 797 -89 163 -156 494 349 -290 -71 734 -294 135 286 -307 -522 -367 840 -21 418 75
4101 75 -310 -434 -479 -440 597 591 -402 -518 -275 48 -905 -424 -278 -355 -328 -642 322 -90 -202 -852 881 724
4123 724 -73 -754 -326 203 -495 294 610 -1327 46 -449 462 484 -242 -298 132 -46 6 470 -299 198
4143 198 98 -801 -419 458 -20 116 -146 -542 417 -181 148 -97 111 558 38 52 1188 -354 1120
4162 1120 206 -145 673 38 755 747 -22 171 -605 945 625 -661 -118 433 -40 864 66 325 52 -1032
4182 -1032 199 -126 -548 -45 821 -946 -165 43 870 413 -4 -280 490 496 -692 202 -76 167 381
4201 381 -360 -84 37 21 -399 90 -455 -789 -580 -657 -241 -984 455 -59 -724 163 388 255 -305 526
4221 526 -263 -894 622 209 382 -703 202 -1 684 323 -170 -531 494 -654 278 139 -347 387 593
4240 593 238 662 479 -602 -255 -269 34 121 192 -118 555 97 416 -609 509 611 148 791 454 389
4260 389 -645 958 -261 -39 209 -44 212 427 1071 404 -455 699 757 -150 -43 -58 -456 249 576
4279 576 1000 -229 -442 510 489 -348 12 -502 -427 -200 -779 -273 -658 298 -712 -850 120 -1378 -920 297
4299 297 666 601 167 169 971 -84 -99 -72 27 -878 -420 191 372 447 -148 -425 549 -198 -107 -416 -309 187
4321 187 -760 -486 998 -106 685 -7 303 -874 -61 9 299 -275 19 -136 -32 825 480 -140 618
4340 618 906 322 1025 223 -639 178 304 -665 -1411 135 273 -1409 -186 586 505 -34 558 293 3
4359 3 -1130 359 -662 337 -16 314 188 755 795 -212 -1099 -359 321 76 315 -18 -294 760 383
4378 383 -545 -420 998 802 465 -660 -1095 -430 -82 598 191 292 -363 107 570 -227 1307 238 927
4397 927 618 19 -154 257 -278 73 615 -178 -324 78 -1098 290 204 -822 -299 319 189 -599 906
4416 906 -925 368 -637 953 -1021 -665 668 180 409 933 733 -189 153 -24 -403 -656 1132 -233
4434 -233 -40 -143 900 459 359 -937 -156 -683 686 -199 -1181 508 -557 -324 -994 353 -9 232
4452 232 -259 -244 -389 -1511 300 -322 -331 -792 220 553 -179 -626 -175 -310 345 552 -733 -381 -28 -312
4472 -312 -324 309 -472 -318 26 -757 -1111 -801 -405 824 -249 43 239 -469 -403 294 424 -271 235 -378
4492 -378 312 -114 -592 827 -472 51 919 -516 15 637 -146 748 531 -879 336 -591 -644 -690 -762
4511 -762 -707 3 198 -545 405 -268 84 225 -45 -716 393 201 358 -936 70 -1501 -184 462 -484
4530 -484 -865 -815 282 -118 786 -391 53 -1027 -234 1022 235 715 239 292 -774 136 277 22 764
4549 764 177 446 226 -240 529 -22 128 732 88 205 77 59 -801 -271 -202 696 1038 -135 470 -280
4569 -280 726 304 415 660 -55 -685 -1065 -535 142 -7 184 -74 871 -448 -281 -745 429 -220 -105
4588 -105 -356 -153 -152 -872 -87 423 -902 -61 -1319 473 -638 167 15 283 -299 -898 -178 -127 208 -204
4608 -204 649 540 143 660 -405 -67 526 391 -256 181 -954 0 839 1132 -1038 -818 931 -53 -1013
4627 -1013 -582 679 -699 -1114 873 -467 431 -90 -592 -466 -598 -142 509 261 -767 -301 582 -94
4645 -94 -460 126 -34 -420 440 148 -373 1187 -256 39 690 103 -461 -433 -56 94 148 158 -500 -125 -797
4666 -797 89 -188 187 -371 -283 -742 400 -305 602 -204 -750 54 -108 847 -178 552 317 -904 -437
4685 -437 -298 -1168 -320 -459 349 -1478 -284 -88 -542 -1261 -1009 112 -182 -360 328 471 770 317 -952
4704 -952 -381 208 -13 -440 -74 -881 47 -139 235 -795 -33 -984 280 -363 -68 -187 -367 671 -274
4723 -274 -532 -173 -69 41 -17 -390 -493 424 -408 -284 -782 -139 91 -504 -553 -137 -571 837 171 803
4743 803 545 151 678 -236 -315 -20 668 -390 251 -485 435 -513 472 -1356 123 1643 927 281 -378
4762 -378 -439 -272 -415 -97 -788 -27 410 698 -684 -67 732 -628 -142 -883 -956 344 -160 718 229 645
4782 645 -1087 589 135 -362 -441 217 -570 109 904 -125 296 762 -479 -794 -17 -522 699 250 436
4801 436 -669 453 -196 -1104 384 -700 190 529 -565 96 -6 -499 142 7 -169 -299 825 46
4819 46 691 -79 -295 -305 -679 -384 827 501 521 -85 115 -451 -352 -294 191 -412 508 544 182 867 194 143
4841 143 125 303 172 -185 354 554 593 363 1055 -398 -542 65 -79 236 -412 445 1078 103 327 315 678
4862 678 -380 -963 192 -1056 380 392 615 239 456 951 -824 326 -4 187 589 -199 -1418 77
4880 77 621 -539 -4 721 186 227 13 168 -595 -86 -512 -235 -135 -434 -265 736 -165 27 -457 183
4900 183 -27 503 522 203 -650 -711 -829 -803 694 -931 827 973 465 -378 2 -387 -573 -214 718 142
4920 142 -133 265 -802 510 -757 503 266 -978 809 589 -112 281 -229 -286 239 744 -208 48
4938 48 -103 -371 -140 -243 -1232 441 184 -509 -466 904 -334 -158 587 -236 -33 234 204 -164 -164 -39 -165
4959 -165 -273 163 -557 1649 -3 -631 -55 322 -233 201 594 -415 402 760 -75 133 125 -271 -102 -112
4979 -112 371 -464 -175 -267 -768 -710 638 336 310 984 1244 -99 -39 -654 968 34 -79 -618 556 -459
4999 -459 -620 1053 -58 -90 -231 706 -80 68 -625 376 -247 -1299 474 87 -302 803 -443 -610
5017 -610 -259 -98 -479 392 -713 224 187 690 -387 -320 1283 590 -235 -1104 -548 -177 -177 476 288 -1004
5037 -1004 -227 428 1042 274 21 -42 -803 -490 665 -1136 830 539 27 -210 -853 -623 -245 -391 -346
5056 -346 -275 230 965 112 235 -415 -631 66 354 -485 -169 -116 293 629 -78 91 -9 -395 264 1057 -476
5077 -476 1082 502 1126 -599 560 801 177 738 -696 -94 675 -640 -503 -514 342 523 -222 -722 -375
5096 -375 -322 -626 -1013 -472 -468 -509 -174 -831 -588 553 161 -873 270 58 589 -77 -485 -739 -145 586
5116 586 -477 -1123 623 319 1069 559 1572 46 533 40 215 -204 -272 -579 -172 -164 -203 -384 576 -528
5136 -528 782 -578 -363 -376 -294 394 134 459 102 -198 -749 18 -131 546 -617 -1455 239 921 217
5155 217 425 -294 188 127 -961 -693 746 634 304 221 1011 -134 -652 -330 865 1043 -847 -1127 529
5174 529 137 78 -575 248 279 185 982 -597 1207 198 -520 391 251 -134 134 -569 -269 394 -960 -158
5194 -158 -517 28 679 -431 -653 -223 -300 -122 -19 -95 -14 389 -586 196 111 -905 686 -77 329 -184
5214 -184 502 -740 -287 -1317 208 -5 -580 -344 -217 -453 232 265 -170 -352 -237 566 384 360 -43 268
5234 268 -668 -274 -564 296 -945 -893 308 -641 188 -153 233 -210 21 370 -911 34 524 52 -444
5253 -444 -502 552 295 169 -134 -298 225 60 -424 -248 397 422 -690 -426 -1021 -157 -525 -138 3 158
5273 158 -542 69 -231 274 369 -607 875 922 -604 -245 -247 -366 54 444 552 -302 449 -545 579 -82
5293 -82 489 162 340 -452 -426 -61 -164 231 -153 -495 -418 675 1087 345 785 -343 148 -224 456 -4
5313 -4 -310 907 85 -123 -971 -59 -641 -713 797 332 -1011 -708 -328 -119 -41 440 -570 581 704 -126
5333 -126 145 391 -1465 23 -43 479 -211 17 756 148 700 322 -60 -921 187 -368 1352 144 1021
5352 1021 -955 218 112 -674 -138 209 652 -1093 649 42 164 181 1168 -48 794 165 -129 -741
5370 -741 -284 682 -621 -333 126 72 376 134 -819 -310 345 -854 -332 756 -354 101 160 252 720 -524
5390 -524 -482 -172 -20 344 22 -275 -126 92 -58 546 -24 -598 -65 929 794 -421 -556 518 849 -635
5410 -635 216 225 692 -566 416 -227 23 657 63 24 -388 286 288 80 -1229 748 542 74 69 246 47
5431 47 -139 213 235 97 417 159 781 805 -183 518 621 280 248 487 -184 -9 -560 -314 300 324 389 -317
5453 -317 442 421 -804 699 577 460 109 414 -292 294 34 183 -341 -102 207 384 409 -366 -454 200
5473 200 1035 -45 -515 430 -54 -113 -700 -179 553 45 -422 433 126 83 25 1055 168 -40 -225 252
5493 252 -69 730 -295 -480 561 475 957 -134 383 -261 30 0 -180 -301 284 -165 -1010 539 177
5512 177 -924 -117 48 -246 131 328 313 -38 367 -638 50 -8 672 213 332 -709 -634 590 -269 -140
5532 -140 -90 -759 242 340 -484 421 -192 -699 284 -482 938 182 128 791 616 969 -301 164 -267 730
5552 730 696 -460 887 1130 1006 472 -316 368 -811 125 951 735 -124 162 475 -218 -502 472 -231
5571 -231 -208 1035 -366 708 531 566 662 -392 -221 -268 1109 105 78 306 434 -302 629 741 -671
5590 -671 -340 -164 -206 112 -413 374 36 -688 -398 -206 17 -833 764 -30 -174 -658 111 276 439 336
5610 336 -852 954 -1053 -792 276 -789 490 -207 -1049 61 475 -403 349 -286 16 -406 -1449
5627 -1449 374 12 -63 -505 139 269 360 435 313 812 94 104 -314 -310 590 557 -324 -425 707 549 82
5648 82 -118 482 218 946 341 423 148 821 1443 -337 65 -224 349 -297 -94 474 -414 -1174 -209 -21
5668 -21 -287 -174 -709 161 -743 -935 635 667 79 -850 -274 975 -934 472 -556 -754 -362 -474 -563
5687 -563 -616 760 -110 -382 -184 -731 332 39 7 126 -485 1059 419 156 607 290 -595 -1333 396
5706 396 -182 262 -35 -901 800 -308 -74 1160 34 319 -394 -360 96 -286 218 -22 585 105 762
5725 762 994 740 34 -403 -224 706 137 -466 41 239 28 -235 -840 -707 395 -696 397 -283 584
5744 584 -126 48 -193 367 -1006 -406 327 84 687 -451 -295 -116 -596 358 577 499 31 -918 610
5763 610 905 187 304 -917 907 476 -278 -436 -6 223 325 872 -342 98 411 106 499 587 -427
5782 -427 154 -60 845 291 792 -566 -387 -222 -116 400 168 690 -559 -269 -446 -10 -128 636 681 96
5802 96 -133 760 305 -68 -296 277 -704 -96 342 581 -67 -477 471 -574 423 424 765 -1057 -85 816
5822 816 -280 39 184 727 -579 -241 1144 -178 59 -198 694 688 309 -41 561 338 342 451 207 -891
5842 -891 169 -807 8 -333 32 198 142 -355 326 23 326 756 -814 -410 -206 -18 -143 179 569 86
5862 86 1038 744 112 -58 -143 190 -250 27 -874 298 655 205 243 331 -997 798 -516 -200 -77 -348
5882 -348 -342 -48 434 375 895 -564 80 -72 466 1066 -762 -675 288 -745 -352 -298 -141 360 -6 424 -100
5903 -100 414 131 -326 -608 -479 -559 -251 -313 468 661 173 1574 -284 -1116 -97 493 471 -170 240 -313
5923 -313 681 50 -245 -32 105 -361 -275 135 -250 236 517 384 511 182 278 38 18 131 332 483 -947
5944 -947 -1022 280 1056 -1213 -328 -422 541 285 1095 347 206 -417 -471 543 -812 763 -706 499 -524
5963 -524 -318 -545 -118 708 -107 474 309 -81 137 -732 -314 56 -704 204 301 392 -800 5 -78 551 43
5984 43 40 6 416 -534 595 -197 -81 -191 -135 -147 19 -706 411 -51 183 198 -159 140 429 -174 275 941
6006 941 -87 -19 -58 472 283 188 -23 -48 -1022 -222 -144 -579 438 -502 -165 509 -56 -21 -512 571 -698
6027 -698 -610 228 -37 -171 -167 -165 499 -573 -606 -724 577 -210 -253 271 488 602 -584 -100 -121 -32 -452 -368
6049 -368 -126 -60 -544 -732 -577 -221 -260 455 -258 -249 -1 -50 585 190 -336 558 -35 35 295 128 -1510 3
6071 3 160 363 -909 -675 -132 -44 -698 -1057 671 -10 -609 -613 -225 532 839 -414 -243 -900 37 -40 799
6092 799 -537 -233 63 -459 867 -121 264 -932 -161 -233 484 66 175 -598 -235 -49 955 643 -1325
6111 -1325 -1232 717 -849 -623 1058 -426 162 496 -329 -469 280 199 364 316 -444 -63 -238 189 -291
6130 -291 -687 390 -236 -40 429 -464 -116 -877 622 -141 -149 -362 227 293 -496 -74 57 -62 -940 -129
6150 -129 83 -812 6 -73 588 1278 -5 1078 -386 -114 17 660 -875 443 889 739 -497 155
6168 155 -910 -374 -887 639 54 -192 347 -12 265 187 5 523 67 -500 855 -171 285 -1126 624
6187 624 -362 62 -238 -553 -144 535 -299 -188 -15 789 -50 -40 228 698 423 -300 1288 -218 198 -714
6207 -714 426 -332 289 -165 -17 -115 278 -2 -119 6 496 -34 -18 307 513 -575 1486 144 704
6226 704 -491 337 192 -123 -773 -622 271 321 -577 -71 -327 55 -282 1037 72 -1087 162 -714 212
6245 212 155 -32 39 -18 171 -73 1353 430 -467 -900 155 -40 619 -657 365 -442 605 -257 968
6264 968 -517 -110 106 -925 207 405 -240 -1270 188 167 -274 453 -1275 -296 -620 -873 -483 316
6282 316 116 -61 -829 317 -115 -145 385 -927 -235 -543 447 175 153 432 555 192 -177 -420 181 -578
6302 -578 902 726 -134 66 -519 110 -371 -414 -391 294 318 525 613 -801 -641 87 203 373 -1352 407
6322 407 599 -583 1290 237 704 -1272 -595 90 339 1242 963 -198 1139 -190 -1002 687 -29
6339 -29 179 342 -313 861 -926 -97 90 864 203 -233 -817 -1086 -725 269 279 -298 -381 -446 -407 383 450
6360 450 -516 -191 -501 338 78 -671 164 -162 -227 -43 -758 -670 -327 -121 1263 225 334 124 -83 -407
6380 -407 52 611 242 -342 -572 137 211 -716 -3 560 -62 205 -346 -662 132 -282 -595 231 -495 919
6400 919 -180 -1705 171 1292 -394 -279 186 -517 -470 -149 487 320 -217 280 -589 84 -139 301 -691
6419 -691 -954 677 593 -157 -400 -231 -1342 73 527 292 -141 599 699 713 207 138 282 -1503 402
6438 402 956 -794 168 406 -251 854 -128 127 302 19 1 265 -433 7 -173 -437 -28 504 -943
6457 -943 796 349 298 709 -868 -155 667 165 -709 71 -184 -12 -427 810 87 437 238 264 162 130
6477 130 602 -116 -658 155 -174 -691 273 823 -179 409 944 -608 45 -286 420 501 -358 216 -448 1109
6497 1109 -204 78 598 881 -621 -395 -952 -65 -188 -800 426 663 188 421 -426 -117 -120 252 600
6516 600 292 -716 -563 970 253 -2 421 -514 251 334 373 99 337 176 -63 87 -1266 -311 -744 -206
6536 -206 -381 330 -248 15 722 400 408 -120 617 -554 -205 -380 140 -442 31 254 121 308 913 233
6556 233 -972 -536 -688 -248 201 -736 1222 -88 -164 152 324 -557 190 64 -940 149 -1447 604
6574 604 130 372 -507 805 67 34 -148 -381 -1203 43 -437 -469 542 -471 -85 -183 -1351 -235 632
6593 632 -555 419 34 264 333 544 115 409 710 246 -293 -157 26 902 431 331 -1157 673 888
6612 888 737 -142 195 213 103 -536 -209 -169 500 523 -672 -893 181 900 -372 129 818 1029 -540 197
6632 197 -359 -734 -1170 187 769 768 -318 -1161 435 327 -34 252 429 -114 556 -53 835 -505 -443 -570
6652 -570 -398 225 -155 -244 535 -704 -634 -50 681 848 391 -574 -750 695 -997 -90 -148 -852 988 295
6672 295 251 -738 34 -113 -467 110 624 -300 -153 -539 179 104 -54 -661 219 -1072 -772 181 268 85 261
6693 261 197 -550 183 660 -596 -446 57 19 332 -146 364 321 241 602 113 579 480 -1025 -346 -245 -322
6714 -322 -240 330 239 -148 -138 -940 206 347 -339 319 362 -307 -1192 -69 358 -85 -635 588 389 626
6734 626 -631 -252 289 -133 -20 799 -194 142 -742 -188 103 102 757 -228 882 319 -230 -43 792 12
6754 12 -521 -406 1022 160 -102 514 29 603 -451 51 -37 242 857 -160 375 -410 824 -85 80
6773 80 -84 394 750 -44 867 -1074 -421 598 65 -1104 -33 251 -10 48 -740 -509 -178 779 153
6792 153 -607 -249 42 -913 140 -366 -65 -307 806 -540 -663 333 49 540 -105 -220 118 702 -671
6811 -671 41 -106 353 634 -200 51 -35 -413 389 131 -153 218 -200 380 231 -223 941 250 235 307 -601
6832 -601 -894 -424 205 -737 -636 310 660 196 -56 -179 594 524 606 284 -501 286 -564 -295 774 540
6852 540 974 1030 1182 173 211 -337 -141 -262 294 143 -293 -212 91 -627 -28 -290 42 -1023 479 -569
6872 -569 182 202 -433 331 -847 -847 350 -233 -144 76 -740 245 714 -791 -33 512 -261 372 174 230 71
6893 71 -105 -569 269 -679 496 23 1145 203 -305 561 -65 439 -61 709 -292 205 -155 -566 590
6912 590 -1229 1426 -27 -702 -279 -326 -159 -430 505 182 675 -133 -470 614 366 -210 94 325 336
6931 336 33 -230 186 1695 -143 786 22 752 223 -222 454 629 94 -141 52 -71 918 672 126
6950 126 30 -277 -499 724 384 -505 153 -1049 -372 1581 31 -433 196 913 65 403 -511 -588 297
6969 297 -884 -6 296 -587 -892 -289 -903 -234 124 -351 -355 -722 431 291 413 180 -150 -201 706 431
6989 431 427 -42 -611 172 -287 590 773 -384 -119 397 -909 -378 250 450 -576 -144 -555 491 -665
7008 -665 -390 232 511 557 1172 1134 777 440 -172 -22 -492 -170 -62 119 205 -895 -522 -441 -1087 57 -627
7029 -627 988 765 -11 -1309 -488 -712 -34 422 -547 -469 -1201 -750 -162 -539 -635 -832 -369 -114 556 770
7049 770 -258 -10 297 -57 172 -164 310 -66 -449 779 386 53 -487 34 -1159 203 -668 283 870
7068 870 -128 -722 -22 980 -183 383 -1149 -496 -78 430 42 -551 -704 -712 -446 167 46 -378 529 -800
7088 -800 -66 -575 -554 155 48 245 -97 7 -312 337 479 -115 245 488 244 353 249 835 -140 654
7108 654 -1028 -413 106 201 450 -372 -293 119 -441 143 -210 -590 524 233 -1108 630 430 -302 208
7127 208 -622 761 -223 305 1241 -656 527 -223 344 408 -434 191 611 716 -79 -179 16 53 391 -450
7147 -450 -914 19 1028 -969 492 -1141 126 -553 757 682 -84 275 479 -430 -267 885 518 34
7165 34 157 31 573 -360 -23 517 817 36 754 122 658 643 564 317 257 136 -284 274 1673 541 -203
7186 -203 760 523 -46 -288 -204 62 -582 923 521 -92 392 -511 -205 -425 -461 -540 -147 -164 531 73 -177
7207 -177 -597 31 -382 23 620 343 -384 406 -273 900 943 -186 834 163 875 -64 44 1243 -167
7226 -167 -270 572 -392 -662 -197 -103 -301 903 188 376 704 -5 -232 -766 -448 734 133 -531 208 -178
7246 -178 72 -228 -75 973 -695 -129 -108 740 -135 -722 295 1049 -1051 293 -190 172 -854 38
7264 38 23 644 -85 -823 -329 83 641 -147 78 -130 676 -348 930 -414 -489 -89 73 -89 39 -575
7284 -575 858 500 -252 154 -213 419 37 -219 421 -350 -630 -189 156 -163 296 304 -186 -165 357 394 -12
7305 -12 -305 715 -727 703 72 -67 -204 131 -92 -252 69 1281 622 310 -476 -957 777 -427
7323 -427 -734 -347 -79 -167 -492 -510 30 53 -430 -309 603 -483 -490 94 -382 87 -118 143 238 -647 230 526
7345 526 -537 -568 288 -9 598 -391 168 591 -573 -987 111 682 -127 -71 -329 952 175 -549 335
7364 335 -29 -701 -111 -370 380 -90 -33 -377 900 469 628 -144 -179 -2 380 880 -550 -320 -421 70
7384 70 -884 274 -215 -339 253 780 154 202 4 656 -1020 -765 557 -150 -1598 762 974 -204 532
7403 532 349 -129 -73 68 1040 -652 -759 608 191 -554 544 -1254 777 -298 431 297 302 -68 481
7422 481 9 -503 -15 -955 680 -552 391 -277 214 19 355 459 -839 -66 127 -140 -441 476 -1113
7441 -1113 143 459 -1067 8 287 -513 -22 60 672 929 -209 -601 -44 286 -4 -367 755 743 155
7460 155 -82 -304 358 805 270 -639 -445 -486 758 -829 26 -20 162 358 -719 -604 -38 -117 563 37
7480 37 362 79 257 -320 246 -529 -401 -365 -558 -355 104 -607 209 -168 131 -649 -754 148 246 -72 42
7501 42 -249 -121 684 -109 -601 386 -888 -146 -508 -261 -1205 -293 850 702 527 -298 729 -265 -985
7520 -985 -556 -52 -61 382 -459 810 208 896 -376 614 -914 490 99 -294 -271 -779 166 624 -175 -724
7540 -724 -502 976 -218 100 -555 -858 124 -434 39 514 299 673 807 462 45 294 553 479 20 246
7560 246 -16 498 -576 -600 194 574 -454 -75 -210 -538 -558 -116 568 619 267 -957 828 -112 -410 592
7580 592 76 -1349 -867 -268 352 -288 546 -835 -41 484 -304 -374 188 -238 -512 358 -164 309 43 -179
7600 -179 -29 -610 192 -302 231 237 -881 -467 777 -704 -616 -190 145 -474 184 312 -276 -10 456 -16
7620 -16 -321 -499 -26 -591 -1386 54 295 91 -87 -851 -580 -99 75 261 582 -364 760 -112 1132
7639 1132 594 226 -552 741 -483 -230 487 900 8 -615 85 695 754 360 -809 855 -297 -96
7657 -96 -474 175 -148 77 -124 362 544 -736 278 -453 -51 -115 102 756 -346 -234 54 -774 -3 113
7677 113 -327 -503 -395 314 79 -167 -57 -656 -351 -742 72 -593 -420 246 336 53 -843 576 40 -577
7697 -577 130 719 396 490 -387 -1027 -236 516 747 460 -97 72 -644 -65 -506 273 630 98 -741 -86
7717 -86 -31 -41 803 670 120 -26 1034 -142 -385 468 141 -10 -22 577 4 301 -426 321 453 28 -914
7738 -914 -1687 -386 278 405 634 -428 578 280 8 -758 -346 568 541 898 -879 303 -848 -130
7756 -130 167 -301 -55 -314 230 -263 344 167 -1051 130 164 174 -267 867 30 400 427 469 -565 -498
7776 -498 -851 -180 325 -447 -90 218 -359 826 -951 -255 918 -409 101 -784 -595 144 -716 186 -952
7795 -952 189 -285 176 515 929 -257 -52 432 -249 274 -744 576 -756 -367 18 671 -208 -211 -198
7814 -198 -794 474 138 -133 -59 108 -262 -109 -1338 -488 247 -652 -51 971 240 -1419 343 -68 -377
7833 -377 -221 84 259 -259 433 540 -414 312 -959 150 430 135 -325 1087 818 87 -205 416 500
7852 500 99 -88 -113 328 -1168 -102 406 -320 -328 -991 -356 228 541 239 -261 -734 313 261 -317 130
7872 130 -321 1081 284 -625 -491 -210 122 147 196 58 -339 -380 411 165 -138 180 -648 1085 -374 -574
7892 -574 239 -100 -192 565 -114 24 -39 541 553 -808 69 -155 -357 -84 112 -645 132 359 497 -559
7912 -559 -74 246 101 -237 292 -369 950 -362 552 -82 122 624 -571 265 499 114 403 92 560
7931 560 -195 477 222 74 301 524 660 127 372 -1090 471 -667 550 310 -737 274 -110 -439
7949 -439 41 -325 -1010 303 139 -33 -84 -235 -55 -857 -511 -5 -141 -616 -57 80 330 6 -708 -446
7969 -446 3 61 832 -703 -86 -783 -1332 445 -57 174 228 -123 -452 692 -450 -150 650 -144 579
7988 579 283 224 -9 -7 1003 -657 -1231 282 -444 438 500 656 -293 445 182 -203 -60 -494 -822 369
8008 369 1126 352 363 -958 515 -831 -66 -337 -1 -589 -482 -628 139 -500 54 -800 280 776 -559
8027 -559 178 -771 -283 286 268 -33 1090 -1145 -105 -496 -179 324 -365 189 -876 187 341 665 524
8046 524 -196 372 227 17 -819 -30 -482 -214 37 -647 -329 60 -637 378 -55 -160 69 267 -192 154
8066 154 305 -23 -712 690 -618 266 -61 -192 -462 -61 -256 153 -86 -104 875 -810 112 -137 -64 -495
8086 -495 620 728 218 1153 165 363 -121 44 -72 -1259 -27 -462 8 -219 -588 102 547 283 451
8105 451 142 37 -368 42 282 1028 -74 730 -387 335 -1032 186 275 661 374 -1069 -854 605
8123 605 683 -23 417 -180 220 697 542 -46 1223 443 139 -20 -161 -2 467 382 -879 1039 -162
8142 -162 -76 768 -421 192 412 -210 888 -112 -789 -773 -56 75 292 -212 -25 31 -163 463 -186 473
8162 473 515 -1 -355 335 -157 -227 -77 -460 -1223 -1325 -472 -1073 138 -330 -35 25 -972 415 -34 -674
8182 -674 -1415 -537 -328 -303 111 -415 646 -865 -453
8191d53
$$ Imaginary data points
##PAGE= N=2
##DATA TABLE= (X++(I..I)), XYDATA
0 0 0 0 0 0 0 0 0 0 0 0 0 0 0 0 124 -124 124 -124 124 -170 248 -248 309 -372 422 -496 619 -638 746 -868
30 -868 993 -1124 1295 -1483 1647 -1863 2093 -2338 2607 -2900 3226 -3571 3971 -4392 4847 -5352
46 -5352 5900 -6510 7168 -7893 8694 -9581 10575 -11664 12906 -14315 15913 -17759
58 -17759 19937 -22524 25663 -29560 34551 -41195 50484 -64394 87454 -132269 250531
69 250531 -1205164 -2314371 1929049 1645720 -1260790 -423995 1212889 -222182 -608342
78 -608342 612480 434875 -436009 76342 264709 -528769 -382732 952479 806408 -685145
88 -685145 -509666 1012283 428135 -1210113 -393057 1332235 412861 -1179917 -239404
97 -239404 1130089 171185 -747593 316615 781732 -355001 -463405 176413 -430052 -501588
107 -501588 823893 457426 -1010777 -57162 1220505 -291626 -1197695 682019 1201431
116 1201431 -817349 -1143951 560097 568688 -791564 -495270 643607 334323 -354302
125 -354302 8275 191032 -238236 19088 387904 -313887 -579586 465572 554198 -695150
135 -695150 -502772 947850 567715 -945358 -466810 880816 216660 -909949 -68575
144 -68575 799527 -98878 -618124 247491 453824 -135893 70785 309868 -294786 -216933
154 -216933 562503 31555 -887781 -1406 938395 -155634 -916982 363920 925715 -395184
164 -395184 -707689 520450 547697 -538014 -380681 415588 116288 -314135 55783 84296
174 84296 -282849 86967 408094 -269134 -465380 433491 415582 -677029 -460193 760565
184 760565 435274 -740987 -296916 747577 200892 -646887 -66114 492435 -109058 -383648
194 -383648 135610 104052 -241635 108399 266430 -276578 -136559 538195 74878 -656018
204 -656018 87988 778962 -183955 -792173 231802 646222 -353349 -533934 393167 406469
214 406469 -339942 -219636 259445 38607 -130084 167824 43851 -275637 98670 359928
224 359928 -240056 -392447 389958 406894 -498355 -378137 553904 275615 -620581 -204163
234 -204163 602062 112927 -517804 -15440 380273 -58147 -160995 172206 -17845 -224573
244 -224573 167470 166850 -372316 -131113 483825 24305 -579986 65685 605419 -136780
254 -136780 -532052 255243 487428 -282178 -379409 273303 234931 -256457 -118605 163908
264 163908 -37938 -95525 133782 -22689 -224308 153526 314265 -251620 -357033 331219
274 331219 357493 -379408 -293781 436867 227311 -448917 -138290 428788 52363 -361636
284 -361636 20867 231399 -115599 -112787 149299 -32793 -135574 215317 137834 -333978
294 -333978 -79538 440420 17252 -489462 48296 469006 -144722 -449436 184775 372356
304 372356 -190344 -236999 215960 136893 -176624 -8335 146351 -75801 -70733 145105 -44176
315 -44176 -233563 122020 273002 -208564 -287569 283351 269471 -350370 -247647 367408
325 367408 188396 -352439 -103202 309075 9370 -236622 77501 149622 -125247 -30114
335 -30114 138282 -123316 -166722 210416 113379 -303264 -48175 367820 -16126 -376700
345 -376700 97991 380836 -130670 -320500 151590 228206 -178689 -159670 149635 65284
355 65284 -108157 30052 68532 -108783 -13490 185701 -19084 -204660 97106 225876
365 225876 -176063 -244706 227341 227095 -258036 -162727 293573 101134 -292924 -42403 245566
376 245566 -22190 -159323 89369 68771 -123152 37179 140261 -122427 -108888 214045
386 214045 75371 -282325 -51550 278480 -22257 -290741 59621 253141 -104322 -209241
396 -209241 140307 172865 -125520 -98737 113006 14575 -113385 31342 62083 -102001 -15901
407 -15901 159634 -42353 -211135 88910 225524 -135623 -197442 199881 167768 -233702
417 -233702 -124538 225042 51085 -197481 30193 170082 -68241 -103183 92927 13858
427 13858 -122079 52158 114316 -110597 -76720 186553 62782 -208846 -13850 239960
437 239960 -8311 -220455 46984 187895 -85926 -157405 94966 98295 -100634 -35301 108912
448 108912 -4002 -78180 66111 53485 -114844 -29107 127927 -44477 -169557 86928
458 86928 175681 -126382 -156900 144422 92758 -186439 -62266 181558 25786 -141132 22238
469 22238 84847 -82639 -49681 110519 16255 -95533 54278 86899 -124945 -97624 138622
480 138622 56269 -155140 1612 179617 -30459 -161700 69031 152079 -67151 -99373
490 -99373 79529 47760 -93126 -10447 90861 -19428 -62887 67276 33888 -107980 6289
501 6289 151490 -20283 -137583 62721 109097 -124371 -97240 148817 80005 -128589 -27703
512 -27703 109859 -38743 -123480 44278 81263 -59140 -24726 75892 -35441 -98600 73324
523 73324 96626 -94367 -60550 117203 14170 -144491 1729 126306 -38535 -117643 47792
534 47792 83534 -65558 -51597 88043 40360 -74129 -3563 57324 -50397 -47982 93633
545 93633 47554 -94757 -231 100748 -50118 -107040 86095 108373 -85784 -70812 91646
556 91646 26239 -99453 9229 102640 -21167 -70772 52622 38382 -81110 -12100 83483
567 83483 -28780 -81859 56562 60615 -82089 -29113 108532 17164 -104844 856 83018
578 83018 -33263 -72343 52120 59338 -69854 -51515 57598 5988 -64755 33937 72731
589 72731 -55572 -57068 67146 19390 -83936 15429 94160 -37675 -79293 62780 58642
600 58642 -79495 -36605 86380 12861 -83101 10728 66188 -36764 -37482 71087 28053 -71819
612 -71819 137 69392 -25625 -52605 53517 32807 -77075 -27494 72797 6891 -66266
623 -66266 17785 66712 -30032 -56812 40903 38135 -55872 -17264 64706 -3766 -63830 24322
635 24322 47332 -51993 -29419 69017 6270 -76530 12094 70736 -31037 -54731 51608 39335
647 39335 -62279 -15139 73157 671 -64357 20714 46253 -47640 -34539 54712 10385 -57343
659 -57343 12914 56422 -28753 -40887 47818 31093 -51802 -15148 53537 -4394 -56309 15267
671 15267 51081 -28410 -38492 42598 21381 -53970 -1669 58859 -13442 -50725 29077 35056
683 35056 -45302 -13483 57435 -1435 -60654 13559 47272 -33799 -38617 44417 20496 -53569
695 -53569 -4432 54143 -11721 -43832 35014 39878 -38625 -19123 43607 -2359 -46113 15774
707 15774 40907 -28913 -36422 32068 20722 -36059 -1756 44957 -7874 -44791 19663 38404
719 38404 -28558 -24034 39851 8014 -46618 3803 41778 -21594 -35597 32021 21178 -44213
731 -44213 -11138 41921 -5314 -36945 22066 34022 -31758 -26274 36379 10388 -40241 5215
743 5215 36075 -22166 -35259 28326 24870 -31655 -8352 38727 -3749 -35535 17196 33729
755 33729 -22974 -21786 30726 8830 -38005 -555 35607 -12646 -29639 24283 22566 -33468
767 -33468 -15733 35569 3274 -31933 12796 29418 -23397 -24176 29162 16089 -31730 -2807
779 -2807 29669 -12349 -31483 20694 23503 -27048 -13172 31256 1869 -32094 9909 28662
791 28662 -17001 -21846 21116 8685 -32614 -3899 29918 -5374 -23778 14832 18497 -25665
803 -25665 -12374 30479 8647 -25351 7096 25308 -16099 -24032 19945 15340 -24918 -5297
815 -5297 26793 -5357 -26257 13544 21239 -20335 -10969 26743 4415 -26625 6057 26637 -13117
828 -13117 -22616 18930 11232 -25335 -6018 26660 -3002 -23212 9331 15953 -16485 -11136 24208
841 24208 6901 -20454 4106 20151 -12503 -19730 16110 14445 -20044 -4886 21795 -2970
853 -2970 -25485 6492 19194 -12950 -10657 20517 7791 -20640 545 18749 -10508 -17326 14853
866 14853 11640 -20675 -4089 21725 -2615 -21874 8441 17515 -14510 -11684 20709 8618 -17713
879 -17713 -495 16659 -8296 -16223 11899 11604 -13398 -2995 14996 -4331 -20367 5280 15831
892 15831 -10432 -9228 18679 7729 -20002 -3833 19074 -4133 -16983 10533 13022 -14088
904 -14088 -8803 13729 507 -15399 6285 15575 -10319 -8973 16928 5774 -19105 469 17978
917 17978 -8398 -16738 13892 12418 -14801 -7112 14797 -1204 -16899 3414 13344 -4570 -5961
930 -5961 11656 3847 -14389 -1594 12342 -4747 -11117 12583 10779 -16069 -9357 14635 -88
943 -88 -16576 5865 18723 -7109 -11194 11724 6239 -11869 -801 13614 -3708 -9932 7274
956 7274 6092 -12319 -5061 13269 -1558 -15930 7132 15079 -8864 -9634 13366 6185 -14313
969 -14313 -4251 11213 -143 -7776 6013 8687 -8750 -7155 7574 414 -9289 6605 13484
982 13484 -9514 -10163 12002 4126 -16863 -187 17905 -2179 -13440 4509 7248 -10376 -6582
995 -6582 8997 4142 -7667 976 8803 -4952 -6065 10442 2433 -13041 -1218 12599 -5507
1008 -5507 -13297 7586 10652 -10602 -6450 11443 3837 -8715 670 10476 -1918 -8581 3764
1021 3764 2412 -8742 85 11988 -2977 -10768 6917 6414 -14455 -4244 15308 436 -11997
1034 -11997 3544 10494 -5106 -9494 6648 4841 -6242 -1356 7032 -2139 -8092 3508 5013
1047 5013 -6673 -3362 10262 -188 -11037 6533 13144 -6821 -9355 8821 4765 -9992 -3970
1060 -3970 10163 -311 -9934 2529 7097 -6144 -5906 8099 214 -8407 4577 7965 -9221
1073 -9221 -8290 12824 4013 -11316 931 10846 -4724 -10132 5851 8300 -4390 -5371 5931 3847
1087 3847 -5296 1367 4818 -2273 -4857 7959 4157 -10166 -1496 9641 -4427 -11142 6346 8239
1101 8239 -9635 -6315 10144 3880 -9266 -577 9273 -2950 -7815 5930 4353 -8646 -1602
1114 -1602 8469 -3105 -8153 8307 6930 -11235 -3372 12203 149 -10710 2082 8452 -4795
1127 -4795 -5421 6819 5995 -7211 -4085 6527 139 -5938 3219 4950 -6543 -4558 10281 1124
1141 1124 -10949 1543 10702 -4554 -7747 6459 5466 -10870 -4929 10133 800 -11302 1470
1154 1470 8039 -6041 -4632 10474 2024 -10061 2953 9567 -5732 -7092 9090 3056 -11280
1167 -11280 1361 12496 -1714 -9801 4172 7424 -5146 -5947 6736 3427 -8482 581 9100
1180 9100 -3307 -7752 5576 4641 -8819 -2410 8678 -3580 -11676 4412 10237 -6786 -7411 9228
1194 9228 4042 -9745 477 11368 -1581 -8701 4741 5774 -7855 -2637 10056 -1900 -11072
1207 -11072 4361 8845 -6976 -6618 9335 2120 -9366 1615 10651 -4798 -9970 6030 6422
1220 6422 -7456 -4541 6905 -95 -9770 3177 9041 -4456 -7820 7728 3808 -9010 269
1233 269 10197 -3698 -9608 6113 8488 -7824 -6567 8848 2570 -10281 2097 11721 -4212
1246 -4212 -8803 8916 7142 -8957 -2324 10489 -2242 -10097 6404 6962 -9056 -5644 10603
1259 10603 1049 -10433 2516 9657 -5816 -8715 7925 6257 -7924 -2922 9831 -374 -8307
1272 -8307 4860 6146 -7688 -5751 9252 2997 -9443 346 10276 -4080 -9589 7929 7608 -8438
1286 -8438 -3276 10012 1156 -10429 2506 8853 -7551 -8374 9906 4288 -10295 -178 8646
1299 8646 -4320 -9780 7803 6453 -9068 -3716 9793 1160 -9807 1624 7371 -5512 -6735
1312 -6735 7439 4690 -8969 -2036 8870 -2037 -9437 4395 7922 -6738 -5368 9417 2139
1325 2139 -10692 -306 9398 -4631 -7472 7139 6236 -10264 -2770 10995 -226 -10543 4698
1338 4698 8750 -7706 -5686 9642 2383 -9351 667 8412 -3840 -6415 6599 4726 -8167
1351 -8167 -3029 9376 71 -9097 3593 8434 -6684 -6512 7380 2910 -10166 -436 8431 -2216
1365 -2216 -8848 4740 6648 -6859 -4731 9276 2281 -9223 1820 9366 -5167 -8273 7756
1378 7756 4018 -10013 -1204 9886 -1724 -8789 4821 6484 -7769 -3849 8628 1180 -8214
1391 -8214 2970 8409 -4693 -7903 6724 4632 -7546 -1376 8662 -705 -7768 2787 7243
1404 7243 -5544 -4052 7135 3080 -7651 -29 8371 -3640 -7918 4956 5700 -6586 -1928 8511
1418 8511 449 -8637 2556 7412 -5088 -4910 8406 2688 -7667 276 8933 -3491 -7306 5136
1432 5136 5127 -6606 -2244 8113 -624 -8000 1782 5943 -4801 -5339 6956 3154 -6627 -1106 7739
1447 7739 -1573 -7705 3518 6382 -5513 -4111 6654 1792 -7686 1110 8104 -3029 -6061 6039
1461 6039 4366 -7345 -1190 8843 -1824 -8187 3483 6920 -6512 -4893 7457 1825 -8089
1474 -8089 536 7207 -3911 -5971 4459 4411 -5794 -472 6321 -1586 -5946 4189 5568 -5119
1488 -5119 -4537 5852 1905 -7647 -145 6553 -2046 -6656 3700 5050 -3980 -4263 6157 1474 -6351
1503 -6351 1045 5454 -4000 -4580 7586 2343 -8553 -560 7804 -2851 -8051 5706 6042 -5874
1517 -5874 -4004 6935 1620 -5804 903 5867 -2317 -4250 4402 2311 -5522 362 6329 -3193 -5379
1532 -5379 5295 5339 -6567 -3982 7280 1482 -6432 -323 7122 -922 -5444 2854 4364 -3994 -2002
1547 -2002 4099 285 -4367 2625 3119 -4478 -3600 6720 -576 -9002 772 7755 -3355 -6821 5227
1562 5227 6138 -4938 -4265 6244 1134 -4456 147 4445 -1953 -2753 4776 877 -5374 1807 4463
1577 4463 -4507 -4577 5367 3700 -5969 -2762 7557 2153 -6783 -638 7047 269 -5201 1783 3243
1592 3243 -1825 -1474 3843 -620 -3594 3405 3205 -5070 -1018 8184 -166 -7479 2500 8296 -4326
1607 -4326 -6173 3745 5173 -4020 -3235 4758 906 -3400 381 3472 -673 -993 3659 -1360 -3447
1622 -3447 2431 4007 -4367 -4610 5320 4034 -7104 -3255 6926 1600 -8179 -1579 6361 -333 -4842
1637 -4842 1283 2811 -1222 -945 2038 -2005 -1574 3743 932 -4536 -56 6169 -1088 -7748 2353
1652 2353 7974 -2934 -6714 2610 4342 -3688 -3274 2733 2181 -3298 73 225 -1401 876 923 -2731
1668 -2731 -3188 3432 3763 -4957 -5202 5991 5095 -5970 -3184 7451 2519 -6280 -1284 5313 855
1683 855 -3786 208 1532 -343 1222 1114 -2663 -676 4294 -273 -5335 406 6107 -1217 -6905
1698 -6905 2378 7110 -2497 -6788 2107 5410 -2632 -3500 1115 2865 -1085 -1303 -12 -1013 420
1713 420 1831 -2145 -2406 4745 4176 -4875 -4541 6652 4568 -6155 -5099 7786 2827 -5482 -1829
1728 -1829 4400 1877 -2629 -409 43 565 1820 67 -3295 -450 5691 -3 -6332 1097 6890
1743 6890 -2560 -7742 1813 6147 -1848 -5825 1916 5799 -1344 -3069 172 3275 1361 38 -2118
1758 -2118 -1228 2541 2267 -4058 -3345 4373 4087 -6184 -3455 5841 5147 -6841 -3894 5605 3349 -4622
1774 -4622 -3251 2902 1814 -1344 -1230 -350 1647 2514 -549 -4335 1345 5419 -513 -8235 -337 7058
1790 7058 -1423 -7220 1465 6847 -1691 -5138 618 4999 -234 -3858 -540 1838 1377 -1029 -2481
1805 -2481 -407 3455 2797 -4179 -4029 5009 3328 -5906 -4048 5438 4146 -6172 -3800 5027 3966
1820 3966 -3803 -3276 1779 2391 -1290 -2533 -1291 1242 4001 -2673 -5652 921 5545 -699 -6433
1835 -6433 1670 7967 -1260 -6296 111 6459 -384 -4566 -511 3627 1073 -2180 -1620 1578 2570
1850 2570 -346 -3467 -2400 3963 2731 -4527 -3980 4692 5059 -5466 -4998 6320 4105 -5870 -4080
1865 -4080 3767 3483 -3039 -3493 1155 3128 564 -2209 -2261 1304 5127 -1228 -5485 1090 6014 -694
1881 -694 -6110 540 6780 -849 -5976 -178 5497 775 -4190 -2076 3935 1722 -2731 -1682 1360
1896 1360 3220 110 -4294 -2622 4274 3433 -4380 -4995 4899 4678 -5301 -4819 3812 4342 -4700 -4419
1912 -4419 2375 3814 -1457 -2347 366 2439 1503 -2153 -2996 1381 4674 -1728 -6014 1573 5947 -604
1928 -604 -6180 -210 6674 1078 -5844 -1118 5870 2162 -5158 -1707 2287 1822 -1473 -2244 166 2772
1944 2772 1100 -3749 -1549 4097 3603 -4982 -4573 3685 4882 -3777 -4797 3435 4526 -3060 -4053 1246
1960 1246 2710 -561 -2817 -597 3433 3090 -2054 -3203 1363 4515 -1103 -4790 127 6133 1178
1975 1178 -6313 -686 5760 1363 -6182 -1881 4216 1298 -4111 -1671 1562 2563 155 -2836 -1103
1990 -1103 2605 2133 -2610 -3385 4201 3868 -4058 -3452 4019 4365 -3307 -4471 2314 4495 -2599 -3272
2006 -3272 1216 2708 1220 -2991 -2388 1597 2342 -1451 -4200 1111 5524 -144 -5255 -500 6080
2021 6080 1620 -5997 9 4640 1206 -4570 -1215 2959 1700 -2276 -2798 1673 2392 -366 -2572
2036 -2572 -1726 1864 2442 -4019 -3446 2648 4618 -2743 -4563 3748 4024 -2015 -3969 1659 3773 -1472
2052 -1472 -3457 808 2030 330 -1372 -2064 1503 1795 -1246 -3298 554 4670 614 -3658 -1118
2067 -1118 5517 1391 -4109 -1273 4018 2664 -3088 -3369 1615 2545 -1407 -1467 1187 2381 -172 -2791
2083 -2791 -1211 2505 1881 -2518 -3484 2077 3576 -2181 -3827 2519 4060 -2503 -3952 1150 4046
2098 4046 945 -2518 -844 2170 1692 -1175 -1952 1110 2545 279 -3325 -123 4233 693 -4343
2113 -4343 -999 4065 769 -3693 -826 3119 1970 -3132 -811 2709 798 -1014 -1933 -876 1685
2128 1685 1959 -2346 -1208 2012 3659 -1804 -3674 2151 3395 -2221 -3585 1024 2677 -991 -2974
2143 -2974 971 2617 -804 -1845 -334 1524 2110 -2209 -2655 -366 3220 330 -3013 -1076 3227
2158 3227 218 -2788 -401 2360 1460 -2458 -2248 1779 -321 -2178 -983 1754 2323 740 -2492 -1226
2174 -1226 1030 966 -1212 -1541 994 3256 -1594 -2934 1817 3387 -1781 -3594 1884 2879 -535 -1695
2190 -1695 1080 1777 1017 -1891 -1150 988 -30 -468 -1331 -462 2786 -13 -2002 -706 4126 293
2206 293 -2967 -583 2762 748 -2108 -1807 1955 743 -1733 -1272 180 854 315 -1341 -884 185
2222 185 914 -58 -2018 1288 2974 -1010 -1827 1353 3405 -1255 -2417 1131 2639 -1166 -2206 148
2238 148 923 655 -1269 -118 -246 1287 390 -1049 -257 2003 720 -1729 -2019 1704 265 -2208 -745
2255 -745 1640 1902 -2146 -825 236 1157 -1161 -622 679 -228 722 -1065 -1151 700 1595 -956 -1637
2272 -1637 359 1757 -147 -2180 938 2381 -681 -950 248 695 37 -1055 -91 1157 -73 -635
2288 -635 -482 54 969 -586 -1844 -325 1678 1333 -1465 -1429 1248 1356 -1856 -1571 1929 1064 -1131
2305 -1131 -1356 -44 523 892 -484 -715 1584 178 -708 -807 1124 856 -714 -2145 457 1312 -36
2322 -36 -1917 -275 1555 -263 -1253 701 906 807 -1131 -452 90 803 -712 -735 -117 262 51 -1008
2340 -1008 -28 538 943 -2162 -1459 943 809 -1823 -740 1156 1063 -150 -1255 292 213 -496 -266 31
2358 31 -78 344 342 -1371 -985 1715 -53 -1298 -316 1508 -464 -1847 11 1416 -753 -715 -110 290
2376 290 -246 -1136 414 433 458 370 48 1330 907 592 -1048 188 1058 -500 -181 -87 459 261 -22 -739
2396 -739 1234 513 -240 89 1185 -105 -203 -332 17 664 -78 -761 -695 265 953 147 -1415 -401 342
2415 342 -192 -1018 -590 -130 -110 -631 -565 147 -514 -703 -1199 -518 -333 -183 149 -646 -25 1432 -237 -276
2435 -276 -22 1310 -437 140 -11 757 -1971 -481 1095 -1032 309 -219 -30 261 293 -525 -114 -232
2453 -232 850 -154 -318 -497 684 -15 -964 -219 960 258 -486 -819 305 -135 -289 167 394 29
2471 29 -58 1314 771 359 725 18 171 316 803 270 -30 523 557 -478 -380 -216 406 -850 -230 619
2491 619 363 -301 -495 -707 247 171 379 40 -1385 -166 -190 -586 39 485 467 -984 -830 87 -311 -545
2511 -545 50 485 -385 -120 -536 541 275 46 -420 411 1233 -190 403 207 -516 22 859 -596 738
2530 738 501 -273 -1951 772 62 -308 -96 293 744 524 -203 778 308 -158 -1179 235 -98 -463 644
2549 644 -140 -379 -248 520 -429 956 868 -175 -133 -537 -650 146 71 1035 953 -15 -11 124 725 105 453
2570 453 1140 172 -939 764 99 -175 946 82 705 268 580 -66 -79 86 -260 101 155 -229 509 401
2590 401 854 -514 346 100 -660 -335 -1035 172 291 37 -232 463 648 592 -343 -9 -66 -779 -80 -293
2610 -293 911 -342 403 43 -1471 -439 -285 1022 -276 244 153 768 -821 -149 30 315 210 148
2628 148 41 86 162 1127 265 560 229 707 39 372 782 -53 -1023 247 128 -42 450 -223 1341 -169
2648 -169 362 840 542 383 259 123 229 -505 -233 -434 -100 483 47 -686 -1096 -5 764 -1036 996
2667 996 679 -178 -96 871 -395 189 -879 286 -495 601 -141 878 -150 -23 -1564 -176 -926 -328
2685 -328 201 -592 692 342 604 -661 -278 166 -635 128 25 -105 -236 639 4 970 -432 444 1243
2704 1243 -1362 -83 566 226 -617 85 381 -264 347 66 120 761 -618 676 -27 -99 -59 -381 -604
2723 -604 221 680 -486 -143 -579 -109 -825 -32 486 246 -563 -136 -116 -109 -606 69 -121 -219 -307 -200 -71
2744 -71 -45 1174 277 325 -1005 -212 92 -78 -341 -112 -195 -55 -64 26 445 -28 -312 366 629 -55 229 319
2766 319 1148 -102 -792 856 80 -624 868 -724 -777 -739 500 -704 563 148 -332 125 -523 656
2784 656 384 693 -375 165 33 -238 13 58 716 415 -376 349 -257 348 886 -444 395 -244 214 -537
2804 -537 -220 296 -1042 474 368 -303 -354 -90 364 49 -407 1296 326 1196 487 -174 82 188 379
2823 379 -437 -779 -1 877 -178 -89 37 663 403 134 589 -1096 -316 340 610 -266 -233 -10 -212 -530
2843 -530 774 -579 -386 230 103 -419 -53 -347 -218 707 -604 1117 300 -566 1090 -186 -24 767
2861 767 -117 151 110 -479 16 -229 -1045 954 -1664 -331 379 524 637 25 -16 -70 -765 -19 -512 495
2881 495 376 15 -607 -9 424 -439 -258 -232 118 -212 -500 182 -282 -1100 112 -197 -416 53 -873 -342
2901 -342 -126 880 -132 -306 554 908 -524 268 47 -141 -396 -293 514 -664 334 373 -239 527 -735
2920 -735 -96 -687 -128 393 728 -493 -99 438 -991 569 -439 -1155 279 -97 -700 433 -106 -686
2938 -686 68 994 782 -808 1218 437 366 -769 -291 579 -1119 668 -16 -162 -304 -896 -454 271 104
2957 104 600 -187 -101 -199 -709 -883 291 -180 -780 -405 -453 -237 -563 240 -383 -998 -418 -5 -41 -759 335
2978 335 309 164 120 -369 -684 -433 -905 41 -116 -556 -97 -18 1117 126 -871 -336 33 545 1236 18
2998 18 579 691 -267 -463 179 171 -298 563 407 -633 563 94 636 -286 -487 -74 -209 -329 158 -267
3018 -267 -597 232 115 533 -63 -174 -44 394 -946 335 -127 -107 -265 -935 1363 445 -987 -156 30
3037 30 263 475 -116 537 245 -672 243 -489 -103 -813 -153 333 -667 -222 515 -607 -1042 337 -558
3056 -558 123 -87 293 -138 -477 893 474 -165 -243 550 504 457 155 795 246 -206 156 154 639 63 849
3077 849 36 -176 -143 -190 18 165 549 -195 184 617 -470 -263 -295 616 -624 406 -568 272 -767 33
3097 33 -408 -589 334 -788 -149 39 951 -196 174 107 -382 406 202 1253 498 118 336 363 -382 172
3117 172 182 1198 -169 170 -383 -625 -382 391 974 -427 -893 -809 -75 311 -495 267 197 85 5 1598
3137 1598 -229 644 350 226 517 -366 1008 260 815 -1055 531 77 -962 -160 -390 563 560 -659
3155 -659 -311 -20 -560 442 1075 -137 1185 124 -20 -156 478 943 -578 53 -642 -694 509 285
3173 285 55 291 124 -1225 54 -355 -106 53 438 -502 279 -166 -332 -173 191 -883 309 323 181
3192 181 853 675 263 37 -28 -50 406 598 -370 128 -87 -279 142 277 -100 37 1118 -158 1171 -625
3212 -625 481 89 318 -225 105 -190 132 -113 464 426 -170 548 370 518 134 470 100 -185 -443 894
3232 894 -682 -224 -53 622 6 -1029 -524 354 164 647 122 855 792 584 1000 26 -146 128 -169 104
3252 104 370 -457 758 -728 -493 503 -420 661 782 119 24 -734 435 -575 149 -152 -21 -824 32
3271 32 -1149 -1062 228 88 159 -661 -137 450 -1428 888 -1204 -79 14 -1350 694 -170 -329 -54 -362
3290 -362 66 436 -37 602 1401 -362 78 227 -220 -998 -566 271 -20 -101 -1168 -296 433 269 211 66
3310 66 147 -403 118 -401 -455 368 -817 280 913 1094 -861 -857 -31 -14 103 -1098 205 188 -233 -701 470
3331 470 238 -52 6 720 -258 -134 1245 -424 1267 47 204 1057 -140 754 241 -42 -1400 571
3349 571 -557 -186 572 -501 716 551 860 1029 -163 -1256 -85 -58 -406 514 -257 1031 -216 853
3367 853 -402 583 -167 28 -376 333 403 -584 672 -427 280 -392 -768 -170 1008 567 635 163 -522
3386 -522 -280 -1491 -216 417 -1120 -176 232 -1008 37 157 -594 399 157 241 602 144 462 -186 -82
3405 -82 409 -1082 -196 -284 65 124 88 -519 -882 1247 514 265 471 -366 -439 -818 -441 614 244 1166 -599
3426 -599 86 -197 64 -320 186 88 -192 882 630 234 566 29 -1234 -241 -88 -423 -68 -491 -745 470
3446 470 90 749 667 127 -257 -389 -685 434 362 382 -488 404 451 -212 -122 -311 -141 -1048 936 -273 -89
3467 -89 56 1053 -305 -425 167 -20 604 -27 573 250 -111 -596 1267 828 1006 505 -152 300 -273 -76
3487 -76 -26 -431 -62 -222 249 247 386 -158 370 405 -595 698 -542 397 246 300 -150 104 -114 310 273
3508 273 -157 488 77 159 888 656 412 555 -125 -370 45 947 100 -318 164 257 -708 314 882 593
3528 593 27 -377 -335 315 68 -141 341 757 173 -458 -9 1320 -208 78 -263 197 -883 -821 1015
3547 1015 534 901 199 -80 -230 -203 -229 -56 -689 362 -257 -432 -685 -233 477 672 182 10 -311 590
3567 590 435 54 -274 -750 300 -1430 1481 -314 -201 -456 18 128 -1 964 58 -101 -321 226 632
3586 632 452 129 -1 376 673 -563 140 161 -447 -54 195 10 -192 -42 49 -1099 -377 -559 101 1263
3606 1263 -320 -47 -239 -346 199 743 -350 -374 -701 -448 669 -225 -549 -167 21 8 139 492 775
3625 775 249 533 144 190 -240 -491 580 -317 -228 43 -370 305 -553 309 -81 749 -27 261 310 -8 942
3646 942 -898 670 -345 1324 989 -940 529 478 234 1142 -813 -615 -887 53 26 397 136 470
3664 470 -300 -500 774 343 291 -823 -11 43 -380 457 -913 585 -92 -340 -517 74 -453 -775 273
3683 273 -241 219 176 -338 -359 422 83 -305 -911 19 -1075 -484 -286 -143 -579 -329 -230 117 751 -791
3703 -791 279 -987 146 -254 172 -245 -784 -1069 725 263 418 -686 -138 -475 -639 786 529 197
3721 197 -229 405 -244 -683 808 -593 842 117 539 293 -695 155 -430 -538 399 -344 397 336 -59
3740 -59 -256 -578 145 105 196 -1019 541 103 -700 38 -367 -1246 528 170 -85 -823 -320 -792 -126 382
3760 382 465 216 387 -993 233 126 56 -459 -928 157 552 616 -694 -219 -333 -74 -386 -332 316 938
3780 938 -609 -102 52 -848 390 -21 -407 -244 501 425 -608 420 -413 -257 503 7 -1229 31
3798 31 -124 -442 526 -866 498 97 -320 52 -658 114 -399 233 -155 450 201 -343 484 -70 360 -330
3818 -330 -218 650 -165 136 -953 -201 -64 3 194 -410 -881 -8 159 -266 -701 -287 169 -39 -183 -268
3838 -268 1188 21 -381 -77 82 1205 622 -483 -95 43 233 -411 -914 -150 -944 -754 99 -1290
3856 -1290 540 -495 -1086 588 30 191 -606 1054 -407 -394 741 377 686 -502 -529 179 294 172
3874 172 -767 185 -808 825 -219 -1023 539 169 1169 -15 -89 -979 753 458 752 17 -300 28
3892 28 571 -19 -78 -312 149 -1184 130 -221 216 716 600 18 -71 -140 -208 -196 -436 -645 -48 216 637
3913 637 773 -1718 216 325 212 -891 379 -788 358 -100 150 -358 427 -410 -617 368 243 -279
3931 -279 -501 48 582 -1016 -721 -477 -111 -225 -466 -439 781 278 -71 -266 171 496 100 -268 -215 -144
3951 -144 -562 -497 204 245 244 -574 -193 101 185 -338 -208 -43 714 371 863 132 271 151 -438 790 169
3972 169 266 30 505 786 -934 220 -459 149 426 15 -47 -99 -444 0 -40 -861 920 112 755 58
3992 58 560 70 -275 -374 1319 -141 -515 -163 -116 866 638 1244 191 -587 -888 -433 390 -250 10 -38
4012 -38 -91 412 205 -218 372 -218 -626 415 -161 15 -455 880 176 -460 -527 -51 -794 374 768 290
4032 290 6 -15 -401 596 -238 -808 -274 -664 -47 412 771 735 461 152 30 464 436 -226 489 381 975
4053 975 250 -476 -226 -78 -505 563 -476 -442 -191 312 -312 -490 1326 427 -643 -533 -593 460 -45
4072 -45 -179 117 -432 -736 -680 205 -472 544 408 -148 -447 16 -472 337 -408 504 -348 -712 -63 84
4092 84 -350 -935 735 -386 -1489 -182 -964 -629 984 133 -74 271 687 -412 -532 131 333 183
4110 183 -281 -297 -748 -811 343 133 23 210 855 -700 60 -117 -713 423 -179 309 -130 304 -324 18
4130 18 512 -116 795 -564 397 194 477 11 -145 -476 435 -181 579 -511 -72 411 410 903 777 67
4150 67 -107 -311 -234 118 -157 392 247 1101 -261 208 372 -1017 545 279 -292 677 30 520 -646
4169 -646 230 410 -369 574 805 175 569 350 -361 -417 83 1382 -33 -610 -745 83 -69 1157 620
4188 620 -431 25 8 386 -340 543 -140 990 291 516 814 130 163 -708 -144 250 -244 206 -679 -247
4208 -247 91 62 925 -881 108 -477 -719 -318 1115 -319 -61 398 -689 119 225 -78 228 164 -331
4227 -331 -551 168 690 -681 487 700 33 99 292 -123 -159 -69 -170 -970 -250 -155 750 -89 602 -622
4247 -622 -387 -222 -136 -206 -926 -419 41 246 -164 316 424 124 -102 -357 1203 -95 -484 -55 -1709 459
4267 459 396 -289 156 -585 949 -447 -196 60 -67 -31 284 459 -25 -979 -870 207 180 246 -223 979
4287 979 -623 353 -63 -504 -470 -941 -1001 334 -249 386 712 562 607 289 -162 27 -660 29 722 75
4307 75 -37 21 -135 -68 -365 -233 -324 815 257 230 96 -427 442 -520 -410 206 413 -233 -289 470 -168 -515
4329 -515 -148 143 797 1280 -393 -882 245 123 174 -935 -1523 423 -279 203 202 -461 -422 56 -254 494
4349 494 318 567 -92 766 171 289 533 470 -967 -171 713 -518 146 194 405 152 210 -1059 137 -258
4369 -258 143 -54 -311 -533 447 278 -991 -374 389 539 -211 86 -1087 436 547 -147 590 -494 186
4388 186 -645 199 -135 792 -30 1126 686 -751 -532 529 -582 -258 -317 -798 -120 193 216 352 -399
4407 -399 -514 -15 -47 92 1123 -53 -314 412 473 53 617 587 71 243 -502 117 300 48 529 321
4427 321 -615 101 737 -595 -276 -32 229 -78 89 -223 -587 521 91 -10 -1053 1689 150 -334
4445 -334 691 17 349 -269 707 6 -803 -361 965 990 238 458 -562 -122 831 410 -775 -524 66
4464 66 1121 -208 -247 -567 -311 62 454 360 310 14 501 203 -625 1510 376 143 -98 777 -501 52
4484 52 -171 413 117 -891 553 490 -226 -319 693 163 -279 -2 50 -515 -382 680 924 48 80 -222
4504 -222 -622 326 -395 -54 -261 -902 800 90 277 -116 933 255 -791 316 795 400 315 -725 218
4523 218 282 433 419 -10 -397 -548 292 -437 -75 407 -96 -191 380 300 -23 -641 -1138 345 -88 -161 165
4544 165 24 39 -376 162 216 -520 37 -827 1135 204 318 -657 -414 359 -137 580 -149 -357 -317 -495 14
4565 14 -66 646 290 75 86 -462 1392 388 790 -150 -926 165 -220 675 -87 906 548 -126 -701 438
4585 438 -298 -512 371 195 222 517 -56 67 -491 -377 -241 -949 470 -361 -490 -36 -435 291 -69 -513
4605 -513 985 918 -200 -283 -96 65 339 -105 1315 -307 86 -10 262 -285 -367 577 967 -606 722
4624 722 220 283 388 -338 248 391 559 129 172 -76 -367 -494 -937 -506 -215 980 96 -733 -240 124
4644 124 452 701 222 206 -691 295 -18 10 -741 39 100 -99 482 203 50 -237 412 -240 -956 1002 -124
4665 -124 -440 718 -507 398 253 -285 1318 -211 -917 -271 -806 620 -304 1017 -893 651 -494
4682 -494 641 -303 -543 -594 -322 352 -492 -1013 483 -1155 699 416 -15 -783 246 701 56 338 577
4701 577 -1072 -490 -5 -66 39 901 82 -669 758 -13 -162 -290 106 -370 -830 77 -725 232 661 29
4721 29 -290 167 -862 -1482 -845 -291 1113 -319 95 -96 138 622 223 -791 -681 -239 -1046 405 -838
4740 -838 -202 -139 429 233 -226 717 -1143 -1252 -732 -113 -441 -79 -537 265 -1104 92 -55 546 772
4759 772 -684 -289 -242 -367 239 -455 -19 -143 363 4 -675 -227 -421 -274 -242 -269 -458 -211 704 -146 5
4780 5 284 1029 -84 787 34 24 -295 -256 -984 -389 -83 1170 -240 -541 19 -225 132 -1081 310 -35
4800 -35 440 -382 -633 -800 397 416 -741 -616 230 344 19 -295 130 -371 -121 -137 701 -803 564 -102
4820 -102 -21 -478 -422 -168 -177 164 -755 -109 -142 561 -156 680 -68 594 -984 406 -641 -224 -291 -243 -296 -421
4842 -421 139 -265 23 402 -361 58 193 195 -407 647 -42 244 500 859 468 -198 -239 782 -530 -796
4862 -796 139 -444 -322 -819 -314 -12 -295 -536 309 754 -636 82 436 -93 115 -272 -99 -565 -112 -368
4882 -368 1291 -326 218 30 -694 339 445 -622 139 291 -36 -249 -173 -447 -1340 -602 -993 388 -95
4901 -95 324 -213 -733 112 356 716 799 450 56 371 -446 91 246 314 -148 -252 419 853 85 -518 641
4922 641 -206 525 653 41 278 -204 -477 -719 -303 -86 -542 267 66 -1188 -318 113 245 -38 259 1312
4942 1312 -574 179 -83 -392 -142 441 -205 -1023 -936 173 -223 137 189 10 848 516 -31 288 49 -159
4962 -159 -78 74 -1208 -27 -382 -919 50 368 1059 162 -19 -666 133 -238 177 340 741 -377 -232
4981 -232 -429 371 497 -459 5 -637 -614 831 229 468 147 -1123 -423 216 149 -565 1006 363 129 797
5001 797 -173 -550 -298 -135 -392 110 -1299 655 436 -570 144 424 -907 -695 -494 -383 261 -539 -61
5020 -61 -524 408 200 340 114 236 -117 142 -229 144 134 427 356 543 -116 191 453 -382 -490 -102 -183
5041 -183 -280 -569 -209 -85 998 117 741 -418 -56 13 813 -449 -67 475 -448 -455 404 -78 478 -66
5061 -66 -76 -490 580 -573 -97 421 -457 257 914 -139 248 395 -1503 -16 -374 139 189 167 702 -95
5081 -95 -254 -167 -272 -155 -669 477 395 129 -71 898 -123 -602 -275 -76 -624 -628 -687 1370 -409 -467 115
5102 115 174 430 43 -177 -113 342 -570 -526 -263 679 -446 -864 402 166 -220 -64 -248 59 466 66
5122 66 -1055 -792 -247 -121 1176 241 -30 -255 -641 -854 542 91 389 702 434 -584 -417 -333 295
5141 295 683 186 272 -681 505 531 62 544 426 145 -693 6 -303 217 897 690 -682 1159 224 -77
5161 -77 651 -645 548 -313 663 -246 648 -1217 28 -95 -566 252 -989 1024 -58 -791 -745 -1278
5179 -1278 -795 -595 499 -294 253 333 406 12 400 -894 -129 258 420 -921 1177 519 459 93 -696
5198 -696 305 677 609 902 795 -587 -266 634 -135 -17 301 770 1060 -490 791 -323 -319 -294 -118 1255
5218 1255 -63 577 21 -81 -477 185 525 -257 47 185 215 -985 -132 -397 614 -347 -470 72 -493
5237 -493 -342 675 377 20 -518 196 322 168 -636 -41 -161 256 -296 1112 -165 -556 331 -92 357
5256 357 -325 283 518 -850 -291 251 -352 282 -116 572 828 11 -741 -496 254 -136 -983 -537 -482 513
5276 513 427 -117 251 632 68 -388 204 -501 692 56 -698 208 1027 62 -790 -632 -871 -275 791 -443
5296 -443 123 -205 -302 846 -525 -205 -60 71 -986 14 -51 -416 893 -245 554 -354 -163 -51 311
5315 311 -228 -209 0 -223 -260 -188 -1425 897 262 653 -392 652 529 -670 -711 308 334 -103 100 -356
5335 -356 136 -667 382 27 950 -24 -686 142 -867 -202 -438 -539 -43 1738 -208 163 -828 -87 -937
5354 -937 733 -136 343 411 -74 -1000 -206 -34 297 158 333 -741 79 532 -813 35 -289 1079 -683
5373 -683 374 829 42 -275 130 56 -271 -135 -29 574 -181 199 1106 -369 892 93 767 38 1049
5392 1049 332 -89 424 -206 -136 -25 -205 927 515 285 127 -655 -691 475 105 302 116 753 246 584
5412 584 -79 -592 218 600 618 -314 -619 67 -1086 -123 -69 -11 33 100 -588 -220 72 -236 670 -818 -248
5433 -248 -306 32 638 138 -453 2 -711 67 214 830 -27 568 803 491 -827 465 -358 -396 392 907
5453 907 -509 180 11 -55 817 202 -137 -204 819 812 -1069 265 -42 -109 817 396 978 -172 281 -445
5473 -445 -366 -765 -222 -241 -478 279 -117 -47 727 -524 849 -602 63 494 473 -445 -132 902 -1395 -554
5493 -554 0 630 574 -506 764 -622 -808 855 -138 678 1099 98 -709 -123 746 -930 -157 -565
5511 -565 -85 -605 268 1025 889 -594 -1428 -494 -691 -172 -929 -561 -923 -709 -253 277 594 -686 522
5530 522 1115 -423 -503 1280 -356 -820 -408 80 -517 -296 217 904 -224 379 -475 174 585 -283 566
5549 566 367 -20 951 -467 -518 -655 -1212 -325 831 1107 182 -369 -237 122 470 1282 -278 468 -564
5568 -564 -709 -516 101 125 -1003 555 434 459 -203 -19 -217 -69 -9 -25 -798 9 710 171 -398 -137 623
5589 623 978 -328 -820 -397 -63 552 -625 719 -811 -600 426 266 1319 343 -244 542 1011 1099
5607 1099 333 669 -319 161 195 -474 -234 26 902 -198 -83 -268 355 301 -364 220 401 954 1437 4
5627 4 230 -665 617 934 261 -715 248 252 341 -71 -808 443 160 -98 -965 -151 877 261 -370 83 -639
5648 -639 -675 12 -93 -339 -517 38 -169 137 -1142 -743 198 506 337 391 794 411 898 151 -362 4
5668 4 51 38 -412 127 29 -192 358 -155 27 258 1389 549 68 348 -339 -158 764 -252 208 -661 -448
5689 -448 119 -240 188 216 -43 -106 -746 169 536 149 187 603 -332 1129 429 -709 -150 -605 -269 176
5709 176 1 613 1075 530 648 -604 -387 669 211 931 -484 995 349 -654 -142 316 -901 850
5727 850 -289 722 231 200 988 513 -113 68 -417 332 -390 624 -122 -124 -206 25 302 -85 11 117 -12
5748 -12 -235 -269 131 265 97 438 389 716 869 -78 774 -255 -817 685 675 -176 544 305 63 -827 -187
5769 -187 816 -239 375 -140 509 -671 75 323 95 -171 -343 353 603 -601 748 -664 417 -666
5787 -666 1542 -436 615 -576 223 51 163 245 297 176 97 338 -348 372 -252 -188 474 714 -468 -315
5807 -315 -196 -786 -428 -255 -328 357 -435 39 -290 -478 375 485 -861 349 -899 1085 -698 -273 -171
5826 -171 597 200 1462 220 -659 10 -239 -441 111 -839 459 -77 -1076 -686 -626 52 -359 -52 -30 -34
5846 -34 -458 -343 96 -139 -103 64 -869 -367 771 -473 43 -157 311 591 224 324 -693 -53 236 603
5866 603 -282 -1461 -416 -1447 556 -244 907 640 -401 23 -170 85 -206 -524 173 283 -416 297
5884 297 -338 -305 -29 -187 -434 182 -1200 339 -38 -1267 -95 -113 451 -223 -551 310 -670 -504 -873
5903 -873 279 33 38 434 141 738 245 253 -322 -214 -189 -82 -391 -39 -358 -30 451 -536 38 460 509 -374
5925 -374 -101 -266 -154 209 734 4 368 -101 144 -142 -387 47 -368 275 563 -1108 534 -370 -678
5944 -678 -130 -185 -343 743 56 -234 133 50 -489 -332 21 679 -152 -375 219 -132 -554 290 1046 157
5964 157 148 -630 107 394 284 205 -73 -714 -416 598 611 -735 -92 -264 -1061 267 -18 -493 44 -48 725
5985 725 -17 -397 -580 -222 -306 -274 258 -901 438 376 -713 -99 -1386 -288 302 588 265 -152 -54 34
6005 34 -138 -684 -11 292 -659 -310 -655 285 -929 -89 1314 695 331 -1098 541 -167 77 -213 143
6024 143 -29 54 -279 -63 -427 56 -175 -283 -378 -1139 -203 -494 84 88 -800 371 797 1101 614 -251 -118
6045 -118 -419 -527 470 -350 97 -174 -47 -452 -801 -682 412 18 -771 44 343 -395 -297 -46 976 112
6065 112 -945 800 237 -314 240 751 163 389 -507 -307 368 1462 55 239 634 740 -387 -236
6083 -236 108 -100 -424 -23 -210 -416 324 -379 50 -458 270 283 -833 -943 -470 333 651 -265 -622 -278
6103 -278 613 -27 420 733 -725 -662 63 1292 1094 330 -248 -122 417 203 -86 -231 305 -310 583 140
6123 140 -88 296 465 591 821 117 -195 -43 -190 -837 659 -509 -188 -164 121 -1174 927 -8 547
6142 547 -478 -621 120 848 193 108 -136 -142 -461 22 974 457 -672 -142 -529 -1074 -103 -250 1162 590
6162 590 575 693 648 -547 -378 -231 166 17 -54 540 1596 -17 114 -15 545 -891 270 -258 -136
6181 -136 578 -153 -813 -551 263 -501 777 -88 -89 658 -3 267 -212 -59 -114 629 258 -335 -89 -160 190
6202 190 200 -1053 862 223 -667 332 -361 633 444 -737 568 -170 -12 -627 81 500 -512 -911 1241
6221 1241 433 17 73 503 -195 363 -349 236 224 552 163 -14 -271 889 291 89 505 433 -117 438
6241 438 436 -1076 -946 -1398 -332 -39 737 280 784 889 79 846 -146 -830 201 -426 -181 418 404 256
6261 256 992 -167 248 331 123 -865 235 -87 69 -503 -195 -348 -601 132 108 169 -52 -608 96 -184
6281 -184 -1172 -240 1432 126 -616 -159 668 496 49 -163 -739 -348 332 -606 794 71 -1009 237
6299 237 -310 590 550 -189 211 442 359 134 397 317 -621 -238 449 164 740 284 53 370 345 -991 -568
6320 -568 352 -489 -628 -551 -1013 100 48 203 -281 -477 -44 -136 -386 -585 -689 -816 -344 1239 562 -319
6340 -319 445 378 -753 -1043 351 -190 426 488 -490 -573 397 -253 -83 -695 1151 -35 -302 625 725 520
6360 520 196 367 -507 599 -536 420 -439 103 229 1058 638 1429 500 -159 881 -283 -270 -625 541
6379 541 -467 293 -574 696 75 -443 394 413 -34 -1160 380 734 293 -591 -240 -516 771 815 -794
6398 -794 610 351 1016 -649 -1844 -56 222 -650 158 324 295 660 -887 -452 370 -253 -18 590 -641
6417 -641 -797 -319 -481 168 80 41 919 -429 -270 487 417 381 -399 -630 -130 428 236 -607 -42 62 51
6438 51 159 291 124 681 -424 -718 -82 -1157 -91 -699 523 -4 322 954 -779 -652 -331 -53 211
6457 211 -631 42 -349 -219 411 -551 773 -132 276 -602 414 -209 -341 51 39 505 -77 -58 367 133
6477 133 327 448 -68 -228 -803 -25 -246 80 84 464 488 381 -1334 -1273 1032 -942 -480 -133 -509 -368
6497 -368 -81 646 -227 256 -483 113 -345 -138 258 -1486 -1173 82 429 -137 22 266 -271 923 169
6516 169 -461 -14 -347 369 -16 -690 887 147 102 -17 275 61 455 586 613 -774 -336 467 -635 -479
6536 -479 -909 -27 324 313 -1127 854 -139 553 492 -523 -86 -440 48 624 -620 -655 857 -637 -1100
6555 -1100 256 244 410 548 -181 -132 111 -709 -599 903 98 -60 -185 -180 -1361 534 -202 260 -972
6574 -972 -30 580 85 -507 -787 -106 -205 2 -458 -560 -287 787 426 -383 419 471 1102 421 -314 -354 184
6595 184 -161 274 229 77 -118 372 -256 209 97 -670 823 254 605 599 411 97 406 -233 50 426 990
6616 990 445 -55 -113 -509 -583 465 272 415 332 -495 -598 -119 145 -545 -418 -580 726 1 106 988
6636 988 492 -587 -137 -217 366 -167 -226 117 -328 692 -425 108 246 -247 18 -1241 873 565 -153
6655 -153 153 -72 566 102 620 383 -47 941 137 -100 -301 -205 380 -314 879 -648 -796 220 504
6674 504 185 -526 14 -243 532 87 -139 -280 513 281 -1379 9 -168 -193 65 269 63 -1251 47
6693 47 61 1271 404 -182 -143 -318 -542 624 294 -1056 732 250 753 -621 39 -328 525 1210 358
6712 358 -50 -30 451 -363 -58 601 -109 736 356 332 -211 -226 299 -1112 -64 -75 206 1021 480 -181 -943
6733 -943 911 409 -370 437 412 381 -763 464 35 540 824 -433 -1016 -1083 215 217 -1046 -188 1002
6752 1002 -1515 614 -655 959 1333 388 -1282 -63 129 172 436 -98 -649 -140 -41 -473 -320 455
6770 455 256 -713 850 834 -82 -266 386 -161 6 -40 681 786 -114 433 -285 454 28 375 -241 -146 -124
6791 -124 416 -79 901 -141 69 -127 -179 -124 125 -891 -4 792 184 754 -1023 384 -72 126 505
6810 505 190 -16 859 -360 270 586 -994 -191 -297 197 -400 824 -753 14 -643 260 950 281 -764
6829 -764 -682 286 624 -194 -750 145 28 3 1051 486 -179 -610 -207 632 -686 48 -463 121 -133 -482
6849 -482 865 317 -642 -118 -1103 -371 164 555 -565 -318 -275 445 490 -474 579 -379 16 82 -317 -476
6869 -476 -184 -829 -1249 474 -66 -488 -88 669 1133 189 4 -56 -384 -648 551 -112 391 -882 430
6888 430 -472 -325 -339 81 755 -604 -615 -691 -148 668 496 765 -128 130 -366 215 160 -644 -131 59 457
6909 457 522 448 -158 -263 -493 175 -170 -568 -1052 635 -210 271 -141 -186 -264 -30 -164 214 310 74 -400
6930 -400 -185 -318 505 -528 -526 66 -108 1251 -275 -283 -428 107 718 369 -1155 438 659 486 -66 -582
6950 -582 87 383 -97 -913 -857 -539 1095 605 213 114 -452 362 125 -240 -135 107 475 108 -482 -55
6970 -55 -389 677 -404 -1073 -188 -205 -288 510 258 -389 173 59 70 1319 -607 -825 577 668 -25 -1540
6990 -1540 -1289 -29 163 -101 363 -504 -536 -958 729 1113 -319 591 58 457 504 -562 143 -533 514
7009 514 -52 -94 101 -786 -48 72 324 -829 -218 -584 -194 -591 -295 594 282 299 277 222 578 794 -541
7030 -541 -389 149 544 182 -152 -17 -512 381 -307 379 -157 161 -427 -636 310 -84 -281 -29 171 -407
7050 -407 117 -108 375 5 -247 -126 -76 -663 120 308 -274 286 413 -1015 634 330 -382 -545 375 -547
7070 -547 543 729 -399 81 -818 76 -362 28 106 -136 -528 -401 -10 -777 -215 -1706 276 662 -179
7089 -179 780 -592 -139 -152 181 -1527 -55 -35 -6 210 -875 312 -85 -655 -370 349 -399 -139 26
7108 26 -252 -497 372 -949 339 24 -346 377 234 280 65 551 -69 678 285 866 -395 -377 -347 -748
7128 -748 -97 468 -342 -1130 -753 113 -344 -482 275 106 1007 113 324 136 -49 448 -110 -282 224 357
7148 357 -405 -733 -78 165 -162 -193 -878 736 289 364 58 -247 -637 -659 -108 347 377 -176 207 523 21
7169 21 749 70 161 -352 -284 413 -805 520 -238 7 55 -492 306 669 166 -530 -725 -552 -249 -445 24
7190 24 609 127 491 -586 651 -31 -514 463 -927 -329 -346 274 -201 537 -195 -193 271 711 -841 531
7210 531 296 101 356 -365 527 558 360 -325 200 -394 -752 -44 0 -409 239 577 627 258 -122 -65 131
7231 131 -21 -522 -849 237 410 10 -1005 -767 120 141 -265 -482 408 58 -967 -32 491 306 -60
7250 -60 -24 -497 -310 -545 939 -257 -451 -277 184 258 -110 91 -224 -686 463 688 383 -309 142 497
7270 497 -505 -257 -378 5 1089 181 411 221 428 1121 23 32 402 -893 418 237 357 -1629 -727
7289 -727 -32 1001 -850 369 -157 487 625 581 -481 -265 1 -118 192 -151 -1163 395 -432 309
7307 309 1340 666 532 -37 38 180 343 19 1 -211 196 -289 71 -493 915 -344 219 -213 800
7326 800 -1389 -112 688 -1086 -694 -438 293 -100 629 -31 175 -226 50 -449 -784 -519 196 606 690
7345 690 -510 -596 -246 -46 357 209 483 -379 394 291 -1093 -661 277 67 -469 561 -537 76 -63
7364 -63 -634 651 441 547 520 -706 -876 -232 -406 -1109 -577 319 -188 148 -178 -339 -88 -116 -149 -752 277
7385 277 701 789 -637 -673 -181 -89 704 -652 864 686 -949 752 48 -779 656 321 1088 839 765
7404 765 531 -1323 -72 641 958 -406 -120 111 675 259 966 323 766 538 -646 152 -862 535
7422 535 305 -851 267 181 -591 -757 -756 387 -62 479 -288 288 -98 139 -76 1510 -752 1142 364
7441 364 727 451 145 337 -217 414 -150 -254 1179 145 -198 194 -464 741 153 309 -122 534 35
7460 35 801 8 -404 916 -85 440 278 -99 -56 -308 -541 220 -22 542 -10 -421 151 -284 -401 -178
7480 -178 -267 69 -45 1130 209 104 623 135 273 -7 290 155 -400 -339 -40 -300 -399 671 926 665
7500 665 133 42 361 425 461 -132 342 -446 -191 -69 -600 -241 -572 134 -92 37 1044 594 -320 -802 199
7521 199 605 -410 -38 -722 920 1746 -414 843 465 -251 968 354 -429 411 -126 -294 -296 71 698
7540 698 57 -137 871 977 4 -221 -325 1089 190 -518 -611 -242 -488 414 467 363 -438 171 335 -164
7560 -164 -57 190 218 450 -24 458 -224 -205 397 838 231 -539 -778 438 -686 -1021 652 456 -361 -1184
7580 -1184 127 136 456 -150 440 -382 136 557 10 -743 -412 146 428 -87 -53 -10 -167 503 -641 -84
7600 -84 408 150 410 151 438 939 191 211 1431 108 -1989 -647 -100 -563 -128 -554 -254 -137 -997
7619 -997 826 74 -49 725 428 -658 160 -890 -520 104 -462 233 -435 -360 -792 233 384 333 91
7638 91 -115 -658 198 -96 349 169 339 -94 -390 428 590 884 240 -52 -412 -685 283 -216 -226 507 -1023
7659 -1023 -54 -326 1000 729 -94 754 -605 -197 -292 500 -518 -550 498 -169 -214 247 -565 -718 -822
7678 -822 -126 -57 319 772 -44 262 602 579 -157 -248 592 -831 -786 -168 -729 361 -924 -292 -350 232 619
7699 619 -925 -298 -11 -57 -782 20 -59 -740 -744 -291 548 -181 -33 -43 987 334 -1123 774 -87 -592
7719 -592 -704 -280 382 -222 -599 -301 -283 615 280 807 -119 -452 1174 19 -65 -413 571 578 308 113 -910
7740 -910 -1145 -203 552 -471 542 -783 115 -125 834 126 -229 -203 -538 -69 -220 -204 231 -575 67 -205
7760 -205 417 -98 333 228 -337 787 178 -1201 -120 575 496 -608 -189 148 -739 170 -475 -308 -113
7779 -113 210 272 190 107 -433 -795 609 11 -372 -622 446 250 -410 -7 -513 -790 283 504 -199 43
7799 43 139 953 -71 155 362 129 559 -554 83 -254 -589 -765 576 -281 580 -789 -372 -656 787
7818 787 351 773 300 -262 1487 -752 -223 -473 616 -47 154 43 552 -927 -7 720 -902 -514
7836 -514 -580 79 -544 611 124 -99 -253 155 -63 739 -556 -364 -357 -288 394 410 -608 934 -547 -202
7856 -202 -2 44 -433 -561 -53 -247 285 -439 -64 484 -21 38 -1054 -73 -462 -250 99 -642 159 -80
7876 -80 86 -221 188 769 10 -815 -1068 -410 62 -702 678 417 -69 446 33 220 -16 322 -587 -369
7896 -369 1242 -804 461 -581 -234 -65 -792 -64 -417 -245 -77 -158 726 -249 -729 298 -439 1276
7914 1276 301 543 1079 -53 734 -367 486 -235 370 834 306 -629 882 52 -156 -6 -283 60 -382
7933 -382 -193 -338 -376 298 -34 865 1155 -208 185 -235 5 18 -418 348 -248 263 207 -302 527 -462 845
7954 845 -93 223 913 141 185 -155 120 115 -352 244 -521 -215 369 215 6 457 153 -704 -26 -383 312
7975 312 -261 138 -867 181 311 -295 -755 470 176 282 -292 401 -353 277 270 -488 424 885 219 710
7995 710 -420 -214 -1235 -970 225 27 -597 -225 188 -315 -109 -806 337 963 865 -869 1244 462
8013 462 252 480 877 -310 -307 221 -330 80 821 33 -982 -299 24 -264 23 -316 6 223 99 708
8033 708 -152 147 6 477 -67 147 -456 -480 1047 -629 772 528 403 -60 -30 137 547 -95 687 81
8053 81 383 44 496 57 -357 66 497 -644 -475 42 -667 213 -142 5 -37 0 602 934 -912 -418
8073 -418 -578 517 151 287 -672 430 541 489 -161 218 -31 64 -33 558 -264 250 -454 -216 -27 804
8093 804 733 -77 413 368 10 150 172 -311 -590 -284 -1011 178 1063 -99 -254 231 -24 -386 -419 218 104
8114 104 -182 152 -781 -173 434 -41 706 12 330 -11 76 -81 -616 1039 -133 -383 51 857 304 -272
8134 -272 403 297 41 264 273 -406 370 171 382 218 460 117 459 -150 48 -89 471 181 -668 2 -457
8155 -457 -323 -224 457 946 214 478 468 -173 -870 -571 -642 1027 198 314 -195 469 -137 -97 60 -190 1267
8176 1267 -362 165 705 81 -425 71 -184 490 -272 -233 -765 -815 -620 19 341
8191C41
##END NTUPLES=NMR FID
##END=
