##TITLE=1H_AT-40_2
 DMSO-d6, CD3ONa
 124 sc, 
 22.08.2022
##JCAMPDX= 6.0         $$ Bruker NMR JCAMP-DX V2.0
##DATA TYPE= NMR FID
##DATA CLASS= NTUPLES
##ORIGIN= UXNMR, Bruker Analytische Messtechnik GmbH
##OWNER= root
$$ XWIN-NMR		Version 3.5
$$ Mon Aug 22 12:07:16 2022 Russian Standard Time (UT+4h)  she@DPX200
##.OBSERVE FREQUENCY= 200.1313499994
##.OBSERVE NUCLEUS= ^1H
##.DELAY= (6, 6)
##.ACQUISITION MODE= SIMULTANEOUS
##.ACQUISITION SCHEME= undefined
##.AVERAGES= 124
##.DIGITISER RES= 18
##SPECTROMETER/DATA SYSTEM= spect
##.PULSE SEQUENCE= zg30
##.SOLVENT NAME= DMSO
##.SHIFT REFERENCE= (INTERNAL, DMSO, 0, 15.7039)
##AUDIT TRAIL= $$ (NUMBER, WHEN, WHO, WHERE, WHAT)
$$ ##TITLE= Audit trail, XWIN-NMR		Version 3.5
$$ ##JCAMPDX= 5.01
$$ ##ORIGIN= Bruker BioSpin GmbH
$$ ##OWNER= she
$$ F:/spectra/data/she/nmr/H-F/1/audita.txt
$$ ##AUDIT TRAIL=  $$ (NUMBER, WHEN, WHO, WHERE, WHAT)
(   1,<2022-08-22 12:03:32.51 +0400>,<she>,<DPX200>,
      <created by zg, POWCHK disabled, PULCHK disabled
       configuration hash MD5:
       00 E9 B6 7A A2 85 ED C7 34 08 36 98 17 FE 4E 26
       data hash MD5: 16K
       5A F1 9D 0C 1C B0 59 AE E9 EA 8B 8A F5 BE 19 4E>)
$$ ##END=
$$ 
$$ hash MD5
$$ A1 42 11 A3 28 C3 BB 8D 14 21 8B 8A 0D C0 AA 7B
##$RELAX= 
##$RELAX= 
##$RELAX= 
##$RELAX= 
##$RELAX= 
##$RELAX= 
$$ Bruker specific parameters
$$ --------------------------
##$DU= <F:/spectra>
##$EXPNO= 1
##$NAME= <H-F>
##$PROCNO= 1
##$TYPE= <nmr>
##$USER= <she>
##$AMP= (0..31)
100 100 100 100 100 100 100 100 100 100 100 100 100 100 100 100 100 100 
100 100 100 100 100 100 100 100 100 100 100 100 100 100 
##$AQSEQ= 0
##$AQ_mod= 1
##$AUNM= <au_zg>
##$AUTOPOS= <>
##$BF1= 200.13
##$BF2= 200.13
##$BF3= 200.13
##$BF4= 200.13
##$BF5= 200.13
##$BF6= 200.13
##$BF7= 200.13
##$BF8= 200.13
##$BYTORDA= 1
##$CFDGTYP= 0
##$CFRGTYP= 5
##$CHEMSTR= <none>
##$CNST= (0..31)
1 1 145 1 1 1 1 1 1 1 1 1 1 1 1 1 1 1 1 1 1 1 1 1 1 1 1 1 1 1 1 1 
##$CPDPRG= <>
##$CPDPRG1= <>
##$CPDPRG2= <>
##$CPDPRG3= <>
##$CPDPRG4= <mlev>
##$CPDPRG5= <mlev>
##$CPDPRG6= <mlev>
##$CPDPRG7= <mlev>
##$CPDPRG8= <mlev>
##$CPDPRGB= <>
##$CPDPRGT= <>
##$D= (0..31)
0 1.2 0 0 0 0 0 0 0 0.06 0 0.03 0 0 0 0 0.0002 0 0 0 0 0 0 0 0 0 0 0 0 
0 0 0 
##$DATE= 1661155411
##$DBL= (0..7)
120 120 120 120 120 120 120 120 
##$DBP= (0..7)
150 150 150 150 150 150 150 150 
##$DBP07= 0
##$DBPNAM0= <>
##$DBPNAM1= <>
##$DBPNAM2= <>
##$DBPNAM3= <>
##$DBPNAM4= <>
##$DBPNAM5= <>
##$DBPNAM6= <>
##$DBPNAM7= <>
##$DBPOAL= (0..7)
0.5 0.5 0.5 0.5 0.5 0.5 0.5 0.5 
##$DBPOFFS= (0..7)
0 0 0 0 0 0 0 0 
##$DE= 6
##$DECBNUC= <off>
##$DECIM= 32
##$DECNUC= <off>
##$DECSTAT= 4
##$DIGMOD= 1
##$DIGTYP= 9
##$DL= (0..7)
0 120 120 120 120 120 120 120 
##$DP= (0..7)
150 150 150 150 150 150 150 150 
##$DP07= 0
##$DPNAME0= <>
##$DPNAME1= <>
##$DPNAME2= <>
##$DPNAME3= <>
##$DPNAME4= <>
##$DPNAME5= <>
##$DPNAME6= <>
##$DPNAME7= <>
##$DPOAL= (0..7)
0.5 0.5 0.5 0.5 0.5 0.5 0.5 0.5 
##$DPOFFS= (0..7)
0 0 0 0 0 0 0 0 
##$DQDMODE= 0
##$DR= 18
##$DS= 0
$$ [...]
##$SUBNAM2= <"">
##$SUBNAM3= <"">
##$SUBNAM4= <"">
##$SUBNAM5= <"">
##$SUBNAM6= <"">
##$SUBNAM7= <"">
##$SUBNAM8= <"">
##$SUBNAM9= <"">
##$SW= 18.0517283424941
##$SWIBOX= (0..15)
0 0 2 0 0 0 0 0 0 0 0 0 0 0 0 0 
##$SW_h= 3612.71676300578
##$TD= 16384
##$TD0= 1
##$TE= 0
##$TE2= 300
##$TE3= 300
##$TEG= 300
##$TL= (0..7)
0 120 120 120 120 120 120 120 
##$TP= (0..7)
150 150 150 150 150 150 150 150 
##$TP07= 0
##$TPNAME0= <>
##$TPNAME1= <>
##$TPNAME2= <>
##$TPNAME3= <>
##$TPNAME4= <>
##$TPNAME5= <>
##$TPNAME6= <>
##$TPNAME7= <>
##$TPOAL= (0..7)
0.5 0.5 0.5 0.5 0.5 0.5 0.5 0.5 
##$TPOFFS= (0..7)
0 0 0 0 0 0 0 0 
##$TUNHIN= 0
##$TUNHOUT= 0
##$TUNXOUT= 0
##$USERA1= <user>
##$USERA2= <user>
##$USERA3= <user>
##$USERA4= <user>
##$USERA5= <user>
##$V9= 5
##$VALIST= <valist>
##$VCLIST= <CCCCCCCCCCCCCCC>
##$VD= 0
##$VDLIST= <DDDDDDDDDDDDDDD>
##$VPLIST= <PPPPPPPPPPPPPPP>
##$VTLIST= <TTTTTTTTTTTTTTT>
##$WBST= 1024
##$WBSW= 4
##$XGAIN= (0..3)
0 0 0 0 
##$XL= 0
##$YL= 0
##$YMAX_a= 2058070
##$YMIN_a= -2288667
##$ZGOPTNS= <>
##$ZL1= 120
##$ZL2= 120
##$ZL3= 120
##$ZL4= 120
##$ABSF1= 10
##$ABSF2= 0
##$ABSG= 5
##$ABSL= 3
##$ALPHA= 0
##$AQORDER= 0
##$ASSFAC= 0
##$ASSFACI= 0
##$ASSFACX= 0
##$ASSWID= 0
##$AUNMP= <proc_1d>
##$AZFE= 0.1
##$AZFW= 0.1
##$BCFW= 1
##$BC_mod= 2
##$BYTORDP= 1
##$COROFFS= 0
##$CY= 11.3945322036743
##$DATMOD= 1
##$DC= 2
##$DFILT= <>
##$DTYPP= 0
##$F1P= 2.36226072786647
##$F2P= -0.459571619588291
##$FCOR= 0.5
##$FTSIZE= 0
##$FT_mod= 4
##$GAMMA= 1
##$GB= 0.15
##$INTBC= 1
##$INTSCL= 1
##$ISEN= 128
##$LB= 0.24
##$LEV0= 0
##$LPBIN= 0
##$MAXI= 10000
##$MC2= 0
##$MEAN= 0
##$ME_mod= 0
##$MI= 1.114404
##$NCOEF= 0
##$NC_proc= 0
##$NLEV= 6
##$NOISF1= 3.799351
##$NOISF2= 2.8
##$NSP= 1
##$NTH_PI= 0
##$NZP= 0
##$OFFSET= 15.70392
##$PC= 1
##$PHC0= -18047.57
##$PHC1= 17.60068
##$PH_mod= 1
##$PKNL= yes
##$PPARMOD= 0
##$PSCAL= 0
##$PSIGN= 0
##$REVERSE= no
##$SF= 200.130013532006
##$SI= 16384
##$SIGF1= 3
##$SIGF2= 2
##$SINO= 400
##$SIOLD= 16384
##$SREGLST= <1H.CDCl3>
##$SSB= 0
##$STSI= 0
##$STSR= 0
##$SW_p= 3612.71676300578
##$SYMM= 0
##$S_DEV= 0
##$TDeff= 0
##$TDoff= 0
##$TI= <>
##$TILT= no
##$TM1= 0
##$TM2= 0
##$TOPLEV= 0
##$USERP1= <user>
##$USERP2= <user>
##$USERP3= <user>
##$USERP4= <user>
##$USERP5= <user>
##$WDW= 1
##$XDIM= 8192
##$YMAX_p= 0
##$YMIN_p= 0
$$ End of Bruker specific parameters
$$ ---------------------------------
##NTUPLES= NMR FID
##VAR_NAME=  TIME,          FID/REAL,        FID/IMAG
##SYMBOL=    X,             R,               I
##VAR_TYPE=  INDEPENDENT,   DEPENDENT,       DEPENDENT
##VAR_FORM=  AFFN,          ASDF,            ASDF
##VAR_DIM=   8192,          8192,            8192
##UNITS=     SECONDS,       ARBITRARY UNITS, ARBITRARY UNITS
##FACTOR=    0.0002768,     1,               1
##FIRST=     0,             0,               0
##LAST=      2.2672688,     0,               0
##MIN=       0,             -2288667,        0
##MAX=       2.2672688,     2058070,         0
$$ Real data points
##PAGE= N=1
##DATA TABLE= (X++(R..R)), XYDATA
0@%%%%%%%%%%%%o3J87k48K48k48L38m62M96o20P44q68J056j180J364j615J886
$$ 0 0 0 0 0 0 0 0 0 0 0 0 0 -63 124 -124 124 -124 214 -248 248 -372 372 -496 560 -620 744 -871 1015
28A015k217K569k945L369l825M342m918N546o234O998p840Q755r758J0855j2050
$$ 1015 -1202 1367 -1578 1791 -2034 2308 -2610 2936 -3298 3700 -4140 4615 -5143 5712 -6338
43f338J3365j4800J6367j8076J9939k1984K4228k6674K9375l2384L5712l9417
$$ -6338 7027 -7773 8594 -9482 10457 -11527 12701 -13973 15402 -16982 18730 -20687
55b0687M3576m8290N3659n9842O7066p5623Q5965r8771J15085j36675J66808k12130
$$ -20687 22889 -25401 28258 -31584 35482 -40141 45824 -52947 62138 -74537 92271 -119859
67a19859K88831m52273J454833j639278r29684L455500j278128k189987J262191
$$ -119859 168972 -283301 1171532 -467746 -1397430 2058070 779942 -1410045 -147854
76a47854J314022j373146r2646P30908m73043n39331R43344K51646q90393k4523
$$ -147854 1166168 -206978 -299624 431284 -41759 -581090 362254 613900 -276493 -301016
86c01016J161750m70091j598037N11255J877558o18311j695787P87174J537617
$$ -301016 860734 390643 -1207394 -696139 1181419 563108 -1132679 -345505 1192112
95A192112j043371j327476J167872J174500j209431q95838R14793K11421p47049
$$ 1192112 148741 -1178735 -10863 1163637 -45794 -941632 -26839 184582 -562467
104e62467N69501N69370r31576O3351J233095q25681j350550J372284J138476
$$ -562467 7034 576404 -355172 -291821 941274 115593 -1234957 137327 1275803
113A275803j741521p75153J813097K95416j803076M8068J724854o4530j279970
$$ 1275803 -465718 -1240871 572226 867642 -935434 -887366 837488 772958 -507012
122e07012K06592Q12304m11255m49431M58479L064m41256M43141L34424q35204
$$ -507012 -300420 511884 100629 -348802 109677 112741 -328515 114626 449050 -386154
132c86154j10879J218469o3056j431676K19876J425489m72613j385201O76407
$$ -386154 -497033 721436 658380 -773296 -553420 872069 399456 -985745 -309338
141c09338J269468p92764r99592Q95873O91141q70878l13194P32671p4174n04248
$$ -309338 960130 167366 -832226 63647 754788 -116090 -429284 303387 229213 -275035
151b75035L36859N2045o59737L67038Q89220o74791q95545R92819Q35984j185475
$$ -275035 61824 113869 -545868 -178830 710390 35599 -859946 132873 968857 -216618
161b16618o62591J265434L83502j305559j61282J188417m8612r42909K41286O23747
$$ -216618 -879209 386225 769727 -535832 -697114 491303 442691 -500218 -258932 364815
171C64815l53090k34363M11701j36565l63774M81280K27647q07544p8074J037119
$$ 364815 11725 -222638 189063 52498 -311276 170004 397651 -409893 -487967 549152
181E49152p3865j123173K78228J160579m42539j124352N18096R48815n78833p05495
$$ 549152 475287 -647886 -369658 790921 348382 -775970 -257874 690941 112108 -593387
191e93387N91135M04559n52878p9145M87010j70087k82645M02102j0697o04520
$$ -593387 -2252 402307 -150571 -229716 257294 87207 -195438 206664 195967 -408553
201d08553L03728P02839o01730p23214Q19675O25900r75542m59155J057715L06406
$$ -408553 -104825 598014 -3716 -726930 92745 718645 -256897 -716052 341663 648069
211F48069r85812j19711Q14033p0409o07591K05813L53604k78595o7470K90157
$$ 648069 -337743 -457454 356579 286170 -321421 -115608 237996 -40599 -108069 182088
221A82088k32939k74224M96023K24205o85364j10119Q06534o1224q91219K30754
$$ 182088 -50851 -325075 170948 395153 -290211 -400330 406204 344980 -546239 -315485
231c15485R26932l57941q67467M49905P23137m91540n02581M85473K41120m28520
$$ -315485 611447 253506 -613961 -164056 559081 67541 -435040 50433 291553 -136967
241a36967J3002K84335k65063r4228M73473j04336n74829L25560N99630n29237
$$ -136967 -123965 160370 -104693 -198921 274552 170216 -404613 -79053 520577 -8660
251h660n46426O91124M46055p87075l31251P73396J71341p02972j8148N84532
$$ -8660 -555086 136038 582093 -204982 -536233 237163 408504 -294468 -312616 271916
261B71916r3710m07897J71971K06707k01681L4502K09813k63906k01685M50340
$$ 271916 178206 -229691 -57720 148987 -52694 -18192 191621 -72285 -273970 176370
271A76370J47288n97738o1816O98503l8746p35922J44759P05217k54330o19541
$$ 176370 323658 -274080 -335896 362607 323861 -412061 -267302 437915 183585 -435956
281d35956L44516M84042l96024l18547L86422J35588l00264P3922J79120k64229
$$ -435956 -91440 392602 -3422 -321969 64453 200041 -100223 -26301 152819 -111410
291a11410l4418L94368j42906m76840L14629M91755m64221m57072N73025L82860
$$ -111410 -145828 248540 105634 -371206 -56577 435178 -29043 -486115 86910 469770
301D69770o01494k52461N83479J11258n23889P844M04773j13151k61569J81078
$$ 469770 -131724 -384185 199294 310552 -213337 -205493 199280 86129 -175440 5638
311E638Q8465k17536Q3730K22085k37189j72894L91207J06001n19878l9398N95066
$$ 5638 94103 -123433 -39703 182382 -54807 -227701 163506 269507 -250371 -289769 305297
322C05297l9179o06385J30214N64718k15764m77482K80371L45485l04360j81788
$$ 305297 266118 -340267 -210053 354665 138901 -338581 -58210 287275 -17085 -198873
332a98873K84591k156k32957J64382J37923k83615Q877L74408j59153m09846K96518
$$ -198873 85718 83562 -149395 14987 152910 -130705 -121828 252580 93427 -316419 -19901
343a9901L91749m08019l35708M68467K37806m88861j41107M56503N4566l61089
$$ -19901 371848 -36171 -371879 96588 334394 -154467 -295574 160929 215495 -145594
353a45594L6899K48640j14437j26297J63624J415j86979J19700J81709k44987
$$ -145594 -108695 139945 25508 -100789 62835 64250 -122729 -3029 178680 -66307
363f6307j64743L42526J21867m07220l8325M59703n1877m77419J26733M33933
$$ -66307 -231050 111476 233343 -173877 -212202 247501 195624 -281795 -155062 278871
373B78871j96044l41017K48392K20682k62835q2834K27659o0839j52400J87207
$$ 278871 82827 -258190 -9798 210884 -51951 -134785 92874 32035 -120365 66842
383F6842N6417k85838M4375L29289j49254l30035K47688L02925l07547k40983
$$ 66842 123259 -162579 -118204 211085 61831 -268204 -20516 282409 -25138 -266121
393b66121L46210J67474l51175q8438L16228O336k71315N3426J95706r7369q9248
$$ -266121 80089 247563 -103612 -192050 124178 130514 -140801 -87375 108331 10962 -78286
404g8286J47827j6840j77620J20442J80523k19287j55153L10560J04744l76348
$$ -78286 69541 52701 -124919 -4477 176046 -43241 -198394 112166 216910 -159438
414a59438l9930L88799m4950l62526J37327L10631j93198k21432K13610J01070
$$ -159438 -199368 189431 144481 -218045 -80718 229913 36715 -184717 28893 129963
424A29963k15549P562J82827r5358j08995J78175K5870k38334N2121K63724j32569
$$ 129963 -85586 -78024 104803 9445 -99550 78625 104495 -133839 -81718 182006 49437
435D9437k63812J96855K35150k46041j90100K65219J27782k52669m6873K27679
$$ 49437 -214375 -17520 217630 -28411 -218511 46708 174490 -78179 -125052 102627
445A02627k1980j85223P4992J22206j21456n6194J43068k9388j56091J23144J61563
$$ 102627 80647 -104576 -29584 92622 -28834 -85028 58040 28652 -127439 -4295 157268
456A57268j90657j22895K47875N9819k95068O41L06664n4524k63660J13172J94072
$$ 157268 -33389 -156284 91591 151410 -143658 -143017 163647 109123 -154537 -41365 152707
467A52707j63269j28392J79467N7653j54297L3867J22458j23276r8152J71810
$$ 152707 -10562 -138954 40513 98166 -56131 -22264 100194 -23082 -121234 50576
477E0576M5134j91165M1526K12115j16857k08589J65579J73578j98936j22827
$$ 50576 95710 -95455 -53929 158186 41329 -167260 -1681 171897 -27039 -149866
487a49866K07515N9881k04040r037J79709k8536j28940P5331P1460j21576j8053
$$ -149866 57649 117530 -86510 -95547 84162 55626 -73314 2017 73477 -48099 -66152
498f6152J47855l9327j44782J05356J15238j82953q5785K25191N1911k20818J7484
$$ -66152 81703 42376 -102406 2950 118188 -64765 -150550 74641 126552 -94266 -76782
509g6782K02100r1511j87493J26255J47119j25195p5332J33915N46j34928N8878
$$ -76782 125318 33807 -153686 -27431 119688 -5507 -80839 53076 53622 -81306 -22428
520b2428J08788j10262n7978J56994p29j87590M9461J81235r0725j45672J34127
$$ -22428 86360 -23902 -81880 75114 74385 -113205 -63744 117491 26766 -118906 15221
531A5221J05861j58072o5575J67088L3054j51362l3J16527n3361q9617J01096
$$ 15221 121082 -36990 -102565 64523 97577 -53785 -53818 62709 9348 -80269 20827
542B0827O0514j17249p107J21845o5814j23714J19742J07104j50251o2251J64949
$$ 20827 81341 -35908 -43015 78830 13016 -110698 9044 116148 -34103 -96354 68595
553F8595N510j73562L4997J61110o1741j21413R0569P0949j19648k8188J28754
$$ 68595 74105 -99457 -64460 96650 34909 -86504 4065 75014 -44634 -72822 55932
564E5932j4022j11722O4822Q0054j06927l8535J38656m170j46785M0260J25877
$$ 55932 41910 -69812 -4990 75064 -31863 -70398 68258 64088 -82697 -42437 83440
575H3440p9484r9419J08892P6787j19142m7762J16193J0131j09518L4507J04472
$$ 83440 3956 -95463 13429 90216 -28926 -76688 39505 49636 -59882 -25375 79097
586G9097o5475q0061R0009L0123j14548J7110J25326n7165j02588R2351O4502
$$ 79097 13622 -66439 23570 53693 -60855 -43745 81581 24416 -78172 14179 78681
597G8681j24128k5606J38026o334j33037L5837J10151o2885p6856Q9726M1951
$$ 78681 -45447 -71053 66973 60639 -72398 -36561 73590 10705 -66151 23575 65526
608F5526j07960m469J02299l6828q5669P0750N8010r4387k3643J02865j1311r8584
$$ 65526 -42434 -46903 55396 18568 -67101 3649 61659 -32728 -56371 46494 35183 -63401
620f3401M7358R2313o7471p8399P4497N0914q6929j8584R7084r665r5891L6473
$$ -63401 -16043 76270 8799 -69600 4897 55811 -31118 -49702 47382 37717 -58174 -21701
632b1701P9549o3280m9057Q7903J2379r7128K4792R2513n8727p4640Q1507M8497
$$ -21701 57848 -5432 -54489 33414 45793 -51335 -26543 65970 7243 -67397 14110 62607
644F2607r4719j8892R9655j2448r4552M0953P9014o8132n5847Q3755K4807q3896
$$ 62607 -32112 -51004 48651 36203 -58349 -17396 61618 -6514 -62361 21394 46201 -37695
656c7695J2155Q0044m5934o3400O5949M0178p6664j5515P9698j5011p5185L6505
$$ -37695 -25540 54504 8570 -54830 11119 51297 -25367 -40882 38816 23805 -51380 -14875
668a4875O9534n1127n2197O2215L0273p2959n189P8844k3505p3311M5747N5608
$$ -14875 54659 3532 -48665 13550 43823 -29136 -34325 44519 21014 -52297 -6550 49058
680D9058o4965k9062P7553K12p7590K7992O7311n2817n1003O9091L3011p5405
$$ 49058 -15907 -44969 32584 32796 -44794 -16802 50509 -2308 -53311 15780 48791 -26614
692b6614o741P3311k1652o5636M8082N3530o4889l3877O8415N277o7840K2922
$$ -26614 -33355 39956 18304 -47332 750 54280 -10609 -44486 23929 29206 -38634 -15712
704a5712N9505m3460m4910N6273K6289n8792o234O0676j4091n8920L0497M6759
$$ -15712 43793 333 -44577 11696 37985 -20807 -27041 33635 19544 -39376 -8879 37880
716C7880m6146l3047N9692J7991o5290L913O0209k6752m7100M6974L2018o0596
$$ 37880 -8266 -41313 18379 36370 -28920 -25007 35202 8450 -38650 8324 40342 -20254
728b0254j5404O2453n548n5245K8053M5895m5952l2992N3813J7020n8302N925
$$ -20254 -35658 26795 21247 -33998 -5945 39950 -6002 -38994 14819 31839 -26463 -20538
740b0538N4664k3290m8031M1122L3216n0818j3054N2943n120n3553K1940M3701
$$ -20538 34126 10836 -37195 3927 37143 -13675 -26729 26214 21094 -32459 -10519 33182
752C3182l4590l0929M5295J5390n2486j61N1026j3726m1442L0799L1112m5331
$$ 33182 -1408 -32337 12958 28348 -24138 -24299 26727 13001 -28441 2358 33470 -11861
764a1861k0574N2791K915m9217J4171M3911l2436l2298M2447J8517m7301k499
$$ -11861 -32435 20356 23271 -25946 -11775 32136 -300 -32598 9849 28366 -18935 -21434
776b1434M5535j2733m1460K6800L2327l6687j7313M3705K034m5313R886M0929
$$ -21434 24101 11368 -30092 -3292 29035 -7652 -24965 18740 20774 -24539 -14653 26276
788B6276k1668l0543L2697J8209m2147m707M3889o424l7143K0214K7285l1329
$$ 26276 4608 -25935 6762 24971 -17176 -21883 22006 15582 -21561 -1347 25938 -5391
800e391k0049L9608O123l8331N974L6672k0031l2038K8949K2024l4249q431L8835
$$ -5391 -25440 14168 20291 -18040 -12066 24606 4575 -27463 1486 23510 -10739 -19170 19665
813A9665n228l8279J7352L0064k5147j9777L3010O529l7821O269L6430j7526l0405
$$ 19665 14437 -23842 -6490 23574 -1573 -21350 11660 18189 -19632 -13363 23067 5541 -24864
826b4864K7081K0119l3944q981L8339k948l4251J4058K6928k3637j8658K9045
$$ -24864 2217 22336 -11608 -20589 17750 14802 -19449 -5391 21537 -2100 -20758 8287
838H287R867l1230K672K9164j3862k5523K1036J7852k5269q985L0438k077l1852
$$ 8287 18154 -13076 -10404 18760 4898 -20625 411 18263 -7006 -15991 14447 12370 -19482
851a9482J1494K6745j7655k1065K6826J2233l0974j978K8367r835k3630J9000
$$ -19482 -7988 18757 1102 -19963 6863 19096 -11878 -13856 14511 4676 -18954 46
863D6J7607k3899q859K8052q84k8550J0205K3527j9014j7775K6955J0179k9554
$$ 46 17653 -6246 -15105 12947 12063 -16487 -6282 17245 -1769 -19544 7411 17590 -11964
876a1964o08K7116q890k4422J6257J8119j8468r761K3051J504k5546O588K0615
$$ -11964 -12572 14544 5654 -18768 -2511 15608 -2860 -12621 10430 11934 -13612 -7024 13591
889A3591j3184j3826K0100Q985k5832k115K4192n268k3474J4413K0275j8976j3452
$$ 13591 407 -13419 6681 15666 -10166 -12281 11911 6643 -16831 -2418 17857 -1119 -14571
902a4571K1705L659k2263M243K0729r276j6158J5571Q817k3345O44K1419o906
$$ -14571 7134 10793 -11470 -7227 13502 4226 -11932 3639 12456 -10889 -10245 11174 4268
915D268k0765J5788J6757j9941j0199K3243K385k4296M018K1256r094j4341J3452
$$ 4268 -16497 -709 16048 -3893 -14092 9151 11536 -12760 -8742 12514 3420 -10921 2531
928B531R199j6329n752J6089j788j4059J0892J2873j6312j0327K0934J035k1781
$$ 2531 11730 -4599 -10351 5738 3950 -10109 783 13656 -2656 -12983 7951 8986 -12795
941a2795N790K2843j0508j8982J5302J1494j8626o026J9109O27j7026N481J2058
$$ -12795 -7005 15838 5330 -13652 1650 13144 -5482 -11508 7601 8228 -8798 -3317 8741
954H741j0310p861J5198J992j7018N177J5822j0698j4199J7575R422k1913l297
$$ 8741 -1569 -9430 5768 7760 -9258 -4081 11741 1043 -13156 4419 13841 -8072 -11369
967a1369J9180r28j6658O567J5043r061j2685J0498N059j2424J760J3792n029
$$ -11369 7811 6883 -9775 -3208 11835 2774 -9911 587 5646 -6778 -5018 8774 3745
980C745j3280J0852O718j8060L74K1396m354j9719J0354J4452j5179r784J5907
$$ 3745 -9535 1317 8035 -10025 -9651 11745 7391 -12328 -1974 12478 -2701 -12485 3422
993C422O028j5318J00J3947n101j0283P432P537j1701q50J2961m251j4983J0477
$$ 3422 9450 -5868 -5768 8179 3078 -7205 227 7764 -3937 -4787 8174 3923 -11060 -583
1007e83J3134j4490q148J5885L651j6184j53J6862m693j2789M591R458r241n312
$$ -583 12551 -1939 -10087 5798 9449 -6735 -6888 9974 5281 -7508 -2917 6541 -2700 -8012
1021h012J2229J340j0893L303R094j0902o164J5596K673j6895N002J4715r627
$$ -8012 4217 5557 -5336 -2033 7061 -3841 -10005 5591 8264 -8631 -3629 11086 1459
1034A459j4078J2273R005j0670l601R997J083j1578L670R309m690p953Q766J795
$$ 1459 -12619 -346 8659 -2011 -5612 4385 5468 -6110 -2440 6869 2179 -5774 2992 4787
1048D787j0801L578J0903q076j0325J2104O799j5194k900J4651J93j3181L959
$$ 4787 -6014 -2436 8467 391 -9934 2170 8969 -6225 -9125 5526 5719 -7462 -3503
1061c503J1976o229j0259Q428O032r079k201J0874n629q818J1221M388j3096j24
$$ -3503 8473 2244 -8015 413 6445 -2634 -4835 6039 410 -8408 2813 7201 -5895 -6019
1075f019J4229l804j3183O963J1139j0641q196J2183N708j0374l900R036n9q190
$$ -6019 8210 4406 -8777 -1814 9325 -1316 -9512 2671 8379 -1995 -5895 3141 3082 -5108
1089e108M863N698p395l684J0190J52j1435M643J0269r170q040J3519M698j5710
$$ -5108 -245 5453 -1942 -5626 4564 4716 -6719 -2076 8193 -977 -9017 4502 9200 -6510
1103f510O3J3558k497j2187O332Q596j0003l980J1125K49j0719N028Q014r511
$$ -6510 -6447 7111 4614 -7573 -1241 7355 -2648 -6628 4497 4746 -5973 -945 7069 -2442
1117b442m632J3062J068j5518L952J3357o097j1053R030P332j1418l165J0731
$$ -2442 -7074 5988 7056 -8462 -4510 8847 2750 -8303 727 8059 -3359 -6524 4207
1130D207R61r668O8R698l840p002Q174K097j1002Q62J2449m319j0758Q149Q035
$$ 4207 5168 -4500 -4432 5266 1426 -5576 2598 4695 -6307 -5445 7004 2685 -8073 76 8111
1145H111j1127m606J3222J81j3466L404J2409n604r983P774O710j1620o47J1330
$$ 8111 -3016 -7622 5600 5781 -7685 -4281 8128 2524 -7459 315 7025 -4595 -5242 6088
1159F088l271j0332P345Q067j0943j306J2473m232j3466Q422J0067q696r352R027
$$ 6088 2817 -7515 -170 7897 -3046 -4352 8121 3889 -9577 -1155 8912 216 -9136 -109
1173a09O486j0267j743J1242k558j0829O257R688q519o309R694J272j0837M468
$$ -109 6377 -3890 -5633 5609 3051 -7778 -1521 8167 -352 -6661 3033 4305 -6532 -2064
1187b064J0298p749p958R538M970j0749k025J2174k703j0551M634J0702r044q223
$$ -2064 8234 485 -7473 2065 7035 -3714 -5739 6435 3732 -6819 -2185 8517 -527 -8750
1201h750J0600L672j0377J688J1262p272r319J0067N648j2209j039J1884l755
$$ -8750 1850 5522 -4855 -3167 8095 823 -8496 1571 7219 -4990 -6029 5855 2100
1214B100r964P071J1032j1495o894J0165M233j1101O69J0261m179r149O595P334
$$ 2100 -7864 -793 10239 -1256 -8150 2015 6248 -4853 -4184 6077 1898 -7251 -656 6678
1228F678r453k747R689j19j0424N299Q666q458p339J1076L770j1352m0J0693k979
$$ 6678 -2775 -5522 4167 4048 -6376 -1077 7589 -869 -8208 2868 6638 -4714 -4754 5939 2960
1243B960j1763Q079Q887j0131o188J2344Q65j0816L300R855p275q355J1821L928
$$ 2960 -8803 -724 8163 -1968 -8156 4188 5053 -5763 -2463 7392 117 -8238 3583 7511
1257G511j1876r33J2561m682j0208P249Q007r638m934J1526J759j1111J598R125
$$ 7511 -4365 -5298 7263 2581 -7627 -378 7629 -2009 -6943 4583 6342 -4769 -3171 5954
1271E954n631q123Q785N712j0049k409J0829j442j1685O968R020r368n230J0884
$$ 5954 323 -7800 985 6697 -3352 -5761 5068 3626 -8059 -1091 7929 -1439 -6669 4215
1285D215K069j1851J209J0709m372r233Q348P355j1622l542J2192o3j2024M750
$$ 4215 6284 -5567 -4358 6351 1979 -7254 1094 8449 -3173 -6715 5477 5414 -6610 -1860
1299a860R616q459o174J0687J857j2118J517J0780l689r431P282P095r343l638
$$ -1860 7756 -703 -6877 3810 5667 -6451 -4934 5846 2157 -7274 8 7103 -2240 -5878
1313e878J0686o7j0356J938J0755o532p215R026M441j0795j808J0675p29j0862
$$ -5878 4808 4741 -5615 -3677 7078 546 -6669 2357 6798 -3997 -5805 4870 4141 -6721
1327f721N375Q855q842n475J1335J532j1808J712J1386n900r076P449P011j1224
$$ -6721 -1346 7509 -1333 -6808 4527 6059 -5749 -4037 7349 1449 -7627 -178 6833 -4391
1341d391j613J1413j056j2212O995P265o717o674J0252K271j0528K175Q008l971
$$ -4391 -6004 5409 4353 -7859 -864 6401 -316 -6990 3262 5533 -4995 -2820 5188 1217
1355A217q887Q744M960r377k342J0544j437r218L683R106o205p143Q571L784q690
$$ 1217 -7670 1074 6034 -3343 -5685 4859 3422 -5796 -2113 6993 788 -6355 2216 6000 -2690
1370b690j228R226k989r736P268O722q146l308Q627J815j1573M085Q329n917q350
$$ -2690 -3918 5308 2319 -7417 -149 6573 -1573 -4881 3746 5561 -6012 -1927 6402 485 -7865
1385g865R118L771r774K95R888k457r148N490O599p791m500R597O92j0450M189
$$ -7865 1253 5024 -4750 -4455 5433 2976 -6172 -682 5917 -1874 -6374 3223 3915 -6535 -2346
1400b346Q139m597p490P712L831p533k097Q674j461q330L556P383m995o651Q531
$$ -2346 5793 1196 -6294 1418 5249 -2284 -4381 4293 2832 -5498 -1942 5441 446 -6205 2326
1415B326L120r720J499P612l856q401Q269N618r578j570Q458m63r500M996O909
$$ 2326 5446 -4274 -2775 4837 981 -7420 849 6467 -3111 -4681 3777 3314 -6186 -1190 5719
1430E719n425n551P410K932q499l43Q389l184o490N848N187p237l092Q362q06
$$ 5719 294 -5257 2153 5085 -3414 -3757 4632 1448 -5042 806 5993 -1244 -4336 4026 3220
1445C220p806K250P399m369p280O466N058p464j388P601k0q720K946P486o380
$$ 3220 -4586 -2336 5063 694 -6586 -120 4938 -2526 -3914 3687 3667 -5053 -2107 5379 -1001
1460a001m373Q466M41p466R14R056n725o183P120M705q154j735Q518j349p055
$$ -1001 -5374 3092 3533 -3933 -3019 6037 312 -5871 1249 5954 -2200 -3935 4583 3234 -3821
1475c821K637O017m727n029O429J896p376J674O497l621o182N901M877q384j368
$$ -3821 -1184 4833 106 -4923 1506 3402 -3974 -2300 4197 576 -5606 295 5172 -3212 -4580
1490d580P754l38p682M189N575m913n265O220L943p038p53O080m65o863M345M054
$$ -4580 3174 2836 -4846 -657 4918 5 -5260 960 4903 -2135 -2888 3192 2727 -4136 209 4263
1506D263n096l508P649m90q044L941O810n433n874P582L690p596k312Q626j407
$$ 4263 -833 -4341 3308 2818 -5226 -1285 5525 92 -5782 1800 5490 -2106 -4418 4208 2801
1521B801p570M121M443m716k179M790j15m193K032N845n948l330N546K455o645
$$ 2801 -4769 -648 3795 -921 -3100 1690 1575 -2618 -586 5259 -689 -4019 1527 3982 -2663
1536b663m65N912k67o661K230O452l523n405N314K776n160j953M448q85k273L033
$$ -2663 -3128 2784 2517 -4144 -1914 4538 1015 -4390 924 3700 -1460 -3413 1035 150 -2123 910
1552I10K231n656m81O302j257o590L565O497o823l161O962K368o159k393O441
$$ 910 3141 -2515 -2996 3306 2049 -4541 -976 5521 -1302 -4463 2499 4867 -1292 -3685 2756
1567B756o10n384J993N154n206k108N114j15m912L909K209m400k159O316P75p452
$$ 2756 2146 -3238 -1245 3909 -1297 -3405 1709 1594 -3318 591 2800 -1600 -3759 2557 3332 -4120
1583d120M84O651n90o070O72P165l581m967M616L328n121L07L680k277k841M992
$$ -4120 -3636 3015 2425 -3645 -2973 4192 611 -4356 260 3588 -1533 -1226 2454 177 -2664 2328
1599B328n25n446K737N777l243p551N769N588o097m650P160K188n308k518N503
$$ 2328 1803 -3643 -906 4871 1628 -5923 -154 5434 -663 -5313 1847 4035 -1273 -3791 1712
1614A712M49m161J56L588q98j638K789j733k334K733K663m535m203P336K406p592
$$ 1712 2161 -2000 -1844 1744 846 -792 1997 264 -2070 663 3326 -1209 -5412 1924 4330 -3262
1630c262o99P236J76p344J562O129j962n864L375L581l626p58K738k475M31L576
$$ -3262 -3961 3275 3451 -3893 -2331 3798 1836 -4028 -653 2928 -698 -1456 1282 -1193 -762 2814
1646B814j371n079L267M094l458n514M335O959o371n703O151N609p056l135N572
$$ 2814 1443 -3636 -369 3725 267 -5247 -912 6047 -324 -6027 124 5733 -1323 -4458 1114
1661A114K07k546J4J980r15J076N03k338j231L009K552n899k004P445K174p858
$$ 1114 1321 -1225 -1211 769 -146 930 1433 -905 -2136 873 3425 -2474 -4478 2967 5141 -2717
1677b717j155P291Q5p531M07O846r87m984R93K698j128o83R56l42k02L136j440
$$ -2717 -3872 3419 3504 -4027 -3620 3226 2239 -2745 -1752 946 -182 -865 91 -251 -453 2683 1243
1694A243n011L067N152l875o346N640N581m955n619N776L709m377l116L227K471
$$ 1243 -3768 -701 4451 576 -5770 -130 5451 496 -5123 653 4362 -15 -3131 96 2567
1709B567k263j935J309L20J202l68k487q61M621J414o860j075O606K851q762j911
$$ 2567 304 -1631 -322 -2 1200 832 -1655 -2516 2105 3519 -3341 -4416 2190 5041 -3721 -5632
1725e632R176j07p284L86N463k28l629J77K462P24r59j10k660K400K826k216m653
$$ -5632 3544 3437 -3847 -3461 2002 1774 -1855 -1678 784 1508 549 439 -2221 179 3005 789 -3864
1742c864L735M273l658m830L552N410l363o720M914M140l336k959J414J851j25
$$ -3864 -129 4144 486 -4344 -792 4618 1255 -5465 -551 3589 253 -2706 -1292 559 434
1757D34r83n87L19J972J4k927o83M700J163o207r20P283R28p303j311N824K326
$$ 434 -549 -1136 -817 1155 1169 -1758 -2441 2259 3422 -2785 -3705 3578 4506 -2797 -4108 1716 4042
1774D042n995r31M333J30k913L91l19K154r8j670j674K612L438l655m348L831
$$ 4042 -1953 -2884 1449 1579 -1334 -943 -1262 892 794 -876 -2550 62 3500 -155 -4503 -672
1790f72N521l614n658K690O153m218m445L007M842j682n739K518L588r23k008
$$ -672 4849 1235 -4423 -1733 4420 202 -4243 -1236 3606 1924 -3815 -1297 2291 1368 -640
1805f40j082K59L756q44l327j008N238J219o328k142P524K645p587j228N072K879
$$ -640 -1722 -1463 2293 1449 -1878 -2886 2352 3571 -2757 -4899 2625 5270 -2317 -3545 1527 4406
1821D406o316q04K621K606k020j074NM18K404j971l412L000M358l662l292J805
$$ 4406 -1910 -2714 -93 2513 493 -581 -576 -158 2246 275 -3137 -137 4221 559 -2733 -928
1837i28N305l133n177K209M915k301m391J089M983j98m369j588M122K639k755
$$ -928 4377 1244 -3933 -1724 3191 890 -3501 -2412 2571 2373 -1996 -3584 538 3177 422
1852D22j626J462K492q07m168j510O068K83m852k192O787J408n645j452M645K026
$$ 422 -1204 258 2750 1943 -2225 -3735 2333 2616 -2236 -4428 2359 3767 -1878 -3330 1315 3341
1868C341l831k830K706K627r82k210j504L565J638k510l660K572N123k668m366
$$ 3341 -490 -3320 -614 2013 1031 -1179 -2683 882 2520 10 -3650 -1078 4045 1377 -2989
1883b989K091M504k635m700J309N408J30o538K606J961J533m203j273L401J301
$$ -2989 -898 3606 971 -3729 -2420 2988 3118 -3420 -814 1147 2680 -1523 -2796 605 1906
1898A906j410k635N55K404K142m836j023N421K145o126k662N321K077m188k647
$$ 1906 496 -2139 -1584 820 2962 -1874 -2897 2524 4669 -1457 -4119 1202 3279 -909 -3556
1913c556M203L347m300k361K431K483%l268j665K513L641l216l330J965M829j780
$$ -3556 647 3994 -306 -2667 -236 2247 2247 -1021 -2686 -173 3468 252 -3078 -1113 3716 1936
1929A936n277J734M969p87o381J699N797j376m200M10L339P71l254j918K339K470
$$ 1936 -3341 -1607 3362 2575 -3806 -2107 3690 2314 -1886 -1476 1863 2634 -620 -2538 -199 2271
1945B271j373l281K35L749J426l837k298M449J591m285k088L858K500m861j174
$$ 2271 898 -2383 -2148 1601 3027 -810 -3108 1341 2932 -1353 -3441 417 2917 -1944 -3118
1960c118M004J618j791l052J410K680Q47l551j432K538K603k323l436J787M615
$$ -3118 886 2504 713 -2339 -929 1751 2598 -953 -2385 153 2756 433 -3003 -1216 3399
1975C399k502m343J692N140j301n224O22N474j037l280o73L468N43j870j611J410
$$ 3399 897 -3446 -1754 3386 2085 -3139 -2517 2957 1920 -1360 -2033 1435 1978 108 -1503 -93
1991i3J827O6k526j779K922L186n602j269L830L084k936m357L088M221l090l418
$$ -93 1734 1800 -726 -2505 417 3603 -1999 -3268 562 3646 710 -3647 -559 3662 572 -2846
2007b846K626L027j933l037P65K613J61j162k310J233L989k693k745J095L815
$$ -2846 -220 2807 874 -2163 -1398 1215 1376 214 -2096 -863 3126 433 -2312 -1217 2598
2022B598r04m438M25N173j069l609n11M291O68l823p04L080k24L7k927Q27J679
$$ 2598 1694 -2744 -2319 2854 1785 -1824 -2335 1956 2624 -1199 -1903 1177 953 990 -1937 -1110 569
2039E69Q91k796p10L012K671l974k884M135K512m192j356K324J711j923k147J816
$$ 569 1460 -1336 -2046 966 3637 -337 -3221 914 3426 -766 -2122 202 1913 -10 -2157 -341
2055c41J687J25l284m30L658k85j782J67o06K399J25l395J304L612j546l386n4
$$ -341 1346 1471 -1813 -2243 1415 1130 -652 -485 -1091 1308 1433 -1962 -658 2954 1408 -1978 -2032
2072b032M643j066l653M60K337J627k220j460J179K257j114j416q91K519M89l157
$$ -2032 2611 1545 -2108 -1648 689 2316 96 -1364 -185 2072 958 -458 -1349 1170 1659 -1498
2088a498o26K763J853k543k482L565K621m519j784J093L933q52k938m17J323J713
$$ -1498 -2124 639 2492 -51 -2533 1032 3653 -866 -2650 -1557 2376 1524 -1414 -1831 -508 1205
2104A205j815n29J361R91m04j952q56L693j058k190l79M140l63l317j73K715N06
$$ 1205 -610 -1139 222 1213 809 -1143 -1999 1694 636 -1554 -1933 2207 1844 -1473 -1646 1069 1575
2121A575k721o68K316P80m33k226J241J315m23k082j28K149Q78j983k825L588
$$ 1575 -1146 -1814 502 1282 849 -1377 -136 1179 756 -1326 -1454 695 1573 -410 -3235 353
2137C53J694j259l163K357J594j847j389J935M09j27j573j62J531J237k038r05
$$ 353 2047 788 -2375 -18 1576 -271 -1660 275 684 557 -1016 -1178 353 1590 -448 -1353
2153a353J338K306j198k820P19J868J64j530Q3J548J57j913j414L377K64j869
$$ -1353 -15 2291 1093 -1727 -1008 860 1024 -506 -423 1125 1282 -631 -2045 1332 1596 -273
2169b73j802K585j2m39j141J56J794q25K21k017K563Q48k424j022J676K058j740
$$ -273 -2075 510 498 59 -1082 -926 868 43 264 -1753 810 1658 -766 -1788 -112 1946 206
2186B06k714K731J194o74k174L10J607J0j279R0O82j06n83O14K67J487l28k176
$$ 206 -2508 223 1417 743 -1431 -1121 486 496 -783 -693 -11 -117 -700 -86 181 1668 1340 -836
2204h36r18K425Q17j929j253K705J8j890j141L047n2j644q83Q06N67l2m34o71
$$ -836 -1754 671 1488 -441 -1694 1011 1029 -861 -2002 1045 993 -651 -1534 -728 -161 -193 -627 -1298
2222a298K362M21k081j93M11J856j211k213K275J016p66j766M02K291q05j498
$$ -1298 1064 1485 -596 -789 -378 1478 267 -1946 329 1345 579 -1187 -785 1506 701 -797
2238g97N39R78o9p10k64j74J035K95j296J84O93L85j679j344L170N51k145q26
$$ -797 -258 720 651 -59 -323 -497 538 833 -463 -279 414 799 -880 -2224 946 1497 -648 -1474
2256a474K453K84j959r11K310P03j555k28R76k0K32p76o10J151M90l94j511n0
$$ -1474 979 1263 -696 -1607 703 1406 -149 -377 599 579 811 35 -575 576 1066 672 -839 -889
2274h89M83J174k455J823J015j670k13J035rR22j381j041J256O58o13k4J61l43
$$ -889 -406 768 -1687 136 1151 -519 -732 303 294 1216 -165 -1206 50 708 95 71 232 -111
2292a11l40K09r22J117J278j130q35R10O23p31j493J794Q44r64r91K07O48N29
$$ -111 -451 -242 -1164 -47 1231 101 -734 176 799 68 -1425 369 1213 249 -742 -535 113 642
2310F42j634R18k72R10n22o13N67R93m8j737L72J233O3p54p31J334O80k232L97
$$ 642 -992 -74 -346 564 42 -571 -4 989 941 -796 -424 809 872 118 -613 721 1401 -831 -434
2329d34N89n15j18k69J359L13o23k92k74k33M24k05p36J202K51j5l04K81J196
$$ -434 155 -360 -478 -747 612 925 302 10 -264 -497 -73 -278 -1014 188 439 424 120 401 1597
2348A597j144j586R49J90J26o57N16K63n14o74J126k17Q32M38k400J262m4L90
$$ 1597 453 -1133 -184 6 132 -525 -9 254 -260 -934 192 -25 807 1245 -1155 107 63 453
2366D53r64m10J254o42m88P30O72J12q74P41r11Q32J65j517P87O84n89n72o90
$$ 453 -511 -921 333 -309 -797 -67 605 717 -157 584 -327 505 670 -847 -60 624 35 -537 -1227
2385a227J763l51j95j63j8K92L86j2p27O18n23O27k4j61j12K99n16P11q73j54
$$ -1227 536 185 -10 -173 -191 101 487 475 -252 366 -157 470 446 285 173 472 -44 667 -206 -360
2405c60J333j417M54L58q79M73K55q50J057p59l04J006m20p5Q67j027Q63l57l81
$$ -360 973 -444 10 368 -511 -38 217 -633 424 -335 -639 367 -53 -128 739 -288 575 218 -163
2424a63L39M2l2p28Q09N66j264J57J124p45l25k97P36Q6m60M7M45K10m53J44J150
$$ -163 176 218 186 -542 267 833 -431 -274 850 105 -220 -517 219 305 -155 -108 337 547 94 238 1388
2445A388j318n36L11O89n62r8K94q63J694q04J7n35k66Q68o86R19j081N51L16
$$ 1388 70 -466 -155 534 -28 -126 168 -695 999 195 212 -323 -589 279 -407 512 -569 -18 298
2464B98k69n06M76l56K40J31N11l57j259Q20J418p94j033R40l74J92k03J55l69
$$ 298 29 -477 -1 -357 -117 14 525 168 -1091 -271 1147 353 -680 260 -114 78 -125 30 -339
2483c39j29N34N03j028m45K78J100r12L85p19N08M55k6K87j197N57J05P58p32
$$ -339 -468 66 569 -459 -904 -626 474 -438 -53 -772 -264 191 165 452 -745 -188 -83 675 -57
2502e7L82kj025J213q05k06O29J64j91j78N34o88R44o7p45m4P16m77J9J18M4O51
$$ -57 325 323 -702 511 -294 -500 129 293 102 -76 458 -230 714 647 -98 -142 574 97 116 234 278 929
2524I29q63o11k24J357j411J051j074J65k89P51J41K05o16k09Q39R9P6j031K56
$$ 929 66 -545 -769 588 -823 228 -846 -681 -970 -219 -78 127 -489 -698 141 240 316 -715 -459
2543d59J6R95j071M15l61R33j042L41K3J55O3O30K89r39j05k34k75Q06k90M44
$$ -459 -443 552 -519 -104 -465 468 -574 -233 -210 -55 8 638 927 -12 -117 -351 -626 180 -110 334
2563C34l54J2o26M22m60L46J208j15m17n85K0J4L77o53N53j69J008j112J066m92
$$ 334 -20 -8 -634 -212 -672 -326 882 767 350 -235 -215 -201 176 -477 76 -93 915 -197 869 377
2583C77kk1j87K43K0m68J48l9n65O86M76L94j893K88O19J84O26j10j097M85J8
$$ 377 375 354 167 410 430 -38 110 71 -494 192 668 1062 -831 -543 76 260 886 776 -321 164 182
2604A82L41J76n77p68O54j182J319O3n96K70l22K69l63K56J95k52P40r78K75J29
$$ 182 523 699 122 -646 8 -1174 145 208 -388 -118 -440 -171 -534 -278 -83 -335 405 -573 -298 -169
2624a69N14o6m21N70r56P05j35M36M55j370J187n35j92J46M71P67r05k70K47l33
$$ -169 345 279 -142 428 -528 177 42 478 933 -437 750 215 23 169 640 1407 502 232 479 146
2644A46o93Q99k3j029P18l49O00L79j70j028O50J31o90j59J219N4r01j36Q49k49
$$ 146 -547 352 329 -700 18 -331 269 648 478 -550 100 231 -459 -618 601 655 -246 -382 467 218
2664B18K59M8p38m1J287n98n56P55q55J077j30m50K2N55j222L63L6p13J708Q28
$$ 218 477 525 -213 -254 1033 435 -121 634 -221 856 726 276 298 853 -369 -6 30 -683 1025 1853
2684A853j973N04k28k51J285j780J03l56K09m2J115m75qR50l43j053J129o7j221
$$ 1853 -120 384 156 -95 1190 -590 -487 -843 -634 -676 439 -36 -44 906 563 -490 639 572 -649
2703f49J255q18P13j196P38P14n62j45J73n51R16J46o60N97o03K8m95O40P33n60
$$ -649 606 -212 501 -695 43 757 195 50 223 -328 588 734 74 671 68 96 -399 241 974 414
2723D14q78R06m2O8o15k62M94J24J60j55R30n22J57l35l16l32K65J6j57J35r1
$$ 414 -464 442 400 468 -147 -409 85 209 369 214 1144 622 779 444 128 -204 61 77 -80 55 -36
2744c6j76N45N04n56n95P74r97J082J03r61J48k92R76m41K53j14n3n07r7O17k16
$$ -36 -212 333 837 281 -314 460 -537 545 648 -313 -165 -457 519 78 331 217 164 -343 -440 177 -39
2765c9j5l08M61l84P86Rj083M11r1o27M40l11J053p60j405K244p03M21l97Q13
$$ -39 -54 -362 99 -285 501 510 -573 -162 -253 -880 -440 -751 302 -458 -1863 381 -322 99 -298 515
2785E15r52L6J63J15l43J233j715N54LP19J199j458L82j027P23j30n12J382p29
$$ 515 -437 -401 -238 -123 -466 767 -948 -394 -391 328 1527 69 451 -576 147 17 -495 887 158
2804A58J45r40J725j340n07O50O97M26q71L72O48j044J60P25j730K97j14M41j011
$$ 158 303 -637 1088 -252 -759 -109 588 1014 143 515 1163 119 279 1004 -726 -429 -543 -102 -1113
2823a113J489q1r39L12O11k64j28n5L8K90L90l62P18k67m31p11Q82m63L59o15
$$ -1113 376 295 -644 -332 279 15 -113 -168 -130 160 550 188 906 639 208 -503 379 -84 275 -340
2843c40M30p68N06Q87p24j026J697J18j246p5l03O1M22j3M03M15j74O61j113j6
$$ -340 90 -678 -172 715 -9 -1035 662 780 -466 -541 -844 -783 -361 -374 29 444 270 931 -182 -198
2863a98J31J012oj257J91l63P84q3j09j61j65J73J11O4M09r39L77j85m08M33q3
$$ -198 -67 945 939 -318 -127 -490 294 211 102 -59 -224 -51 60 124 533 -406 -29 -214 -622 -189 -272
2884b72O32j636J949n09n18Q39o77M20L98q60P46N1j164J016j286JM41K08L61
$$ -272 360 -1276 673 164 -354 485 -192 228 626 -234 512 563 -601 415 -871 -870 -429 -221 140
2903A40n05J151o49Q11l0j295P17R2p39l54j90J027j5L75l80q2K92r64J849l01
$$ 140 -365 786 137 948 918 -377 340 432 -307 -661 -851 176 161 536 156 74 366 -598 1251 950
2923I50j452J295l79o66p55Q05L52m13J93k02M13k06M84J04r4j015P31o06Q30
$$ 950 -502 793 414 -252 -1007 -202 150 -263 -70 -272 141 -65 419 523 429 -586 145 -461 369
2942C69q02m2M30k0K9o18M63o36N06J87o02j41J249J49m15N48q81K95J21j024
$$ 369 -433 -475 -45 -65 -36 -654 -191 -827 -321 -134 -736 -877 372 521 106 654 -227 68 189 -835
2962h35J095l03O35L2o91N7j34M05l31M19N61O38j722k42J20l08O32j08j27O92
$$ -835 260 -43 592 624 -67 -10 -144 261 -70 349 910 1548 -174 -416 -296 -604 28 -80 -207 485
2982D85j412R33q72M78K36n86J625n59L8J53j59o58n44P63J63Q70l70k75m35q40
$$ 485 -927 6 -866 -388 -152 -738 887 328 366 519 360 -298 -842 -79 84 954 584 309 -126 -966
3002i66N19R2K48Q71r28n66J380m09p28L88P45o18O98r47J56j70K90m53M08p53
$$ -966 -447 -355 -107 764 -164 -730 650 241 -487 -99 646 28 726 -221 -65 -235 55 -398 10 -743
3022g43N48o1P01j217M72K29m84J042L20k230J302N49j589P59R23p36N59j084
$$ -743 -195 -256 445 -772 -300 -71 -555 487 807 -1423 -121 428 -1161 -402 521 -215 344 -740
3040g40L03J402m97l15J7M94p8n97n50L2p3O15k04N46o71O89L36m48r87k42J467
$$ -740 -437 965 468 153 170 664 586 -11 -561 -529 -602 13 -191 355 -316 373 709 261 -726 -968 499
3061D99p33k06J241o84k9r96K039k65K05m74l89j126R58J31J51M21jp92l20n30
$$ 499 -234 -440 801 117 88 -908 1131 866 1071 597 208 -918 40 171 322 743 742 -50 -370 -900
3081i00J25J136J00n44k9o3J78M9P5q37L93j95Q37k31M77m80K00K25l79P19j53
$$ -900 -775 361 461 -83 -112 -175 3 52 127 -710 -317 -512 325 94 571 91 291 516 137 856 703
3102G03j87r87M65J78j313J129j53J7R43o85j809J783n32P84k5j92m29O65q75
$$ 703 516 -471 -6 172 -1141 -12 -165 -148 795 110 -1699 84 -448 336 311 119 -310 355 -520
3121e20M75J05n82O11m41M87p52O90L29L3k520J883M4N2r8m30N53N18k57j157
$$ -520 -45 60 -522 89 -352 135 -617 73 402 435 -2085 -202 -158 -106 -204 -634 -81 437 180 -977
3141i77L46K28l12M62L17r16Q22K77k03J95k69l65O3P20n63R3L97m43J26k51J193
$$ -977 -631 -403 -715 -253 64 -852 -30 247 44 239 -30 -395 -332 388 -175 -82 315 -128 -2 -253 940
3162I40j454K79O46j53j25R8k6J027j465o46J50Q79J68p27Q70L30q0o49L03k66
$$ 940 -514 -235 411 258 133 231 205 1232 -233 -879 -729 150 318 -409 461 791 711 62 365 99
3182I9j01q66J314k58l3L11j734J525p92M02j53J686j828K57Q01k36k23K0N83
$$ 99 -2 -868 446 188 155 466 -1268 257 -535 -133 -286 1400 -428 -171 630 394 171 191 774
3201G74J51n24L54j173O27k61p4P49j054oJ083q22J25m79M78on29J599q41M06
$$ 774 925 401 755 -418 209 -52 -126 623 -431 -437 646 -176 -51 -530 -52 -58 -587 1012 171 577
3221E77j054l42L54R68o87L13Q9J365k220O4M77j36J001m53j39n21L92M25o73
$$ 577 -477 -819 -465 503 -184 129 218 1583 -637 -573 -96 -232 769 316 177 -344 48 473 -200
3240b00j529J648O27j279O41k94P66k68K80K95o96O82j364L68Q8M23K47j056M64
$$ -200 -1729 -81 546 -733 -92 -386 380 112 392 687 -9 673 -691 -323 -235 188 435 -621 -157
3259a57o9L78Q86q93O3N19m65L74k13l26K31P7r99J82N29N89j652J735r00N17
$$ -157 -226 152 1038 145 208 727 262 636 423 97 328 405 -594 -412 117 706 -946 789 -111 406
3279D06j519R17q63J371M72m48m22o14r4O87m67n08J182j89r08J098L91j403N89
$$ 406 -1113 -196 -1059 312 784 336 -86 -700 -794 -107 -574 -1082 100 -89 -997 101 492 -911 -322
3298c22L59m7N13m62O42j060J91Q62j082M39J27J31m55k38K46n50R41M47J39l82
$$ -322 37 -10 503 41 683 -377 -186 676 -406 33 160 291 -164 -402 -156 -706 235 682 821 439
3318D39r0q9J65O05p66R4k40J166q95j99r97Q97J15l32ro01M64R70j061O45o72
$$ 439 349 260 425 1030 264 358 118 1284 389 190 -807 90 205 -127 -136 -737 -273 697 -364 281 -391
3339c91M30M53q36J48l18L16J452n43l28r04L10P73m95l23K91J164r01m13j159
$$ -391 39 492 -344 -196 -514 -198 1254 711 383 -521 -211 562 67 -256 35 1199 298 -115 -1274
3358a274J275J00n49k8L16R24r80m25P28l40n26M17J571j711J171j399M53J21
$$ -1274 1 101 -448 -476 -160 764 -216 -641 87 -253 -779 -362 1209 -502 669 -730 -277 -156
3376a56J108j74k70j069L07n81M18J434j484J56K27l97P84Q5n87o10J116L79p21
$$ -156 952 778 508 -561 -254 -835 -417 1017 -467 -311 -84 -481 303 388 -199 -809 307 686 -35
3395c5o55P75j373J601q11Q91l52k08J041J23j208N7P6N59J25n75n97P0M31o3
$$ -35 -690 85 -1288 313 -498 393 41 -167 874 997 -211 -154 -78 481 606 31 -566 -496 -65 -128
3415a28j81J135j273K84k38J48N16J52p73J14L31M21O1r28Q40j218J270p4k85
$$ -128 -309 826 -447 -163 -401 -253 263 415 -358 -244 87 508 569 -359 481 -737 533 459 174
3434A74j85j25o51K88M01M42M91j873J231O41j184L22m90L40m34N73O44j132P74
$$ 174 -11 -136 -787 -499 -98 344 835 -1038 193 834 -350 -28 -518 -178 -612 -39 605 -527 247
3453B47N5m64L6m01o5J120o52Q25m26P30j081L20m19J13O88r43M76K19j12n95
$$ 247 302 -162 -126 -527 -592 528 -124 701 275 1005 -76 244 -175 -62 626 -317 159 378 266 -329
3473c29K1R16K07j396R92p79M13k83P43l69p95K68Q17R16j403J70j187J105j132
$$ -329 -308 608 815 -581 411 -368 45 -238 505 136 -659 -391 426 1342 -61 109 -1078 27 -1105
3492a105J153L24n50O1K09l19Q02o40N58n42p67L58j85J040l70M9R3L22r50K63
$$ -1105 48 372 -178 -117 92 -227 575 -65 493 -49 -816 -458 -643 397 27 76 169 491 -459 -196
3512a96P07r10L46p86J220j42j679J403M13p57L18l44J223o40l7R4q81P91j77
$$ -196 511 -399 -53 -839 381 239 -1440 -37 376 -381 -63 -407 816 176 139 233 -648 143 -34
3531c4o6j072O49O94n30N76Mp9L47j269L73j68Q83k31J53n2L90J30m19n49n57
$$ -34 -100 -1172 -523 171 -359 217 221 142 489 -780 -407 -575 308 77 230 178 568 698 279 -270 -827
3552h27J211n13J13J72j023n22J070n13J30K72Q27J18L77J070k916P00k07K40
$$ -827 384 -129 -16 156 -867 -1389 -319 -832 -702 -430 397 515 892 1962 -954 -254 -461 -221
3570b21N03N25j220n89P38Q66n5n65M43j362J569m87P0J57k19l33n39J109l62
$$ -221 282 807 -413 -1002 -264 602 547 -18 425 -937 632 145 215 372 153 -180 -719 390 28
3589B8k78l24n5J046P14q53K73j050O70k72M81Q73j168p7n83Q57Q0L79j37K54
$$ 28 -250 -574 -629 417 1131 278 551 -499 171 -101 380 1253 85 8 -575 282 362 741 604 858
3609H58q24Q84j98r08k65J712j074j70q33L49P07j634K024k52l54m9M89k55j97
$$ 858 34 918 720 -188 -453 1259 185 15 -818 -469 238 -1396 628 376 22 -27 462 207 10
3628A0L86p5r9m80M44l06K0p22J505l43n37P3l38M11M21r06L43N0n16J715j280
$$ 10 396 321 222 -258 186 -120 -100 -822 683 340 -197 -124 -462 -51 370 -536 -193 -143 -659 1056 -224
3649b24P1p64Q70m87J272j816J116o83J419k52k08j10J222r35k03o85m90R30L84
$$ -224 -153 -917 -47 -534 738 -1078 38 -645 774 522 314 204 1426 491 288 -397 -887 43 427
3668D27q13j64J22Q22q09J69K4L68r33M0O6N31J31l6J66M8n1k0N98n24j42m12
$$ 427 -386 -550 -428 394 -415 -246 -222 146 -787 -747 -681 -150 -19 -55 111 159 108 88 686 162 20 -392
3690c92Q31k07q88M45R32k72j69j64N90q77r21J646K81q46L85j340O67l20m40
$$ -392 439 232 -656 -211 721 449 280 116 706 -171 -1092 554 835 -11 374 -966 -299 -619 -1059
3709a059J514m48k99j02J031q41K06p37K45J037o19n63p7K18Oo25P12Q88n71L80
$$ -1059 455 7 -292 -394 637 -204 2 -735 -490 547 -72 -635 -712 -494 -488 -1113 -401 487 -84 296
3729B96r66kK68P05j07n43n05J208k21l65K16R07p98M82j175J506j349R69r71
$$ 296 -670 -672 -404 301 194 -349 -854 354 133 -232 -16 891 93 575 -600 906 -443 526 -445
3748d45l91R75q27J815j653J439j639Q42Q8L70k10p86q6M93K16L61j099j39P24
$$ -445 -836 139 -688 1127 -526 913 -726 116 204 574 364 -422 -508 -15 201 562 -537 -676 48
3767D8m12R32j24q93O2R40p43k21L7k61L64J06l90J092J45j71J06n58K58J98j267
$$ 48 -364 568 444 -449 -387 553 -190 -411 -374 -635 -271 -165 -555 537 682 511 617 59 317 515 -752
3788g52K57L83j14n88R26L10j348N9J207l02R31j220K83j00M12J55p18PR73o61
$$ -752 -495 -112 -226 -814 112 422 -926 -867 340 38 969 -251 32 -68 344 499 -219 -212 761 100
3808A00Kl2L07K30l92n61P54j34K19p36K25o4m04J52k23P37J63o24O94k8o25P59
$$ 100 102 70 377 607 215 -346 408 274 493 -243 -18 -82 -486 -334 -557 180 343 -281 413 385 -240 519
3830E19L27o18n87O78O56p45j319N57O29J116j813J5R54o78R54o1J68q98k02K1
$$ 519 846 228 -359 319 975 230 -1089 -532 97 1213 -600 -585 369 -309 645 584 752 -146 -348 -327
3850c27k47m15J172p31L71M97J00J62j125M4R69n94M26p94L88K99k12M77m71p05
$$ -327 -574 -989 183 -548 -177 320 420 582 -543 -499 470 -124 302 -492 -104 195 -17 460 -11 -716
3870g16J517n37%M2p95K05K94n63J65Q81j336J819j874Q09k57L12R8l35o36J27
$$ -716 801 264 264 306 -489 -284 10 -553 -388 493 -843 976 -898 -89 -346 -34 64 -271 -907 -780
3890g80J207j05k53J35j122O73K77m6M17n67J117j527N38k56L12N4P03j786P60
$$ -780 427 322 69 204 -918 -245 32 -14 403 -164 953 -574 -36 -292 20 74 777 -1009 -249
3909b49K32l33Q18j042L35P44n74l13Q40n0q70K65N07p05O76p91M27M89j90M03
$$ -249 -17 -350 468 -574 -239 505 -69 -382 458 408 -462 -197 310 -395 281 -510 -83 406 216 619
3929F19K90r58J418j883M58L44j400R99J477j104r48J188j095J121j018M73K12
$$ 619 909 -49 1369 -514 -56 288 -1112 -113 1364 260 -688 500 -595 526 -492 -19 193
3946A93p88K43O59K70k63j3j72L97j068R35K03j34r95JJ147o03j26q10R51q22
$$ 193 -595 -352 307 577 314 301 129 526 -542 393 596 462 -533 -532 615 12 -114 -924 27 -795
3966g95J996j863N89J032p91q77M98k33Q67j016Q32L00O2j710N36O27J9l72k86
$$ -795 1201 -662 -73 959 168 -709 -211 -444 423 -593 239 539 601 -1109 -573 54 73 -299 -585
3985e85L72R03k21r1K0l29M26N63j773Q59J193j244k63L68k47L57N0j086N98n30
$$ -585 -213 690 469 378 398 69 495 1058 -715 144 1337 93 -170 198 -49 308 358 -728 -130 -660
4005f60M07p0P42O9l10O65q24k15M9R12j460J946j445j009J121j065J288m37K27
$$ -660 -253 -323 419 488 178 843 19 -196 -147 765 -695 1251 -194 -1203 -82 -1147 141 -296 -69
4024f9j95P64q47O94q45O48j332J246k81K84j27K40l7r60R56L67k53l73j17L39
$$ -69 -264 500 -347 347 -498 150 -1182 64 -217 67 -60 180 143 -817 139 506 253 -120 -237 102
4044A02J19J86j031M83O17j10o46J107q02l57Q25p15N22M59o94L54p07J65L27
$$ 102 221 407 -624 -141 476 366 -280 827 25 -332 493 -222 300 759 65 419 -288 -123 204
4063B04n58P10m74R52j56p51K6R6Q89o02q96J043k60k87o96N84J87j95j18P2M96
$$ 204 -354 356 -118 834 678 -73 -47 49 938 336 -560 483 223 -64 -760 -176 11 -184 -302 -230 266
4084B66N6N59j382Q35m36m01j85N09n28P49j91k86L99J258j601K25O54Ll76l49
$$ 266 322 881 -501 334 -102 -503 -688 -179 -707 42 -149 -435 -36 1222 -379 -154 500 503 127 -222
4104b22M67o43k92L94Q24M36j810J109n68L92p03P16m4k33O03n2k26m51Q35r52
$$ -222 245 -398 -690 -296 528 964 -846 263 -305 87 -616 100 56 -177 426 374 148 -303 532 -420
4124d20n88R20L95j13p95n60J121k45k08L04O81K05j381J683p77L62j036Q08r6
$$ -420 -1008 -88 307 194 -601 -1161 -40 -285 -493 -189 492 697 -684 999 222 584 -452 356 260
4143B60k2j106kO37o16P26J07n97J797j189j071J541n01J68N03k9l57k0j80o01
$$ 260 238 -868 -870 -233 -849 -123 -16 -613 1184 -5 -1076 465 -36 132 635 606 249 229 49 -552
4163e52L38k07m60NQ38L20K35p46p96R02J05m89N65k92j061J293j216J411P89
$$ -552 -214 -421 -881 -876 -38 282 517 -229 -1025 -123 -18 -507 58 -234 -1295 -2 -1218 193 982
4182I82j091R81K15j158L28p95R26r01P76l94m03N34N35j010Q59j366J487R4l81
$$ 982 -109 872 1087 -71 257 -538 388 -513 263 -131 -534 0 535 -475 384 -982 505 599 218
4201B18l0o37O04J0m12n04P02k1r6K6j33O93l22m32J189p23m36o13Q90L18m53
$$ 218 188 -449 155 165 -247 -751 -49 -70 -166 -140 -273 420 98 -334 855 132 -304 -917 -27 291 -162
4222a62Np01M47P44m70Q1K74M15l64L35p82j13L16j068J472j11o45J95m06k54
$$ -162 -157 -858 -411 333 -137 -56 218 633 269 604 -178 -291 25 -1043 429 318 -327 -132 -538 -792
4242g92L77J136p21r44J113o17J80J382n74p99N49l36k71N8L05O44o84L79q8r95
$$ -792 -415 721 0 -944 169 -448 -268 1114 540 -259 290 -46 -317 -259 46 690 6 385 297 -698
4262f98R55oJ57k76L38j26j036J524k012Q49K59q13M61J252N0m49q40M37o81J398
$$ -698 257 251 408 132 470 344 -692 832 -1180 -331 -72 -885 -424 828 878 429 -411 26 -655 743
4282G43n21K07o72P89n22o7o84n04J184o75Q14n78Q02o86J444p54p24J001k11
$$ 743 222 429 -243 546 24 -43 -727 -1231 -47 -722 92 -486 316 -370 1074 320 -404 597 386
4301C86l92k53J051p82J4m49M89n91J305m87k74k96L96l75j17N96o33R4J78N5
$$ 386 -6 -259 792 10 24 -425 64 -527 778 291 17 -279 117 -258 -375 221 -412 -318 -140 -85
4321h5m15N08j63O16q22oK10J21j11L02m67M68R8o25J363m85j042P02J7j8o30
$$ -85 -500 8 -155 461 -361 -367 -157 -36 -147 155 -312 156 254 -371 992 507 -535 167 184 166 -464
4342d64k19P03m26J348o60n3l39j098J449m17K2l08QM72O12j012J10L6R81l22
$$ -464 -683 20 -406 942 282 229 -110 -1208 241 -176 -154 -462 -454 18 630 -382 -272 -236 745 423
4362D23K73o67L25k30o47M05M41j457J678r19q0j066J079M81J009m34m27p83J552
$$ 423 696 29 354 124 -523 -118 323 -1134 544 -375 -455 -1521 -442 39 1048 614 187 -596 956
4381I56j403M14L95K19p55m93J31Q86J28j898J629o76O74o93P0J221r16M93K26
$$ 956 -447 -33 362 581 -174 -667 -536 350 478 -1420 209 -467 207 -486 -416 805 -111 382 608
4400F08n87l4N29J86j199m41J012l84M21N88j919J976n88O89j913J419l39J57
$$ 608 21 -13 516 702 -497 -938 74 -310 111 699 -1220 756 168 857 -1056 363 24 181
4418A81n17J273j058J02L80L2O7k91J82o97L5P53j055K76J90K08M07q83K6Q00
$$ 181 -336 937 -121 -19 361 393 460 169 351 -346 -311 442 -613 -337 -147 61 468 -415 -389 411
4438D11n86n54Q71k41k48l3K20N34m34L44m7o7q79J77J17P91n22K59k98Q10J01
$$ 411 -175 -729 142 -99 -347 -380 -160 374 -60 284 237 170 -709 -532 -415 376 -146 113 -185 625 726
4459G26j353M71Q67j13j040P58l15P85j643J369j035J292j095Q2m36J620q70j2
$$ 726 -627 -156 711 598 -442 316 1 786 -857 512 -523 769 -326 -244 -680 940 70 58
4477E8p3J03K51m28k81j60K68Q76m85r87P86J231j421K64N26o45n03M91J000j128
$$ 58 -15 88 339 -89 -370 -530 -262 614 129 -858 -72 1159 -262 2 528 -117 -620 -129 871 -257
4497b57q11M67O67l27n58J886j670Q39n00R41q43L75k0n4M39r51L7K03q6l90J613
$$ -257 -1068 -601 66 -261 -819 1067 -603 236 -264 677 -166 209 189 135 574 -377 -340 -137 -223 -613 1000
4518A000j453M99J140l39q46L31qj032N57k3J48lk85r0Q70j67o36J631j797O00
$$ 1000 -453 46 1186 847 1 332 324 -708 -151 -174 -26 -29 -314 -404 466 299 -337 1294 -503 97
4538I7L33j80L56M81j741P70n19J380j613N81q48J643pl23j065J482j264j23k21
$$ 97 430 250 606 1087 -654 116 -403 977 -636 -55 -903 740 733 410 -655 827 -437 -560 -781
4557g81j83L10k8L52M49L87K21r60Q13q52j76P75k25n37Q55L21r59J163j492k88
$$ -781 -964 -654 -682 -330 119 506 727 -233 580 -272 -448 327 102 -435 420 741 -218 945 -547 -835
4577h35M24M32L92n62O44n63j079J264o10L30J17K83j624J313Jm77J03J038K68
$$ -835 -411 21 413 -149 495 -68 -1147 117 -493 -163 -46 237 -1387 -74 -73 -550 -447 591 859
4596H59p04K00m29J46r03N13R68r3j019N36N3n48O15O07q10j21J94k98Rom31J056
$$ 859 155 355 -74 72 -831 -318 650 557 -462 74 127 -421 194 801 -9 -130 64 -234 -225 -231 -662 394
4618C94j11k7k14K07r07J098J40l40J9J17k85o10P67p39J182k4r76l10P69l01
$$ 394 283 256 42 249 -658 440 580 240 259 376 91 -519 248 -491 691 667 -309 -619 150 -151
4638a51O08L4l25p56J063j149P82m82L75k48L49j01R1r36J785j087l36L11L07
$$ -151 457 491 166 -590 473 -676 106 -376 -1 -249 100 -1 90 -846 939 -148 -484 -173 134
4657A34N20p79J61K9L18j64L20q81R76l35q7n73k27M28q7p60R04m75J324q15J53
$$ 134 654 -125 36 65 383 219 539 -342 634 299 212 -361 -588 -160 -247 -1007 -103 -578 746 -69 84
4678H4m34O26Q2J0O4k61k88j44p19J337p75O3K39N14k00o11L23L22p70N52m45
$$ 84 -350 276 358 368 432 171 -117 -261 -980 357 -418 -355 -116 398 198 -413 -90 232 -538 14 -431
4699d31k9J440j336P14m4N1n19N02j170R71J13m86R1j50N81K7p68N14m01M42j193
$$ -431 -460 980 -356 358 314 365 -154 348 -822 149 262 -224 -133 -283 298 325 -443 71 -330 112 -1081
4720a081J035J15o40j39O63J8j121J597j713Q59P18l51p13M84M58O81k35m38J17
$$ -1081 -46 69 -571 -710 -47 -29 -1150 447 -1266 -407 311 -40 -753 -269 189 870 635 197 314
4739C14O5J49J07o0K78K0j395J193M26q15n16p0N72j41M59j20k81Q1j683Q51J60
$$ 314 379 528 635 575 853 873 -522 671 1097 282 -234 -304 268 127 586 466 185 266 -1417 -566 -406
4760d06J349j317J60L06r79N04K93k78L73L46M67r56m03J19m30k13j69J415j377
$$ -406 943 -374 -214 92 -887 -383 -90 -368 5 351 818 -138 -541 -422 -852 -1065 -1234 181 -1196
4779a196J009J373o54p25n86J190J52r33J75M0j08N54q93N12q77J048N56l19K96
$$ -1196 -187 1186 532 -193 -779 411 563 -370 -195 -155 -263 291 -602 -90 -967 81 637 318 614
4798F14o91K10k01l34n5J117q64K6J51M26j32p49l58M79K0k46M46p26q09J053
$$ 614 -77 133 -68 -402 -457 660 -204 -178 -27 399 267 -482 -840 -361 -341 -587 -141 -867 -1676 -623
4818f23J040o1K37j293R52j15j51J17O10q78K45N73K09j119M19K31k99r0M57p44
$$ -623 417 356 593 -700 252 137 -14 103 713 -165 80 653 862 -257 162 393 94 4 461 -283
4838b83J57n0Q73j032j303J228M17p05K31P74j80m08K5L03Q4m68J007j017M83
$$ -283 -126 -176 697 -335 -1638 -410 7 -698 -467 307 127 -281 -256 47 131 -337 670 -347 136
4857A36R63k094k33J082k06N60m05l2M72K60m60J12k9o7j54K57k36l92O79p04
$$ 136 1099 -995 -1228 -146 -352 208 -197 -229 243 503 43 155 126 59 -95 162 -74 -466 213 -491
4877d91J844p29q76m41Q74M1KO5j199P56J86m52P44K62O49j432L08L11m87J2J58
$$ -491 1353 624 -252 -693 181 222 224 289 -910 -154 32 -420 324 586 1235 -197 111 422 -65 -53 105
4898A05q97J000r5L16m55K29L58p16Jm84K33J145J7j404j39P87J21m13m16J416
$$ 105 -792 208 113 429 -26 203 561 -155 -154 -638 -405 740 757 -647 -786 1 122 -291 -707 709
4918G09p06J26N37q90L02j5o25k58P79o85Q51N0J5j22P51k74k58K04j034j29J255
$$ 709 3 129 666 -224 78 63 -562 -820 -41 -726 125 175 190 68 819 545 287 491 -543 -672 583
4939E83q72m26k35k67m73O41J546n95j50R29j231m17n89O32J307p91R02j33q26
$$ 583 -289 -715 -950 -1217 -1690 -1049 497 -98 -248 681 -550 -967 -1556 -924 383 -408 494 361 -465
4958d65O37N24q55Q92n96P2m15M41O05m26r56L05M32K97J00p28j18NO03K50J34
$$ -465 172 696 -159 733 137 209 -206 235 840 414 -542 -237 195 492 592 -136 -254 -249 354 604 738
4979G38q16J71K52j72L5j97L59r71N85Q64k88j167O96m21j72J306p28L0l90n48
$$ 738 -78 93 345 173 208 11 370 -601 -16 848 560 -607 89 -332 -504 802 74 104 -286 -834
4999h34J000L69r23J018m23J98j339O33Q10k79q51o4R47J67l78q0K86m73Q04j603
$$ -834 166 535 -388 630 207 405 -934 -301 509 230 -621 -685 262 429 51 -29 257 -216 588 -1015
5019a015K705j059O51j040M27K89j564O92M98j43p28O82j91q90N16J032r29m70
$$ -1015 1690 631 1282 242 669 958 -606 86 584 441 -287 395 204 -686 -170 862 -67 -537
5037e37N21q70J787K94j863k84J470M90j343k59L19M14N87m45K1p60J806j183
$$ -537 -16 -886 901 1195 -668 -952 518 1008 -335 -594 -275 139 726 281 302 -458 1348 165
5055A65k37L93k75N96N31j270M72n94L19m09j6j65R14j001J5K67N80R7m31N97
$$ 165 -72 321 46 642 1173 -97 375 -219 100 -309 -325 -490 424 -577 -562 -295 285 382 -49 548
5075E48p56q35J490q50K03N61L47q99p74K18q9J793j188J08k14L17j78Q94n16
$$ 548 -208 -1043 447 -403 -200 361 708 -191 -965 -747 -836 957 -231 -123 -337 -20 -198 696 180
5094A80j83p17R54r31j36M76O6R27J51j282J665j425K04J007p33O3J65j345J029
$$ 180 -3 -720 234 -697 -833 -357 -291 636 787 -495 1170 -255 -51 956 223 286 451 -894 135
5113A35Km40M81L74P86j304p7p84N67J2j44M61q51J761k151O80l27o1N28J71N28
$$ 135 137 -303 178 552 1338 34 -43 -827 -260 -248 -392 69 -782 979 -1172 -492 -819 -880 -352 -181 347
5134C47J1j121m47J38J309l86J83N05o80P94j397M38J92Q68j543J082n37J3M32
$$ 347 358 -763 -1210 -1072 237 -149 34 539 -141 653 -744 -306 -114 754 -789 293 -244 -231 201
5153B01l32J228r14K93n31k96O80l44J1L79o11O76j172J21J427k72p09m01N07
$$ 201 -131 1097 183 476 -55 -351 329 -15 -4 375 -236 440 -732 -611 816 544 -165 -566 -59
5172e9N64L52q02K3P54n93l41M10p81J245j902L57O88k18J70J55n53J9J080o91
$$ -59 505 857 55 78 832 239 -102 308 -473 772 -1130 -773 -85 -303 -133 22 -531 -512 568 -123
5192a23%O3M11p25P03o1j38j284J094o18L35M96k48L42o01J414k365J337m69L59
$$ -123 -123 -60 351 -374 329 268 130 -1154 -60 -678 -343 153 -95 247 -354 1060 -1305 32 -437 -78
5212g8l81N48J17p16R11M13j289L84P48m82p19O30k90J54L99k2k36m23P71p18
$$ -78 -459 89 206 -510 401 814 -475 -91 657 175 -544 86 -204 -50 349 327 91 -332 439 -279
5232b79L26O07k09j24L09r25mk43Q78m23K49p32J019j157P64L6L46K64j150O64
$$ -279 47 654 445 321 630 -295 -299 -542 336 -87 162 -570 449 -708 56 92 438 702 -448 216
5252B16n66p0L18k2N68k09p85l64J016M16P2l52r41L56O66o03Q75j014l89N00
$$ 216 -350 -420 -102 -124 444 235 -550 -914 102 518 590 238 -703 -347 319 -284 591 -423 -812 -312
5272c12M19k87P0l57R12k08j30K71m27M36n21k13L7J044L04n64k24O22r69M75
$$ -312 107 -180 -110 -467 445 237 107 378 -49 387 -134 -347 -310 734 1038 474 250 872 -97 378
5292C78j46J051j408n3p37P86n62R44j30j82L14l30L02l40M86m96k70K56p33P32
$$ 378 232 1283 -125 -178 -915 -129 -691 253 123 -59 255 -75 227 -113 373 -123 -393 -137 -870 -138
5312a38j2m04N61m91r5j7P29J56q02l69Q38r9j176R08J379on57k011N45n3J53
$$ -138 -150 -554 7 -484 -579 -596 133 289 -513 -882 -44 -143 -1319 -411 968 962 405 -1606 -1061 -1114 -961
5333i61P9N41K03O47j573J836j106L53J36L57n15N31Q5Q9j07o68m83O30q35jP96
$$ -961 -882 -341 -138 509 -1064 772 -334 19 155 512 -3 528 613 702 595 -73 -556 74 -761 -762 34
5354C4m50K07q07J457k97M15r10J004j462J840m30j383Q42P8m75N95K93m64j76
$$ 34 -416 -209 -1016 441 144 559 -351 653 -809 1031 601 -782 60 138 -337 258 551 87 -89
5373h9k39J39m6m32J563j354R26j095N54j102J388k21o68J203M32l41p89K63o51
$$ -89 -328 -189 -235 -667 896 -458 468 -627 -73 -1175 213 -8 -676 527 959 618 -171 92 -559
5392e59Q5N43r04Q98n18J09N09K05o28O19j266M97M92K59J124j439l73J252r81
$$ -559 -474 69 -835 63 -455 -346 163 368 -260 359 -907 -410 82 341 1465 26 -347 905 -76
5411g6J15p64Q64n17J09K98O61n02n79k0J02L16k09M44k55J88J26n73N56m92J83
$$ -76 39 -725 139 -378 -269 29 690 188 -391 -411 -309 7 -202 242 -13 175 301 -272 284 -208 -25
5432b5R17j850O22q94Q35O80o2k00M16n49k47n7m04L55J66n72j25O73P02n01o87
$$ -25 892 -958 -336 -1230 -395 285 223 23 439 -110 -357 -414 -818 -463 -297 -869 -994 -321 381 -120 -807
5453h07M64J222m61l19l08J96r05J715k43j285M5M1R41l32O87o15j16n86J033
$$ -807 -343 879 418 99 -209 -13 -918 797 554 -731 -686 -645 296 -36 651 36 -80 -666 367
5472C67k10N78j42M4q31J474r29r65J21O89n25L23o28M18o83J338j418O98m86
$$ 367 157 735 593 637 -194 1280 351 -614 -493 196 -329 -6 -634 -216 -899 439 -979 -281 -767
5491g67J061l36m17K22P7jp0N17m60m12J28p5P07j31Q95r60P8J181j878O43j33
$$ -767 294 -42 -459 -237 -160 -161 -231 286 -174 -586 -458 -533 174 43 938 -22 56 1237 -641 2 -131
5512a31R4o25J061j0Oj340J737n35p46j57P69l7p0J91k34N70q01L83j91Q25j758
$$ -131 -37 -662 399 389 395 -945 792 257 -489 -646 123 86 16 207 -27 543 -258 125 -66 759 -999
5533i99P30L14n16N31O58k21p4j138j83K057o81n91J050p15m70O00q78Q11m10
$$ -999 -269 45 -471 60 718 497 423 -715 -898 1159 478 -113 937 222 -248 352 -526 285 -125
5552a25l34j20k16N54P4P42q95Q62j147k44M81K02R62r2r17Q55m93m25K48j53
$$ -125 -459 -579 -795 -241 -167 575 -320 542 -605 -849 -368 -166 796 704 -213 642 149 -276 -28 -181
5572a81M56l40P7N59j958P03J577k58l83L3l56k74Q61n1p92N5N27j59j20l41j15
$$ -181 275 -65 12 571 -1387 -684 893 635 252 285 -71 -345 516 465 -327 -272 255 96 -24 -365 -480
5593d80N38r93O13Q53o61k1O85n36r37q85J715K39L32m55N3j116R10j14n42L52
$$ -480 58 -935 -322 531 -130 -151 534 -2 -939 -1824 -109 130 462 7 60 -1056 -146 -260 -802 -450
5613d50J51P22p33j78L62M42n19r8p9J88K59M82m61J90K65j90j54q97K08J136
$$ -450 -299 423 -310 -488 -126 316 -203 -301 -380 -192 67 549 88 278 543 353 199 -698 -490 646
5633F46p02Q30j513N68k68N00n07J31j75L99P22j092J129l40J64q24J182r74j91
$$ 646 -56 774 -739 -171 -439 61 -446 -315 -490 -91 631 -461 668 328 492 -332 850 -124 -315
5652c15J246o59j3j00R2q02Q61m53o93J028r37p5J965j47j586n27O28QN21J292
$$ -315 931 272 259 159 251 -551 310 -143 -836 192 -745 -820 1145 998 -588 -1115 -487 -479 42 1334
5672A334j360j95k36j80K73l33O15R94j337N9Q84m19n23N44m62O03n09K75k94
$$ 1334 -26 -221 -457 -637 -364 -697 -82 912 -425 -366 518 99 -424 120 -342 261 -248 27 -267
5691b67l54L38M39N07q52m08J20Q01Ko25L91r8N8m75O23r24J076L64n11n3j62
$$ -267 -621 -283 156 663 -189 -597 -477 324 326 -299 92 -6 52 -423 200 -724 352 716 205 152 -10
5712a0L85n6k71Q7O46n19o3m71l82K494k276J096n56j84n01R46O33j455j57R00
$$ -10 375 319 48 135 781 262 199 -272 -654 1840 -436 660 104 -80 -581 365 998 -457 -614 286
5732B86J43l00m42K13M51j130P98l57O32L80j477K42N37k11N78R66k163j52K97
$$ 286 429 129 -313 -100 351 -779 19 -338 294 674 -803 -561 -24 -235 343 1309 -854 -1006 -709
5751g09N20J62n74N84j47M3k50K64l11L30n18L43k22N82O96j881J408n29l87J366
$$ -709 -189 -27 -601 -17 -164 -121 -371 -107 -418 -88 -606 -263 -485 97 793 -1088 320 -209 -596 770
5771G70q01n95P01j80j95m22J40M58N61j157L61m39R61j3k66O04n82R83j069l55
$$ 770 -31 -626 75 -105 -300 -722 -582 -124 437 -720 -359 -798 163 150 -116 488 -94 889 -180 -535
5791e35M73n99J024l13q25O30j13j55R03o89m47R76j020L21M47l29j32P32n47
$$ -535 -62 -661 363 50 -775 -145 -258 -413 490 -199 -646 330 -690 -369 78 -251 -383 349 -198
5810a98J301j286L63O60m06k26L94k29O13o02o20j17J97m59M79l18J146m65m82
$$ -198 1103 -183 180 840 434 208 602 373 986 384 -236 -353 -156 -615 -136 -454 692 227 -255
5829b55O43j179O10Q42q03O52J06j69P4k63N1m9o00k87N30r91N39J027o86K37
$$ -255 388 -791 -181 661 -142 510 616 447 521 258 309 260 -340 -627 -97 -1088 -549 478 -208 29
5849B9o69M59R6P1J23o2K41o21n90J486o4m4m50j00J22K37j12j229P65P72n02
$$ 29 -640 -181 -85 -14 109 47 288 -333 -923 563 499 455 5 -95 27 264 152 -1077 -312 460 -42
5870d2K40n11J73L99n21k91J361n47l25Q32n56m41m21Q04q1J05R00j14q94Q0j197
$$ -42 198 -313 -140 259 -262 -553 808 261 -64 768 212 -229 -650 154 73 178 1078 964 70 150 -1047
5891a047J065o97O87j45l23J034p78Q33k73n52J397j314L38j82j42p3j47R46k66
$$ -1047 18 -679 8 -137 -460 574 -204 629 356 -196 1201 -113 225 43 -99 -172 -319 627 361
5910C61mL10j525Q92O39j07M99j043m22P29m39M02r56K80M0M94l58L63j310N51
$$ 361 357 667 -858 34 673 566 1065 22 -400 329 -110 292 -664 -384 -344 150 -208 155 -1155 -604
5930f04J052K70n84M45k50j01J69N6m1l93n42M02m67Q89m76K120k323R49p32r7
$$ -604 448 718 134 579 329 228 397 453 412 19 -523 -121 -588 301 -175 1945 -378 571 -161 -258
5950b58m29R3k55J183j763J699K00K30j110o91J076j34j87k91L36m72J125n14
$$ -258 -687 -594 -849 334 -1429 270 470 700 -410 -1101 -25 -159 -346 -637 -301 -773 352 -162
5968a62P34n36R87q18k96l40L83k78R56j227Q31n30J20m5J65k40m4M04K39j338
$$ -162 572 36 1023 205 -91 -431 -48 -326 630 -597 234 -296 -176 -221 -56 -296 -340 64 303 -1035
5988a035P84J94K16j64j1O75r48J09K50J37q89m7K90j36J005q14P71k25p06K081
$$ -1035 -251 -57 159 -5 -16 659 -289 -180 70 207 -682 -729 -439 -575 430 -384 387 162 -544 1537
6008A537j073k29p9r50O56j198L7J506J37k77j60K24N2P4P3r16J230n42l74q9
$$ 1537 464 235 156 -794 -138 -1336 -1299 207 344 67 -93 131 183 257 330 -586 644 102 -272 -361
6028c61L85K78m51j24O6n11J342r49L96m48P59j578J035N55o70m65J141n30k08
$$ -361 24 302 -149 -273 -207 -718 624 -325 71 -377 382 -1196 -161 394 -276 -741 400 -130 -338
6047c38N47r50L09m02J206p33PP65n59Q12j304m31J516k69k33p10Q59j39m46j5
$$ -338 209 -741 -432 -834 372 -361 -354 411 -148 664 -640 -1071 445 176 -57 -767 92 -47 -493 -508
6067e08j03L87r0K54L34n01J285j042k80j86j39n37J326J27l00k12K54J05j39
$$ -508 -611 -224 -314 -60 274 -227 1058 16 -264 -450 -589 -1126 200 327 27 -185 69 174 35
6086C5l10N74j271M92M63p87P51N75o56j90r4M20M73r80J368j418j17J034k32
$$ 35 -275 299 -972 -480 -17 -804 -53 522 -134 -324 -418 2 475 -505 863 -555 -672 362 130
6105A30l04q6O43n97P16o3o94M51N11o66k94j68L5J109j40p96l17j18J504j380
$$ 130 -174 -260 383 -214 502 439 -255 196 707 41 -253 -421 -386 723 583 -213 -530 -648 856 -524
6125e24K63J759q87o22l11p19Q11M59n77N49k45M41j31m29m39P03m04J108p65
$$ -524 -261 1498 611 -11 -322 -1041 -230 229 -348 201 -44 397 266 -163 -602 101 -303 805 40
6144D0l62n12o6J243q36M84J409j157j296M45J054j34l76l13N97r99J263j13o99
$$ 40 -322 -834 -900 343 -493 -9 1400 243 -1053 -608 446 312 -64 -377 220 -779 484 371 -328
6163c28Q47m2J465j887JJ066p69o01j57O24j85j059K409j825R15L37r47l9L13
$$ -328 519 477 1942 55 56 1122 353 -248 -405 219 34 -1025 1384 -441 474 811 -136 -175 138
6182A38J80j374Q08j51j52M85k06M64K31q41k9M55p92N39R89j899J024J249q85
$$ 138 318 -1056 -248 -399 -551 -66 -272 192 423 -418 -447 8 -784 -245 744 -1155 -131 1118 233
6201B33M63j037M06j97K79K19O28j018j0N33o4K87j182m21M52J05P30k20m53j61
$$ 233 696 -341 65 -132 147 366 994 -24 -34 499 435 722 -460 -881 -429 -324 406 186 -267 -428
6221d28K91N35j080K44M50P78j226p26J327m29K17K41O26j528L38O23j091K37
$$ -428 -137 398 -682 -438 12 790 -436 -1162 165 -264 -47 194 820 -708 -370 253 -838 -601
6239f01L98N45k46K67lj05m12k88N38m8M6j57N54m3j98k16p25J370l45j61J0n84
$$ -601 -203 342 96 363 360 255 -157 -445 93 45 91 -66 488 445 247 31 -694 676 331 170 180 -404
6261d04K38J476j630m44J083M34p40q2r4R72M15k274J402m38K66O58j045p51J048
$$ -404 -166 1310 -320 -764 319 753 13 -69 -163 809 1224 -1050 352 -86 180 838 -207 -958 90
6280I0J76l98n42P30m91L50M05q75J70j30R22r99J038o87P9p62M90K05q26J241
$$ 90 266 -132 -674 56 -435 -85 320 -555 -385 -515 407 -592 446 -241 -162 -924 -434 -229 -1055 186
6300A86p83J06m35J090n41p7P20O7m44O83j527J671j224J06M83M76r30O4j29Q68
$$ 186 -597 -491 -926 164 -377 -454 266 333 -111 572 -955 716 -508 -402 81 557 -373 -309 -438 430
6320D30o5j34m89K49k4P9N85j55J05o03l13J209q72j55n51R91j253N94R13j028
$$ 430 365 231 -258 -9 -33 46 631 476 581 -22 -335 874 2 -153 -704 287 -966 -372 541 -487
6340d87Q2M53Q0l95K45n17N13l08J381j874J517p62J012l96l97p79O43m43K48
$$ -487 -405 48 128 -267 -22 -539 -26 -334 1047 -827 690 -72 940 544 147 -632 11 -432 -184
6359a84l6J10N80m79J294j615K12M69o11M12p90n40l13J533k79M37R9Kp61K72
$$ -184 -220 -110 470 -9 1285 -330 -118 351 -260 152 -638 -1178 -1491 42 -237 200 299 301 -460 -188
6379a88O05n31R2l93M76l04J242j937J100o26N89k99J71k62N87o31P14r03J20
$$ -188 417 -114 -22 -415 61 -243 999 -938 162 -464 125 -174 -3 -265 322 -309 405 -498 -378
6398c78R20j101Q17K90K84j086M96k26Q8m27J25P98k49j01j158M92J022m68k44
$$ -378 542 -559 258 548 832 -254 242 16 104 -323 -198 600 351 250 -908 -416 606 138 -106
6417a06r58J597r80N36J30L9N2J171j808N86j68j095J666k71n1j399J890n59q43
$$ -106 -1064 533 -447 89 219 258 310 1481 -327 259 91 -1004 662 391 340 -1059 831 272 -571
6436e71P36L32J91q04O24k51o65P84k31M14j43J0p03r66J479O3j062J123l16l91
$$ -571 165 497 688 -116 508 257 -408 376 145 559 416 426 -277 -1243 236 299 -763 360 44 -347
6456c47l32J086K31m80j37o05J20N62n92j21N81n7j8M98l76l48O17j69l95k65
$$ -347 -679 407 638 158 21 -584 -464 98 -494 -615 -34 -91 -109 389 13 -335 282 113 -282 -547
6476e47M61L33J89r26K97J47n5n56Q14o78J388j24j59j387M42R03l57M24p41k4
$$ -547 -86 247 436 -490 -193 -46 -101 -657 157 -521 867 743 584 -803 -361 542 185 609 -132 -156
6496a56l64M99M73n41n25J609j101O2J1O7Q5q38O73Kj38P10j21n57R37o27k05
$$ -156 -520 -21 452 -89 -614 995 -106 -44 -33 34 119 -719 -46 -44 -182 528 407 -150 787 160 -45
6517d5K84M12m38n81N3Q01j03k64K07L67q76J78P44n01r59l1Q35K8J27l80j44
$$ -45 239 651 213 -368 -315 486 383 119 326 693 -183 -5 739 238 -721 -752 83 111 238 -142 -286
6538b86P20j56O98j179J220J85j306j40k40M57J46j182n5O45M67n09n41J268l40
$$ -286 434 278 976 -203 1017 1202 -104 -244 -484 -27 119 -1063 -1118 -473 -6 -515 -1056 212 -128
6557a28j13M02k04N35o22j19J104l44J23j816J469p07P55N94j061M22j000L00
$$ -128 -241 161 -43 492 -130 -249 855 511 634 -1182 287 -420 335 929 -132 290 -710 -410
6575d10J530j433qK01N7L93l12Q35j307n26J110q23O44M45n9J87QJ32M7r88o71
$$ -410 1120 -313 -321 -120 -63 330 18 853 -454 -980 130 -693 -49 396 337 524 532 664 711 -277 -948
6596i48K121j069o01M20M72l37N08l25J199j376p54j10J864j766J241j161P00
$$ -948 1173 104 -497 -77 395 58 566 241 1440 64 -690 -800 1064 -702 539 -622 78
6613G8r69K48L59M41r41Q68N20n53M39n43j180P78O80q15j82M36m33J326K89r74
$$ 78 -891 -643 -284 157 -784 84 604 51 490 -53 -1233 -455 225 -590 -772 -336 -769 557 846 -128
6633a28J030j520O52k03K08n86J827j014J96p70m0J86K83j26J95j29j79M55o50
$$ -128 902 -618 34 -169 39 -547 1280 266 462 -308 -348 -162 121 -5 190 61 -118 337 -313
6652c13J108j43j278K75J96J05M9j340J486l37m19P68l64R48m95m67Q24J55j275
$$ -313 795 652 -626 -351 -155 -50 -1 -1341 145 -192 -611 157 -207 741 246 -221 603 758 -517
6671e17Q39M5j642J287L20p96K43P4k07P00J101j525o08L71M20J95j84l17Q87
$$ -517 322 367 -1275 12 332 -464 -221 -147 -354 346 1447 -78 -686 -315 105 300 116 -201 686
6690F86j045N17NJ130j856Q46Oo47L13m58J044J261j577J53Q1n43J81p43O74m80
$$ 686 -359 158 163 1293 -563 283 289 -358 -45 -503 541 1802 225 378 459 -84 97 -646 28 -452
6710d52Q06j227L73P66Q19r89n31L40K26p4L89j49p54j13R34L67n54n8M20j65
$$ -452 354 -873 -500 266 1085 96 -435 -95 131 57 446 297 -457 -570 364 731 177 119 539 374
6730C74q16L46N76q32J063r90n06M62o72O74L99k39m53O47N16q10J193j186l42
$$ 374 -442 -96 480 -352 711 -279 -785 -323 -995 -321 78 -161 -614 33 549 -261 932 -254 -596
6749e96l25Q68m16o64J132j77j56j82m89P04K90o6J470j884O20m83Q47o58k45
$$ -596 -921 -53 -469 -1133 -1 -178 -334 -516 -1005 -301 -11 -77 1393 -491 129 -354 493 -165 -410
6768d10m84P69L49j6p13J157k32j108J068q00J164j627L64N88j14M29r2l83p96
$$ -410 -894 -125 224 208 -505 652 420 -688 380 -420 744 -883 -519 69 -45 384 292 -91 -887
6787h87M76L89j37L32R35j275k5N8J134j889J489Ln09k38k81M41J304j207j97
$$ -887 -411 -22 -159 173 1108 -167 -192 -134 1000 -889 600 603 94 -144 -425 16 1320 113 -84
6806h4Q33j88j676J685o71o5M44p37L16M95n43k07J23J246q41k45k14R76q09J005
$$ -84 749 561 -1115 570 -101 -166 278 -459 -143 352 -191 -398 -275 971 130 -115 -329 647 -162 843
6826H43m45k32R4L25j19J52j218K35P12m93N82j113K7L65o24Q50q9j81P47l51
$$ 843 398 166 260 585 466 618 -600 -365 347 -146 436 -677 -650 -285 -909 -59 -148 -329 418 67
6846F7j88K52p63O24n19J14K95J478o83o00k15P88j148J071j41j325K50O32K35
$$ 67 -121 131 -632 -8 -527 -413 -118 1360 677 77 -138 650 -498 573 432 -893 -643 -11 224
6865B24j141K95MO43k54Q20k87K76j554O85m86L0M55N90j112O95L46n37R85j003
$$ 224 -917 -622 -618 25 -229 591 304 580 -974 -289 -775 -745 -290 300 -812 -117 229 -308 677 -326
6885c26m96O88K20J86J06o64K91Pp14J058m81j89K74R50p75j077O89k09J043m39
$$ -326 -822 -134 86 272 378 -286 5 12 -702 356 -125 -314 -40 910 135 -942 -253 -462 581 142
6905A42l30j29n51P35j021J316o68J93J428q42j13K5j53k0j53Q13m53K14q78L5
$$ 142 -188 -317 -868 -133 -1154 162 -506 -313 1115 273 160 185 32 12 -141 672 219 433 -445 -410
6925d10K56l02O61m16O45p33L22k58r4J645j506L45j80J20r70N53L86q02M8R83
$$ -410 -154 -456 205 -211 434 -299 23 -235 -329 1316 -190 155 -25 95 -875 -322 64 -738 -690 293
6945B93j42n47M03J24l20J7m9p17Q79l40J123l33j309j74J556K94Nk88L99q31
$$ 293 151 -396 7 131 -189 -172 -221 -938 -59 -399 724 391 -918 -1092 464 758 763 475 874 43
6965D3j068M33R72R9q56N72J85m26m13k60J036M49p08P46L06j636J72O70j004
$$ 43 -1025 -592 380 479 -377 195 380 -46 -459 -719 317 766 58 804 1110 -526 -354 316 -688
6984f88P4P58k31l71M90J063j033M55p71l46L44K29l62L72J150p40M98j097N39
$$ -688 -614 144 -87 -458 32 1095 62 517 -254 -600 -256 -27 -389 -17 1133 393 891 -206 333
7003C33l39l23M75p74P06q03R83l68K46L74q12J28n13K53J022K39o70o78Q48n44
$$ 333 -6 -329 146 -628 78 -725 258 -110 136 510 -302 -174 -687 -434 588 827 157 -521 327 -217
7023b17q11J800j155P48J59o49M43J36l11L46J90n90K42l81lN33M95l01J21q24
$$ -217 -1028 772 -383 365 524 -125 318 454 143 489 679 89 331 -50 -53 480 975 674 795 -29
7043b9p79J375l06O45o74n86k40J397j836R31m29k50O26j011R93j6L37K06n48
$$ -29 -808 567 261 906 232 -354 -594 803 -1033 -102 -531 -781 -155 -1166 -173 -189 148 354 -194
7062a94M96q97N15l21M90J135j875M35m86J51N52m62k6M1L80N48K14m2j74j130
$$ -194 302 -595 -80 -401 89 1224 -651 -216 -702 -551 1 -461 -487 -446 -66 482 696 654 480 -650
7082f50J299k32J044j397O9l15k3Lo37J088K98k3j495R59k22j49j19r04J303j10
$$ -650 649 417 1461 64 133 -182 -205 -202 -839 249 547 524 -971 -12 -234 -383 -502 -1406 -103 -213
7102b13L24k8n16J53K44M26q61J214n73l80N26Q24r54m72O91k95L10K22O00q29
$$ -213 111 83 -433 -280 -36 390 -471 743 170 -210 316 1140 186 -286 405 110 420 642 1242 413
7122D13m92L42L8L08j005J303j292L8K44n18L25J03K88rO73l98r44l31J547q91
$$ 413 -79 263 301 609 -396 907 -385 -347 -103 -621 -296 -193 95 86 759 361 -583 -914 633 -258
7142b58n58J045k33o72P51rJ37O9j061l2J269r19P9L40Q10j430J426j71p58J276
$$ -258 -816 229 -4 -676 75 66 203 272 -789 -821 448 -471 -392 -52 758 -672 754 583 -175 1101
7162A101j692N06l81J154m32o50O4O03N11M17j429L07m26j44Q04M02m19L98k26
$$ 1101 -591 -85 -466 688 256 -394 -330 273 784 1201 -228 79 -347 -491 313 715 296 694 468
7181D68l74R1m63R54p04J38K19N86k97r27O36O3Q73j044n71q6O28K05k38N3j33
$$ 468 94 185 -278 676 -28 110 329 915 618 -309 327 390 1263 219 -352 -438 190 395 157 210 77
7202G7O15j361Q76L79l41m81L08p5M70M1q4J27r13J100m32k48j4j287J282J69
$$ 77 692 -669 207 586 245 -236 72 -3 467 508 424 551 -362 738 306 58 44 -1243 39 208
7222B08p1j94l6L07M81r00L90L1p79Q50q99J545j952J053l7m45M14J59O26j502
$$ 208 137 -57 -93 214 695 -205 185 216 -563 287 -612 933 -1019 34 -3 -448 -34 125 751 -751
7242g51M42l42j23J557M09j257l4N04q85l30n3N69L18n83K34M53O85j728K87K79
$$ -751 -309 -651 -774 783 1192 -65 -99 405 -480 -810 -863 -294 24 -559 -325 128 813 -915 -628 -349
7262c49L73J373j885P6q99J133l6K36r84P41K44n18Q93R0l62M96j34p46J127j500
$$ -349 24 1397 -488 -412 -1311 -178 -214 22 -962 -221 23 -495 398 488 126 622 488 -258 869 -631
7282f31P56m04J173o14m45L56j8r46J179K20jj081K2O82q4k58M5J71p81P49q41
$$ -631 125 -279 894 280 -165 191 173 -773 406 626 625 -456 -434 248 164 -94 -49 122 -659 90 -751
7303g51N72L21J98L22q45R52n23k8l33j13K69J114k684J083N07m34k84N48O36
$$ -751 -179 142 340 662 -183 769 246 218 -115 -228 41 1155 -1529 -446 61 -373 -657 -109 527
7322E27l28N3m5R42r83k88M11M98j689J177j61K03j056M49O80j000j11J681K1
$$ 527 199 252 207 1149 166 -122 289 787 -902 275 114 317 -739 -290 390 -610 -721 960 981
7341I81o32q81o7J660j024o42o0Q09P41j015L13L35r54O08p4l64j50J018n45P70
$$ 981 349 -532 -599 1061 37 -605 -665 144 885 -130 183 518 -436 172 98 -266 -416 602 57 827
7361H27o37l91k29J064j472O62K99J32l59n35O71j71N95m21q16J05R29K26n50
$$ 827 190 -201 -430 634 -838 -176 123 255 -104 -639 32 -139 456 35 -781 -676 253 479 -71
7380g1J83l86l55J433j384J325p38m61L31J74L74K5l06m1l28N13m20J63p71O09
$$ -71 112 -274 -629 804 -580 745 7 -454 -123 51 425 450 144 103 -225 288 -132 31 -740 -131
7400a31R06o17q42K16r4J065o27O01J79p45L50n86M66k06J46j7q63j77J047j063
$$ -131 775 158 -684 -468 -562 503 -124 477 656 -89 261 -325 141 -65 81 64 -799 -976 71 -992
7420i92J648m84o31n32Q37J15k19M0o59O29p51K52m1R99l07l21j04M43R96j170
$$ -992 656 172 -459 -991 -154 -39 -258 -218 -877 -248 -999 -747 -788 211 -96 -417 -521 -78 918 -252
7440b52j90R96k87p17O75k45n84J562q25n86R91K3m89m63j76K38O06k41m81n5
$$ -252 -442 554 267 -450 225 -20 -604 958 133 -453 538 561 72 -391 -567 -329 277 36 -445 -500
7460e00o1O24l44M97k48N7p27L25J045n90n32l23J060p56L98N19l44l89L79N3
$$ -500 -561 63 -281 216 -32 25 -702 -377 668 78 -454 -777 283 -473 -75 444 100 -289 90 143
7480A43p83L72nJ079j075N39L02j265R46j016J402m68j316P66K15L06J17m44m65
$$ 143 -640 -268 -273 806 -269 270 572 -693 253 -763 639 171 -1145 -379 -164 142 259 -185 -650
7499f50R10M09j011J1R41m79J36r00J844j315K54Q59n60k01J12q69L21M71M24
$$ -650 260 669 -342 -331 610 131 267 -633 1211 -104 150 1009 449 248 360 -509 -188 283 707
7518G07p79K39L82j324J372q75O28o37k51J277j448L96m22N26j9k75P85n71R29
$$ 707 -72 167 549 -775 597 -278 350 -287 -538 739 -709 -313 -735 -209 -228 -503 282 -289 640
7537F40p82K58r2m63M18j73q97J366n38N46k79n44J040n13l31K08L93l17O30l96
$$ 640 -142 116 24 -439 -21 -194 -1091 275 -263 283 4 -540 500 -13 -344 -136 257 -60 570 174
7557A74K57o67M84k44l98j99R37j127Q98O77q66K02o97M95m3K00k81r9P6O85q90
$$ 174 431 -236 248 4 -394 -593 344 -783 115 792 -74 128 -569 -74 -117 83 -198 -297 -221 464 -426
7578d26P19o71J196q65m62K24n64M91O53l47J54k60m4L51k12N41k65p39J91j1
$$ -426 293 -378 818 -47 -509 -285 -849 -358 295 -52 102 -158 -202 149 -63 478 213 -526 -335 -346
7598c46j78J289j168L46L8o2J014j384J097j007M12l79R6J65K61K15p63R69j401
$$ -346 -524 765 -403 -57 -19 -81 933 -451 646 -361 51 -328 -232 -67 194 409 -354 615 -786
7617g86J81r8J370m26j91J021j129m01K23n39J306q04K27L85p54J004j185Q46
$$ -786 -605 -703 667 241 50 1071 -58 -459 -236 -775 531 -273 -46 339 -415 589 -596 250
7635B50m27J21M97n29J125j179r58R66K31q49J714j407O9M98j42n64J092n36j62
$$ 250 -177 -56 441 -88 1037 -142 -1100 -134 97 -752 962 -445 -376 122 -20 -584 508 -28 -190
7654a90Q7pn68J144n1o03Q44q7j39j079R71m1j98l51k72J356j051P9O70j01n55
$$ -190 -103 -110 -678 466 415 -188 656 569 430 -649 322 281 83 -268 -540 816 -235 -156 514 413 -142
7675a42k34k22j89J201L14p32P75l26p88L68Rp16O83k08k21O22J080q79M2j70
$$ -142 -376 -598 -787 414 728 -4 771 445 -343 25 34 -682 1 -207 -428 194 1274 395 437 267
7695B67p63k43M19Q7j90P53j018K29J027j341L93P73k11q26l40K37P17q9j42K80
$$ 267 -496 -739 -320 -233 -423 330 -688 -459 568 -773 -380 393 182 -644 -984 -747 -30 -119 -261 19
7715A9m30M61K69m68O00K50q33j80J77R65j416o2J094n26L73l6n07J23Q8L22j280
$$ 19 -411 50 319 -149 451 701 -132 -312 -135 830 -586 -648 446 -80 293 257 -250 -127 -39 283 -997
7736i97J904j139l13K31K39J74K42o94k94M09O28K53j113k0J180q52O6J83n15
$$ -997 907 -232 -545 -314 -75 99 341 -353 -647 -238 390 643 -470 -490 690 -162 -96 87 -428
7755d28M18PQ84q83j434J966o91k86R3M69n08R13L71j161Q12j142k54L05M59l13
$$ -428 -10 -3 881 -2 -1436 530 -161 -447 -354 115 -393 520 891 -270 542 -600 -854 -549 -90 -403
7775d03R17l72m22N09r2n77j38K69J001j63r3l13r02Q12J82l71o38Q4j08Q09j385
$$ -403 514 142 -280 229 137 -440 -578 -309 692 529 436 123 -779 33 215 -156 -794 -710 -818 -9 -1394
7796a394N71j50M39R13j146J151m82j65M83k71K95J77p9q02l7M60j06k39R41N58
$$ -1394 -823 -973 -534 379 -767 384 -98 -263 220 -51 244 421 342 -460 -497 -37 -143 -382 559 1117
7816A117p17j123R28k27p56l43J422k4l71o23M52q4p81J317p0j95M9N19o75J41
$$ 1117 400 -723 205 -22 -778 -1121 301 277 -94 -717 -265 -349 -1130 187 117 -78 -29 490 -185 -44
7836d4J00M20J72j929P92N51J14l19q81J048k48q9P2j17k75M63P12j63k7q71K81
$$ -44 56 476 648 -1281 -489 62 176 -143 -1024 24 -224 -313 -241 -358 -633 -170 542 379 352 -519 -238
7857b38k88r3J820k57p81K43p72N32j8j438Q67J90l52Q36K31O17p75r84O80m3
$$ -238 -526 -619 1201 944 163 406 -366 166 148 -1290 -423 -233 -585 251 482 1099 324 -660 20 -23
7877b3l5M2J59J029j535l82J366k2o18L58M26j560J322j1K59n06j199J381L29
$$ -23 -58 -16 143 1172 -363 -745 621 599 -19 339 765 -795 527 516 775 269 -930 451 780
7896G80k21n73R18j221J505j413K42o62O57L90K9l33K2k52Q84r74K69M02q37M95
$$ 780 559 -14 904 -317 1188 -225 17 -645 12 402 431 98 120 -132 752 -222 47 449 -388 107
7916A07m60j94J385j09j306L51k44K32n17J583j829J749K59r90K50o70N66J81
$$ 107 -353 -547 838 729 -577 -226 -470 -238 -755 828 -1001 748 1007 17 267 -403 163 344
7934C44r65J149j336J644p46j21J02N36lq02J35L77n79m38K30O43J03K76r17O45
$$ 344 -621 528 -808 836 90 -31 71 607 604 -198 -63 314 -265 -703 -473 170 273 549 -368 277
7954B77m48l27k7K89R72q43j84R10j070K26J162n25K58k01j445J391k22M4P17
$$ 277 -171 -498 -525 -236 736 -107 -291 619 -451 -225 937 412 670 469 -976 415 193 237 954
7973I54j249P10q75L82o07O57j99M20p6r91J254j167K022j864J82p5J58m09J921
$$ 954 -295 415 -460 -78 -685 -28 -227 193 117 -874 380 -787 1235 -629 -447 -522 -364 -773 1148
7992A148j017k93j7K11Q76o15L49Q6j673J263o60N60K8J75j219J252jJ67l03n25
$$ 1148 131 -162 -179 32 908 293 642 728 -945 318 -342 218 246 421 -798 454 453 620 317 -208
8012b08K92j58n53Q47J20N75j375J290O3j642O30l66Q23k58J389j812J5k82J60
$$ -208 84 -74 -627 220 340 915 -460 830 893 -749 -119 -485 338 80 1469 -343 -328 -610 -450
8031d50K66J104j47p05m17M81J07K77j103R71p9n91K79N10Q2j225J014n77N35
$$ -450 -184 920 773 68 -349 132 239 516 -587 384 305 -286 -7 503 585 -640 374 -203 332
8050C32p51L84O89K66l21m08o66O93o49J95Q91j369J498j022K9M26O69j459P80
$$ 332 -419 -35 654 920 599 191 -475 218 -431 -236 655 -714 784 -238 -209 217 886 -573 207
8069B07K31n75o17L38K27n00R50p95P80m06L22l51N17l52N52J93m08K91Q2n28
$$ 207 438 -137 -754 -416 -189 -689 261 -534 246 -160 162 -189 328 -24 528 721 313 604 686 158
8089A58n20O50o56M80K84r60P83j422J378n53J89L51l08j02o27Q74l86o8J072
$$ 158 -362 288 -368 112 396 -564 219 -1203 175 -378 -189 162 -146 -248 -875 -1 -387 -455 617
8108F17j063P6n64O58J023o17k66k22J88K73j54j46k79l1Q04j89r0o66K406k184
$$ 617 -446 -370 -934 -276 747 130 -136 -358 -170 103 -51 -197 -476 -507 297 108 18 -648 1758 -426
8128d26J87N79o68l53J316l39J56j243J436m56J43o10O18n51J98k58M87L30o28
$$ -426 -239 340 -328 -681 635 296 452 -791 645 189 332 -278 340 -211 -13 -271 216 546 -82
8147h2k93O56o30N62k8j106K7R45n56P62p5q99J066p12J372j305N77l57L46l16
$$ -82 -375 281 -349 213 185 -921 -894 51 -505 257 182 -717 349 -363 1009 -296 281 -76 270 -46
8167d6k16L33O79Q1r29K44R9n70J89J5J9Q18j181Q68L0l07j62l11q24J787l92
$$ -46 -262 71 750 831 -98 146 245 -325 -136 -121 -102 716 -465 403 433 126 -36 -347 -1171 616 224
8188B24j35l65L01
$$ 224 89 -276 25
8191B5
$$ Imaginary data points
##PAGE= N=2
##DATA TABLE= (X++(I..I)), XYDATA
0@%%%%%%%%%%%%%%J24k48K48k48K48l71M95m96O20p44Q68r92J116j340J513j696
$$ 0 0 0 0 0 0 0 0 0 0 0 0 0 0 0 124 -124 124 -124 124 -247 248 -248 372 -372 496 -496 620 -720 793 -903
30i03J932k223K558k873L235l657M090m584N126n715O362p062P837q683R593j0590
$$ -903 1029 -1194 1364 -1509 1726 -1931 2159 -2425 2701 -3014 3348 -3714 4123 -4560 5033 -5557
46e557J1692j2900J4213j5648J7235j8990K0937k3098K5520k8273L1402l4987
$$ -5557 6135 -6765 7448 -8200 9035 -9955 10982 -12116 13404 -14869 16533 -18454
58a8454L9154m4089N0022n7300O6494p8511R4949j18845J56838k26393L92920
$$ -18454 20700 -23389 26633 -30667 35827 -42684 52265 -66580 90258 -136135 256785
69B56785j479851j065601M244251l70002k862890Q74256J611050j450889l77267
$$ 256785 -1223066 -2288667 1955584 1585582 -1277308 -403052 1207998 -242891 -620158
78f20158J220707j59620q66036M96763J96429p86757J20930J331345j39958j498012
$$ -620158 600549 440929 -425107 71656 268085 -518672 -397742 933603 793645 -704367
88g04367K02804J552829o27658j662912Q72190J727837r93107j570753J017261
$$ -704367 -501563 1051266 423608 -1239304 -367114 1360723 367616 -1203137 -185876
97a85876J326260j026118q69339J106295M18260j130743n6819O12598o35660m7070
$$ -185876 1140384 114266 -755073 351222 769482 -361261 -418080 194518 -441142 -488212
107d88212J303492m06646j420912R89229J223090j524787q46801J876260M77423
$$ -488212 815280 408634 -1012278 -23049 1200041 -324746 -1171547 704713 1182136
116A182136j991926k86033J687594k3695j369275K96053J144995l14536p00290
$$ 1182136 -809790 -1095823 591771 568076 -801199 -505146 639849 325313 -374977
125c74977L80654K05101m47815K39709L84785o90135k71601J042447Q3614j256338
$$ -374977 5677 210778 -237037 2672 387457 -302678 -574279 468168 551782 -704556
135g04556K07617J451124m04693j499494N20076J331117p10273j106829Q67412
$$ -704556 -496939 954185 549492 -950002 -429926 901191 190918 -915911 -48499
144d8499Q37231r16870m96009Q67863J87542n80645K14921K40186n83761Q8666
$$ -48499 788732 -128138 -624147 243716 431258 -149387 65534 305720 -278041 -189375
154a89375P50327n33168q89097Q69640R03488j080517p34315J261673N42296j305496
$$ -189375 560952 27784 -861313 8327 911815 -168702 -903017 358656 900952 -404544
164d04544k98562J226319K2999j085720J62147Q05460l04786m46473L76893M8875
$$ -404544 -703106 523213 546212 -539508 -377361 428099 123313 -323160 53733 102608
174A02608l72871L50606L26842o62292j97877Q86169k5276j082320K20905J201612
$$ 102608 -270263 80343 407185 -255107 -452984 433185 407909 -674411 -453506 748106
184G48106l39380j157077M66069J028320n57525q27238N95274N45317o08118k71012
$$ 748106 408726 -748351 -282282 746038 188513 -638725 -43451 501866 -106252 -377264
194c77264N20679l0883l53349L31053J59738n21879J35280O50575m50105p05879
$$ -377264 143415 112532 -240817 90236 249974 -271905 -136625 513950 63845 -642034
204f42034P31646O72942r47230n89482J013254M00924r93918j73728R26666O976
$$ -642034 89612 762554 -184676 -774158 239096 640020 -353898 -527626 399040 406016
214D06016p49229J23089M88073k26069j87412K97529j03373l16851L52612K59310
$$ 406016 -343213 -220124 267949 41880 -145532 151997 48624 -268227 84385 343695
224C43695n74478j48407P63259J4693q85375J26568R15782k85166q85872M17354
$$ 343695 -230783 -379190 384069 398762 -486613 -360045 555737 270571 -615301 -197947
234a97947P97554m93491o28747N05708L97568m45521j08472L44568j74321k15432
$$ -197947 599607 106116 -522631 -16923 380645 -64876 -173348 171220 -3101 -218533
244b18533L75178J1407n17354K24394N93967m42725n86261O26470N22934p29805
$$ -218533 156645 168052 -349302 -124908 469059 26334 -559927 66543 589477 -140328
254a40328l88003P79408K30654p64829r8994O55509l2889m99207J31447L00606
$$ -140328 -528331 251077 481731 -283098 -382092 273417 240528 -258679 -127232 173374
264A73374j96654p7900K26252j34745k03667L53979J62723n42072j10013O65418
$$ 173374 -23280 -101180 125072 -9673 -213340 140639 303362 -238710 -348723 316695
274C16695K6658p19316Q7046P18111k10073o65980L13115N65572l77873m15721
$$ 316695 343353 -375963 -288917 429194 219121 -446859 -133744 431828 53955 -361766
284c61766L84048K19230l49045j6296K63607j61455j10531L25630o1722m46431
$$ -361766 22282 241512 -107533 -123829 139778 -21677 -132208 193422 131700 -314731
294c14731K35733M98104l98263m89284N12150M14156n91110l07701O18090J95030
$$ -314731 -78998 419106 20843 -468441 43709 457865 -133245 -440946 177144 372174
304C72174n59470n8195M60807o6451l32616J58325J76331k13991j7413K12031
$$ 372174 -187296 -245491 215316 148865 -183751 -25426 150905 -63086 -80499 131532
314A31532j63338j90656L33215J55037m60919q3576N52288n885o04380R3304O01472
$$ 131532 -31806 -222462 110753 265790 -195129 -278705 273583 267698 -336682 -243378 358094
325C58094j72819n33636K41430M13295k90621k57505L10406Q9685k73435P0076
$$ 358094 185275 -348361 -106931 306364 15743 -241762 68644 158329 -115106 -45030
335d5030J79145k30832o0871L45253p4851l96350K27609M04459l53955l61703
$$ -45030 134115 -96717 -157588 187665 112814 -283536 -55927 348532 -5423 -367126
345c67126M51905K89221m93633k03207M66711R3463m08372L836L17776p4390j92499
$$ -367126 84779 374000 -119633 -322840 143871 237334 -171038 -167202 150574 76184 -116315
356a16315J35821N8882j75166P0558J96491j82581j83629K80723J32268l80910
$$ -116315 19506 78388 -96778 -26220 170271 -12310 -195939 84784 217052 -163858
366a63858p4263M51556Q458m69897Q4202M49701j72561l96062K32213K93617k54533
$$ -163858 -238121 213435 221893 -248004 -163802 285899 113338 -282724 -50511 243106 -11427
377a1427j55279K44045M212j96298J33580J13503k37420p486L05179j07277l42619
$$ -11427 -166706 77339 81551 -114747 18833 132336 -105084 -112570 192609 85332 -257287
388b57287K01229L23554k77964k71284L30065K05833l47468j20935L42509N0328
$$ -257287 -56058 267496 -10468 -281752 48313 254146 -93322 -214257 128252 178580
398A78580l01569J2880K24170q3825j44065J34246M6833j57257O4765J76016j77362
$$ 178580 -122989 -110109 114061 30236 -113829 20417 67250 -90007 -25242 150774 -26588
409b6588j72922K72907J42324l38916p3028L79640j3106l91126Q8243L48004j58436
$$ -26588 -199510 73397 215721 -123195 -196223 183417 170311 -220815 -132572 215432 56996
420E6996k56475K14760J61365k28889n6728J93173n5616j41893J48779P7652k07822
$$ 56996 -199479 15281 176646 -52243 -108971 84202 28586 -113307 35472 113124 -94698
431i4698J1798K50432r8132k68435J71117K57129k24007k20222K51572J52632
$$ -94698 -82900 167532 69400 -199035 -27918 229211 5204 -215018 36554 189186
441A89186k63318q5414K50080J8144k06271M9708J55570r9029r0832J35981P897
$$ 189186 -74132 -159546 90534 108678 -97593 -47885 107685 8656 -82176 53805 61702
452F1702j63397O4235J55549j52689j29357K35343J01987k81547m7122K90387
$$ 61702 -101695 -37460 118089 -34600 -163957 71386 173373 -108174 -155296 135091
462A35091l3941k77799J06411K44975j39090j77613J52377P9415j64171J0669
$$ 135091 101150 -176649 -70238 174737 35647 -141966 10411 89826 -74345 -63676
472f3676J62436o9239j19503J29519N1405j95228N124K24157o2624k08093J34961
$$ -63676 98760 29521 -89982 39537 90942 -104286 -99162 124995 62371 -145722 -10761
483a0761J82441j90176j44799K18937R7701k12050m7814J78930j4828j47379O9431
$$ -10761 171680 -18496 -163295 55642 153343 -58707 -106521 72409 57581 -89798 -20367
494b0367J12505j00296n6955J21205j3674j40236R1522J46211j47806j23983J83657
$$ -20367 92138 -8158 -65113 56092 42418 -97818 -6296 139915 -7891 -131874 51783
505E1783N6361k20568P452K38743m5997k08657Q5253J46614j32530r9653J54530
$$ 51783 108144 -112424 -104972 133771 87774 -120883 -35630 110984 -21546 -121199 33331
516C3331N3390j35962J4035J06857r2805p6072J51694M1280j75714J1526J73728
$$ 33331 86721 -49241 -35206 71651 -21154 -97226 54468 95748 -79966 -68440 105288
527A05288p8513j61905J25252J34328j49310r4191J56208N2542j48258j073J40613
$$ 105288 26775 -135130 -9878 124450 -24860 -119051 37157 89699 -58559 -59632 80981
538H0981l2910j20679N9281P1366r8212j6592J37096k6890j39034P5533J07587
$$ 80981 48071 -72608 -13327 58039 -40173 -56765 80331 53441 -85593 -10060 97527
549I7527j32172o9554J74969L7958j81703k330J59158m9196j30822R1168J03105
$$ 97527 -34645 -104199 70770 108728 -72975 -75305 83853 34657 -96165 -4997 98108
560I8108j11213o0967J17108M100j17268M7600J00481r1551o6314J23349K2573
$$ 98108 -13105 -74072 43036 47136 -70132 -22532 77949 -13602 -79916 43433 66006
571F6006j36495L2103J36535p1212j24361Q7464R0953j04155n3380J20167K1077
$$ 66006 -70489 -38386 98149 26937 -97424 -9960 80993 -23162 -76542 43625 64702
582F4702j26236N118J10445l8211q0386Q5345N2658j16229j8765J19593l2261
$$ 64702 -61534 -56416 54029 15818 -64568 20777 73435 -42794 -61559 58034 25773
593B5773j05336Q2221Q4917j13763n3342J31046J3171j33282K4438J22825n6486
$$ 25773 -79563 2658 87575 -26188 -79530 51516 64687 -68595 -44157 78668 22182
604B2182r7820P7657O4679r2745j9969J04472k2065j01671N4270P5853p9597l8512
$$ 22182 -75638 2019 66698 -26047 -46016 58456 36391 -65280 -11010 64843 -14754 -53266
616e3266R5489p89j07657L0337J01861n0284p9401P1547N7683q6592l8167R3648
$$ -53266 42223 41434 -66223 -35886 65975 15691 -63710 7837 65520 -21072 -59239 34409
628C4409Q672r3536K3760Q6333n5190o6499P7726L3187r0042O439R5287m4981
$$ 34409 43081 -50455 -26695 59638 4448 -62051 15675 48862 -41180 -34741 60546 15565
640A5565q5117P1303O5456q8861l4452R6752J913r6510K9518Q9843n4216p2915
$$ 15565 -69552 1751 67207 -21654 -56106 40646 42559 -53951 -24433 65410 11194 -61721
652f1721P2786L8458q5334m525Q7163k7683p4029N8085N2103p3246k6935Q2522
$$ -61721 11065 49523 -35811 -40336 46827 19144 -54885 3200 55303 -17943 -44878 37644
664C7644k002p9912K1496P2100m4143n9293O0945M3101o9884k0545P6202p259
$$ 37644 35642 -44270 -22774 49326 5183 -54110 6835 49936 -19948 -40493 35709 28450
676B8450p5074L6345O4398n8379m5771O9609J7350p5160J6858P3046m4544o3457
$$ 28450 -46624 -10279 54119 -4260 -50031 19578 36928 -38232 -21374 51672 7128 -56329
688e6329O1806M1844o9781j6130P4296q643p4262L5636O1127n2921m2675O9278
$$ -56329 5477 47321 -22460 -38590 35706 27063 -47199 -11563 49564 -3357 -46032 23246
700B3246J7953p2366O001O3474l1104n1845N1520L5975o2155j8599O3299N86n6413
$$ 23246 41199 -31167 -25166 38308 7204 -44641 6879 42854 -19301 -37900 25399 25985 -30428
713c0428K1287N1365m3132m3341N4342K7576n9523o195O1435j8206n6865L9895
$$ -30428 -9141 42224 -908 -44249 10093 37669 -21854 -28049 33386 15180 -41685 -1790
725a790M4156n4823k3731O0957J240o0544J7394N3013l3833l8983M8864K2135
$$ -1790 42366 -12457 -36188 24769 26009 -34535 -17141 35872 2039 -36944 11920 34055
737C4055n8589n366N9364j3199n1123L1412L8589m8646k1477N6647O088n3687
$$ 34055 -24534 -29900 29464 16265 -34858 -3446 35143 -13503 -34980 21667 27755 -25932
749b5932J2037M7158l1210l5273M1086K5211m9188r664M9353r541m6649K6953
$$ -25932 -13895 33263 2053 -33220 7866 33077 -16111 -25775 23578 14037 -32612 -5659
761e659L9544l7425k6623M7366Q328n2175P714M9407k1368l8320L3493K4146m5356
$$ -5659 33885 -3540 -30163 17203 25531 -26644 -18930 30477 9109 -29211 4282 28428 -16928
774a6928r537N0594m454m5231J7319L5430l2060k4047M2408J2225m5954J871M4490
$$ -16928 -26465 24129 19675 -25556 -8237 27193 -4867 -28914 13494 25719 -20235 -18364 26126
787B6126j8767l6759L2024K4799l8756j1556L8925k020l8993J6928L5258k5028
$$ 26126 7359 -29400 2624 27423 -11333 -22889 16036 14016 -24977 -8049 27209 2181
799B181k6571L3344J2095m0369J550M3893j2911l6660K2832K5804l3902j5786
$$ 2181 -24390 8954 21049 -19320 -17770 26123 13212 -23448 -616 25188 -8714 -24500
811b4500L8812L849l8195R596L4022k2093k4980K9464J5734l5918j386L5312j0304
$$ -24500 14312 18161 -20034 -10438 23584 1491 -23489 5975 21709 -14209 -15595 19717 9413
824I413l2304K2782K5003l1324j6345L4837L740l6012J0811L2657k0429k3919
$$ 9413 -22891 -109 24894 -6430 -22775 12062 15802 -20210 -9399 23258 2829 -21090
836b1090K5020J3291k8750k913L2239p363k8323J5556K1004k4845j4479L1689
$$ -21090 3930 17221 -11529 -14442 17797 10434 -17889 -2333 18671 -6174 -20653 11036
848A1036N335l0697N015K8831j7379k4062K3912J7118k6626o350K9436m830k7720
$$ 11036 16371 -14326 -9311 19520 2141 -21921 1991 19109 -7517 -13867 15569 10739 -16981
861a6981J2843K1738k1626j3658K6344N633k7533O099K5994j6293k2182K2589
$$ -16981 -4138 17600 -4026 -17684 8660 14293 -13240 -7141 18853 2560 -19622 2967
873B967J5718k8917m483K9861l683k7518J1652J8923j7086j3082K1251P121k2295
$$ 2967 18685 -10232 -14715 15146 11463 -16055 -4403 14520 -2566 -15648 5603 12724 -9571
886i571K508K0309j0938j9188J8051J3544k0899n515K5938m720k6579J0428K1739
$$ -9571 -7063 13246 2308 -16880 1171 14715 -6184 -11699 14239 9519 -17060 -6632 15107
899A5107j6028j6420K3401Q819k4067o55K1159o419j7209J3444J3490j9690n473
$$ 15107 -921 -17341 6060 14879 -9188 -9843 11316 4897 -12312 1132 14622 -5068 -10541
912a0541K1491l282k3134J2016J8240j8832j0681K3292N345k4296J290K0417p595
$$ -10541 10950 7668 -15466 -3450 14790 -4042 -14723 8569 13914 -10382 -9092 11325 3730
925C730j7282J1923J4234j3911p590J6236j368j6638M797J6334j2276r182J8654
$$ 3730 -13552 -1629 12605 -1306 -8896 7340 5972 -10666 -5869 10465 -1811 -10993 7661
938G661M395k3277k0K3164p220j9949J6411J4674j8780q945J7796L019j7472L972
$$ 7661 12056 -11221 -11241 11923 4703 -15246 1165 15839 -2941 -11886 5910 8929 -8543 -4571
952d571J3229o682j1318J3537L533j6642L023J7237q406j6534J4581J2083j7942
$$ -4571 8658 1976 -9342 4195 7728 -8914 -5891 11346 2940 -13594 987 13070 -4872
965d872o022J9702p41j9635L950J7303n999j2115J0116O891j0560m431J1910k810
$$ -4872 -10894 8808 8067 -11568 -7618 9685 3686 -8429 1687 8578 -1982 -6413 5497 2687
979B687j0256R807J0623j6981n785J7205m75k0733R602J9281j2582j5066J4226
$$ 2687 -7569 2238 12861 -4120 -9905 7300 6825 -13908 -4306 14975 2393 -12673 1553
992A553P252j3781l495J4295p64j1601M963P794q443l854J2012m54j4772N569
$$ 1553 8805 -4976 -8471 5824 5060 -6541 -1578 6216 -2227 -6081 5931 5477 -9295 -3726
1006c726J4158j0491j1327J6669O256j8140j646J6762k036j3215M449J0892o702
$$ -3726 10432 -59 -11386 5283 11539 -6601 -8247 8515 6479 -6736 -2287 8605 1903
1019A903r969Q275L226r043L498J1343q558r183J0855N141j7343L197J8313q061
$$ 1903 -8066 209 3435 -5608 -2110 9233 675 -8508 2347 7488 -9855 -6658 11655 3594
1033C594j4307J0910R403j0761p288J1499L014j0139J035Q942n229p765P736M451
$$ 3594 -10713 197 9600 -1161 -8449 3050 6064 -4075 -3040 5902 673 -7092 644 5095
1047E095r436L41J1256n294j0907R764J0200j4173o723J5321N27j2023J378J2504
$$ 5095 -4341 -4000 7256 1962 -8945 819 11019 -3154 -9877 5444 5971 -6052 -4674 7830
1061G830m634j1490P720P143r114l238R880j274r193O686P300j3935j649J5196
$$ 7830 3196 -8294 -574 6569 -2545 -5783 4097 2823 -6370 316 7616 -6319 -7968 7228
1075G228j905j4300O982J1758j0455r588J2275O778j1505k919Q397J374p141R37
$$ 7228 5323 -8977 -1995 9763 -692 -10280 1995 8773 -2732 -5651 2746 4120 -3021 -2084
1089b084P807p027m068J0050J053j2915M592R815p948p451J1500N413j4236k837
$$ -2084 5723 -1304 -5372 4678 5731 -7184 -2592 7223 -725 -8176 3324 8737 -5499 -8336
1103h336J5055r65j2496L850J0536p347q011R568K567r990J907J1072p592o379
$$ -8336 6719 5754 -6742 -2892 7644 297 -7714 1854 4421 -5569 -3662 7410 -182 -6561
1117f561J1578K732j4665J807J3015m058j3022R742P829j0646m288J0821K244
$$ -6561 5017 7749 -6916 -5109 7906 3848 -9174 568 8397 -2249 -6537 4284 6528
1130F528j0272p16R084j875p401L956N550r023m77J1151k662j1608O953R150r638
$$ 6528 -3744 -4460 4624 2749 -4652 -696 4854 -4169 -4646 6505 3843 -7765 -812 8338 -1300
1145a300o360J1761J964j4303K484J2825k724j2452O933O953p577l933J0873k033
$$ -1300 -7660 4101 6065 -8238 -5754 7071 4347 -8105 -1172 5781 -1796 -5729 5144 3111
1159C111r695N358Q268q269m634J1330o19j1996N097J1798p346j0575R020O389
$$ 3111 -6584 -1226 7042 -1227 -5861 5469 4850 -7146 -2049 9749 2403 -8172 848 7237
1173G237q883m220J0290r32r938L420J0140o295p680Q819K879r325J505J0945
$$ 7237 -1646 -5866 4424 3492 -6446 -3026 7114 819 -6861 1958 4837 -4488 -2983 7962
1187G962o445r999R546Q261j2474l523J1576J8j2455M722J1323p452q987R490
$$ 7962 1517 -8482 1064 9325 -3149 -6672 4904 4922 -7533 -2811 8512 1060 -7927 1563
1201A563N623j1345l33J1607m236j0834P835P683j0185l596J1272j178j1663O285
$$ 1563 7186 -4159 -4492 7115 2879 -7955 -120 7563 -2622 -6218 5054 3876 -7787 -1502
1215a502J0761r877q252J1465N116j1559j593R498k075q840O600Q372j0569l520
$$ -1502 9259 -618 -8870 2595 7711 -3848 -5441 4057 1982 -6858 -258 8114 -2455 -5975
1229e975Q817K495j0978J839J1688q581p282J0057O352j1838k608J2691k317j2084
$$ -5975 2842 5337 -5641 -3802 7886 -695 -7977 2080 8432 -3406 -6014 6677 4360 -7724
1243g724N821J0184q637q089J1545M289j1864k47J1765o293q619R453P149j4571
$$ -7724 -1903 8281 -356 -8445 3100 7389 -4475 -4722 7043 750 -7869 1584 8733 -5838
1257e838j375J3184j516j2133O340Q400p815p013J0805L528j1137m13J1729m000
$$ -5838 -7213 5971 4455 -7678 -1338 7062 -753 -7766 3039 6567 -4570 -4983 6746 2746
1271B746r543P328O978j1547k708J1982m7j0865L211R632o754p502R526N851j2440
$$ 2746 -6797 531 7509 -4038 -6746 5236 5189 -5676 -2465 7167 413 -7089 2437 8288 -4152
1286d152j440J1268j844j1416O352Q903r881n885J3073J005j1973K604R859n784
$$ -4152 -5592 5676 3832 -7584 -1232 7671 -2210 -8095 4978 5983 -5990 -3386 6473 689
1300F89q044J0139L148j0487j482J2631l199j0406N450Q815r252m806J2346J271
$$ 689 -7355 2784 5932 -4555 -6037 6594 3395 -7011 -1561 7254 -1998 -6804 5542 6813
1314F813j2348J637J0682n403q391Q115N433r600l058J1576j198j1424M141R513
$$ 6813 -5535 -3898 6784 1381 -7010 1105 6538 -3062 -6120 5456 4258 -7166 -3025 6488
1328F488n764p335Q202M729j1296K77J2354n108r601P523O917j0359k754J1097
$$ 6488 724 -6611 1591 6320 -4976 -4699 7655 2547 -7054 469 7386 -2973 -5727 5370
1342E370j125j1234M879R628p051p745R901K642j0160J676Q460k459j0293O237
$$ 5370 4245 -6989 -2110 7518 467 -7278 2623 5265 -4895 -3219 5241 2782 -7511 -1274
1356a274O782p563k908Q665J382r596K129P868l861p444O895N177r722j923R955
$$ -1274 5508 -2055 -4963 3702 5084 -4512 -2383 5485 1624 -5820 1075 6252 -3470 -5393 4562
1371D562j293q824L976R047q065o128R099K874j0817K335J0266m393r673P313
$$ 4562 3269 -5555 -1579 7468 -597 -6725 2374 5248 -5569 -3234 7032 2639 -7034 279
$$ [...]
8191a96
##END NTUPLES=NMR FID
##END=
