##TITLE=1H_AT-40
 CDCl3
 128 sc, 
 20.2.2023
##JCAMPDX= 6.0         $$ Bruker NMR JCAMP-DX V2.0
##DATA TYPE= NMR FID
##DATA CLASS= NTUPLES
##ORIGIN= UXNMR, Bruker Analytische Messtechnik GmbH
##OWNER= root
$$ XWIN-NMR		Version 3.5
$$ Mon Feb 20 16:14:40 2023 Russian Standard Time (UT+4h)  she@DPX200
##.OBSERVE FREQUENCY= 200.13135
##.OBSERVE NUCLEUS= ^1H
##.DELAY= (6, 6)
##.ACQUISITION MODE= SIMULTANEOUS
##.ACQUISITION SCHEME= undefined
##.AVERAGES= 128
##.DIGITISER RES= 18
##SPECTROMETER/DATA SYSTEM= spect
##.PULSE SEQUENCE= zg30
##.SOLVENT NAME= CDCl3
##.SHIFT REFERENCE= (INTERNAL, CDCl3, 0, 15.7039)
##AUDIT TRAIL= $$ (NUMBER, WHEN, WHO, WHERE, WHAT)
$$ ##TITLE= Audit trail, XWIN-NMR		Version 3.5
$$ ##JCAMPDX= 5.01
$$ ##ORIGIN= Bruker BioSpin GmbH
$$ ##OWNER= she
$$ F:/spectra/data/she/nmr/H-F/1/audita.txt
$$ ##AUDIT TRAIL=  $$ (NUMBER, WHEN, WHO, WHERE, WHAT)
(   1,<2023-02-20 16:12:57.95 +0400>,<she>,<DPX200>,
      <continue with go, POWCHK disabled, PULCHK disabled
       configuration hash MD5:
       00 E9 B6 7A A2 85 ED C7 34 08 36 98 17 FE 4E 26
       data hash MD5: 16K
       B3 81 75 0D DD B3 68 91 A4 80 A4 00 4E CE 89 EB>)
$$ ##END=
$$ 
$$ hash MD5
$$ B5 00 FD C8 B9 C4 DA 80 6E A4 12 E4 5B 8C B8 E9
##$RELAX= 
##$RELAX= 
##$RELAX= 
##$RELAX= 
##$RELAX= 
##$RELAX= 
$$ Bruker specific parameters
$$ --------------------------
##$DU= <F:/spectra>
##$EXPNO= 1
##$NAME= <H-F>
##$PROCNO= 1
##$TYPE= <nmr>
##$USER= <she>
##$AMP= (0..31)
100 100 100 100 100 100 100 100 100 100 100 100 100 100 100 100 100 100 
100 100 100 100 100 100 100 100 100 100 100 100 100 100 
##$AQSEQ= 0
##$AQ_mod= 1
##$AUNM= <au_zg>
##$AUTOPOS= <>
##$BF1= 200.13
##$BF2= 200.13
##$BF3= 200.13
##$BF4= 200.13
##$BF5= 200.13
##$BF6= 200.13
##$BF7= 200.13
##$BF8= 200.13
##$BYTORDA= 1
##$CFDGTYP= 0
##$CFRGTYP= 5
##$CHEMSTR= <none>
##$CNST= (0..31)
1 1 145 1 1 1 1 1 1 1 1 1 1 1 1 1 1 1 1 1 1 1 1 1 1 1 1 1 1 1 1 1 
##$CPDPRG= <>
##$CPDPRG1= <>
##$CPDPRG2= <>
##$CPDPRG3= <>
##$CPDPRG4= <mlev>
##$CPDPRG5= <mlev>
##$CPDPRG6= <mlev>
##$CPDPRG7= <mlev>
##$CPDPRG8= <mlev>
##$CPDPRGB= <>
##$CPDPRGT= <>
##$D= (0..31)
0 1.2 0 0 0 0 0 0 0 0.06 0 0.03 0 0 0 0 0.0002 0 0 0 0 0 0 0 0 0 0 0 0 
0 0 0 
##$DATE= 1676894891
##$DBL= (0..7)
120 120 120 120 120 120 120 120 
##$DBP= (0..7)
150 150 150 150 150 150 150 150 
##$DBP07= 0
##$DBPNAM0= <>
##$DBPNAM1= <>
##$DBPNAM2= <>
##$DBPNAM3= <>
##$DBPNAM4= <>
##$DBPNAM5= <>
##$DBPNAM6= <>
##$DBPNAM7= <>
##$DBPOAL= (0..7)
0.5 0.5 0.5 0.5 0.5 0.5 0.5 0.5 
##$DBPOFFS= (0..7)
0 0 0 0 0 0 0 0 
##$DE= 6
##$DECBNUC= <off>
##$DECIM= 32
##$DECNUC= <off>
##$DECSTAT= 4
##$DIGMOD= 1
##$DIGTYP= 9
##$DL= (0..7)
0 120 120 120 120 120 120 120 
##$DP= (0..7)
150 150 150 150 150 150 150 150 
##$DP07= 0
##$DPNAME0= <>
##$DPNAME1= <>
##$DPNAME2= <>
##$DPNAME3= <>
##$DPNAME4= <>
##$DPNAME5= <>
##$DPNAME6= <>
##$DPNAME7= <>
##$DPOAL= (0..7)
0.5 0.5 0.5 0.5 0.5 0.5 0.5 0.5 
##$DPOFFS= (0..7)
0 0 0 0 0 0 0 0 
##$DQDMODE= 0
##$DR= 18
##$DS= 0
##$DSLIST= <SSSSSSSSSSSSSSS>
$$ [...]
##$SUBNAM2= <"">
##$SUBNAM3= <"">
##$SUBNAM4= <"">
##$SUBNAM5= <"">
##$SUBNAM6= <"">
##$SUBNAM7= <"">
##$SUBNAM8= <"">
##$SUBNAM9= <"">
##$SW= 18.05172834244
##$SWIBOX= (0..15)
0 0 2 0 0 0 0 0 0 0 0 0 0 0 0 0 
##$SW_h= 3612.71676300578
##$TD= 16384
##$TD0= 1
##$TE= 0
##$TE2= 300
##$TE3= 300
##$TEG= 300
##$TL= (0..7)
0 120 120 120 120 120 120 120 
##$TP= (0..7)
150 150 150 150 150 150 150 150 
##$TP07= 0
##$TPNAME0= <>
##$TPNAME1= <>
##$TPNAME2= <>
##$TPNAME3= <>
##$TPNAME4= <>
##$TPNAME5= <>
##$TPNAME6= <>
##$TPNAME7= <>
##$TPOAL= (0..7)
0.5 0.5 0.5 0.5 0.5 0.5 0.5 0.5 
##$TPOFFS= (0..7)
0 0 0 0 0 0 0 0 
##$TUNHIN= 0
##$TUNHOUT= 0
##$TUNXOUT= 0
##$USERA1= <user>
##$USERA2= <user>
##$USERA3= <user>
##$USERA4= <user>
##$USERA5= <user>
##$V9= 5
##$VALIST= <valist>
##$VCLIST= <CCCCCCCCCCCCCCC>
##$VD= 0
##$VDLIST= <DDDDDDDDDDDDDDD>
##$VPLIST= <PPPPPPPPPPPPPPP>
##$VTLIST= <TTTTTTTTTTTTTTT>
##$WBST= 1024
##$WBSW= 4
##$XGAIN= (0..3)
0 0 0 0 
##$XL= 0
##$YL= 0
##$YMAX_a= 1000334
##$YMIN_a= -907921
##$ZGOPTNS= <>
##$ZL1= 120
##$ZL2= 120
##$ZL3= 120
##$ZL4= 120
##$ABSF1= 10
##$ABSF2= 0
##$ABSG= 5
##$ABSL= 3
##$ALPHA= 0
##$AQORDER= 0
##$ASSFAC= 0
##$ASSFACI= 0
##$ASSFACX= 0
##$ASSWID= 0
##$AUNMP= <proc_1d>
##$AZFE= 0.1
##$AZFW= 0.1
##$BCFW= 1
##$BC_mod= 2
##$BYTORDP= 1
##$COROFFS= 0
##$CY= 11.3945322036743
##$DATMOD= 1
##$DC= 2
##$DFILT= <>
##$DTYPP= 0
##$F1P= 2.36226072786647
##$F2P= -0.459571619588291
##$FCOR= 0.5
##$FTSIZE= 0
##$FT_mod= 4
##$GAMMA= 1
##$GB= 0.15
##$INTBC= 1
##$INTSCL= 1
##$ISEN= 128
##$LB= 0.24
##$LEV0= 0
##$LPBIN= 0
##$MAXI= 10000
##$MC2= 0
##$MEAN= 0
##$ME_mod= 0
##$MI= 1.114404
##$NCOEF= 0
##$NC_proc= 0
##$NLEV= 6
##$NOISF1= 3.799351
##$NOISF2= 2.8
##$NSP= 1
##$NTH_PI= 0
##$NZP= 0
##$OFFSET= 15.70392
##$PC= 1
##$PHC0= -19106.29
##$PHC1= 6.200779
##$PH_mod= 1
##$PKNL= yes
##$PPARMOD= 0
##$PSCAL= 0
##$PSIGN= 0
##$REVERSE= no
##$SF= 200.130013532006
##$SI= 16384
##$SIGF1= 3
##$SIGF2= 2
##$SINO= 400
##$SIOLD= 16384
##$SREGLST= <1H.CDCl3>
##$SSB= 0
##$STSI= 0
##$STSR= 0
##$SW_p= 3612.71676300578
##$SYMM= 0
##$S_DEV= 0
##$TDeff= 0
##$TDoff= 0
##$TI= <>
##$TILT= no
##$TM1= 0
##$TM2= 0
##$TOPLEV= 0
##$USERP1= <user>
##$USERP2= <user>
##$USERP3= <user>
##$USERP4= <user>
##$USERP5= <user>
##$WDW= 1
##$XDIM= 8192
##$YMAX_p= 0
##$YMIN_p= 0
$$ End of Bruker specific parameters
$$ ---------------------------------
##NTUPLES= NMR FID
##VAR_NAME=  TIME,          FID/REAL,        FID/IMAG
##SYMBOL=    X,             R,               I
##VAR_TYPE=  INDEPENDENT,   DEPENDENT,       DEPENDENT
##VAR_FORM=  AFFN,          ASDF,            ASDF
##VAR_DIM=   8192,          8192,            8192
##UNITS=     SECONDS,       ARBITRARY UNITS, ARBITRARY UNITS
##FACTOR=    0.0002768,     1,               1
##FIRST=     0,             0,               0
##LAST=      2.2672688,     0,               0
##MIN=       0,             -907921,         0
##MAX=       2.2672688,     1000334,         0
$$ Real data points
##PAGE= N=1
##DATA TABLE= (X++(R..R)), XYDATA
$$ [...]
2649h25J583o29O67o15J59k13o05Q69q38n97O01J11M5n04N34k55K121k057J093
$$ -825 758 129 796 181 340 127 -478 391 -447 -1044 -443 -332 -287 -791 -257 -512 1609 -448 645
2668F45j03M53j471J80J848r36o42N93l57p1n53L40Q84n16K49n49P93n0O8m56
$$ 645 542 995 -476 -296 1552 616 -26 567 210 139 -414 -74 810 294 543 -6 787 737 805 349
2688C49l55k14o07k76R16k57j50R18o50P93j34m89J65j08N27j39o75R05P1M20
$$ 349 -6 -220 -827 -1103 -187 -444 -594 324 -326 467 333 -156 9 -99 428 289 -386 519 590 1010
2708A010j346J108K2j698J734j353P95m2j009O21N2L58J82r91L20J08n76J145
$$ 1010 -336 772 794 -904 830 -523 272 230 -779 -158 -106 252 434 -557 -237 -129 -705 440
2726D40o34k25M78j79q3N14q0l21L41J12O0j06o74P24L15j160P39M51J20L47r83
$$ 440 -194 -419 59 -120 -203 311 231 -90 251 363 423 317 -357 367 682 -478 261 712 832 1179 196
2747A96N3j511J466j66M96q88l80j8j92J477K83m39j283k74R40L0k20k45M76K32
$$ 196 249 -1262 204 38 534 -354 -734 -752 -944 533 816 377 -906 -1180 -240 -210 -430 -675 -199 33
2767C3LN48Q00j625J040k79m82J52L04m88p8q28M54J044q20q1Q12j99k44m02k43
$$ 33 36 584 1384 -241 799 520 38 190 494 6 -72 -900 -446 598 -222 -303 509 310 66 -336 -579
2788e79M50o54P04p90J558j913J372K24P89j704J329j50M64n04ql54R5k77k15
$$ -579 -129 -783 -79 -869 689 -1224 148 372 1161 -543 786 636 1100 596 588 234 329 52 -163
2807a63k22%L58n67K77J252n78o83O17k52O82r66Q2p17R24J29l28j97M32o31J064
$$ -163 -385 -385 -27 -594 -317 935 357 -326 291 39 721 -245 -163 -880 44 173 -155 -352 80 -551 513
2828E13J39J34r57K75O86l53K68p23J607j506P09q24N98p01J74j80m67J153j131
$$ 513 652 786 -171 104 790 437 705 -18 1589 83 792 -32 566 -135 39 -141 -608 545 -586
2847e86l5P71K03o52j6P41q57L29m13K82m5O8Q24j57o70J01q0l36J256q99K24
$$ -586 -621 150 353 -299 -315 426 -431 -102 -515 -233 -278 -210 614 457 -213 -112 -192 -528 728 -171 53
2868E3J177o35J01J75j637J317m80K34L22q62O97j636N34o5L72L41l72L0l19Q30
$$ 53 1230 595 696 871 -766 551 71 305 627 -235 462 -1174 -640 -705 -333 8 -364 -334 -653 177
2888A77j08J33j127N48J174k11j50j185R8R92M64m4r89K03J40r75J092J03p79
$$ 177 69 202 -925 -377 797 586 436 -749 -651 341 805 761 -228 -25 115 -860 232 335 -444
2907d44P34L17r44Q25n18k47p21K82M9L05O16o97k49J36J200q32k47P31M22j122
$$ -444 290 607 -337 488 -30 -277 -998 -716 -667 -362 254 -443 -692 -556 644 -188 -435 296 718 -404
2927d04R49M58o50J70j85n78J46M55q1M98l06j05N8j191J160j001J356j573R8
$$ -404 545 1003 353 523 338 -240 -94 361 280 778 472 367 425 -766 394 -607 749 -824 -726
2946g26Jj390J352M28J98j050J796j072Q93k93n98Q03L5p39L17J30l93J45Q98
$$ -726 -725 -2115 -763 -335 -137 -1187 609 -463 430 137 -461 342 377 -362 -45 85 -308 -163 735
2965G35r68J396j239M03J126r77l5R1n46L82l36K77o4j255R03K70n05Q26n46p56
$$ 735 -233 1163 -76 327 1453 476 441 532 -14 368 32 309 245 -1010 -107 163 -342 484 -62 -818
2985h18J276j723J063K89j01K21j19J400j822Q7j06K84o72O83L17K13l15J83l38
$$ -818 458 -1265 -202 87 -14 207 88 1488 -334 -247 -353 -69 -741 -58 259 472 157 340 2
3004BL14m58N74k49q97J241q37k0j35L13k33j361R08J489j012L92R27o5j350P05
$$ 2 316 -142 432 183 -714 527 -310 -330 -465 -152 -385 -1746 -838 651 -361 31 958 893 -457 248
3024B48P97j665R15Q26k80l12J54p63M35J070r31n08j89L90m84j49L57M28j56
$$ 248 1045 -620 295 1121 841 529 683 -80 355 1425 494 -14 -203 187 -297 -446 -89 339 183
3043A83r53K4l2O62K9L27r22J21L13l49l16Q41N0J064q1m27j041J302q1o2j180
$$ 183 -770 -746 -778 -116 -87 240 -682 -561 -248 -597 -913 -72 -22 1042 961 534 -507 795 714 652 -528
3064e28J411O55j871J748j581j30J179j064L43j61M3l86N02O6p64J10Q77m80R5
$$ -528 883 1538 -333 1415 -166 -296 883 -181 162 1 44 -342 160 226 -538 -428 449 -31 64
3083F4k72N99J42n20r45J626N27j106J227q89K43o62kO76j26m67rN07m89j322
$$ 64 -208 391 533 13 -932 694 1221 115 1342 453 696 34 32 708 582 115 106 613 124 -1198
3103a198J08J034K8j177L22M9N14l14M20n69R07L61j97j53n78J588j955J048N71
$$ -1198 -1090 -56 -28 -1205 -883 -834 -320 -634 -214 -783 124 485 288 135 -443 1145 -810 238 809
3122H09j34j93m21k46l21P5P73Q01r59k53m87J051l7o28r17N86R37r96J727r52
$$ 809 675 482 61 -185 -506 -431 342 1143 184 -69 -556 495 458 -170 -1087 -501 436 -560 1167 215
3142B15P49j853P51o32q0M61j65N93J02L65O8m19m92P57o76K87N2R26j679J624
$$ 215 964 -889 -138 -770 -850 -389 -554 39 141 506 574 155 -337 420 -256 31 83 1009 -670 954
3162I54q4J0l48p52J73K60o03m99J52kJ858l76p00o79M06O3N92j75m93Q22j395
$$ 954 870 880 532 -220 -47 213 -390 -889 -737 -739 1119 743 43 -636 -230 -167 425 250 -243 579 -816
3183h16k47Q69J304l08O4R9j014P69o02J125k57k93j90k04L33l42o74O70j031
$$ -816 -1063 -194 1110 802 866 965 -49 720 118 1243 986 693 503 299 632 290 -384 286 -745
3202g45n86Q33R6Q85j028J41N12m74m91J227n09q68J426J22l26o27M58m37M53
$$ -745 -1331 -498 -402 483 -545 -404 108 -366 -857 370 -139 -1007 419 541 215 -412 46 -391 62
3221F2N47L70m75O84o68l4m31k52Q36p00J34j58l64R90p04L94n01K70j96q2p18
$$ 62 609 979 504 1188 520 486 55 -197 639 -61 73 -85 -449 541 -163 231 -270 0 -196 -278 -996
3242i96L66L51l45N87k91L85n57N73O41j52m13k4P1j3k2J87O74o29M52m45K36
$$ -996 -630 -279 -624 -37 -328 57 -500 73 714 562 149 125 196 183 161 348 1022 393 845 400 636
3263F36p35P50q37o48K53N81l96m33M78p70J070n36J468j546O61r23K191J81j738
$$ 636 -99 651 -186 -834 -581 0 -396 -829 -351 -1121 -51 -587 881 -665 -4 -927 1264 1445 -293
3282b93M62j7j219J441J76N16p72j89J55J36P26j046M05o68J770j130r93jm63
$$ -293 169 152 -1067 374 550 1066 294 105 260 396 1122 76 481 -187 1583 453 -540 -541 -1004
3301a004L95L19q14K13J556m5r98O92j074J843n18j379Q71J61j73K18k10O20n94
$$ -1004 -609 -290 -1104 -891 665 620 -378 314 -760 1083 565 -814 57 218 45 263 53 673 79
3320G9K28L55q44M32n9n39P09n00r53J522r30P35j17p19P80j00j36j60m51R65
$$ 79 307 662 -182 250 191 -348 361 -139 -1092 430 -500 235 118 -601 179 79 -57 -217 -668 297
3340B97o43r17J542K80p72Q8K50M04J53J03K02l78j96J93m87m45K78q5K88O19
$$ 297 -346 -1263 279 559 -213 -125 125 529 682 785 987 609 413 606 119 -326 -48 -133 155 774
3360G74j217l5O71j9n71K59J90L84L65j433O51O94j804J385j063J46Q70M68j574
$$ 774 -443 -478 193 174 -397 -138 52 436 801 -632 19 713 -1091 294 -769 -623 247 715 -859
3379h59k55J815j95m86m51P66j30L65m20M36R4r05J381j228n35L68j11l62R53
$$ -859 -1114 701 506 20 -431 335 205 570 150 586 680 -225 1156 -72 -607 -239 -350 -712 241
3398B41q36N61k01O33q51m19J778p45j176N28RL78k74k91J875o87K6m45O0J53
$$ 241 -595 -34 -235 398 -453 -872 906 161 -1015 -487 -478 -100 -374 -665 1210 523 549 104 164 317
3418C17Q99l96j044L26O8P90r15N2n99O26j58o86L26J95k51j67P86j816O97L61
$$ 317 1216 820 -224 102 170 960 45 97 -502 124 -34 -720 -394 -199 -450 -617 169 -1647 -950 -589
3438e89R00N70j382r3j52o6J736P25j816K68M54Q78j236O40o30r0j12L46J4o27
$$ -589 311 881 -501 -594 -746 -812 924 1649 -167 101 555 1433 197 837 207 117 5 351 365 -262
3458b62P9p71R63p65J373j204P16l5j081k23J171n84Q74j89J25l55j74Q36k24
$$ -262 -183 -954 9 -756 617 -587 129 94 -987 -1210 -39 -623 251 62 187 -168 -342 494 270
3477B70k56k74M28K33N81J73l59l06P54k142J066m78J99M33k67j149R98M52p18
$$ 270 14 -260 168 401 982 1155 796 490 1244 -898 168 -310 -111 322 55 -1094 -96 356 -362
3496c62l44O10k34k67N85j197J669j21m63P2k90l59O54n2J188L91j650P93l30
$$ -362 -706 -96 -330 -597 -12 -1209 460 339 -124 -52 -342 -701 -47 -99 1089 1480 -170 623 293
3515B93N72n93n65Q83o09Q23p2j262K09N42j3k49r16O31L10L73o66K96N16q74
$$ 293 865 272 -293 590 -19 804 732 -530 -321 221 208 -41 -957 -326 -16 357 -309 -13 503 -371
3535c71M99m15Q60j32j105M64J23r3L45L76l99M3P0M46M09n62Kj145N80O8J51
$$ -371 128 -287 573 441 -664 -200 -77 -170 175 551 152 195 265 711 1120 558 560 -585 -5 63 214
3556B14j479R84K72j13j381R26Q70n21r0o95L83J371k33r71M32j325J718j000
$$ 214 -1265 -281 -9 -122 -1503 -577 293 -228 -318 -1013 -630 741 508 -463 -31 -1356 362 -638
3574f38J005r01M68J881r32m86J69q99K4R30n96k23Q22r4o90L62m20K90j642M64
$$ -638 367 -534 -66 1815 883 397 566 -333 -309 621 25 -198 624 530 -160 202 -218 72 -1570 -1106
3594a106R32K49k96J54q51J743j172L05O7m75J339o67l57J061r76J046q22K06
$$ -1106 -174 75 -221 -67 -918 825 -347 -42 25 -450 889 222 -135 926 -50 996 174 380
3612C80k28n57N12M73K95k73q52l65J029r53J083p97M9r1N98j28q47J002o00L04
$$ 380 152 -405 107 580 875 602 -250 -615 414 -539 544 -253 -204 -295 303 175 -672 330 -270 34
3632C4q60N62j78K69k93Q68l55Q25l66k56l00L78o7q87N47qp20J286K70M75j591
$$ 34 -826 -264 -442 -173 -466 402 47 872 506 250 -50 328 261 -626 -79 -87 -807 479 749 1224 -367
3653c67j21r6J002j122R09j516Q11P65q49K48K8P0M34J13l92L78j01M4P52q74
$$ -367 -488 -584 418 -704 205 -1311 -500 265 -584 -336 -308 -238 196 309 -83 295 194 238 990 116
3673A16L50n64Q89n18j1K80q95m35J00J54o4O13p88R05r1p84J82N65m14K30k48
$$ 116 466 -98 791 273 262 542 -353 -788 -688 -534 -598 15 -773 132 41 -743 -561 4 -410 -180 -428
3694d28l49k57J527j190R32O19o58K83J09m86K42j265J813o09o28N70j87N53n96
$$ -428 -777 -1034 493 -697 235 854 196 479 588 102 344 -921 892 283 -345 225 38 591 -5
3713eL27j19N09J07j16n91p60K569j706J66j226M66Q13j266J142o1l51l4j62l9
$$ -5 322 203 712 819 703 112 -648 1921 215 381 -845 -379 434 -832 310 249 -102 -136 -298 -337
3733c37k48J717j703l47J634r06R3k25P45L86l54j162J234o88N85n40L66q69K43
$$ -337 -585 1132 -571 -918 716 -190 -97 -322 423 809 455 -707 527 -161 424 -116 250 -619 -376
3752c76r23K410o92p85K06j094J233j58J31q7q64N60M44o97K72l56J126k43J245
$$ -376 -1299 1111 419 -366 -160 -1254 -21 -179 -48 -135 -999 -439 5 -692 -420 -776 350 107 1352
3771A352j666R78o52J758j990J58J199n22k31L11l49k57n14J57j09O9j13M77M2
$$ 1352 -314 664 12 1770 -220 -62 1137 615 384 695 346 89 -425 -268 -377 -308 -421 56 98
3790I8j107J069j089R18o50L33J57L31K46m04M7N70q03N4J46J27K41j28N43q73
$$ 98 -1009 60 -1029 -111 -761 -428 -271 60 306 -98 -51 519 -284 -230 -84 43 284 156 699 -174
3810a74J044j280O3R94j337M61N92o79j437J447O5N89q24m26L43L52l84O37L21
$$ -174 870 -410 -347 647 -690 -229 363 -316 -1753 -306 -241 348 -476 -902 -559 -207 -591 46 367
3829C67l32L13J87p26j066J305j02L24J66r35P86j33O9m60J201K5l05m08q77J017
$$ 367 35 348 535 -191 -1257 48 -54 270 436 -499 287 154 223 -237 964 989 684 276 -601 416
3849D16j531M31J18P49r7j040J65Q23p72K2J99J28N10n08K59K98Q89j934J120
$$ 416 -1115 -684 -566 183 86 -954 -789 34 -738 -716 -517 -389 121 -387 -128 170 1059 -875 245
3868B45o61M03M65m8M51K70j247j0J95M96oP03m17l64n3k92L5j119K02P33n72
$$ 245 -416 -13 452 404 855 1125 -122 -132 63 559 553 1256 839 475 422 130 165 -954 -752 -19 -591
3889e91k24J664K48r49m55K26L78K65n44m01J031k15q10M32K66Qq52Q27L24n49
$$ -591 -815 849 1097 148 -307 -81 297 562 18 -383 648 433 -377 55 321 329 -523 304 628 79
3909G9p2j66j7O4k02K86j04Q9P40j896J091o6R47r99l96Q88j33M1j052R17Q40
$$ 79 7 -159 -176 -112 -314 -28 -132 -43 697 -1199 -108 -174 773 -226 -622 266 133 174 -878 39 879
3930H79r02R21k14j232J64n92J209K57l32k08M84L33j47j032K97Q48k328J782
$$ 879 -23 898 684 -548 -384 -976 233 490 158 -50 434 767 620 -412 -115 733 -1595 187
3948A87N7j090J76j63P22n08j9J49Q36j000Q84k44K22l7n58O40K20M24j21j424
$$ 187 244 -846 -670 -833 -111 -619 -638 -489 347 -653 231 -13 209 172 -386 254 474 898 777 -647
3968f47J158k64p67%R47q00M61P25p19Ok76j31M5p12J427j375L53R52j273j33
$$ -647 511 247 -520 -520 427 -373 88 813 94 100 -176 -307 -262 -974 453 -922 -569 383 -890 -1023
3988a023p6M63J24M94K42K76j093M95J274o20j84l70M98k75J278k296J510p91
$$ -1023 -1099 -636 -512 -18 224 500 -593 -98 1176 556 372 2 500 225 1503 -793 717 -74
4006g4p14J397j926J796l19l72o35J75N28Q89p23k52m38m25J292j239J475j434
$$ -74 -788 609 -1317 479 160 -212 -847 -672 -144 745 22 -230 -668 -1093 199 -1040 435 -999
4024i99Q67o93N27K55M99m95L61L08l94M83o38j27K124j347K19n30j49L20m68
$$ -999 -132 -825 -298 -43 456 -39 322 630 236 719 81 -46 2078 731 950 420 271 591 123
4043A23L50Q15m7k246O87n57N82r9K37k4r51P87L74J85o82N26L25o7m18L27P38
$$ 123 473 1288 1241 -1005 -318 -875 -293 -392 -155 -179 -1130 -343 31 216 -466 60 385 318 -100 227 965
4064I65j012m00Q19J223j067O4o24j13L87j345J378m78j13l99L51N54j01n34k50
$$ 965 -47 -447 372 1595 528 592 -32 -145 242 -1103 275 -203 -316 -715 -364 190 89 -445 -695
4083f95m8J78L63N59p38M23J05o50J06N80J32R7J43O1J085j400m05K32P2l81L77
$$ -695 -743 -565 -202 357 -381 42 147 -503 -397 183 315 412 555 616 1701 301 -104 128 200 -181 196
4104A96P4m49m96K3M30m61O38j364J726K16n94n19n54Q26J233j99j608P71m60
$$ 196 270 -179 -675 -652 -222 -683 -45 -1409 317 533 -61 -580 -1134 -308 925 726 -882 -111 -571
4123e71Q67n28J62j84M58J107p99o2m95l30N71J52k07O1l68j60N43n35N90r84
$$ -571 296 -232 -70 -254 204 1311 512 450 -45 -375 196 348 141 202 -166 -326 217 -318 272 -712
4143g12J330r07q01P90J44M67q35j11K18m91N25Q38l56j7Q50j271R35M19j759
$$ -712 618 -289 -1090 -300 -156 311 -524 -635 -417 -908 -383 455 99 82 932 -339 596 1015 -744
4162g44J204J93q52L7J093l16j942J889q21L68O9j362J154n77O61q02N29N74j68
$$ -744 460 653 -199 -162 931 615 -1327 562 -259 109 178 -1184 -30 -607 54 -748 -219 355 187
4181A87j034J588j069p29P04K53R2L32L21q29J301j571J34J211j03q19J432j203
$$ 187 -847 741 -328 -1057 -353 -100 -8 324 645 -184 1117 -454 -320 891 788 -31 1401 198
4199A98m2J66p90M13R66j214O61P53r23m2j61J64m06n37L86K3J2n8J279j181L58
$$ 198 156 322 -468 -55 911 -303 358 1111 188 146 -15 149 -257 -794 -408 -385 -373 -431 848 -333 25
4220B5J112j265k40J071j019n83J019J393j474L96j62L19m45N35J32j176L41K8
$$ 25 1137 -128 -368 703 -316 -899 120 1513 39 435 273 592 147 682 814 -362 -21 7
4238GK45P5r96n8K00R80r97N21k91l17m9J300P29k165J004m18K06R46o57q64j02
$$ 7 252 327 -669 -727 -527 453 -544 -23 -314 -631 -680 620 1349 -816 188 -230 -24 922 265 -599 -701
4259g01J009m90l1P97q81K30J69K51m12Q3j27m75KL80R6J12K22n19j83m61P27
$$ -701 308 -182 -213 584 -297 -67 102 353 -59 24 -103 -578 -576 -196 -100 12 234 -285 -468 -929 -202
4280b02P3n01L48K00O62k23l45j20m31l81J755M39r64N57j65n59J2J015r29K33
$$ -202 -129 -630 -282 -82 580 357 12 -108 -539 -920 835 1274 310 867 702 143 155 1170 241 474
4300D74m52j4m27l2M11m93M14m28j18o45J622J81q10q06J300r32N40n3J141j404
$$ 474 22 8 -419 -451 -40 -533 -119 -547 -665 -1310 312 493 -317 -1123 177 -755 -215 -268 873 -531
4320e31K48O06P44j471K38O77J091r00m03m25P8J29N73o16M1k12p0M05p1l06N02
$$ -531 -283 323 1067 -404 -166 511 1602 702 299 -126 -48 81 654 38 79 -133 -203 202 131 -175 327
4341C27r21R3k39J59o7mQ65j454M22L89L41L93j7k82L04q87L69K62K61Q4j60j7
$$ 327 -594 -501 -740 -581 -648 -652 213 -1241 -819 -430 -89 304 287 5 309 -578 -209 53 314 398 238 221
4363B21l02J70k0K94j1m03p37O13p16K04R76q62l22R71j044L62J272k60k85n34
$$ 221 -81 89 69 363 352 -51 -788 -175 -891 -687 289 -573 -895 76 -968 -606 666 406 121 -413
4383d13R20j11j628J230M93n82M82o64O70p7j38Q44p73P89j519L26r54J336p5
$$ -413 507 396 -1232 -2 491 -91 391 -273 397 320 182 1026 253 1042 -477 -151 -1105 231 156
4402A56n13m60o17J609o4J72n35j86J09j21J391j218N54N06q69M10N1n20J23q34
$$ 156 -357 -817 -1434 175 111 283 -252 -438 -329 -450 941 -277 277 783 -86 324 375 -145 -22 -856
4422h56K207j376q40J001K49O46j11r17K60r95J634o27m43P44j221P55k73J93
$$ -856 1351 -25 -865 136 385 1031 920 3 263 -732 902 275 -168 576 -645 110 -163 30
4440C0j9n04rJ06k30N58q39R25J58o50m48J752m89J215l62q70N59l09J72j215
$$ 30 11 -493 -502 -396 -626 -68 -907 18 176 -474 -922 830 341 1556 1194 324 883 574 746 -469
4460d69q4J07J31J4J303j395J27k5K95j186m3q0J474n52m16J445k71Q1j008O44
$$ -469 -553 -446 -315 -301 1002 -393 -266 -291 4 -1182 -1225 -1305 169 -383 -799 646 375 456 -552 92
4480I2r28N73N22k45P51r70o6J064M7P36j269j59P6J218p99k92m85Q8q41J413
$$ 92 -836 -263 259 14 765 -205 -271 793 840 1576 307 148 224 1442 643 351 -134 -46 -887 526
4500E26l97l0l75o6n96J450j117L38l82L04M73J596j844o14O60q9P53o17N60l33
$$ 526 129 99 -276 -342 -938 512 -605 -267 -649 -345 128 1724 -120 -734 -74 -163 590 -27 533 200
4520B00j018O33N20K83L65q68m35N15O59r61P6K40N24m28j050R61L48o02M54K71
$$ 200 -818 -185 335 618 983 115 -320 195 854 -107 -31 209 733 305 -745 216 564 -38 416 687
4540F87o08R5k83j11P32j106K55N52r08J03M18K32n34J354J07j233K0L16O61j043
$$ 687 79 174 -109 -220 512 -594 -339 213 -695 -592 -174 58 -476 878 985 -248 -228 88 749 -294
4560b94p5M73K33J63M34j763k65J275q98O64J7n19L05k57NN27r0K61r47J232j067
$$ -294 -369 104 337 500 934 -829 -1094 181 -717 -53 -36 -555 -250 -507 -502 25 -65 196 -751 481 -586
4581e86J129p79L59P00r61q7N24L3R6Q4q69J308j295L32p24P51q62R18r12J031
$$ -586 543 -236 123 823 -138 -225 299 332 428 512 -357 951 -344 -12 -736 15 -847 71 -841 190
4601A90p64L5J222r04J37j007P49M4N82m31Q73m94o21M69m96J539r96K55j096
$$ 190 -574 -539 683 -221 -84 -1091 -342 -298 284 -147 726 232 -389 80 -416 1123 127 382 -714
4620g14K12Q85j68k34l75J240j373j76j14R0K3P74n22M40K66q85M36J65j098N29
$$ -714 -502 383 215 -19 -394 846 -527 -703 -817 -727 -704 70 -452 -12 254 -631 -195 -30 -1128 -599
4640e99k87J453p12Qq22Q80M34N00p86k73O29j32n05O20j316J416n23K51m65M92
$$ -599 -886 567 -145 -137 -959 -79 355 855 69 -204 425 293 -212 408 -908 508 -15 236 -229 263
4660B63o95m90J79J613j088j2J6m86L83Q85k14m40O31l87k00j75K51R7j278J939
$$ 263 -432 -922 -743 870 -218 -230 -214 -700 -317 568 354 -86 545 158 -42 -217 34 131 -1147 792
4680G92k04j468R23n05K36J94M91Q31j682J99O22k73p08l6J541o05M56j141l29
$$ 792 588 -880 43 -462 -226 -32 459 1290 -392 -193 429 156 -552 -588 953 348 804 -337 -666
4699f66j70J38J091l46K45l65J09n90J073p07l40J02J713j230M61l54r57Q68P6
$$ -666 -836 -698 393 47 292 -73 36 -554 519 -188 -528 -426 1287 57 518 164 -793 75 151
4718A51J06N83n77l82O53r44P40l66l27R5P74r83M61l10k56P78K3m29n82J661
$$ 151 257 840 263 -119 534 -410 330 -36 -363 -268 506 -477 -16 -326 -582 196 219 -210 -792 869
4738H69j592J132k25M40q97L69m64Q01M36o07M63n82K96n00J14R38j175Q49m13
$$ 869 -723 409 184 624 -273 96 -368 433 869 262 725 143 439 -61 53 991 -184 665 252
4757B52o34J66Q9n2O66m55j87Q41j463M46k90N33J69m15o35J953l17k211J287
$$ 252 -382 -216 -127 -179 487 32 -155 686 -777 -331 -621 -88 81 -334 -969 984 667 -1544 -257
4776b57J232j356j16R94k95m11l99Q80j64j18R5l19J453n27j217Q46r83N71l2
$$ -257 975 -381 -497 497 202 -209 -608 272 108 -10 85 -234 1219 692 -525 321 -662 -91 -123
4795a23R5L32r10P54J75k09j59m65M80L31O39k93o22J035j754q2J506K51m67o74
$$ -123 -28 304 -606 148 323 114 -45 -510 -30 301 940 647 25 1060 -694 -776 730 981 514 -160
4815a60r70R70O91P87j513K58Jk26O00j720M93O24l14L05q84M31j86o8M87R29
$$ -160 -1130 -160 531 1318 -195 63 64 -162 438 -1282 -789 -165 -479 -174 -1058 -627 -813 -881 -394 535
4835E35n14R2M80k50j168J131j091M44n04J163P01j745n0O08L30%K70m77m8J96
$$ 535 21 113 593 343 -825 306 -785 -341 -845 318 1019 -726 -776 -168 162 162 432 -45 -93 103
4855A03k1q8o88j1O82R6O45p77l55J067m56l65L30O4l03O86j163J287l41k15q66
$$ 103 82 -6 -694 -705 -23 73 718 -59 -414 653 197 -168 162 226 -77 609 -554 733 392 177 -689
4876f89J462L2j246J93l51O86J44O78j273J01N63m46Q56m08l30p54J31M2P12o54
$$ -689 773 805 -441 -248 -599 87 231 909 -364 -263 300 -146 710 302 -28 -782 -651 -609 103 -551
4896e51N89l20Q86j057O7J365r16k67O40m71O00J19j014M0M9L89o10P90K75r27
$$ -551 38 -282 604 -453 -386 979 63 -204 436 -35 565 684 -330 -290 -241 148 -462 328 603 -324
4916c24n3K44O61p74J19k09J64p3R5N80K16o54J17M65p16j075N72M50M09l22o0
$$ -324 -377 -133 528 -246 -127 -336 -172 -245 -150 430 646 -8 109 574 -142 -1217 -645 -195 214 -108 -168
4937a68N78k62Q81M80r99o96J85M8N73r16M48r19N63L2l74k56J278k53n2o43O91
$$ -168 410 148 1029 1509 510 -186 -1 47 620 -296 152 -767 -204 -172 -546 -802 476 223 171 -472 219
4958B19j535K359j910O54J62J11o3n06P33K06j2n79J324j155j47m40L33J021q57
$$ 219 -1316 1043 -867 -213 -51 60 -3 -509 224 430 418 -161 1163 8 -139 -579 -246 775 -82
4977h2k69P36M10K04p44n32J220p06m60J16k6r8O83m68o04O13p61M78O72j055
$$ -82 -351 385 795 999 255 -277 943 237 -223 -107 -133 -231 452 -16 -620 -7 -768 -290 382 -673
4997f73Q51p99J169j04J23r2k59N3j53j80K42R74j598J801o30m37j72k48k80M91
$$ -673 178 -621 548 444 567 475 216 269 116 -64 178 1152 -446 1355 725 288 116 -132 -412 79
5017G9l25o57L80K18K51o27O01n59O92O36j465OL77J035Q6k41o6o4l35P4M60r7
$$ 79 -246 -903 -523 -305 -54 -681 -80 -639 53 689 -776 -770 -393 642 728 487 421 357 22 96 556 459
5039D59J08r48O14j095R25L19M01n15p54Q51n0p31k91M40P55l41Q21j404p76J260
$$ 459 567 -381 233 -862 63 382 783 268 -486 365 315 -416 -707 -267 488 147 968 -436 -1212 48
5059D8j977K738l61J09j542L24O51J76o46J209M41n24r07Q43j027L54J3p84Q51
$$ 48 -1929 809 448 557 -985 -661 -10 166 -480 729 1170 646 -261 582 -445 -91 -78 -862 -11
5078a1M18L52P64k178N08N14m22q4K47J90o47j044J242M17j139J842j789R09o7
$$ -11 407 759 1523 -655 -147 367 -55 -139 108 298 -349 -1393 -151 266 -873 969 -820 89 22
5097B2k73N27m29J51N38n63O34l70l09N27o14O77j104j00N46j065J383O23n73
$$ 22 -251 276 -153 -2 536 -27 607 237 -72 455 -159 518 -586 -686 -140 -1205 178 801 228
5116B28p28L37L68o35o83J119j84K07L86k44o55M85J70n47O92r43J258o90L81
$$ 228 -500 -163 205 -430 -1113 6 -178 29 415 171 -484 1 171 -376 316 -627 631 -59 322
5135C22q17N85l08N09J39L62n50L35J92r77J55k51R26j009J138o84q61n76R59
$$ 322 -495 90 -218 291 430 792 242 577 769 -208 -53 -304 622 -387 751 67 -794 -1370 -411
5154d11R93j256L54P79J07o05o88J429n17m7k70J31n2M8P47n73J39N1J97k23r12
$$ -411 582 -674 -320 459 566 -39 -727 702 185 138 -132 -1 -53 -5 742 169 308 359 556 333 -579
5175e79K85R08k9j165L29m23%J010Pq03N94n11L12n14l07J234l89k72J53P72m89
$$ -579 -294 614 585 -580 -251 -674 -674 336 343 -460 134 -377 -65 -579 -886 348 -41 -313 -160 612 123
5196A23K92J31q55K6O62m37k04M68l02n56j63J50K50j76o7R44n80J029j109Q5
$$ 123 415 546 -309 -283 379 -58 -262 206 -96 -652 -815 -665 -415 -591 -658 286 -294 735 -374 -289
5216b89K40k95N36m53m51N47R24K11m02Q23j926R68n50L35l78L17l76L25R27r87
$$ -289 -49 -344 192 -261 -712 -165 759 970 568 1391 -535 433 -117 218 -160 157 -219 106 1033 46
5236D6K12p7m18j08O04o29N8J63M58J55j059l79Q71M81K28m76K21j54j078R90
$$ 46 258 181 -237 -345 259 -370 -312 -149 309 464 -595 -974 -103 378 606 130 351 197 -881 109
5256A09L84m64K4l04P20p06P49j062N30O2Q69o71j41l9l17N57j46n95q0l23L41
$$ 109 493 29 53 -251 469 -237 512 -550 -20 42 911 240 99 60 -257 300 154 -441 -521 -844 -503
5277e03j81P65q0J57k34L6r96J028q20J117k89J006r25J75O15j412J518j138R75
$$ -503 -684 81 1 158 -76 -40 -1036 -8 -828 289 0 1006 81 256 871 -541 977 -161 814
5296H14j172J031l10j45J198j25p13j111P74n72J75l4R7J33m22P17m07n99O43
$$ 814 -358 673 363 218 1416 1291 578 -533 241 -331 -156 -190 -93 40 -382 335 -72 -671 -28
5315b8L2j621Q34J321j832J777n50K2l23P53p82J640j492Q74n9m58J53l43K64
$$ -28 4 -1617 -783 538 -1294 483 -67 -45 -368 385 -397 1243 -249 625 566 108 261 -82 182
5334A82j6L93j093O76n58J330j020m07j006P36P35K19n36P07n90J67L6p93J321
$$ 182 166 559 -534 142 -416 914 -106 -513 -1519 -783 -48 171 -365 342 -248 -81 -45 -838 483
5353D83N07q26j484K293n61p16J67K68O37k38n80n6l44R15r60M45K50Q3l61n92
$$ 483 990 164 -1320 973 412 -304 -137 131 768 530 -50 -106 -450 465 -495 -50 200 283 -78 -670
5373f70N31P8J62Q2k55k52j58M82o58m81J234k81p06J260k1n73M25o34P62Rm72
$$ -670 -139 -61 101 183 -72 -324 -482 0 -658 -1139 95 -186 -892 368 347 -226 199 -435 327 336 -136
5394a36p0J273j377J459j051J0o5o49P81M84o24m37p8J221j457J55l91J589o35
$$ -136 -206 1067 -310 1149 98 108 43 -606 175 659 35 -402 -480 741 -716 -561 -952 637 2
5413Bj27P94j332K01K5Q38q93o99P52P17L07j005Q69r19L56J513j522M70k5m01
$$ 2 -125 669 -663 -462 -437 401 -492 -1191 -439 278 585 -420 449 -470 -114 1399 -123 347 322 -79
5433g9q5L24k32l5K73j162R93j55K55J00k106K209p99J11l57J251n50J4L5O4k04
$$ -79 -164 160 -72 -107 166 -996 -3 -158 97 197 -1909 300 -499 -388 -745 506 -44 -30 5 69 -135
5454a35Q56o10p83K245k225O73M49N9L06o53J4j182j94J946L44j181J83l54L2
$$ -135 721 111 -672 1573 -652 21 470 529 835 182 196 -986 -1180 766 1110 -71 112 -242 -210
5473b10nN26n53J30O65j418o8O39L54J97q88J657j272J19j19m98L17L11N5j41
$$ -210 -215 311 -242 -112 553 -865 -933 -294 60 257 -631 1026 -246 -127 -246 -744 -427 -116 -61 -202
5493b02N73K98L83j102o57J590q03n3j85L92q64N2R46n35m0n73Q69n17l9m3R03
$$ -202 371 669 1052 -50 -707 883 80 27 -158 234 -630 -578 368 -167 -207 -780 89 -428 -467 -510 393
5514C93p24L80K75K77q15o1O14r51J338j125M79J33L3j214O36R0N28n92J44J46
$$ 393 -331 49 324 601 -214 -275 339 -612 726 -399 80 213 246 -968 -332 -242 286 -306 -162 -16
5534a6p17M95M98j158J33L46P23q4m4L0k34L35k31L90n63p95N24O0J54L4J421
$$ -16 -733 -238 260 -898 -765 -419 304 220 176 206 -28 307 76 466 -97 -892 -368 -308 -154 -120 1301
5555A301m76r98p9M36n76P61L41o99k30o3n73J451L69j22p87M02j299K48Q76p60
$$ 1301 825 -173 -252 184 -392 369 710 11 -219 -282 -855 596 965 843 56 458 -841 -593 283 -477
5575d77J19o2O82r89k1Q95N72l64K17r53L02L39p78J370j372j92Q21K51N38m70
$$ -477 -358 -420 262 -727 -748 147 719 355 572 -381 -79 260 -518 852 -520 -712 109 360 898 428
5595D28Q21j485P73r58K99j52l51R56n53K3P23r47Q48M11j667N67J311q51K24
$$ 428 1249 -236 537 -421 -122 -274 -625 331 -222 -199 524 -423 425 836 -831 -264 1047 196 420
5614D20m18j16J97r24j53O80o06Q00P13m8k82k77n28K45J823j457q46N2J374K19
$$ 420 2 -114 83 -841 -994 -314 -920 -120 593 545 263 -14 -542 -297 1526 69 -777 -725 649 868
5634H68j518Q14k59N53r04O74o59p03K614j991J307k084J925O07q27m07p7o71
$$ 868 -650 164 -95 458 -446 228 -431 -1134 1480 -511 796 -1288 637 1244 417 10 -67 -738
5652g38J3P6R0J405j038j40p04J512p14j56j24N16o25J442j274J82M27m71n04
$$ -738 -725 -649 -559 846 -192 -332 -1036 476 -238 -394 -518 -2 -627 815 -459 -277 150 -321 -825
5671h25J91O28j02o07M13N02K2P85j178L51j044M91M38J007k37p56p37M60L71
$$ -825 -634 -6 -108 -715 -302 200 222 1007 -171 180 -864 -373 65 1072 835 79 -658 -198 173
5690A73J83p59N88k18k0k67N49l23N98p8j131P07j57j255K021j096P3Q72p81R5
$$ 173 356 -403 185 -33 -53 -320 229 -94 504 426 -705 2 -155 -1410 611 -485 -412 460 -321 -226
5710b26R11k30o52n84Q07O89j106m85J524o13m16K97Q94j623J038l97Q71j757
$$ -226 685 455 -197 -781 26 715 -391 -876 648 35 -381 -84 810 -813 225 -172 699 -1058
5728a058L38L08m45O53M29L63k65j78jo66K9J075m86j266N62J090k13j25k86J146
$$ -1058 -720 -412 -857 -204 225 588 323 145 144 -522 -493 582 96 -1170 -608 482 269 144 -142 1004
5748A004k28n64j258M58R67L2j265R86q15J440r02L85n68M32J91j343J166P9o77
$$ 1004 776 212 -1046 -588 379 411 -854 132 -683 757 -145 240 -328 104 295 -1048 118 197 -480
5767d80K9J328q32K5J65n3k68l14J000n00p47M36P70r48N92l18p11J008j01N57
$$ -480 -451 877 45 70 235 182 -86 -400 600 100 -647 -211 559 -389 203 -115 -826 182 81 638
5787F38j442R05O92q41R89q70P21m37m43j42J78N68Q4m91n30P79p30JL23N54o35
$$ 638 -804 101 793 -48 941 71 792 355 -88 -230 -52 516 600 109 -421 358 -372 -371 -48 506 -129
5808a29Q5l60p63O31M01k48J051m19K32j035M70K7J81j197J230j21K53K65m82
$$ -129 -44 -404 -1167 -536 -135 -383 668 249 481 -554 -84 -57 124 -1073 157 36 289 554 72
5827G2p46K84J036j625J084Q50p07p51N48k92K1r88K128n33j114J015n85J93k85
$$ 72 -674 -390 646 -979 105 955 248 -503 45 -247 -226 -1214 914 381 -733 282 -303 -110 -395
5846c95K86o8N69l02M93K25l53J81j134j82K07K61k01l91Q69L25j038M29p03R48
$$ -395 -109 -177 392 90 583 808 455 636 -498 -680 -473 -212 -413 -804 65 390 -648 -219 -922 26
5866B6O85q05j18L45k09K44O46j514J218k29r11P33p70J108L68r48j99Q81K91
$$ 26 711 -94 -212 133 -76 168 814 -700 518 289 -622 111 -659 449 817 -131 -330 551 842
5885H42q28L31K95n86k44j067K050P24k489K80P44M26j097J111o25N42l47Q4k05
$$ 842 14 345 640 54 -190 -1257 793 1517 -972 -692 52 478 -619 492 -133 409 62 146 -59
5904e9m28J422q61N56K77j308L61J08m18N94R52o37K1k53r5M92p76R14j858J324
$$ -59 -487 935 74 630 907 -401 -40 68 -350 244 1196 559 580 327 232 724 -52 862 -996 328
5924C28r03K05R13p26P21m45l08P59o97n62P30L71j378J20K031n43m30j99m23
$$ 328 -575 -370 543 -183 538 93 -215 544 -153 -715 15 386 -992 -872 1159 616 186 -13 -436
5943d36K53M44j27O2m64K3R50Q2k52K98l68r24M15Om74J91k10R58j98p54L28l52
$$ -436 -183 261 134 196 -268 -245 705 787 535 833 465 -459 -44 -38 -512 -321 -531 427 229 -525 -197 -549
5965e49M12J12p52J026K57j88j198J634R8p28j27RL64M59k04j497J702q35M79
$$ -549 -137 -25 -777 249 506 318 -880 754 852 124 -3 6 370 829 625 -872 830 -5 474
5984D74q85m12M19k09L96p65P24m94Q06K6n27N83j1k70J131l91j165k61R67o8
$$ 474 -411 -823 -404 -613 -217 -982 -258 -752 54 80 -447 136 125 -145 986 595 -570 -831 136 68
6004F8k75N58L14p98j399Q82O92m74N88j35Q74j884J918p25n69N1R0K9L25j389
$$ 68 -207 351 665 -133 -1532 -650 42 -432 156 21 895 -989 929 204 -365 -314 -224 -195 130 -1259
6024a259O86m5O10n42m38J242N8l02J51L90m89J75P23j758O27K07K83m58n9p12
$$ -1259 -573 -618 -8 -550 -988 254 312 10 161 551 62 237 960 -798 -171 36 319 -139 -198 -910
6044i10Q71o34J192j254l3k40O65m08J048m29k2j5L76n73M16n1o84O04L94n13
$$ -910 -39 -673 519 -735 -768 -1008 -343 -751 297 -132 -154 -169 207 -366 50 -1 -685 -81 313 -200
6064b00Q7N0m29K48L25K2K67p86J27J033j426n14J523J21r45J082k72j278O95
$$ -200 -113 -63 -492 -244 81 103 370 -416 -289 744 -682 -1196 327 448 -497 585 313 -965 -270
6083b70m91Q6J029j612J425N97q40l54j2O08q09R15n44N85j099R10L22m77j113
$$ -270 -761 -675 354 -1258 167 764 -76 -430 -442 166 -643 272 -272 313 -786 124 446 -31 -1144
6102a144J214j43R78l36q29n53P28j58l48R78K42l46N95j538o5O94o28J736k002
$$ -1144 70 -73 905 569 -260 -813 -85 -243 -591 387 629 283 878 -660 -725 -31 -659 1077 -925
6121i25P70R4q05M26K16q7Q69r22N45N57j33k20j60J696p67p10N99j070p21K38
$$ -925 -155 -61 -866 -440 -224 -311 558 -364 181 738 605 385 225 1921 1154 444 1043 -27 -748 -510
6141e10L74j1K80j52P93j539J394o85K93j131J548p11n00N64n27L18M72o8j125
$$ -510 -136 -147 133 -19 774 -765 629 -56 237 -894 654 -57 -557 7 -520 -202 270 202 -923
6160i23J414j45m71R79j860R78J68J060p76o59O36r89O74J67m43k88M32K45k85
$$ -923 491 346 -125 854 -1006 -28 140 1200 424 -235 401 -588 86 253 -190 -478 -46 199 -86
6179h6m00O37J75J00j48J24K05j047J235r57o6J514j666j31O56l68M20N5j1j86
$$ -86 -486 151 326 426 278 402 607 -440 795 -162 -228 1286 -380 -511 145 -223 197 252 241 55
6199E5J72R1j82Q2l03P15j850J379m72J056j282N69l78m20L75R6L85l10M87q19
$$ 55 227 318 136 218 -85 630 -1220 159 -313 743 -539 30 -348 -768 -393 -297 88 -222 265 -554
6219e54O47n97O49K36m08M2N0L53o54J56PM94Q3j0j44p48N66p19J761j527O8Q31
$$ -554 93 -504 145 381 -27 15 65 418 -236 -80 -73 421 504 494 350 -398 168 -551 1210 -317 -249 582
6241E82j237N58J65K35j022o21J898j372P0P88k32j84J86L23n5N72r67J301j363
$$ 582 -655 -97 68 303 -719 -1340 558 -814 -744 44 -188 -372 -186 137 82 654 -313 988 -375
6260c75j77j5N86n01M82r6J581j591p61K70K73o42Q37N94p38J98k70J14j059J799
$$ -375 -552 -567 19 -482 0 -96 1485 -106 -867 -597 -324 -966 -129 465 -273 -75 -345 -231 -1290 509
6280E09j510K117q66l53R43j060K61N35j412J021k35L6k43k04oR28J24k92J87
$$ 509 -1001 1116 250 -103 840 -220 41 576 -836 185 -50 -14 -257 -461 -467 461 585 293 480
6299D80m79K39j62m00J36J016j076j79N46p19O13L98j696J510m03j58K67l46m41
$$ 480 1 240 78 -322 -186 830 -246 -425 121 -598 15 413 -1283 227 -176 -334 -67 -413 -854
6318h54J562j293n41K99J111ro70K58p9Q7n16O63P27M7q06p57J088l78N42j008
$$ -854 708 -585 -1126 -827 284 275 -395 -137 -216 -129 -645 18 745 792 -14 -771 317 -61 481 -527
6338e27J539j298O74L73j348L02Q69j6j153J369o63k16J029p24q6j35q36L43O10
$$ -527 1012 -286 388 761 -587 -285 584 568 -585 784 121 -95 934 210 124 -11 -847 -504 106
6357A06J022j377P17n50n9M21k80j5L87k98r65J060m31P41o35M94O68o05K00j668
$$ 106 1128 -249 468 -82 -141 280 0 -15 372 74 -891 169 -262 479 -156 338 1006 401 601 -1067
6377a067J556j407J414o05R81o91J81L30j410N54M51N24J2n05q79P01qn70N11
$$ -1067 489 -918 496 -109 872 181 362 692 -718 -164 287 811 823 318 -561 140 132 -438 73
6396G3l36J302j664P56J537j159j128O29L9o1L58K47j028M01P80p65M74r23J598
$$ 73 -263 1039 -625 131 1668 509 -619 10 49 -12 346 593 -435 -34 746 -19 455 -468 1130
6415A130j742N06J44j42O2L15j28k83j29l84J415n93k92l27L13k96J001j90L5
$$ 1130 -612 -106 38 -104 -42 273 145 -138 -267 -651 764 171 -121 -448 -135 -431 570 380 415
6434D15o68J57Q04m64K11m69p50J161m05k66n07J191n40n19J700j017J127j242
$$ 415 -253 -96 708 244 455 -14 -764 397 -8 -274 -781 410 -130 -649 1051 34 1161 -81
6452h1J99M37j019J121nj124l1J186r16m0M33o12J328q70Q57j117Q33n35L1j70
$$ -81 118 555 -464 657 652 -472 -503 683 -233 -273 160 -452 876 6 863 -254 579 44 75 -95
6472i5l29K65k37R20j350K159r32j185J79N04k05p30J48L16P33o25R63m21k54
$$ -95 -424 -159 -396 524 -826 1333 401 -784 -605 -101 -306 -1036 -888 -572 161 -464 499 78 -176
6491a76M49Q2j338M62L37M17P42j248J6m81J065j192J008K1K9q66j30L31l26K40
$$ -176 273 355 -983 -521 -184 233 975 -273 -257 -738 327 -865 143 164 193 -673 -803 -472 -798 -558
6511e58P46j86K19K9K16k20m45J77j47N82k0o29R43L95l37j028m5r5O75j423P21
$$ -558 188 2 221 250 466 246 -199 -22 -169 413 393 -236 707 1102 765 -263 -308 -403 272 -1151 -430
6532d30O18N55r45n75P70j011L41j83o13K324m81j014P20J104j470l32Q76n32
$$ -430 188 743 -202 -777 -7 -1018 -677 -860 -1473 851 370 -644 76 1180 -290 -622 254 -278
6550b78j04J184o8j072J115p26%L63P4o52j047J503L30o61Q36q84J334j041Q5
$$ -278 -382 802 734 -338 777 51 51 414 488 -164 -1211 292 622 -39 797 -87 1247 206 291
6569B91p22l2R7o5R39r5j536Q32O09n02R61p37M3L92q52Q25q44q88K364j349P89
$$ 291 -431 -463 -366 -431 508 413 -1123 -291 318 -184 777 40 83 475 -377 448 -396 -1284 1080 -269 520
6590E20l3m85M38k53n40M53n19K89K99j15M50p50N67q7n77N11L05q10O69p27R9
$$ 520 487 2 440 187 -353 100 -419 -130 169 54 504 -246 321 234 -343 168 473 -337 332 -395 -296
6611b96J146j542l95M17N47n42R16n7l76K97m11J072l80j083J104l07j93O10k02
$$ -296 850 -692 -1087 -670 -123 -665 251 194 -182 115 -296 776 396 -687 417 110 -83 527 325
6630C25j198O63p1P08j139J818j277k35P4O19n95q10J527o64P58q10l00j11J008
$$ 325 -873 -210 -281 427 -712 1106 -171 -406 -332 287 -308 -1118 409 -255 503 -307 -607 -718 290
6649B90m47j34N95M87q24M97l17L04J22k97K46j039r4m76J565l58m96J60L8j29
$$ 290 -157 -291 304 791 -33 464 147 451 573 276 522 -517 -611 -1087 478 120 -376 -216 -178 -307
6669c07P99j253J49J484q36L56O53r47l75oM43o44M48k16N58j000J119K99O51
$$ -307 492 -761 -612 872 36 392 1045 98 -277 -283 160 -484 -36 -252 306 -694 425 724 1375
6688A375q98j105L74J6l65O34K98m38j13K08p35M30o66J31l31J932p06j69l54
$$ 1375 477 -628 -254 -238 -603 31 329 -109 -222 -14 -749 -319 -985 -854 -1185 747 41 -128 -482
6707d82K021j678K73l3j491J953l71m22N02K89r38R08jj55L32j157Q71K18j674
$$ -482 1539 -139 134 101 -1390 563 192 -230 272 561 -377 531 530 375 707 -450 421 639 -1035
6726a035J669o23l51Q47p46K26n24R81o56M46m52P6n96KK233j401J69M83J00j720
$$ -1035 634 11 -340 507 -239 -13 -537 444 -212 234 -218 -142 -738 -736 1497 96 265 748 848 -872
6746h72J190K85j370J164r72q1O96O66k17J27M38j119p2N77l51l77L55n19K56
$$ -872 318 603 -767 397 -575 -656 40 706 489 616 1054 -65 -137 440 89 -288 67 -452 -196
6765a96Km95R18K09q08L72o27O79o95N37k02n33J155L12r25N1J103o82l53O39
$$ -196 -194 -689 229 438 -370 2 -625 54 -641 -104 -306 -839 316 628 -297 -246 857 175 -178 461
6785D61p55Q95j051P31j31Q99k86q53Q3J44K00m18Q21r92j43J61o82R98M20q50
$$ 461 -294 601 -450 281 150 1049 763 -90 -7 137 337 -81 740 -252 -395 -234 -916 82 502 -348
6805c48L57l42M6N40k96L28n32L65P26p24k54m14O65j83J45n4K29K62m92M90m61
$$ -348 9 -333 -287 253 -43 285 -247 118 844 120 -134 -548 117 -66 79 25 254 516 24 514 53
6826E3q14J242j109M17J192j418J52M10M70k47n17k26j47Q23k39r56M75J633p77
$$ 53 -761 481 -628 -211 981 -437 -285 125 595 348 -169 -395 -542 281 42 -914 -439 1194 417
6845D17m83k1l41n7J659j124O11m19o01j6J286j639J048J3p01J012p44N95m03
$$ 417 -66 -87 -428 -485 1174 50 661 242 -359 -375 911 -728 320 333 -368 644 -100 495 92
6864I2j19P96j021J46J67L89m47q14j58Q65L40q19J088J01L03p69R4l87k89P87
$$ 92 -27 769 -252 -106 61 450 3 -811 -969 -104 236 -583 505 606 909 140 234 -153 -442 345
6884C45k42m32L17J7o80Q13j63M66q1j097P41pJ33j87P24r47J6N90P9M01n56j28
$$ 345 103 -329 -12 5 -675 138 -25 441 360 -737 4 -3 130 -57 667 -280 -264 326 405 806 250 122
6906A22J28L31m06k39K65m28M22q57L26L24K16O33j413m82J132mk41J51o57L05
$$ 122 250 581 175 -64 201 -227 195 -662 -336 -12 204 837 -576 -1058 74 70 -171 -20 -677 -372
6926c72k7L22j40P02j99l66n52P69K30o43J256j180l99N06j2O69j123l79Q33K84
$$ -372 -399 -77 -217 485 286 -80 -632 137 367 -276 980 -200 -599 -93 -105 564 -559 -938 -105 179
6946A79n46J048p09J90K52j42l05o52K21Q52o17p59R71m29M25k54o03N72L86l11
$$ 179 -367 681 -28 162 414 272 -33 -685 -464 388 -229 -988 -17 -446 -21 -275 -878 -306 80 -231
6966b31r9p44O84J72O16r52P81J02n84L38P74r30M49p78N52j27k86q5L54j12j72
$$ -231 -330 -1074 -390 -218 398 -554 227 329 -255 83 857 -73 376 -402 150 23 -263 -348 6 -106 -278
6987b78j95J26L82J49K8r45J84R09p23k15P99o98n23J467Q2o05r0R2k73O95r05
$$ -278 -473 -347 35 184 212 -733 -549 360 -363 -578 221 -477 -1000 467 549 -56 -146 -54 -327 368 -537
7008e37M09O20m68P94j598L23o6Q1O57q85R97l36L49J33p22k50J82l12N66o50
$$ -537 -128 492 24 818 -780 -457 -523 -442 215 -670 327 -9 340 473 -249 -499 -317 -629 -63 -713
7028g13Q38l79L12p7j428J435o27J25o99J135J44k74J93N5J286n99m51K52p87
$$ -713 125 -254 58 -19 -1447 -12 -639 -514 -1213 -78 66 -208 -15 40 1326 727 276 528 -259
7047b59Q12j009J92M07N61n18k51L50M05j312P23m62M6K5L08J76P7J116r64m86
$$ -259 553 -456 -264 143 704 186 -65 285 690 -622 101 -361 -315 -290 18 194 271 1387 423 -63
7067f3k87L05j155J036O11l77J159m22j92j02m09K89k49m11P49J88j315N44K28
$$ -63 -350 -45 -1200 -164 447 70 1229 807 615 513 104 393 144 -267 482 670 -645 -101 127
7086A27M4Nq12M16O50p83k61J145J75j380Q8L72o03O02K13n05J279j078r9J016
$$ 127 171 176 -636 -220 430 -353 -614 531 706 -674 -586 -214 -817 -215 -2 -507 772 -306 -405 611
7106F11j520M57K42M37j949J565J030q95M88j219P33p60J209J53k008R38J079
$$ 611 -909 -452 -210 227 -1722 -157 873 -22 466 -753 -20 -780 429 582 -1426 -488 591
7123E91k97Oq33M71j12j01L68k47O48j155J31K04J045n43p92J212J169p87j018
$$ 591 294 300 -533 -62 -174 -275 93 -154 494 -661 -530 -326 719 176 -616 596 1765 978 -40
7142d0L2J04o37M82k5J650j414q18Q46q27P72j097R14j051J414O39j341O52O94
$$ -40 -8 96 -541 -59 -84 1566 152 -666 180 -647 125 -972 -58 -1109 305 944 -397 255 949
7161I49o52m75L13j280J920n03j81L16o00J422j316K16R79p98l95m63J231J31
$$ 949 297 -178 135 -1145 775 272 91 407 -193 1229 -87 129 1108 310 -85 -548 683 814
7179H14j16j608P47L87J25l25j00J272j211K98O15j174j32O12J26K94j40j23n55
$$ 814 698 -910 -163 224 349 24 -76 1196 -15 283 898 -276 -408 204 330 624 484 361 -194
7198a94l06O75p2n63J238o93L84r19R65J0r58O45j79k99j23K50j94M98J21o91
$$ -194 -500 175 103 -460 778 85 469 -450 515 525 -433 212 33 -266 -389 -139 -333 165 286 -405
7218d05N79j497J777Oq29J114j164O80J250p90q56L02j360J521p13J56O48K81
$$ -405 174 -1323 454 460 -369 745 -419 261 1511 721 -135 167 -1193 328 -385 -229 419 700
7236G00j475J633N6m11l27o50J640j395m02J072k35L01j016J820m80j85l65l3
$$ 700 -775 858 914 503 176 -474 1166 -229 -631 441 206 507 -509 1311 831 646 281 248
7254B48K8M98p17j49Q91m17r52J297j490J238k19m41q8J79P01j149Q63l93L84
$$ 248 276 774 57 -92 799 382 -570 727 -763 475 256 -185 -273 -94 607 -542 321 -72 312
7273C12P18j199J22J17m01N15j23l99K68N59j5q68M08N39m58m10o6M70M7l89M88
$$ 312 1030 -169 -47 70 -331 184 61 -338 -70 489 474 -394 14 553 95 -315 -381 89 136 -253 235
7294B35n20O37k33N68j769J774m41o36O52N1k79n71J846j130k80O90k5l60K91
$$ 235 -285 352 119 687 -1082 692 251 -385 267 318 39 -532 1314 184 -96 594 569 209 500
7313E00o09k14NQ6J53J59l93R46J09o69O89K0n4n24R52n40j088M59J44r71J406
$$ 500 -109 -323 -318 -232 -79 80 -313 633 742 73 762 782 728 204 1156 616 -472 -13 131 -840 566
7334E66l68l71P93m37K50l45K61m29J55O75q00O5K55j078J305j22m21l11j01K2
$$ 566 198 -173 620 183 433 88 349 -80 75 750 -50 15 270 -808 497 375 -46 -357 -458 -436
7354d36M91l24j52j2N28J90j2j24r8L76K55j036N49K08r4M67o64k80J11j75Q34
$$ -436 55 -269 -421 -433 95 285 273 149 51 427 682 -354 195 403 309 776 112 -168 -57 -232 602
7375F02j116K73k98k26J044k79n90k28O86J06j350Q16P03n34J888p77n91r70J137
$$ 602 -514 -241 -539 -765 279 0 -590 -818 -132 -26 -1376 -560 143 -391 1497 720 129 -841 296
7394B96P05m51j322O31m3o36P91o2pK69j010J414j287J650j412N75J072j456p40
$$ 296 1001 550 -772 -141 -184 -820 -29 -91 -98 171 -839 575 -712 938 -474 101 1173 -283 -1023
7413a023J303l94K09j246J301N8m78p9K52M84r28Q33J51m27r16J999o34j49R44
$$ -1023 280 -114 95 -1151 150 208 -270 -349 -97 387 -541 292 443 16 -900 1099 465 316 1260
7432A260j531Q54j59j146J675j197O35m31N93j253M24M75o99R42j40J32j006N17
$$ 1260 -271 583 424 -722 953 -244 391 -40 553 -700 -276 199 -500 442 302 434 -572 -55
7450e5M64L90l50n66J013p32l35J246j206J054j726J52J333r51K38M11j590J144
$$ -55 409 799 449 -117 896 164 -171 1075 -131 923 -803 -651 682 -269 -31 380 -1210 -66
7468f6J20n86K17P25j97r58o40J329l59O88j010K82q30J320j24L04m93j83J479
$$ -66 54 -532 -315 410 213 -745 -1385 -56 -415 273 -737 -455 -1285 35 -89 215 -278 -461 1018
7487A018j413K00n08R32O20J35q17k50L01p46K53M52j21P36j279l67J161p1p35
$$ 1018 -395 -195 -703 229 849 984 167 -83 218 -528 -275 177 56 792 -487 -854 307 236 -499
7506d99l33J324M02j278q85J604j67l91O91nO66p40p62P82j38L55n82q90O76J97
$$ -499 -832 492 894 -384 -1269 335 168 -223 468 463 1129 389 -373 409 271 626 44 -846 -170 27
7526B7O7K38n2j88P86q33J73j187P27J588o77l46L11j088J82j28RM3J145o41K70
$$ 27 94 332 280 92 878 45 218 -969 -242 1346 669 323 634 -454 -272 -400 -391 -348 797 156 426
7547D26J53j050N04O71o69L70r23N25l64R56r2j151M32P96l92k83J37P73j054
$$ 426 579 -471 33 704 35 405 -518 7 -357 599 507 -644 -212 584 192 -91 46 819 -235
7566b35j16l6J31J69q29m67J806q50k96J02L65N05n3N9o94N71k66M90L54o81j32
$$ -235 -351 -387 -256 -87 -916 -1383 423 -427 -723 -621 -256 249 196 255 -439 132 -134 356 710 29 -103
7587a03J3N39n42l77J117l07m81q58J532k35j98l46K46o54L3J30N42j80r80K64
$$ -103 -90 449 -93 -470 647 340 -141 -999 533 298 100 -246 0 -654 -621 -491 51 -129 -1109 -845
7607h45J75Q91o72P90j389O57j19O76L91l71m03J029J75n42j49q83K61P59k37
$$ -845 -670 221 -451 339 -1050 -393 -512 164 555 184 -219 810 985 443 294 -589 -328 431 194
7626A94j40M11j71o72N27j96n60L8M16R3k40O2L19O1L45n14k89J442r19jn32O28
$$ 194 54 465 294 -378 149 -47 -607 -569 -153 -60 -300 -238 81 142 487 -27 -316 1126 207 206 -326 302
7648C02l79r07L86L95j24R24p66L56K0r9M61k91R2j000P27K87j132J091j149j2
$$ 302 -77 -984 -598 -203 -327 597 -169 187 207 108 569 278 370 -630 97 384 -748 343 -806 -818
7668h18Q87j34L56M93m82j92O4R5j319J488p56J358r40N95p7n27l1o38J331j202
$$ -818 69 -65 291 784 302 110 174 269 -1050 438 -318 1040 100 695 618 91 60 -578 753 -449
7688d49M34J045p52o10J137n04m72J03p9r0J048j665J725j569P35K18l41L44Q18
$$ -449 -15 1030 278 -332 805 301 -171 -68 -147 -237 811 -854 871 -698 37 255 -86 258 1076
7707A076j147J99M54j290J479j132J71j2Q31M15j209L13o81J919j835p21J293
$$ 1076 -71 128 582 -708 771 -361 -190 -202 629 1044 -165 148 -533 1386 -449 -1170 123
7724A23n56j003J157K03j047J533m17j325J902r56Q58n56K12L22M70j447J457
$$ 123 -433 -1436 -279 -76 -1123 410 -7 -1332 570 -386 472 -84 128 450 920 -527 930
7741I30j463L22Q04q11N92r05L32O6j81M98m54N81o86L07M36j51J30q41J282p3
$$ 930 -533 -211 593 -218 374 -531 -199 -133 -314 184 -270 311 -375 -68 368 217 347 -494 788 715
7761G15j585J483n02p2O03j284Q30o60j07j9J213j122n23J831j595J231n43R5
$$ 715 -870 613 111 39 642 -642 188 -472 -579 -598 615 -507 -1030 801 -794 437 -106 -11
7779a1Q81n92J78j032J423j201N06K65n25J036q26n47Q69n20k64L82k71J4L52
$$ -11 870 278 456 -576 847 -354 152 417 -108 928 102 -445 424 -96 -360 22 -249 -235 117
7798A17J78n92M15m1M84q46N31m71j74p6J047M85o76J83p33N26k34J79k35M9j72
$$ 117 295 -297 118 77 561 -285 246 -225 -399 -475 572 1057 381 564 -169 357 123 302 67 116 -56
7819e6j53R3l82N47J61n78O27r48P90O30j579J156q40P17K95q02q8r3J77N43j003
$$ -56 -209 -116 -498 49 210 -368 259 -689 101 731 -848 308 -532 185 480 -322 -410 -503 -326 217 -786
7840g86K20J136m33l70P3k18J521p07M8L75o07M02k4o19j09n5m10o0K311k082
$$ -786 -566 570 137 -233 -160 -378 1143 436 484 859 252 654 630 11 -98 -153 -563 -623 1688 -394
7860c94l71J210r27n9L87p44J664o77J98Q99j703K66N60m9L76j84p61J189n54
$$ -394 -765 445 -482 -541 -154 -898 766 89 287 1186 -517 -251 309 260 636 452 -309 880 326
7879C26O09j65j305O07m86N57j98J76q63J209K26j133J407j635l93P18n11P26
$$ 326 935 770 -535 72 -414 143 -55 121 -742 467 693 -440 967 -668 -1061 -343 -854 -128
7897a28p75J102o88R36n23j022J279j217K79P09l57J081q32o4l6P81j291R99M56
$$ -128 -903 199 -489 447 -76 -1098 181 -1036 -757 -48 -405 676 -156 -220 -256 525 -766 233 689
7916F89k91P31q02J2j080J22O27l31N10o30R60j788J716K06k65m09N98n97M04
$$ 689 398 1129 327 339 -741 -619 8 -323 187 -443 517 -1271 445 651 386 -23 575 -22 382
7935C82N86n02o82L30J41q09J03j17j3M48l0J22L63r50N03O99l5o81l4O10l40
$$ 382 968 466 -216 114 255 -554 -451 -568 -581 -133 -163 -41 322 -628 -125 574 539 -142 -176 434 94
7956I4R53q76o77K00k22J144k18j099R6O10J40K93n53k92K254j854O69q80M51
$$ 94 1047 171 -506 -306 -528 616 398 -701 -605 5 145 438 -115 -407 1847 -7 662 -218 233
7975B33M6q9P26j713Q10j02k68P2r60M50M13k58K55J44j84m45J045m52M44j55
$$ 233 279 190 916 -797 13 -89 -357 -285 -1245 -795 -382 -640 -385 -241 -425 -870 175 -277 167 12
7995A2o27J50J46m44J238m51j48k07N59l42o8O02n50M34M25q81P39m11Q24q25
$$ 12 -615 -465 -319 -763 475 24 -124 -331 228 -114 -182 420 -130 304 729 -152 587 176 1000 175
8015A75l96J24Q02j723J284o63p95J706k72K80n13K7Q79q22l92N41K7L69q00N25
$$ 175 -221 -97 705 -1018 266 -397 -1192 514 242 522 9 36 915 93 -299 242 269 638 -162 363
8035C63J43L2p22K2N16K19r59R65J71q75L40L13q57K77p53L36j07O69n2L63p31
$$ 363 506 538 -184 -162 354 573 -386 579 750 -125 215 528 -329 -52 -805 -469 -576 93 41 404 -327
8056c27Q93K87j98m18l82lk53n11J351m87n45R61j27K8m83N63j16j28n23P85r13
$$ -327 566 853 655 237 -145 -148 -401 -912 439 -48 -593 368 241 269 -214 349 233 105 -418 367 -546
8077e46j03J343l59l62P73o74L24J68q33M11N6M81j449J58O33p02J062m51k08
$$ -546 -649 694 335 -27 746 72 396 564 -269 142 198 679 -770 -612 21 -681 381 -70 -278
8096b78J667j884M80M66PJ49L6k131J417K43N24q31R31m89j065P07l77N56o09
$$ -278 1389 -495 -15 451 458 607 643 -1488 -71 172 696 -135 796 307 -758 -51 -428 128 -481
8115d81L27j91J7M33n44O11j701J037J59J032k77r66N40R3K26L91p29M26L47r86
$$ -481 -154 -345 -328 105 -439 172 -1529 -492 -333 699 422 -544 -4 89 315 706 -23 403 750 -236
8135b36J67L27k2Q51j059j9kL46J057j216r67N83k05O2m86P53n5Q05p19k00n53
$$ -236 -69 258 236 1087 28 9 7 353 1410 194 -773 -190 -395 -333 -819 -66 -121 684 -35 -235 -788
8156g88J109j22p19O8M77n10P78l75j40Q31l64k90m3N47k0k91N97M01r47l17l12
$$ -788 321 199 -520 -452 25 -485 293 -82 -222 609 245 -45 -88 459 439 148 745 1146 199 -118 -430
8177d30L51j35k58O47m98J069p04J49q56O00J17M05L34r13
$$ -430 -79 -214 -472 175 -323 746 42 191 -665 -65 52 457 791 -122
8191a22
$$ Imaginary data points
##PAGE= N=2
##DATA TABLE= (X++(I..I)), XYDATA
0@%%%%%%%%%%%%%%%%%%M7j67K47k55K56k56K63l53M68n05N55o62P51q52R76j099
$$ 0 0 0 0 0 0 0 0 0 0 0 0 0 0 0 0 0 0 0 47 -120 127 -128 128 -128 135 -218 250 -255 300 -362 389 -463 513 -586
34e86J239j389J558j744J953k178K423k693K983l296L642m027M446m899N397n949
$$ -586 653 -736 822 -922 1031 -1147 1276 -1417 1566 -1730 1912 -2115 2331 -2568 2829 -3120
50c120O550p211P953q783R709j0754J1953j3325J4918j6817J9106k1918K5490
$$ -3120 3430 -3781 4172 -4611 5098 -5656 6297 -7028 7890 -8927 10179 -11739 13751
63A3751l0176L6617m6048O1104q8909J55946n71122m39084J908255m31517j390534
$$ 13751 -16425 20192 -25856 35248 -53661 102285 -468837 -907921 1000334 568817 -821717
74h21717J004136Q12590j345699k73642J072562J2295o02080J33776J37441r8929
$$ -821717 182419 995009 -350690 -624332 448230 460525 -141555 -7779 129662 30733
84C0733O3391M2857j10290L6794N0429p8128j18307l4707J02300J55017j04256
$$ 30733 94124 136981 26691 63485 113914 35786 -82521 -117228 -14928 140089 35833
95C5833k84392M2870L78687k1383m29808R5829M72752k31962m13253L55416K47466
$$ 35833 -248559 -205689 172998 151615 -278193 -182364 290388 58426 -354827 589 248055
106B48055l45363P1137K30792l57155J1324N18811k78733m56823M80084K44071
$$ 248055 -97308 -26171 204621 -152534 -141210 377601 98868 -357955 122129 366200
116C66200n37553k7992M01191j00287j72692P4985p6541n72J83329r7343j73288
$$ 366200 -171353 -199345 201846 101559 -71133 3852 -72689 -73261 110068 12725 -160563
127a60563J31112Q0719r9522j4530J658K2503J44523n2829k45003J07587L04166
$$ -160563 -29451 51268 -48254 -62784 -61126 -38623 105900 53071 -191932 -84345 219821
138B19821j36468k67666J78812K09425j97581j16204J88324Q763j19994J01604
$$ 219821 83353 -184313 -5501 203924 6343 -109861 78463 87226 -32768 68836
148F8836r767k01775J40276K17848k60664j66160K83299L6446k39113O0475J09328
$$ 68836 59069 -142706 -2430 215418 -45246 -211406 71893 108339 -130774 -70299 39029
159C9029q0215N1862N477j86824J18080K38078k07595j64336K49743N0995j89775
$$ 39029 -41186 10676 16153 -170671 -52591 185487 -22108 -186444 63299 114294 -75481
170g5481O8750Q2840r5815P2100O4458j98034J0348K57601r3437k38801J40662
$$ -75481 -6731 76109 -19706 52394 116852 -81182 -70834 186767 93330 -145471 -4809
181d809J36818j60442k9905J14036q2680l2003J32385j00255j54577K12551J17360
$$ -4809 132009 -28433 -58338 55698 -26982 -58985 73400 -26855 -181432 31119 148479
192A48479k75731l8219K56020n3310j59235J26209M0943j09591J01102L9040j74832
$$ 148479 -127252 -165471 90549 37239 -121996 4213 45156 -64435 36667 75707 -99125
203i9125Q2884K00417j65359j36147J87892L4740j40166N4620L6982r8042P1278
$$ -99125 -16241 184176 18817 -117330 70562 105302 -34864 19756 56738 -41304 29974
214B9974O1038j68338J33K00921p8920j91041J08581J08506j15059k2486P5098
$$ 29974 91012 -77326 -77193 123728 44808 -146233 -37652 70854 -44205 -66691 8407
225H407n1707r929R1855o4702p6034J39609N3278j52941K772J33035l8196n0609
$$ 8407 -43300 -53229 38626 -26076 -102110 37499 90777 -62164 -59392 73643 35447 -15162
237a5162O0220l1273l7671J04791k3462j33420R3214J15911j43053p1929J30661
$$ -15162 45058 13785 -23886 80905 57443 -75977 17237 133148 -9905 -81834 48827
248D8827n6q5419L7556n631n9376P3574J5273j19433L9404J20765q3944p6648
$$ 48827 48771 -36648 908 -4723 -64099 9475 24748 -94685 -55281 65484 -18460 -95108
260i5108R6669K1299n6940M5696M667o9856O8808O9503j09922k2811J32826k0787
$$ -95108 1561 22860 -34080 11616 16283 -53573 15235 84738 -25184 -47995 84831 64044
272F4044j09322N4297N4613n9495J3150K7586q0206J5494R5983q0168q7295J12091
$$ 64044 -45278 9019 63632 4137 17287 44873 -35333 -19839 76144 -4024 -91319 20772
284B0772L1893j23842J6551Q2343n8920q990O6082o4531l5815J23201j0026j25999
$$ 20772 52665 -71177 -54626 27717 -31203 -40193 25889 -38642 -74457 48744 38718 -87281
296h7281P4415J02350j01694l6653J05730k0915n4322P1505j6755q1893Q4835
$$ -87281 -12866 89484 -12210 -48863 56867 35952 -18370 53135 36380 -45513 39322
307C9322N0390j25786k894J19012n8923q6102Q1351J1901q2269M8827L0655j03388
$$ 39322 89712 -36074 -38968 80044 21121 -64981 16370 28271 -53998 -5171 25484 -77904
319g7904K8324J09541q6970p4993J20134K3471j05716L7194O7363o1361Q772O5590
$$ -77904 -49580 59961 -27009 -102002 18132 41603 -64113 -26919 40444 -20917 -12145 53445
331E3445o7866k2818J12833k3706j06086P2182P0585r3622j5830P9055m2065l9881
$$ 53445 -14421 -37239 75594 51888 -54198 17984 88569 -5053 -20883 58172 16107 -23774
343b3774O5985k7931p1696P0942L4638j05101K346Q8613m7167n2909O4383j571
$$ -23774 42211 14280 -57416 13526 48164 -56937 -54591 34022 -13145 -66054 -1671 -3242
355c242m8646N2080J4074p2038M2427P3459p2341l5188R0503j277o2639M1118
$$ -3242 -51888 192 14266 -57772 -15345 58114 -14227 -49415 41088 39811 -22828 18290
367A8290K1503m7439L1392K9156o7843N523P5056m5169o4132O0677K1430o5255
$$ 18290 39793 -7646 23746 52902 -14941 -9418 65638 20469 -43663 17014 38444 -26811
379b6811J1387K8372m3915M437M1982m7146k5727P3155n003o6962L6933M8203
$$ -26811 -15424 12948 -30967 -26530 15452 -31694 -57421 15734 10731 -56231 -19298 28905
391B8905m9510j137M8025l2755j4580O3061k0419n5721O1801L5586p7646K507
$$ 28905 -20605 -21742 26283 -6472 -21052 42009 21590 -34131 27670 63256 -14390 -11883
403a1883O5670l8130k8701M8412k3982m2951N6136Q58q0840L7792O1989p4501
$$ -11883 53787 15657 -13044 35368 11386 -31565 24571 25429 -55411 -17619 44370 -30131
415c0131l0833P5753j4768n2186N0215J1173n6162L9956M3526o7927j089P9888
$$ -30131 -60964 14789 21 -52165 -1950 9223 -46939 -6983 36543 -31384 -32473 47415
427D7415l3014n4041O1193K0499n5127K6249L6300n7299J180O4031m2406n1617
$$ 47415 14401 -39640 21553 42052 -13075 13174 49474 -7825 -6645 57386 14980 -36637
439c6637O5087J2823p7135J5946N1050m9875j5968N0649l3942l5427O1599o6o8099
$$ -36637 28450 41273 -35862 -19916 31134 -18741 -34709 15940 -18002 -53429 8170 8104 -59995
452e9995M0943N3173o2492j2011O6795j7676l6374N0559q85m9518M7832L2582
$$ -59995 -19052 34121 -28371 -40382 26413 8737 -27637 22922 22037 -27481 20351 52933
464E2933o5169N102O4322l8805m2837N5594J755n2210L1139J6052n9919J2507
$$ 52933 -12236 -7134 57188 18383 -24454 31140 32895 -19315 11824 27876 -32043 -19536
476a9536N1394m7954l1274N5372n007n0453L2401K3521m1895J6390L2110m0430
$$ -19536 31858 -16096 -47370 8002 2995 -47458 -15057 8464 -33431 -17041 15069 -25361
488b5361l128N8261j9335m4351M6783K3390m7978J2989M0873l0115j3197L6681
$$ -25361 -28489 29772 10437 -33914 12869 36259 -11719 1270 42143 12028 -1169 35512
500C5512k0488k9649M0712M521m8143J4612K6748m0857p096L8369k3535k7893
$$ 35512 15024 -14625 26087 30608 -17535 -2923 23825 -17032 -24128 14241 -9294 -37187
512c7187L9596k229m7526L1565L5825m6388n886M7420j7161k4497M1745J193l5655
$$ -37187 2409 180 -47346 -15781 20044 -26344 -32230 15190 -1971 -26468 15277 16470 -19185
525a9185L0425K1531m6509J2632M9976l6052k8580M6864p494m2863L5707J5934
$$ -19185 11240 32771 -13738 -1106 48870 12818 -15762 31102 23608 -19255 16452 32386
537C2386n3563J1983L6444m7778j4100N4182j8148m9441M1016J8784m7443J5309
$$ 32386 -21177 -9194 27250 -20528 -34628 19554 1406 -48035 -7019 11765 -35678 -20369
549b0369L9123l5978j3099M7389j3520l0057M2781J0413m3955J7265L2715l0314
$$ -20369 18754 -17224 -30323 17066 3546 -26511 16270 26683 -17272 -7 32708 2394
561B394m793M0454j9090l2289L4809O345m3855J5253L2077m0527j8036L8765j0974
$$ 2394 -2399 38055 18965 -13324 21485 27830 -16025 -772 31305 -9222 -27258 11507 533
574E33l2095K9006Q448l8413J3773K8641l2593k799M3103k3886k8448M4204Q253
$$ 533 -31562 -2556 5892 -32521 -18748 9893 -22700 -25499 17604 -6282 -34730 9474 17727
587A7727m0014K8534K9943m8342K140N0545k7213k6479M6781l914m6496K4293
$$ 17727 -22287 6247 36190 -12152 -10012 40533 13320 -13159 33622 29708 -16788 7505
599G505K0851l9304O876K7254l5653j0987L8335j8319k9997L3373O495m0228J2180
$$ 7505 28356 -10948 -4072 23182 -12471 -23458 14877 -3442 -33439 -66 6429 -33799 -21619
612b1619K9128k2353p011K8526j1455j9826K8677J2591k6815J1611K6484k3149
$$ -21619 7509 -14844 -21855 6671 -4784 -24610 4067 16658 -10157 1454 27938 4789
624D789j3571L2208j68k5805J8876Q874l1268P333K5873l0356j3171L5467j5759
$$ 4789 -8782 23426 23258 -2547 16329 25203 -6065 1268 27141 -3215 -16386 19081 3322
637C322l5071L1565J2102m2547J5641K6101l8575k040M4786k0278k8539M0905
$$ 3322 -31749 -184 11918 -30629 -14988 11113 -27462 -29502 15284 -4994 -33533 7372
649G372J773l4777K6048K1841k8841P172K6188k7784m662L7824j2694k6971K6317
$$ 7372 9145 -25632 416 22257 -6584 588 26776 -1008 -5670 32154 19460 -7511 18806
662A8806Q385l5959P124K5997k3835j5008K2581o247k4278J7322J2471k7767J188
$$ 18806 27191 -8768 -1644 24353 518 -14490 8091 1844 -22434 -5112 7359 -20408 -19220
675a9220K0707j5998r638K6213k504k1972K1931J1389k8576J1349L4900k6644
$$ -19220 1487 -14511 -24149 2064 -440 -22412 -481 10908 -17668 -6319 28581 1937
687A937j4103L5981o226k9552K9266J3171l5258J0376K1485l1384n014L1811j9048
$$ 1937 -12166 23815 17589 -11963 17303 30474 -4784 5592 27077 -4307 -9321 22490 3442
700C442k6411K8290l65l0393J6955J6731k8689j165K6542j8047j1332K9837p56
$$ 3442 -22969 5321 4956 -25437 -8482 8249 -20440 -21605 4937 -13110 -24442 5395 4639
713D639k5570J7744J5764k2720N350K6349j3660j4585K5447m36k3079J7576J4781
$$ 4639 -20931 -3187 12577 -10143 -4793 21556 7896 -6689 18758 18322 -4757 12819 27600
726B7600k6583n189K6105j8240j5297K4623n779k7836J7083J3101l1581O462K7720
$$ 27600 1017 -4172 21933 3693 -11604 13019 7240 -20596 -3513 9588 -21993 -15531 12189
739A2189k7242j4306L3684n564k5911K5906J1795k8503J0429K3829j8977m523
$$ 12189 -15053 -29359 4325 -1239 -27150 -1244 10551 -17952 -7523 16306 -2671 -7194
751g194K8319q931k0057K3359O590k3982R684J6978k3181p321K4999j1112k1660
$$ -7194 21125 12194 -7863 15496 22086 -1896 7788 24766 1585 -5736 19263 8151 -13509
764a3509J8411O079k8581N049J9867j9479p787K2767q753j8868K2565N746k4639
$$ -13509 4902 10981 -17600 -12551 7316 -12163 -19950 2817 -5936 -24804 -2239 3507 -21132
777b1132J3621K0490k2561k908K8751r271j4889K2862K080k2077J4360J4155k2264
$$ -21132 -7511 12979 -9582 -12490 16261 6990 -7899 14963 17043 -5034 9326 23481 1217
790A217M2K0073j6655j2607K0161m578j8959J2132O841k2533K721J7848j5401
$$ 1217 1259 21332 4677 -7930 12231 7653 -11306 826 7667 -14866 -12145 5703 -9698
803i698r469J8534k896j5645J2071R259j4740O033J4785j2696k723K2648o336
$$ -9698 -19167 -633 -3529 -19174 -7103 2156 -12584 -6551 8234 -4462 -7185 15463 9127
816I127j5569J8014O755j9239M724J6478j4925o566J7270r674j3622J6030n58
$$ 9127 -6442 11572 18327 -912 3812 20290 5365 -1201 16069 6395 -7227 8803 8245
829H245k0787Q242J1655k1208L5J8068j4595r303K0007j621k0019J4367J4730
$$ 8245 -12542 -4300 7355 -13853 -13818 4250 -10345 -19648 359 -1262 -21281 -6914 7816
842G816j9063J853K0649j0270q107J9858j588j5207J5743O757k0089O358J7225
$$ 7816 -11247 -9394 11255 985 -7122 12736 11148 -4059 11684 18441 -1648 4710 21935
855B1935j8043j1048K1196l992j9171J2027P090k2216K788J5682j5979r241J9800
$$ 21935 3892 -7156 14040 10048 -9123 2904 9994 -12222 -9434 6248 -9731 -18972 828
868H28m571j8802J6654R538j9971N899J8805j3659o301K3722m930j6883J8552
$$ 828 -3743 -22545 -5891 3647 -16324 -10425 8380 -5279 -11580 12142 7212 -9671 8881
881H881Q680j9643N650J7209j5498o149J7559p194j6148J6509J661k1708Q244
$$ 8881 17561 -2082 3568 20777 5279 -870 16689 9495 -6653 9856 11517 -10191 -1947
894a947J2652j8723o605J6877n861j3969J2608L384j5545O396J2751j1598j293
$$ -1947 10705 -8018 -14623 2254 -3607 -17576 -4968 -1584 -17129 -10733 2018 -9580 -10873
907a0873J7743p295r816J5405N714j5275Q045J2129j3375j482J5600o654j1458
$$ -10873 6870 -425 -10241 5164 10878 -4397 3648 15777 2402 920 16520 9866 -1592
920a592J1386L050j6008M454O882j1551k130J0163r950p513J4290m254j4830J2381
$$ -1592 9794 12844 -3164 1290 8172 -3379 -5509 4654 -5296 -12809 1481 -2773 -17603 -5222
934e222P520j6691L945J4595j1353m024J7246k456r540J1969L828j1035Q050P127
$$ -5222 2298 -14393 -10448 4147 -7206 -11230 6016 3560 -5980 5989 9817 -1218 6832 13959
948A3959j2394O72J2675q480q192J2086j400j5080P640O880j3931j390J1204q909
$$ 13959 1565 2237 14912 6432 -1760 10326 8926 -6154 1486 8366 -5565 -6955 4249 -4660
962d660q678J1346k16j3746R061Q028j2824n96J6592o371q569J4477K766j2567
$$ -4660 -13338 -1992 -2208 -15954 -6893 1135 -11689 -12285 4307 -2064 -10633 3844 6610 -5957
976e957J0060R651j3902K857J2618j1853o321J7965m328j7261J2745O530k1251
$$ -5957 4103 13754 -148 2709 15327 3474 -2847 15118 10790 -6471 6274 12804 -8447
989h447L853J4709j3969p853J4435m336j5569J2032P129j3227K403J1887j2785
$$ -8447 -4594 10115 -3854 -11707 2728 -1608 -17177 -5145 1984 -11243 -8840 3047 -9738
1002i738l83J6248o413r344J5964L302j4594O939J4635j2339n024J3917k862j4600
$$ -9738 -10121 6127 -286 -9630 6334 9636 -4958 1981 16616 4277 -747 13170 10308 -4292
1016d292J1242O390j2272l117R169p150q083R962o71j1302O939L47j0373L937
$$ -4292 6950 13340 1068 -2049 7120 -30 -8113 1849 1178 -10124 -3185 -2838 -13211 -9274
1030i274J0813r724m562J4722l303j0171J2067O241j1853K676J1215p272k455
$$ -9274 1539 -8185 -12747 1975 -1328 -11499 568 6809 -5044 -2368 8847 1575 -880
1043h80J3063l198q463P406J273p923M836L951r841j515O282p534l517R404m219
$$ -880 12183 8985 522 7928 9201 1278 6114 10065 224 -1291 4991 -2543 -6060 3344 -875
1058h75j0252P380K744j2227N307R393q647m249J0562k51o140P395M783p025J938
$$ -875 -11127 -3747 -1003 -13230 -7923 1470 -7177 -11426 -864 -1115 -7255 140 4923 -2102 -164
1073a64O034l036O84O859n196l487Q435k947q420Q790L492j2805m28Q354p482
$$ -164 5870 2834 3518 10377 5181 1694 10129 7182 -1238 7552 11044 -1761 -2189 6165 -1317
1088a317p704R495J170j1977L996N552p228K78P701n792k860Q430J25o888R512
$$ -1317 -9021 474 1644 -10333 -6337 -785 -8013 -7735 -34 -5826 -8686 -256 -131 -7019 2493
1103B493N999j3139L327J3398p941p284J5849j737j5808Q822P573j3250J261J1463
$$ 2493 8492 -4647 -1320 12078 4137 -3147 12702 10965 -4843 3979 11552 -1698 -437 11026
1117A1026j0328p386R975k306r287P787K515j2239L538Q682j0331k207J2850m535
$$ 11026 698 -6688 3287 981 -8306 -519 1996 -10243 -6705 1977 -8354 -10561 2289 -2246
1131b246q931J1271M937j0688N526P755p242l202J1841P08q601M032N883r470
$$ -2246 -11177 94 5031 -5657 -131 7624 382 -2820 9021 9729 1128 5160 11043 1573
1145A573j344Q337m551n071N124j029q146L270L188p922J190P256r017m516J1426
$$ 1573 229 8566 4015 -1056 4068 3039 -5107 -1837 1351 -6571 -5381 1875 -7142 -11658 -232
1160b32j283r817Q897N452j1120K790J0427l761m189Q030j944l783O191J834m529
$$ -232 -1515 -11332 -2435 3017 -8103 -5313 5114 1353 -2836 5194 3250 -533 5658 7492 2963
1175B963M023o60o275L188M734o798q63M851n670o866O412L180p417n03L662m292
$$ 2963 6986 6326 51 3239 7973 1175 312 5163 -507 -7373 -961 2219 -5198 -5701 -2039 -6331
1191f331q34L189L99j769K450J222l437M540L928l916k76O706l292k965P986J85
$$ -6331 -7165 -3976 -3577 -5346 -2896 -1674 -5111 -571 3357 -559 -835 5871 2579 -386 7600 7785
1207G785n502J307N210p356k631Q806l514o630N191j413o640K730M753q242j515
$$ 7785 2283 3590 8800 1444 -1187 7619 4105 -2525 2666 1253 -5387 -2657 2096 -6146 -7661
1222g661P301n387j836Q185k054o555O320L531p531M850P849p056l622J0889j736
$$ -7661 -360 -5747 -7583 602 -1452 -8007 -1687 1844 -5687 -837 7012 -44 -3666 7223 5487
1237E487q151P520O162r557l54N874n317l508O481N35q299L014J858p380J882
$$ 5487 -2664 4856 11018 1461 1107 6981 1664 -1844 4637 5172 -3127 -113 1745 -5635 -3753
1252c753N110o125l507Q298k899o831P875M560r722J698R961m625m012Q683r2
$$ -3753 1357 -4768 -8275 23 -2876 -9707 -1832 2728 -6994 -5296 4665 40 -3972 4711 4619
1267D619o130M978L627n650J376M623o225j107O956l573m978N036O38r102M66
$$ 4619 -1511 3467 7094 1444 2820 7443 1218 111 7067 3494 -1484 3552 4190 -4912 -4446
1282d446P777o600k588N944k816n337L536L632m936J863N228m504p44O301K33
$$ -4446 3331 -3269 -5857 87 -2729 -8066 -4530 -898 -5834 -3971 1257 -3247 -3991 2310 2543
1297B543m876N452K056m838J572M754l732j485M453k384l780N303o81o836L444
$$ 2543 -2333 3119 5175 337 1909 6663 2931 1446 5899 3515 -265 5038 4357 -2479 965
1312I65K139o099k87L948m445k875N653j370l449L216J680l457J305L169k693
$$ 965 3104 -2995 -3282 666 -3779 -6654 -1001 -2371 -5820 -2604 -924 -4381 -3076 93 -2600
1327b600J497L295o49k180M707m3m280L211L870m807o85N081k921l861L479N48
$$ -2600 -1103 2192 1543 -637 4070 4027 -253 2958 6828 2021 1336 6417 3496 -365 3114 3662
1343C662m913J200K399o207L30M754n580j930O178k933m423N290K474o176K095
$$ 3662 -1251 -51 2348 -3859 -3529 1225 -4355 -6285 -107 -3040 -7463 -2173 301 -5875 -3780
1358c780O791l691k894O177J74n224M277M307m589J282L094l953r81N150k444
$$ -3780 3011 -680 -3574 2603 2777 -2447 1830 6137 1548 2830 5924 1971 990 6140 3696
1373C696m957M595J495p808J363L751m087l442M994j990m752M471J608m999P08
$$ 3696 -1261 3334 4829 -2979 -1616 2135 -1952 -5394 -400 -2390 -7142 -2671 -1063 -6062 -5354
1388e354N913l300k308O763L74m855N303K242n424L19O401l242j599N049r10n875
$$ -5354 559 -2741 -5049 1714 2088 -2767 2536 4778 -646 -327 6074 2832 1233 6282 5372 -503
1404e03L819J815o600K136L085n017k457M779j719n275M391J236m989J304L124
$$ -503 3316 5131 -1469 667 3752 -1265 -3722 1057 -662 -5937 -1546 -310 -5299 -3995 -871
1419h71k300j935N170r52k750L621L64j973K927K335k466k73L986j695k545L932
$$ -871 -3171 -5106 64 -888 -3638 -17 347 -1626 1301 3636 1170 897 4883 3188 643 4575
1435D575Q90n415K046M12k629n81K334k285k713K885m03l297J652K001m183N63
$$ 4575 5465 50 2096 2508 -121 -702 1632 -653 -3366 -481 -884 -4181 -2529 -528 -4711 -4148
1451d148K643k173o10M951j329k370L504J089j482K708J523l322J092J996k56
$$ -4148 -1505 -3678 -4288 663 -666 -3036 468 1557 75 2783 4306 984 2076 4072 3816
1466C816k017J733p65l349L260k69l085m48L019l798k056L490k113j923K704L46
$$ 3816 1799 3532 2767 -582 2678 2409 -676 -1124 1895 -1903 -3959 -469 -2582 -4505 -1801 -1455
1482a455l905J823L302k465r31M599k47l854K908L400l969J750L657k517j427
$$ -1455 -5360 -3537 -235 -2700 -3631 968 721 -3133 -225 3175 -794 956 4613 2096 669
1497F69L621j284j363J617J086o163L025K713n444j649L568o20n291L178K250
$$ 669 4290 3006 1643 3260 4346 -1817 1208 3921 -1523 -3172 396 -224 -5515 -2337 -87
1512h7l630k06L227k035k156M890o76k515M042P91l713L376K521k771m9K541N48
$$ -87 -3717 -3923 -696 -2731 -4887 3 -673 -3188 854 1645 -2068 1308 3829 1058 1009 3550 4098
1529D098m450K534J902k746q56L134l447j700L096n56l332J816R1k606L60K104
$$ 4098 -352 2182 4084 1338 482 3616 169 -1531 1565 1009 -2323 -507 -416 -3022 -2662 -558
1545e58k052l06K135l64k663K178J518j947J076K866j993o26M706j667j698K104
$$ -558 -2610 -2916 -781 -1145 -3808 -1630 -112 -2059 -983 1883 -110 -736 3970 2303 605 2709
1561B709j52j327J070J324k190j067R30j333j500K481p13k209o8K43r96J378N74
$$ 2709 2557 1230 2300 3624 1434 367 1297 -36 -1536 945 232 -1977 -2045 -1802 -2798 -1420 -846
1578h46j338j351K634j759j437L865Q77k314P99K439j754J503O41k05J42m52J291
$$ -846 -2184 -3535 -901 -2660 -4097 -232 645 -1669 -870 1569 -185 1318 1959 1754 1896 1444 2735
1595B735l56Q55L55l057R69M50l750J743J179j688k892J717M38j900J229Q54j47
$$ 2735 2379 3234 3589 532 1501 1951 -1799 -56 1123 -565 -3457 -1740 -1302 -3202 -1973 -1119 -1266
1612a266j580J182J195j686K171J253k719J945J376j428J37K839j65m661L038
$$ -1266 -2846 -1664 -469 -2155 16 1269 -1450 495 1871 443 580 3419 3254 -1407 1631
1627A631J934l800J099K758k887k091K475n83k128K149P95n053M66L304j600j740
$$ 1631 3565 -235 864 3622 735 -1356 1119 536 -1592 557 1352 -3701 -3235 69 -1531 -3271
1643c271K404n47j074J721J132k576J840K138j423j566L728n85j604K421j75l540
$$ -3271 -867 -1414 -2488 -767 365 -2211 -371 1767 344 -1222 2506 1921 317 2738 2563 -977
1659i77J491L170j954j872L257p07l870R47J636k337p80J501k338m7J927l73j557
$$ -977 514 3684 1730 -142 3115 2408 -1462 -515 1121 -1216 -1996 -495 -2833 -2880 -953 -1326 -2883
1676b883K488j85l817K954J632j471L46K170J45j699J502J822k254O25J763j432
$$ -2883 -395 -580 -4397 -1443 189 -1282 -936 1234 1379 -320 1182 3004 750 1375 3138 1706
1692A706L41q0k92j172J361j084j677O56P63l173J287J003j093k153J526O21p21
$$ 1706 2047 1967 1675 503 1864 780 -897 -241 522 -2651 -1364 -361 -1454 -3607 -2081 -1460 -2181
1709b181Q47j1o48J113J013p07R71m54L87M82O35N63k5Q95k37k295J754O61j335
$$ -2181 -1334 -1345 -1993 -880 133 -574 397 -57 330 812 1447 2010 1985 2880 2643 348 2102 2763 1428
1728A428p96O09K23j851N23J081k236p02J333j499l90J975r51k93J95J638j107
$$ 1428 632 1241 1464 -387 136 1217 -1019 -1721 -388 -1887 -2277 -302 -1253 -1546 -1351 287 -820
1745h20n10K810k368p00L514j514q83L122J580m016O79K747k555r50J993m59k369
$$ -820 -1330 1480 -888 -1588 1926 412 -471 2651 4231 215 894 3641 1086 136 2129 1670 -699
1762f99J581q4j427p7Q60j454q65J640o25r01J316J045k242Q9J217m16l59K020
$$ -699 882 798 -629 -706 154 -1300 -2165 -525 -1150 -2051 -735 310 -1932 -1843 -626 -1042 -1401 619
1780F19J502k944J076J491j278M96R52j2j710K613j226j354R96J1k304R94N99
$$ 619 2121 -823 253 1744 466 962 1914 1902 192 2805 1579 225 1221 1232 -1072 -78 521
1797E21j861q4J829k449o03J99K213k246J097J434j421k48J787j42n49J642L60
$$ 521 -1340 -1424 405 -2044 -2647 -2448 -235 -2481 -1384 50 -1371 -1619 168 26 -523 1119 1479
1814A479q34L38O83J76r50M67J709j869J418r67j692O19N54j667j48j22P65l75
$$ 1479 645 983 1666 1842 892 1359 3068 1199 2617 1650 -42 577 1131 -536 -684 -806 -41 -416
1832d16L25l01j890L11R18p96k16J599k46m19R04K10J08J828n88j313P5K432j230
$$ -416 -91 -392 -2282 -1971 -1053 -1849 -2065 -466 -712 -1131 -227 -17 91 1919 1331 18 93 2525 1295
1851A295l75N25j018l99R27O56q98l86J211l186O08Q47p38N52K8j675Q11j56J11
$$ 1295 920 1445 427 28 955 1611 713 327 1538 -1648 -1040 -193 -931 -379 -351 -2026 -1215 -1371 -1260
1870a260K16k63Q39n26n38K054N20j316J353n1r02L51J248p67m85R29J05j176
$$ -1260 -1044 -1307 -468 -994 -1532 522 1042 -274 1079 1028 126 477 1725 958 473 1402 1507 331
1888C31M58O41j246j46M78j436N30p91l19O1J052J37j409r07K728j68j552K244
$$ 331 789 1430 184 38 516 -920 -390 -1181 -1500 -1439 -387 -250 -1659 -2566 162 -6 -1558 686
1906F86o73j724Q48J639nl53J964j378j533J108P44p26R04m38j135j110K231o54
$$ 686 13 -1711 -863 776 771 418 2382 1004 -529 579 1323 597 1501 1063 -72 -1182 1049 395
1924C95n44O41j085k468K100R65j021n68J112j308k45J084l64l1R63J305o70o9
$$ 395 -149 492 -593 -3061 -961 4 -1017 -1585 -473 -1781 -2026 -942 -1306 -1337 -374 931 261 192
1942A92n7o5N68J062q69j673K014l83q23M88J599k127k58J056j202l34l82P6N43
$$ 192 135 70 638 1700 831 -842 1172 789 -34 454 2053 -74 -332 724 -478 -812 -1194 -1118 -575
1961e75J421j107j023L59O59p15j04K35N18q64J275J22l47N97K53m41J194m05
$$ -575 846 -261 -1284 -925 -266 -981 -1085 -850 -332 -1196 79 201 -146 451 704 263 1457 1052
1979A052M0J64l3j295p39K106p40j58m90J199j139m05P42p45j096Q13m65p87J769
$$ 1052 1092 1256 1223 -72 -811 1295 555 397 -93 1106 -33 -438 304 -441 -1537 -724 -1189 -1976 -207
1998b07J4j113N02P60J40j866J500Q75j177N35Q02l2l47N41K61r62j47O46p85
$$ -207 -193 -1306 -804 -44 96 -1770 -270 605 -572 -37 765 733 386 927 1188 226 79 725 -60
2017f0L93J352j861m39R23m31j006J056J17j781J424l49K66j782K093J45q36R4
$$ -60 333 1685 -176 -615 308 -123 -1129 -73 44 -1737 -313 -662 -396 -2178 -85 60 -776 -682
2035f82J312j473J174N01r27m2L02P80J23K77L87j479o81J059J77q02K1J20p76
$$ -682 630 -843 331 832 -95 -137 165 945 1068 1345 1732 253 -428 631 808 6 27 147 -629
2054f29k97J437k139J292J66n1j009R49O07j693%K184r59m65N87L88K95n5M28
$$ -629 -926 511 -1628 -336 -170 -221 -1230 -281 326 -1367 -1367 817 -142 -607 -20 368 663 608 1036
2073A036j107O12O15p29J127q32k3P72m99m20J29n16n5j026m3J275o46l57j174
$$ 1036 -71 541 1156 427 1554 722 699 1471 972 552 681 165 110 -916 -959 316 -330 -687 -1861
2092a861P52N57K24O7p96O31n29L49K67J183r93J47M35m12J391l73j91p83J207
$$ -1861 -1109 -552 -328 -261 -1057 -426 -955 -606 -339 844 -149 -2 433 21 1412 1039 848 65 1272
2111A272m73q23J42O46p95L25R30j081j418J12J073j067k23K10K59k99K135j051
$$ 1272 799 -24 118 764 -31 294 1224 143 -1275 -1163 -90 -1157 -1380 -1170 -911 -1210 925 -126
2129a26m23m16J53J552m70O46l54j310J327N39q26R47p71j177P51J070r95K70
$$ -126 -549 -965 -812 740 270 916 562 -748 579 1118 292 1239 468 -709 42 1112 117 387
2147C87r5O70k052L33P34j303N85N83j020p10J302N58q43L24M07m81P26j288J749
$$ 387 292 962 -1090 -757 -23 -1326 -741 -158 -1178 -1888 -586 -28 -871 -547 -140 -621 105 -1183 566
2166E66n88m83J811j218L98M12K05j418L274j668j232L67L48J3p47L99q68j45
$$ 566 -22 -505 1306 88 486 898 1103 -315 2959 1291 59 426 774 787 40 439 -429 -574
2184e74k01n7K77J115j651M71M47m47M16q64J451q98J171L01j172l06N22J007
$$ -574 -775 -832 -555 560 -1091 -620 -173 -620 -204 -1068 383 -515 656 957 -215 -521 1 1008
2202A008m60l51K40L72o44J239r40j57l35M58j06j03K11k15n23J68q69kM07J471
$$ 1008 548 197 437 809 165 1404 464 307 -28 430 324 221 432 217 -306 -138 -1007 -1009 -602 869
2222H69j115l50p1Q36J60L4j136O96O35J84j59n8j49p22J219l39K62j012O04M25
$$ 869 -246 -596 -667 169 329 363 -773 -77 558 742 583 525 376 -346 873 534 796 -216 388 813
2242H13j328R06l7k40P1L4j418Q69J331j904Q26J62n21n94J004J23j56K63J98
$$ 813 -515 391 354 114 185 219 -1199 -330 1001 -903 -77 85 -436 -1030 -26 97 -59 204 402
2261D02j189Q08k3O41k69j19R36j219L31O79o41L01L8q91o24N03J042j077O78
$$ 402 -787 21 -2 639 370 251 1187 -32 299 978 337 638 676 -215 -839 -336 706 -371 307
2280C07K46m25j092K95M74L20j74r80R77j077O59J092j76L5l82j83m48J032K31
$$ 307 553 128 -964 -669 -195 125 -49 -1029 -52 -1129 -470 622 446 481 99 -84 -532 500 731
2299G31o14J59N81o85l1J22R98l11k00r99o7N8K41j510J611o87j040K090m16o21
$$ 731 117 276 857 172 141 263 1261 950 750 -249 -316 -258 -17 -1527 84 -603 -1643 447 31 -590
2319e90K09J132j079Q07o15Q46k0j54Oq55J459o30n12k67J179J95n13l3j156M74
$$ -590 -381 751 -328 479 -136 710 690 536 542 -313 1146 516 4 -263 916 1111 598 565 -591 -117
2339a17K10M97j082l5L96L33L27p30K27j69kk79Q62j244M90M31K69j060J567k0
$$ -117 93 590 -492 -527 -131 202 529 -201 26 -143 -145 -424 438 -806 -316 115 384 -676 891 871
2359H71j76j097P67r03J586l89p73K03N14q18q22Q58M4p95p6P46k39M44k40J72
$$ 871 695 -402 365 -538 1048 659 -114 89 603 -215 -1037 -179 -135 -930 -1006 -260 -499 -55 -295 -123
2379a23l75m91N73l23j81R95r82M78J251j800P39M58J25j33J458r06P1j94l65
$$ -123 -498 -989 -416 -739 -920 75 -907 -429 822 -978 -239 219 344 211 1669 763 834 640 275
2398B75j63n84R89j548J066O09m23J00k42m37o7l73J482j649L59J107r85O46j067
$$ 275 112 -472 517 -1031 35 644 221 321 79 -358 -425 -798 684 -965 -606 501 -484 162 -905
2417i05J210p5J41k47K52J61O9l54k91R71m76J33K60k20j264J090p68J217m43
$$ -905 305 230 371 124 376 537 606 252 -39 932 456 589 849 629 -635 455 -313 904 461
2436D61k63p98m39Q35n85N66l02o8N71L54m05M70j514J282O82p07j2L4Q01n82
$$ 461 198 -600 -1039 -204 -789 -223 -525 -593 -22 332 -73 397 -1117 165 847 140 128 162 963 381
2456C81J01K57o58O11R3j214J068j42J86n28q9N94q64qJ52n42M01o41m48M08J49
$$ 381 482 739 81 692 785 -429 639 497 683 155 66 660 -204 -212 -60 -602 -201 -842 -1290 -882 -733
2477g33M01N83k72J70j112M36M67N4Rp3L93r00J846j623Q30j72k88L32M28l93
$$ -733 -332 251 -21 149 -963 -527 -60 -6 3 -70 323 -577 1269 -354 476 304 16 348 776 383
2497C83m29MJ279j215J4P87j277N59o43J175j002n46J222n97P3K01N5j77K71L99
$$ 383 -46 -42 1237 22 36 823 -454 105 -538 637 -365 -911 311 -286 -213 -12 43 -134 137 536
2517E36k74L9R38j182O26k77O91n04Ql24M43o98J300m65j413L24on05J358p15
$$ 536 262 301 1239 57 683 406 1097 593 601 277 720 22 1322 857 -556 -232 -238 -743 615 -100
2537a00L27j90o63k98J271K49q36M71M30J60j263l70K090j523J66J06n18Q13O64
$$ -100 227 37 -626 -924 347 596 -240 231 661 821 -442 -812 1278 -245 -79 27 -491 322 986
2556I86l29j76k45R36q91K89P56j535j160j70K061p12r59R48K16m76l59R62n26
$$ 986 657 481 236 1172 281 570 1326 -209 -1369 -1539 522 -190 -1149 -201 15 -461 -820 142 -384
2575c84Q54q40pN6l97J440j158J197j174P22O26k93j374R60l77M88j012J66K65
$$ -384 470 -370 -377 -321 -718 722 -436 761 -413 309 935 642 -732 228 -149 339 -673 -507 -242
2594b42O4p21L08K67P12q17R89n97q72J252q41M16n01m54J60R16j92k95L77P2
$$ -242 -178 -899 -591 -324 388 -429 560 -37 -909 343 -498 -82 -583 -1037 -877 39 -153 -448 -71 1
2614AL07p5q22L14R19m79M26l79N25k00n54n68R46p52K21K67l07j1m71q7m08R33
$$ 1 308 233 -589 -275 644 165 591 212 737 537 -17 -585 361 -391 -170 97 -210 -221 -692 -779 -1187 -254
2636b54r21J341j074N60J193r49P73j695J075J368j746O2M59mn89Q35j043J060
$$ -254 -1175 166 -908 -348 845 -104 669 -1026 49 1417 -329 -267 192 188 -401 434 -609 451
2654D51j25Lm11j17j04j015J356L6MJ53l18p14J698n68J92p06Q77n79R3M44j405
$$ 451 326 329 -82 -199 -303 -1318 38 74 78 231 -87 -801 897 329 521 -185 692 113 206 650 -755
2675g55J199o19n42J060j58J16J011q73j218J203k40l19O5M62m13j821J160R73
$$ -755 444 -175 -717 343 185 301 1312 439 -779 424 184 -135 -70 392 -21 -1842 -682 291
2693B91j933J326K57q35J17M65L34l12j65J13k11P55k62m94L91m39K09r36K071
$$ 291 -1642 -316 -59 -894 -777 -312 22 -290 -455 -342 -553 202 -60 -554 -163 -602 -393 -1329 742
2712G42r21Q08n33N92K38j596K84P80l75o48J081q86p4o48J052k3j077J346q14
$$ 742 -179 629 96 688 926 -670 -386 394 19 -629 452 -434 -508 -1156 -104 -127 -1204 142 -672
2731f72R35n08J54r11L36P28n18J059p63k01M30P22m37j6j7K92o01o6K60n45J86
$$ -672 263 -245 -91 -1002 -666 62 -456 603 -160 -361 69 791 354 338 321 613 12 -54 206 -339 -153
2752a53J071o30q85R99q39N92q32O07N50q24J080k98l08K27j592L27N66l92J31
$$ -153 918 288 -597 402 -437 155 -677 -70 480 -344 736 438 130 357 -1235 -908 -342 -734 -603
2771f03J092o55M41j768Q40R99l95J10J61n74N86q15K24R46j352R12R4j67K50
$$ -603 489 -166 275 -1493 -653 346 -49 61 222 -352 234 -581 -357 589 -763 149 243 76 326
2790C26J19n89M66p55M16q6L13j000Q92p52M63P07j436J716j277l90J258m3M4
$$ 326 445 -144 322 -433 -17 -103 210 -790 102 -650 -187 520 -916 800 -477 -867 391 348 392
2809C92o50J280q80k55l14J468J8j514K06J630q76n99M25j316k0J09J32M37K49
$$ 392 -258 1022 142 -113 -427 1041 1059 -455 -249 1381 505 -94 331 -985 -1005 -896 -764 -327 -78
2828g8M61j201M44R0K63m09R82M12j216J98k58J64p79M99P58k73k58r85J667P79
$$ -78 383 -818 -374 -284 -21 -430 552 964 -252 -54 -312 -148 -927 -428 330 57 -201 -1186 481 1260
2848A260r37q52J32L97p99Q85R40n80p14j41m69J162q51L62J36o29J106j650J569
$$ 1260 323 -529 -397 0 -799 86 1026 446 -268 -409 -878 284 -567 -205 -69 -698 408 -1242 327
2867C27p36J47K36j479J283q50J936j006Q47j61o14k41Q11o79J687j185M98m80
$$ 327 -409 -262 -26 -1505 -222 -1072 864 -142 705 544 -70 -311 500 -179 1508 323 821 341
2885C41K78q82N02K24p91N63j399J421j229M6J047q31Q01j63M34l75l24J22M43
$$ 341 619 -263 239 463 -328 235 -1164 257 -972 -926 121 -710 91 -72 362 -13 -337 -215 228
2904B28l17k26j5L65R34l25M74j137m91L26O83j233N72K02n92J62K38n75j038
$$ 228 -89 -315 -330 35 969 644 1118 -19 -510 -184 499 -734 -162 40 -552 -390 -152 -727 -1765
2923a765P05J344q29j02K87j86L16N05Q16l86q12M92p17R21p22P44q59P40o08
$$ -1765 -1060 284 -545 -647 -360 -546 -230 275 1091 705 -107 385 -332 589 -133 611 -248 492 -116
2942a16J72P32N59n08j013M38j60j68p28J261k57j15p82M97L62l48m05L81r63
$$ -116 56 788 1347 839 -174 264 104 -64 -792 469 212 97 -685 -188 174 -174 -579 -198 -1161
2961a161J308k49P41n38K17o65j27p66N96J598r79r43J018k73J92L07j34k35l17
$$ -1161 147 -102 639 101 318 -347 -474 -1240 -644 954 -25 -968 50 -223 -31 276 142 -93 -410
2980d10N92N2k34p45L92J39N21L48j895N74P0N32l49P6n36J260j498J533M80j589
$$ -410 182 234 0 -745 -353 -214 307 655 -1240 -666 -596 -64 -413 -337 -873 387 -1111 422 902 -687
3000f87J215o30N60j58j02k13J345j408l17O88O2p49M63J36j7q59N06k35kM8j82
$$ -687 528 -102 458 300 198 -15 1330 -78 -395 293 355 -394 69 205 188 -671 -165 -400 -402 -354 -536
3021e36j9R32m77k07N88R5j611J550j59m06n3j009L91J652j000J110q38n39M54
$$ -536 -555 377 -100 -307 281 376 -1235 315 156 -250 -303 -1312 -921 731 -269 841 3 -536 -82
3040h2P40l83K33o02Q31n01N16o0r36N46j060Q98o31O5N97n37m5q56O57Q36M5
$$ -82 658 275 508 -94 737 236 752 692 -244 302 -758 140 -491 -426 171 -366 -411 -1267 -610 226 271
3061B71r09J019Q22r74n1K15m15J38n3J122j241P62J15k60l15j127J196m30J34
$$ 271 -638 381 1203 229 178 393 -22 116 63 1185 -56 706 821 561 246 -881 315 -115 19
3080A9l96M96j057J32J207r87M34p75J007L8r31J417q20l8J121n46o90k64O38
$$ 19 -377 119 -938 -806 401 -586 -152 -927 80 118 -813 604 -216 -254 867 321 -369 -633 5
3099Ep14J511m73JJ242j264l38m34J404j342J32M73K15j575Q87j61j23K44q31
$$ 5 -709 802 329 330 1572 308 -30 -464 940 -402 -270 203 418 -1157 -270 -431 -554 -310 -1141
3118a141J103l46p63P53l35j09J576p23j61n97N46J005m84NO02q4q68O45Q8j096
$$ -1141 -38 -384 -1147 -394 -729 -838 738 15 -146 -743 -197 808 324 329 931 847 -21 624 712 -384
3138c84R27J22m95Q37p84m30l51L02J75K92N93j665Q11r02R82n38N18K52q32O33
$$ -384 543 665 170 1007 223 -207 -558 -256 -81 211 804 -861 -50 -952 30 -508 10 262 -570 63
3158F3N17L04j151l18Q11K7J42p46j2Q2%O44m12k12J9J57k2K00m43L8j72J741
$$ 63 580 884 -267 -585 226 253 395 -351 -363 -281 -281 363 -49 -261 -242 -85 -107 93 -350 -312 -484 1257
3180A257j208j423O48M26j035N27N15n17N16J341j494L72N42k81q49q20J899j81
$$ 1257 49 -1374 -726 -300 -1335 -808 -293 -810 -294 1047 -447 -75 467 186 -663 -1483 416 235
3198B35k48R12j166N96O5N17j372P05J074j542m88J455r99R4N35K27q07J55k42
$$ 235 -13 899 -267 329 394 911 -461 244 1318 -224 -712 743 -256 -162 373 600 -207 -52 -294
3217b94M25m09l15L50N42k386K364k32k13K45J73L33o44m62J172j17k69J6P82
$$ -294 131 -278 -593 -243 299 -2087 277 45 -168 77 250 583 -61 -523 649 532 263 279 1061
3236A061J4p68l9N82j361k06O74j7N8p66J87J151k077Q92L84n16Q75L30j461N62
$$ 1061 1075 307 268 850 -511 -717 -43 -60 -2 -768 -581 570 -1507 -615 -231 -747 128 458 -1003 -441
3256d41K80N62K90j027M74Q70j04r5l65K12o19k98L34J07k95J206j308m65O48
$$ -441 -161 401 691 -336 138 1008 904 809 444 656 37 -261 73 180 -115 1091 -217 -682 -34
3275c4r61O30P18p61k22j52P41J36o6r14P84p39M50R40P7k33j68O04k96q21J108
$$ -34 -995 -365 353 -408 -630 -782 -41 95 29 -885 -101 -840 -390 550 627 394 226 830 534 -287 821
3296H21p9p51M23q92O81m08K88k42P23p2j00o26N60n57J65M99n45j239J219l03
$$ 821 742 -9 414 -478 203 -205 83 -159 564 492 392 -234 326 -231 -66 433 -112 -1351 -132 -435
3316d35J22L04p91O68M78k51p23L81M79l94J107j843R20Q54m25j052J514j021
$$ -435 -313 -9 -800 -132 346 95 -628 -247 232 -162 945 -898 22 876 451 -601 913 -108
3334a08L21J95r63J115j379R05n91l17J038j023O09L73k13q55J587j892J81N80
$$ -108 213 408 -555 560 -819 86 -505 -822 216 -807 -198 175 -38 -893 694 -1198 -1017 -437
3352d37o3J71j17N07M09j32n07m39R55n34L59L06N70p14k69k6j27O92o77l33j83
$$ -437 -500 -329 -446 61 470 338 -169 -608 347 -187 172 478 1048 334 65 39 -88 604 -73 -406 -589
3373e89J29M38L52m02r77J424j137N98r64M50Q62j076j12L11N14q0Q95o60J45
$$ -589 -460 -22 330 -72 -1049 375 -762 -164 -1128 -678 184 -892 -1004 -693 -179 -259 636 -24 121
3392A21N19k75p52O52l89J01j83j58O85r32l9O81K18j397J925n85p19o7j34K69
$$ 121 640 365 -387 265 -124 -23 -206 -364 321 -611 -650 31 249 -1148 777 192 -527 -594 -728 -459
3412d59L77m23J296q51j8k04Q38o15J76O34j378M12Q61O3j137O80j73J35O96q65
$$ -459 -82 -505 791 -60 -78 -282 556 -59 117 751 -627 -215 646 709 -428 252 79 214 910 45
3432D5n01J183p49J62j307J503O13p47k82o10j22J394o09K94m02o13M87P34m87
$$ 45 -456 727 -22 140 -1167 336 949 202 -80 -690 -812 582 -27 267 -135 -748 -261 473 -14
3451a4rK73n60Q23l04j207K040m58j28R3N17j526N01j07k05P9m46J49q87P34J367
$$ -14 -23 250 -310 513 209 -998 1042 584 456 549 1066 -460 41 -66 -271 -192 -638 -489 -1376 -642 725
3472G25j587J205j93l00N69j446J614j654K90N02M75P47j2q59l04J172Qn82L6
$$ 725 -862 343 150 -150 419 -1027 587 -1067 -777 -275 200 947 935 76 -228 944 952 370 406
3491D06N4n62M07L04K61j135M10l91J76O03q01N6J47K90j112J84P66k89o91M70
$$ 406 460 -102 305 609 870 -265 145 -246 -70 533 -268 -212 -65 225 -887 -703 63 -226 -917 -447
3511d47K59P71j577J559j8q71Q83n87M79m33p61J157K83j302J257m04J68M21j93
$$ -447 -188 583 -994 565 547 -324 559 -28 451 18 -743 414 697 -605 652 248 416 837 644
3530F44n6k80K25n20K88q01M29k56K38N32n0n84r46J149k07m7O93l62l8M68l48
$$ 644 588 308 533 13 301 -500 -71 -327 -89 443 393 -191 -1137 12 -195 -242 451 89 51 519 171
3551A71l23J80J508j037n08L48K14L9j127N42L52N49j92j040J035p57j428J929
$$ 171 -152 28 1536 499 -9 339 553 592 -535 7 359 908 716 -324 711 -46 -1474 455
3569D55r19K029j436q81O87J39j367P26L94j039J40Q50P86k80L62J30m74r89J472
$$ 455 -464 1565 129 -752 -65 74 -1293 -567 -173 -1212 -1072 -222 564 284 646 776 302 -687 785
3588G85j458K92O36k99K2K20q39M85J71R73m34j946k6J319j0K77k84o00O81l42
$$ 785 -673 -381 255 -44 -22 198 -641 -156 15 988 554 -1392 -1418 -99 -109 168 -116 -716 -35 -377
3608c77l18L69O08m22o24O28P75j954J306L05L36m4q86J133r3P8m31k01L49P7
$$ -377 -695 -326 282 -140 -764 -136 639 -1315 -9 296 632 588 -298 835 742 820 389 188 537 614
3628F14q52k04O24l21J48o21P5k17O1J296o91o83m84J571L38j119J66R18j76J50
$$ 614 -238 -442 182 -139 9 -612 -537 -754 -693 603 -88 -771 -1255 316 654 -465 -299 619 443 593
3648E93n80l2r4m14M10m03M64K05R77p90P58j117K78j128P13N54p13M71p55n43
$$ 593 13 -19 -113 -527 -117 -520 -56 149 1126 336 1094 -23 255 -873 -160 394 -319 152 -603 -1146
3668a146J328j212J062l84l37N08L77n86k81Q36n3j72Q37r79M60M35r00P29n80
$$ -1146 182 -1030 32 -352 -689 -181 196 -390 -671 165 112 -60 777 -202 258 693 -207 522 -58
3687e8j44k28R86l02J76j05J39o28l19N35k23M87r93Q6J95o65P71m03Q77p35L24
$$ -58 -202 -430 556 254 430 325 464 -164 -483 52 -171 316 -677 -591 -396 -1061 -290 -693 184 -551 -227
3708b27p74J260p60K19J044j49k62k05n22J444j237L55j29P04K45j617J027k64
$$ -227 -1001 259 -501 -282 762 613 351 146 -376 1068 -169 186 57 761 1006 -611 416 152
3726A52m97k5J96Q18j062J88q20O26n70o05J823k23r75P27Q60l2m16Kj40L17r3
$$ 152 -345 -370 -174 644 -418 -230 -1050 -424 -994 -1599 224 1 -974 -247 613 581 165 167 27 344 251
3747B51r91K58M76P51p7j332J884p20p57N53M93m76L9k51m9O92j453J064j281
$$ 251 -740 -482 -6 745 668 -664 1220 500 -257 296 789 313 352 101 52 744 -709 355 -926
3766i26K25P15K25j031R32J0p30J131p60J16j95O58m86m27M58N17J76j32q5L20
$$ -926 -701 14 239 -792 140 150 -580 551 -209 -93 -288 370 -116 -543 -85 432 608 476 391 711
3786G11j89j094P10j115Q92o60j97M95P46j77o04K58O6m21R74o06l17J34Q67k19
$$ 711 522 -572 138 -977 -85 -745 -942 -447 299 122 -482 -224 -158 -579 395 -211 -528 -394 473 254
3806B54J4r0n81k96J603n07p68J44L46L79q09M61J6N18M96J58p23l71l39R9l92
$$ 254 268 178 -403 -699 904 397 -371 -227 119 498 -311 150 166 684 1180 1338 615 244 -95 4 -388
3827c88k59O00J36n13P56m94L67j327K115j608J431j711P65j10lP19p37J79J033
$$ -388 -647 -47 89 -424 332 -162 205 -1122 993 -615 816 -895 -130 -240 -243 476 -261 -82 951
3846I51j110J0K78j88P32n84o82k8L03m0K96k46O02k19r76j81J482n53o59j51
$$ 951 -159 -149 129 -59 673 89 -593 -621 -318 -358 -62 -308 294 75 -901 -1082 400 -153 -812 -963
3866i63J385r81L83M99j498J887k62k5L6l74K14K21n33j85J54P60p97oR9k59N17
$$ -963 422 -559 -176 323 -1175 712 450 425 461 87 301 522 -11 -196 -42 718 -79 -85 14 -245 272
3887B72o59M75r98J015n85R62l21J1r56o13J384J91o02R10j010j42Q13J15r92
$$ 272 -387 88 -910 105 -480 482 161 172 -784 -1397 -13 178 -424 486 -524 -666 147 262 -730
3906g30N85M64k76O79j511J819M1p64K29l39j312J879r15L42o22j82L30K90j474
$$ -730 -145 319 43 722 -789 1030 1071 307 536 197 -1115 764 -151 191 -431 -613 -283 7 -1467
3925a467J727p1l41K52k26r2L05r2Q24o55l25J283j266l34l60L55J068j091J416
$$ -1467 260 189 -152 100 -126 -218 87 -5 819 164 -161 1122 -144 -478 -838 -483 585 -506 910
3944I10K0k71q43M38l28Q19p14Q10n87l97K86j076J334o16J54l00M39L43j396
$$ 910 930 659 -184 254 -74 745 31 841 254 -143 143 -933 401 -215 -61 -361 78 421 -975
3963i75J417q10j11K97J1M32K35j497P91N42P27P22j404l03N23q68P61p7j254
$$ -975 442 -368 -479 -182 -171 261 496 -1001 -210 332 1059 1781 377 74 597 -271 490 413 -841
3982h41P7J39M76j22R71k10o16M31k22k89o29L11P02q8j077N84N68J3L56K34r36
$$ -841 -764 -625 -149 -271 700 490 -126 305 83 -206 -835 -524 178 90 -987 -403 165 178 534 768 -168
4003a68L82m64J045j449J147p60Q72p72Q94J35j571J392l90J037j493K03J35o51
$$ -168 214 -250 795 -654 493 -267 605 -167 727 862 -709 683 293 1330 -163 40 175 -476
4021d76O9J079p68p39M84J14k39M74M49k40M16n82K05k09N80o22L46p0n16J646
$$ -476 -407 672 -96 -835 -351 -237 -476 -2 447 207 623 41 246 37 617 -5 341 271 -245 1401
4041A401j390L31o92L19PP80o4l27L2j395R98K11K75q5p37k51m34j91J046J35
$$ 1401 11 342 -350 -31 -24 756 692 365 397 -998 0 211 486 401 -336 -587 -1021 -1212 -166 -31
4061c1K46p31J8M51Q26o18O16q76m6O80n91PK70n8j199R71r12Q95j6L18n50K56
$$ -31 215 -516 -498 -47 779 161 777 -99 -145 535 -56 -49 221 163 -1036 -65 -977 -82 -98 220 -330 -74
4083g4j10M04n98J83l92J280k50j396J480o95J57mp87J186j43j356L44jJ504m33
$$ -74 -184 220 -378 -195 -587 693 443 -953 527 -168 -11 -15 -802 384 241 -1115 -771 -772 732 299
4103B99q63J220q86K27m1P7R58j69q28q8O45j061M84N87Q7j403P93P87j138K46
$$ 299 -564 656 -230 -3 -44 33 991 822 -6 -94 551 -510 -26 561 648 -755 38 825 -313 -67
4123f7J26o61Q38p47n8l95M14J0J108k03k09q6o30m86J652n48L78M95l52p60k67
$$ -67 59 -602 236 -511 -569 -964 -550 -540 568 365 156 70 -560 -1046 606 58 436 931 579 -181 -448
4144d48J160j90n16q93R52n26J190j076j047J544q7r77P09L05n01R73j305M52
$$ -448 712 522 6 -887 65 -461 729 -347 -1394 150 63 -914 -205 100 -401 572 -733 -281
4162b81M78n67J180r60Q03l21N63r16q33J879j089M55r3k80N53Q4j041o8p03r29
$$ -281 197 -370 810 -150 653 332 895 -21 -854 1025 -64 391 298 18 571 655 -386 -454 -1157 -2086
4182b086K265o68Q36m94K18j012K05J174r19L28R1O49j05o66N46n18J84l34j05
$$ -2086 179 -489 347 -147 71 -941 -736 438 -481 -153 -62 587 482 -184 362 -156 28 -306 -411
4201d11R1J585j079n37O34J80P80p53L6N34o38r09Q04r21J778k417O85j60O39
$$ -411 -320 1265 186 -351 283 463 1243 490 526 1060 422 -487 317 -604 1174 -1243 -558 -718 -79
4220g9K48m57l90k62J12M91P31r92P43j043J109L32n87L28l68J93m66N52j30j51
$$ -79 169 -288 -678 -940 -828 -337 394 -598 145 -898 211 543 -44 284 -84 109 -357 195 65 -86
4240h6O13r17j3J503j412P08r64K77k62N16q93J313n31l49L45P88p11q24N85j
$$ -86 527 -390 -403 1100 -312 396 -568 -291 -553 -37 -930 383 -148 -497 -152 636 -75 -899 -314 -315
4260c15l92P51K11O3o6l14L64k13k92L48K08q3j24l35P23p69j56J461j115o73
$$ -315 -707 44 255 318 252 -62 302 89 -203 145 353 270 146 -189 534 -235 -391 1070 -45 -718
4280g18J24J040r77m85Q33k4M99L30n01p53J292j177P37N09P4j093M79J132j339
$$ -718 -594 446 -531 -1016 -183 -207 292 622 121 -632 660 -517 220 729 803 -290 189 1321 -18
4299a8K80k88L26N07L60j334K39l90J18n30J177k60M30j91m11k7N18q10J21Q5
$$ -18 262 -26 300 807 1167 -167 72 -318 -200 -730 447 187 617 426 15 -12 506 -304 -183 -98
4319i8K5N43p47j52o0P26k95r61J232K39p4J24j333J994j132M3N23m11J03M23
$$ -98 -73 470 -277 -429 -489 237 -58 -1019 213 452 378 502 -831 1163 31 74 597 186 289 712
4339G12o48n4k99K61l64Q44r19K16m20J002o18k88J36J052j127K78j60O4P36j010
$$ 712 64 10 -289 -28 -392 452 -467 -251 -671 331 -287 -575 -439 613 -514 -236 -396 -332 404 -606
4359f06J011o20M9L78k73J036l57O35j672L85j52R72j521J226r89J056j90l95
$$ -606 405 -215 -166 212 -61 975 618 1253 -419 -34 -186 786 -735 491 -498 558 368 -27
4377b7K11J19q56O12j84k41j19l10J035n7n06L45k84R59l99j093N27K10L15j22
$$ -27 184 303 -553 59 -125 -366 -485 -795 240 183 -323 22 -262 697 298 -795 -268 -58 257 135
4397A35K43o32L23n59N82R00j534n9J065k52Q0l01N62j25j326N90J305r79L72
$$ 135 378 -254 69 -490 92 992 -542 -601 464 212 292 -9 553 428 -898 -308 997 18 390
4416C90p15n76N43N70K01j070n01M91M98j017J976j160N38p80Q22l55j91Q68m92
$$ 390 -325 -901 -358 212 413 -657 -1158 -667 -169 -1186 790 -370 168 -612 210 -145 -336 532 40
4435D0J43k07m72P98r9J09M9j46l94k66Q60j701K151p1q18m54p80M82J016q2M15
$$ 40 183 -24 -496 302 203 312 361 215 -179 -445 415 -1286 865 794 -24 -478 -1258 -776 240 158 573
4456E73n85o64J145p81L40R02q18n83Q22j72l05N83j021J422q24R5N47p95l06
$$ 573 -12 -676 469 -312 28 930 112 -471 351 179 -126 457 -564 858 34 129 676 -119 -425
4475d25o20M74L14p50N76N86j275n06J367J032j006J85o03N64J290j096L18l44
$$ -425 -1045 -571 -257 -1007 -431 155 -1120 -1626 -259 773 -233 -48 -651 -87 1203 107 425 81
4493H1r5J009j184P90q72j14O29N73j091N48j000O71K33M32n10J3j067J559O14
$$ 81 -14 995 -189 601 -271 -385 244 817 -274 274 -726 -55 178 610 100 113 -954 605 1219
4512A219j874J276o00Q00j62o34P44o37l60l09n99J33O88J544j893L82k86K92
$$ 1219 -655 621 21 821 659 25 769 132 -228 -537 -1136 -1003 -315 1229 -664 -282 -568 -276
4530b76P9O01o40p8N45p82J304j912P54N16n19N73K76J247k271Rm42J365k07o20
$$ -276 -197 404 -236 -314 231 -551 753 -1159 -405 111 -408 165 441 1688 -583 -574 -1016 349 142 -478
4550d78J58N19Q63o93p37M0N8n9Q72j017K39J067p92q27J078K106k044l55K09
$$ -478 -320 199 1062 369 -368 -328 -270 -329 543 -474 -235 832 40 -787 291 2397 353 -2 207
4569B07j365J855m33l60L50j99m99O65j358K16Q11k79j97N94J34N4j28J59r91
$$ 207 -1158 697 264 -96 254 55 -444 221 -1137 -921 -110 -389 -586 8 142 196 68 227 -764
4588g64O44J45K19J106j231p12K572j194J18n29L63j16m48p3j05N89l76M41j183
$$ -764 -120 25 244 1350 119 -593 1979 785 903 374 737 621 173 100 -5 584 208 649 -534
4607e34P95k63M4o87J320r10J11n38J14N17N00l59J63o25p37J385R58l73K19o50
$$ -534 261 -2 42 -645 675 -235 -124 -662 -548 -31 469 110 273 -352 -1089 296 1254 881 1100 450
4627D50K16j043Q52k48K15q47O30K61r55O39j79q05L96J224k21k21m38OL53m72
$$ 450 666 -377 475 227 442 -405 225 486 -469 170 -9 -814 -418 806 585 364 -74 -68 285 -187
4647a87M27J55%o38l5P94j280J688o82m2L34j099N52l88J087m60p98N45M20p98
$$ -187 240 395 395 -243 -278 516 -764 924 242 200 534 -565 -13 -401 686 226 -572 -27 393 -405
4667d05k34O89O62k41j213O30l51K99J37j186J152j91O2J36j39l16l20L10J341
$$ -405 -639 50 712 471 -742 -112 -463 -164 -27 -1213 -61 -252 -190 -54 -193 -509 -829 -519 822
4686H22l00o60o97J432n24r24J402j124J438j165P26R17j550K59O69o35r62n30
$$ 822 522 -138 -835 597 73 -851 551 -573 865 -300 426 1343 -207 52 721 86 -876 -1406
4704a406J242N78m43k25K82j47K36q86M31P01R32m05K70p23P3p50J10N83r29J565
$$ -1406 -164 414 -29 -254 28 -119 117 -769 -338 363 1295 890 1160 437 510 -240 -130 453 -476 1089
4724A089p78l23L95Q56p59j290J282j105Q99o10J067j274R23l66J55M2L08M32
$$ 1089 311 -12 383 1239 480 -810 472 -633 266 -344 723 -551 372 6 161 203 511 943
4742I43r47K55N32o50n92J72M70K30k78N30q18J0O29p9n10J516j720N22M68o14
$$ 943 -4 251 783 133 -459 -287 183 413 135 665 -153 -143 486 407 -103 1413 -307 215 683 69
4762F9m24K10n26j35O99n88J163k61m90J007n16r59P72K80L3K02j629J807q18
$$ 69 -355 -145 -671 -806 -107 -695 468 207 -283 724 208 -751 21 301 334 536 -1093 714 -104
4781a04J446j458j84M43K27P74j241j49k66O92k08k88P52q10R23n40o3n12R20
$$ -104 1342 -116 -300 143 370 1144 -97 -246 -512 180 -28 -316 436 -374 549 9 -54 -566 354
4800C54q64J381j055n19J063n65j85O22K14k92P10j644Q60K65l1r08K34J394j482
$$ 354 -510 871 -184 -703 360 -205 -390 232 446 154 864 -780 80 345 314 -594 -360 1034 -448
4819d48Q84L97l91l85R1l74N81m17m13J376k63jq46J135j186Q14j078k39J277
$$ -448 436 833 442 57 148 -226 355 -62 -475 901 638 637 -209 926 -260 554 -524 -763 514
4838E14p90J401j115J24m02Q28o15k54R51m6m35J385o55n57R0n9o32j24M49Q40
$$ 514 -276 1125 10 134 -268 560 -55 -309 642 596 161 1546 891 334 424 365 -267 -391 58 898
4858H98o65q77K51J115K00j424R88k02l85k44k48K15j81j62M54o81Q23l78K4O35
$$ 898 233 -644 -393 722 922 -502 486 284 -101 -345 -593 -378 -559 -721 -267 -948 -125 -503 -479 156
4878A56k18K20o02J087n08q99J393j425P30R4L44o98k97J178p62J42P14Mk78n07
$$ 156 -62 158 -444 643 135 -764 629 -796 -66 28 372 -326 -623 555 -207 -65 649 653 375 -132
4898a32k82l53O69q42O96J182k542J873p52J194j305m28M07J234k78m40N22o2
$$ -132 -414 -767 -98 -940 -244 938 -1604 269 -483 711 -594 -1022 -615 619 341 -99 423 361
4916C61o60K08P79j087J368j478J196n76N77o19l78m8K50j232Q01j519J378J315
$$ 361 -299 -91 688 -399 969 -509 687 111 688 69 -309 -357 -107 -1339 -538 -2057 -679 636
4934F36q79J015r87n13r0N68Q33j94J30l20M9J019o01n61J97q56M0O7P52k57R4
$$ 636 -243 772 -215 -728 -818 -250 583 389 519 199 248 1267 666 105 302 -554 -514 -447 305 48 142
4955A42j50Q8L38n32nJ90M42n29Q18r56q00L85P22q85M75N82j477O19nL21O12
$$ 142 -8 80 418 -114 -119 71 513 -16 802 -154 -954 -569 153 -732 -257 325 -1152 -533 -538 -217 395
4976C95o43L18R98r46O39o74M16j118J291j107N77o71Q77m57l2M34M59j356N44
$$ 395 -248 70 1068 122 761 87 503 -615 676 -431 146 -525 352 -105 -137 297 756 -600 -56
$$ [...]
8191c1
##END NTUPLES=NMR FID
##END=
