##TITLE=1H_AT-40+ppz_H_razb
 DMSO-d6, CD3ONa
 108 sc, 
 22.08.2022
##JCAMPDX= 6.0         $$ Bruker NMR JCAMP-DX V2.0
##DATA TYPE= NMR FID
##DATA CLASS= NTUPLES
##ORIGIN= UXNMR, Bruker Analytische Messtechnik GmbH
##OWNER= root
$$ XWIN-NMR		Version 3.5
$$ Mon Aug 22 14:08:33 2022 Russian Standard Time (UT+4h)  she@DPX200
##.OBSERVE FREQUENCY= 200.1313499994
##.OBSERVE NUCLEUS= ^1H
##.DELAY= (6, 6)
##.ACQUISITION MODE= SIMULTANEOUS
##.ACQUISITION SCHEME= undefined
##.AVERAGES= 108
##.DIGITISER RES= 18
##SPECTROMETER/DATA SYSTEM= spect
##.PULSE SEQUENCE= zg30
##.SOLVENT NAME= DMSO
##.SHIFT REFERENCE= (INTERNAL, DMSO, 0, 15.7039)
##AUDIT TRAIL= $$ (NUMBER, WHEN, WHO, WHERE, WHAT)
$$ ##TITLE= Audit trail, XWIN-NMR		Version 3.5
$$ ##JCAMPDX= 5.01
$$ ##ORIGIN= Bruker BioSpin GmbH
$$ ##OWNER= she
$$ F:/spectra/data/she/nmr/H-F/1/audita.txt
$$ ##AUDIT TRAIL=  $$ (NUMBER, WHEN, WHO, WHERE, WHAT)
(   1,<2022-08-22 14:06:04.31 +0400>,<she>,<DPX200>,
      <continue with go, POWCHK disabled, PULCHK disabled
       configuration hash MD5:
       00 E9 B6 7A A2 85 ED C7 34 08 36 98 17 FE 4E 26
       data hash MD5: 16K
       45 2F E1 C6 B5 1B C1 0B 53 18 69 0B E7 6B E9 2C>)
$$ ##END=
$$ 
$$ hash MD5
$$ E6 D8 23 16 94 A5 44 BE 98 C5 30 87 AB AD BF F6
##$RELAX= 
##$RELAX= 
##$RELAX= 
##$RELAX= 
##$RELAX= 
##$RELAX= 
$$ Bruker specific parameters
$$ --------------------------
##$DU= <F:/spectra>
##$EXPNO= 1
##$NAME= <H-F>
##$PROCNO= 1
##$TYPE= <nmr>
##$USER= <she>
##$AMP= (0..31)
100 100 100 100 100 100 100 100 100 100 100 100 100 100 100 100 100 100 
100 100 100 100 100 100 100 100 100 100 100 100 100 100 
##$AQSEQ= 0
##$AQ_mod= 1
##$AUNM= <au_zg>
##$AUTOPOS= <>
##$BF1= 200.13
##$BF2= 200.13
##$BF3= 200.13
##$BF4= 200.13
##$BF5= 200.13
##$BF6= 200.13
##$BF7= 200.13
##$BF8= 200.13
##$BYTORDA= 1
##$CFDGTYP= 0
##$CFRGTYP= 5
##$CHEMSTR= <none>
##$CNST= (0..31)
1 1 145 1 1 1 1 1 1 1 1 1 1 1 1 1 1 1 1 1 1 1 1 1 1 1 1 1 1 1 1 1 
##$CPDPRG= <>
##$CPDPRG1= <>
##$CPDPRG2= <>
##$CPDPRG3= <>
##$CPDPRG4= <mlev>
##$CPDPRG5= <mlev>
##$CPDPRG6= <mlev>
##$CPDPRG7= <mlev>
##$CPDPRG8= <mlev>
##$CPDPRGB= <>
##$CPDPRGT= <>
##$D= (0..31)
0 1.2 0 0 0 0 0 0 0 0.06 0 0.03 0 0 0 0 0.0002 0 0 0 0 0 0 0 0 0 0 0 0 
0 0 0 
##$DATE= 1661162361
##$DBL= (0..7)
120 120 120 120 120 120 120 120 
##$DBP= (0..7)
150 150 150 150 150 150 150 150 
##$DBP07= 0
##$DBPNAM0= <>
##$DBPNAM1= <>
##$DBPNAM2= <>
##$DBPNAM3= <>
##$DBPNAM4= <>
##$DBPNAM5= <>
##$DBPNAM6= <>
##$DBPNAM7= <>
##$DBPOAL= (0..7)
0.5 0.5 0.5 0.5 0.5 0.5 0.5 0.5 
##$DBPOFFS= (0..7)
0 0 0 0 0 0 0 0 
##$DE= 6
##$DECBNUC= <off>
##$DECIM= 32
##$DECNUC= <off>
##$DECSTAT= 4
##$DIGMOD= 1
##$DIGTYP= 9
##$DL= (0..7)
0 120 120 120 120 120 120 120 
##$DP= (0..7)
150 150 150 150 150 150 150 150 
##$DP07= 0
##$DPNAME0= <>
##$DPNAME1= <>
##$DPNAME2= <>
##$DPNAME3= <>
##$DPNAME4= <>
##$DPNAME5= <>
##$DPNAME6= <>
##$DPNAME7= <>
##$DPOAL= (0..7)
0.5 0.5 0.5 0.5 0.5 0.5 0.5 0.5 
##$DPOFFS= (0..7)
0 0 0 0 0 0 0 0 
##$DQDMODE= 0
##$DR= 18
##$DS= 0
$$ [...]
##$SUBNAM2= <"">
##$SUBNAM3= <"">
##$SUBNAM4= <"">
##$SUBNAM5= <"">
##$SUBNAM6= <"">
##$SUBNAM7= <"">
##$SUBNAM8= <"">
##$SUBNAM9= <"">
##$SW= 18.0517283424941
##$SWIBOX= (0..15)
0 0 2 0 0 0 0 0 0 0 0 0 0 0 0 0 
##$SW_h= 3612.71676300578
##$TD= 16384
##$TD0= 1
##$TE= 0
##$TE2= 300
##$TE3= 300
##$TEG= 300
##$TL= (0..7)
0 120 120 120 120 120 120 120 
##$TP= (0..7)
150 150 150 150 150 150 150 150 
##$TP07= 0
##$TPNAME0= <>
##$TPNAME1= <>
##$TPNAME2= <>
##$TPNAME3= <>
##$TPNAME4= <>
##$TPNAME5= <>
##$TPNAME6= <>
##$TPNAME7= <>
##$TPOAL= (0..7)
0.5 0.5 0.5 0.5 0.5 0.5 0.5 0.5 
##$TPOFFS= (0..7)
0 0 0 0 0 0 0 0 
##$TUNHIN= 0
##$TUNHOUT= 0
##$TUNXOUT= 0
##$USERA1= <user>
##$USERA2= <user>
##$USERA3= <user>
##$USERA4= <user>
##$USERA5= <user>
##$V9= 5
##$VALIST= <valist>
##$VCLIST= <CCCCCCCCCCCCCCC>
##$VD= 0
##$VDLIST= <DDDDDDDDDDDDDDD>
##$VPLIST= <PPPPPPPPPPPPPPP>
##$VTLIST= <TTTTTTTTTTTTTTT>
##$WBST= 1024
##$WBSW= 4
##$XGAIN= (0..3)
0 0 0 0 
##$XL= 0
##$YL= 0
##$YMAX_a= 1009444
##$YMIN_a= -1546249
##$ZGOPTNS= <>
##$ZL1= 120
##$ZL2= 120
##$ZL3= 120
##$ZL4= 120
##$ABSF1= 10
##$ABSF2= 0
##$ABSG= 5
##$ABSL= 3
##$ALPHA= 0
##$AQORDER= 0
##$ASSFAC= 0
##$ASSFACI= 0
##$ASSFACX= 0
##$ASSWID= 0
##$AUNMP= <proc_1d>
##$AZFE= 0.1
##$AZFW= 0.1
##$BCFW= 1
##$BC_mod= 2
##$BYTORDP= 1
##$COROFFS= 0
##$CY= 11.3945322036743
##$DATMOD= 1
##$DC= 2
##$DFILT= <>
##$DTYPP= 0
##$F1P= 2.36226072786647
##$F2P= -0.459571619588291
##$FCOR= 0.5
##$FTSIZE= 0
##$FT_mod= 4
##$GAMMA= 1
##$GB= 0.15
##$INTBC= 1
##$INTSCL= 1
##$ISEN= 128
##$LB= 0.24
##$LEV0= 0
##$LPBIN= 0
##$MAXI= 10000
##$MC2= 0
##$MEAN= 0
##$ME_mod= 0
##$MI= 1.114404
##$NCOEF= 0
##$NC_proc= 0
##$NLEV= 6
##$NOISF1= 3.799351
##$NOISF2= 2.8
##$NSP= 1
##$NTH_PI= 0
##$NZP= 0
##$OFFSET= 15.70392
##$PC= 1
##$PHC0= -18050.36
##$PHC1= 23.60069
##$PH_mod= 1
##$PKNL= yes
##$PPARMOD= 0
##$PSCAL= 0
##$PSIGN= 0
##$REVERSE= no
##$SF= 200.130013532006
##$SI= 16384
##$SIGF1= 3
##$SIGF2= 2
##$SINO= 400
##$SIOLD= 16384
##$SREGLST= <1H.CDCl3>
##$SSB= 0
##$STSI= 0
##$STSR= 0
##$SW_p= 3612.71676300578
##$SYMM= 0
##$S_DEV= 0
##$TDeff= 0
##$TDoff= 0
##$TI= <>
##$TILT= no
##$TM1= 0
##$TM2= 0
##$TOPLEV= 0
##$USERP1= <user>
##$USERP2= <user>
##$USERP3= <user>
##$USERP4= <user>
##$USERP5= <user>
##$WDW= 1
##$XDIM= 8192
##$YMAX_p= 0
##$YMIN_p= 0
$$ End of Bruker specific parameters
$$ ---------------------------------
##NTUPLES= NMR FID
##VAR_NAME=  TIME,          FID/REAL,        FID/IMAG
##SYMBOL=    X,             R,               I
##VAR_TYPE=  INDEPENDENT,   DEPENDENT,       DEPENDENT
##VAR_FORM=  AFFN,          ASDF,            ASDF
##VAR_DIM=   8192,          8192,            8192
##UNITS=     SECONDS,       ARBITRARY UNITS, ARBITRARY UNITS
##FACTOR=    0.0002768,     1,               1
##FIRST=     0,             0,               0
##LAST=      2.2672688,     0,               0
##MIN=       0,             -1546249,        0
##MAX=       2.2672688,     1009444,         0
$$ Real data points
##PAGE= N=1
##DATA TABLE= (X++(R..R)), XYDATA
0 0 0 0 0 0 0 0 0 0 0 0 0 0 0 0 -108 108 -108 108 -108 216 -216 218 -324 326 -432 535 -545 650 -758 866
30 866 -1009 1178 -1301 1507 -1696 1906 -2143 2394 -2680 2990 -3323 3704 -4111 4557 -5031 5562
46 5562 -6139 6773 -7463 8218 -9060 9971 -11003 12130 -13396 14834 -16451 18306
58 18306 -20463 22994 -26029 29726 -34354 40353 -48452 60075 -78247 110826 -187700
69 -187700 812283 -180555 -1056245 920881 448386 -826414 -388595 600720 226671 -31541
79 -31541 -4035 -73556 -97638 250582 137033 -267620 -141547 470563 199219 -575737 -283671
90 -283671 711880 385399 -686906 -467987 579667 359066 -562914 -260449 656124 264802
100 264802 -626197 -344364 323332 174861 -47036 35303 -81910 -40181 294800 -15258
110 -15258 -506189 36689 571220 -168168 -671761 200820 705738 -133704 -564496 184780
120 184780 495181 -206468 -488205 73060 348427 27762 -158761 -41864 80448 135255
130 135255 23235 -225961 -134922 269842 188811 -344849 -271681 396325 379045 -350740 -377629
141 -377629 347072 342654 -372699 -326563 335004 245395 -313497 -190793 235326 149691 -75233
152 -75233 -60152 -65759 -1565 195970 13920 -338179 -40423 410024 19704 -454256 14400
163 14400 487881 -5316 -454509 -5434 379380 -11655 -330945 -21025 254790 64455
173 64455 -146552 -69601 76264 102516 8438 -124076 -98749 119621 151446 -144228 -207872
184 -207872 197698 308765 -195433 -351576 194615 346538 -204571 -321071 183977 243650
194 243650 -165153 -168141 126826 115146 -39757 -53894 -58866 -16567 124069 42569 -195252
205 -195252 -61644 250716 71132 -280629 -67058 302231 72231 -301704 -84341 265975
215 265975 74956 -235252 -71445 203425 87003 -139263 -88919 62319 73582 10360
225 10360 -58910 -83432 39205 136827 -38231 -176236 68263 232022 -80406 -263940 84222
236 84222 263447 -91044 -239996 92353 203906 -79045 -155264 57914 110167 -15364
246 -15364 -61216 -37479 2214 74838 34296 -112749 -61058 146634 83721 -170179 -104934
257 -104934 174334 113251 -170391 -116190 155026 105129 -141360 -91409 126477 82557 -98463
268 -98463 -73104 55364 55455 -6449 -36165 -43871 18520 90942 -7605 -132720 10069 171068
280 171068 -12183 -194492 15835 199613 -19122 -182747 22839 154961 -20869 -119585
290 -119585 14463 80679 1801 -39832 -19642 2848 39415 28542 -55797 -53743 73645 72957
302 72957 -91578 -91973 100169 107818 -101268 -114326 95150 109470 -89225 -98829 76530 80539
314 80539 -60486 -61859 34009 39134 -3306 -15506 -28520 -6520 54702 15787 -83831 -19289
326 -19289 109398 22311 -122092 -18719 130314 14365 -125018 -11085 111428 10555
336 10555 -90486 -10490 68925 19519 -34869 -20475 3861 23608 19544 -27987 -43424 31189
348 31189 61070 -36172 -77109 41535 87029 -44488 -93008 42720 85659 -46826 -79254
359 -79254 44295 68603 -36729 -48940 23971 30834 -7517 -11809 -13668 -8758 32294 21616
371 21616 -50798 -30381 67869 39191 -75981 -37800 77841 32914 -78577 -29335 70018
382 70018 22915 -58352 -16822 47481 16178 -28656 -14402 10109 10477 7542 -9961 -23860 12181
395 12181 43232 -8801 -52281 9863 63353 -11258 -71459 11612 69577 -14773 -63722 16217
407 16217 53841 -14042 -38484 12055 20315 -11275 -8335 -825 -8804 9610 20122 -20585 -27347
420 -27347 34205 33907 -41939 -36183 46044 33802 -49199 -30481 45311 29005 -35217 -19979 28608
433 28608 17054 -18617 -12579 7443 5438 3725 1003 -13323 -4379 25453 9787 -34076 -8082
446 -8082 41086 3209 -48419 -1698 49143 341 -45008 5727 40275 -6567 -31733 5772
458 5772 17168 -6760 -7400 2151 -7567 1836 20019 -4405 -24888 12795 27123 -20442 -31633
471 -31633 21323 28860 -22243 -26329 22162 23412 -19953 -17677 17812 13963 -16516 -11202 9261
484 9261 4319 -2084 4968 -2777 -9628 11877 10201 -20025 -13094 25577 13024 -28875 -11550 30598
498 30598 9456 -26980 -1007 26933 -2850 -23719 3828 15049 -5760 -5288 6816 -3232
510 -3232 -4778 10442 3057 -14760 1677 16746 -7174 -22617 7194 23194 -6832 -22270 8336
523 8336 21310 -11526 -17806 10495 13211 -11033 -6804 10305 2075 -5570 5794 4097 -7162
536 -7162 1755 9774 -7973 -13550 12833 14922 -15725 -12958 19012 10944 -18856 -5906 19116
549 19116 1003 -17012 1383 10314 -2844 -3979 3815 -1120 -4573 3895 4360 -7856 -3638 9869
563 9869 4166 -12131 -1865 15279 628 -15414 2670 15614 -4531 -15042 5709 10870 -6540
576 -6540 -6260 7442 1979 -6636 3764 4952 -5439 -3281 7560 -343 -11613 4045 13587 -7299
590 -7299 -11961 10061 10273 -11115 -5721 11029 1798 -9907 1651 8071 -1270 -4246 3122 3683
604 3683 -3766 -1561 4325 -2444 -7393 4328 6800 -7288 -6610 8938 3864 -9332 -921 9616
618 9616 -1382 -9580 1664 7446 -3733 -6245 5556 3635 -6005 117 6089 -2881 -6086 5585
632 5585 3229 -8022 -478 8203 -3452 -7638 5105 7718 -5288 -5540 5550 3564 -3971 -1195
646 -1195 5382 146 -5821 880 5761 -2707 -2703 4210 -226 -5912 738 6074 -3403 -5001 4604 4877
662 4877 -5703 -3280 5728 446 -6448 625 7530 -2558 -6367 4412 3558 -5064 -437 5615 -1983
677 -1983 -5768 3680 3924 -4423 -2511 4879 503 -4946 901 4975 -1839 -4392 2465 4224 -3478
692 -3478 -2743 3786 2208 -3707 287 4504 -1683 -4084 3328 2745 -3074 -1032 3781 -223 -4752 1041
708 1041 4031 -3748 -4284 4021 2001 -4808 20 4780 -1355 -5287 3224 3326 -4129 -2555 3362 128
724 128 -3296 1117 2815 -1286 -2196 3054 3054 -3608 -596 2425 24 -3586 454 3596 -770 -3234
740 -3234 1723 2416 -2255 -1072 3544 211 -3797 564 2873 -1613 -2155 2745 1103 -3018 794 3442
756 3442 -1674 -3360 1940 2573 -3782 -681 3003 -321 -4082 1377 2235 -1752 -2022 2031 1244 -2586
772 -2586 -812 2480 -933 -2897 1154 1814 -1251 -2389 1314 1605 -1928 -1261 2680 -201 -2816 2261
788 2261 2048 -2149 -2194 2298 1426 -2041 83 2272 -1096 -2866 2341 2289 -1965 -344 3930 153 -2939
805 -2939 1403 2439 -1880 -991 1720 861 -1325 -314 2597 200 -855 2326 1241 -971 -964 1108
821 1108 -362 -1989 -634 1635 -811 -1198 846 1495 -1749 -1652 1587 66 -2452 44 2714 -735
837 -735 -1914 841 1334 -2888 -1195 1957 -283 -1565 1277 1506 -1656 -1088 1455 607 -1725 160
853 160 861 -292 -942 462 1105 -477 -385 504 641 -1266 -300 607 -251 -1193 190 1084 -1860 -467
871 -467 1681 -193 -810 787 1532 -1585 -2210 1595 1230 -1592 -978 1702 -957 -1362 -555 414 -588
888 -588 -698 1367 251 -799 836 1013 -418 -1860 1031 84 -1289 -689 1144 1066 -2068 142 1494
905 1494 -1769 -1038 887 1268 -1098 -632 1167 -961 -1150 1405 -33 -112 -519 813 218 -922 -82
922 -82 1775 -158 -1354 255 329 -885 -1314 909 -321 -281 135 7 -234 -659 -67 60 -153 -397 25
941 25 -1221 -283 956 558 -1510 -1001 1291 716 -1085 -198 949 -696 -1070 -764 558 -1040 -179 464
959 464 543 112 -270 1239 -139 -149 1370 1247 -460 -173 1258 408 -448 100 850 -233 -408 413 552
978 552 -87 -693 964 -21 -218 297 78 -1222 560 423 149 328 1206 914 -751 -920 92 290 -14
997 -14 53 594 697 -1126 -132 700 -120 -412 1092 700 -565 638 560 537 -130 813 847 95 553 536 807
1018 807 -548 -306 238 -353 -229 637 441 -752 -610 334 441 -183 -358 794 758 -57 613 121 -714
1037 -714 890 655 -374 -680 452 1230 -526 -181 936 -113 -354 113 271 -747 -1053 -196 22 29
1055 29 746 502 15 -160 978 -1152 -1299 512 279 -84 -23 -137 738 -323 -307 177 301 -382 -139 -536
1075 -536 -422 -642 602 -57 -550 993 -78 624 -988 -204 173 -1288 -222 -108 1025 -798 -697
1092 -697 789 764 -89 -753 288 134 -50 1248 197 -144 -797 -869 -618 256 601 -654 -119 -833 -307
1111 -307 -454 -41 -304 -285 1199 -761 -163 56 -494 -27 -103 375 -248 -330 551 535 148 172 -477 -379 -218
1132 -218 -494 958 -148 170 82 -596 -1418 1049 99 20 831 1160 1059 -606 799 71 913 -510 52
1151 52 418 -91 156 393 439 -154 650 -683 -789 108 -429 -629 -659 -814 410 94 1401 255 -268 601
1171 601 -173 -275 -106 373 261 -1010 -312 -452 -416 -355 -33 -75 250 506 -836 813 -99 144 -165 182
1191 182 822 -135 -662 106 -559 -257 -151 672 -348 641 31 453 -63 21 -272 259 564 -643 67 -691
1211 -691 -516 879 -247 155 -90 308 118 137 -910 175 -1095 -595 611 994 271 874 -280 154
1229 154 -16 -484 329 -71 -357 1147 -418 -30 698 -437 -131 -664 -75 -302 213 52 1 194 -563
1248 -563 149 -296 -579 780 -447 -516 -54 52 200 262 -53 87 238 -106 -391 -423 -106 188 595 -146
1268 -146 100 -371 -2 315 465 214 -472 478 557 456 -133 -170 57 -294 -330 251 231 253 352 74 130 256
1290 256 104 123 -274 580 648 158 812 -425 532 -867 -443 118 -501 187 -1302 508 -73 793 -545
1309 -545 -437 -525 345 300 772 672 588 137 551 -229 -117 -52 221 252 -233 1033 -286 -137 -58 1186 -210
1330 -210 432 109 41 342 -874 831 -257 -1083 -854 -482 18 -596 -434 -130 49 -679 332 -321 328
1349 328 725 81 156 65 285 -656 597 -68 1042 587 -445 -457 -942 -453 223 545 860 -206 -600 -16
1369 -16 78 467 -620 -187 -488 608 -64 567 372 479 -277 102 713 -733 -59 285 233 -594 -460 421
1389 421 610 892 337 598 452 312 79 158 -1589 289 108 173 159 839 -696 309 -563 -860 -471 -49
1409 -49 -74 106 464 -204 -13 -317 -599 -616 535 -254 -242 -256 -343 1143 462 537 -700 677 1199 -636 103
1430 103 210 720 323 -355 77 443 525 72 486 -418 832 365 -53 -687 192 608 647 41 855 -445
1450 -445 -429 -239 -717 288 292 -166 -528 212 -547 -23 -1074 -1030 -512 -495 -642 -19 56 -860 -858 -89 10 -266
1472 -266 -469 -2 -21 -582 -698 -1027 146 -98 -176 629 354 -314 -672 68 210 -110 142 84 -379 78 307
1493 307 51 118 -66 -12 -108 241 406 733 -168 -221 -47 669 146 74 -738 378 239 730 -122 -457 -399 324
1515 324 -251 -641 693 -175 -140 639 -434 -496 429 871 463 -250 -188 32 -648 -124 -332 -302 -273 744 373
1536 373 -105 -920 -176 493 -428 -134 -325 -63 683 -1 6 463 -419 936 -20 642 -132 407 214 185 520
1557 520 -49 472 -324 -147 -105 75 110 -361 446 -70 -674 579 204 420 194 411 80 89 -765 722 266
1578 266 -307 46 59 -944 631 -107 42 -23 -604 547 -360 450 -482 -348 -702 -386 -200 207 -333 -165
1598 -165 335 -93 19 -635 -570 193 -1174 -268 -496 -330 4 363 154 -243 778 -45 -692 175 240 -527
1618 -527 -7 -820 545 -27 -792 619 26 -377 -645 -677 -421 -322 -245 351 256 134 27 428 -299 544 461
1639 461 137 -466 664 118 173 160 581 -634 -450 6 59 -451 -10 -42 -290 -1 61 822 -534 1093
1659 1093 340 378 -413 262 513 -473 322 -830 511 292 -322 235 22 446 -465 -407 -107 48 652 284
1679 284 -110 599 112 -750 406 1002 -371 4 -196 196 -266 1129 -31 -480 1066 -377 -348 -220
1697 -220 -725 -464 -397 -470 172 376 1249 138 -521 -425 -452 -84 332 817 267 -313 464 -89 334 84 73
1718 73 -16 538 -807 -851 70 -465 7 -811 -439 -451 -293 -961 261 -461 -302 -266 35 162 354 -143 -188
1739 -188 48 691 561 -591 865 -519 310 -1086 -200 232 -532 -684 -103 -99 260 270 -1203 56 45
1758 45 220 -528 -30 -67 468 -783 -376 -542 902 1272 -219 -336 -611 562 250 43 220 156 348 90
1778 90 -290 -311 -107 -557 286 744 623 222 101 -205 11 201 172 -430 154 353 690 47 -126 1064 -339
1799 -339 324 -284 195 -182 362 69 994 -42 934 239 -324 583 522 -148 -46 -73 -257 984 -274 518
1819 518 -599 748 -538 587 119 -75 633 202 -508 172 -4 424 -302 1390 -280 -80 686 267
1837 267 -830 -750 70 292 -576 -503 214 985 543 505 -630 -847 315 -936 -713 757 -97 453 1144
1856 1144 1278 -2 -1055 543 50 -1191 335 63 416 374 45 -685 -387 158 -240 889 -286 240
1874 240 -569 60 -265 130 542 44 497 -187 -358 158 -1081 -1103 168 -86 -480 -213 472 557 -120 7
1894 7 11 -20 396 303 779 -94 -917 -1050 -451 60 293 492 -467 -183 113 -430 -287 -659 11 652 -140 -160
1916 -160 -89 -74 307 115 -765 960 118 246 496 308 -750 -14 104 -530 141 -453 -378 -227 427 119
1936 119 -458 673 188 -152 340 484 309 -216 -281 -309 652 -1257 472 933 1080 -59 770 956 -792
1955 -792 -76 -336 -208 -166 633 -355 -478 135 -464 -314 -52 -630 -218 169 -680 -319 -51 324 14 -123
1975 -123 -390 1011 -67 -377 842 -430 174 -205 526 916 372 -837 -128 476 907 -791 -383 -367
1993 -367 -107 619 -652 141 -157 -25 319 589 -433 551 535 -108 -136 1052 -448 104 1021 -35 -136
2012 -136 173 -43 -420 229 -395 222 -387 -68 -444 321 158 120 -476 81 -255 416 722 -1498 168 -325
2032 -325 -27 374 -199 -326 752 466 246 448 933 373 317 146 -294 -283 -239 -370 109 1052 -145 414
2052 414 -911 618 343 -194 813 -79 -646 -50 57 415 498 241 194 -446 525 -168 -312 178 121 -300
2072 -300 79 25 232 -437 -57 -495 606 90 -488 -39 387 -529 153 -174 -486 -402 -518 233 -70 -490
2092 -490 253 482 -790 246 337 -117 -365 122 -226 726 -955 458 -82 342 -195 356 353 31 679 -292
2112 -292 723 10 64 1109 51 -781 203 22 1204 367 577 224 -112 618 -682 -490 249 762 398
2131 398 269 -94 -400 -507 581 540 195 316 42 507 -28 -208 -629 857 -590 198 -438 -35 446
2150 446 58 -1033 -174 382 -534 -45 -483 383 -531 -370 706 105 -615 214 929 -125 -206 434 -225
2169 -225 -121 596 689 227 780 138 -589 -17 -256 432 496 420 -602 861 246 240 257 165 -97 399 -488 480
2191 480 273 -22 -144 -416 42 -36 0 -12 -1073 521 -767 -352 -164 -711 521 -385 390 329 931 577
2211 577 203 626 -216 -673 635 -156 199 594 -1003 25 -29 396 237 530 389 115 423 -141 542
2230 542 -70 252 79 282 -228 -16 -337 411 286 211 -431 -328 241 -23 515 295 241 -373 450 -378 248
2251 248 513 -483 -648 -164 -419 -71 -833 10 -107 292 218 1 -50 -775 141 -675 120 -47 -61 713 -267
2272 -267 -623 525 777 -61 770 427 90 -269 379 -146 204 126 266 284 209 -443 -109 70 -423 -239 -977
2293 -977 213 365 -464 -385 -216 385 928 181 -366 346 395 -285 1140 381 12 -586 668 -897 -565
2312 -565 688 -301 -188 14 117 328 330 -36 48 221 458 -388 -155 -594 903 631 1360 -470 -433 -90
2332 -90 1070 -594 -18 -568 -98 -431 -361 379 -945 -295 276 26 -166 849 112 406 -211 170 -204
2351 -204 384 -161 830 -380 7 328 -676 40 -429 111 -374 139 -1085 -107 -280 -282 273 -262 -606 -202
2371 -202 -19 -629 486 -362 617 130 -657 241 -394 666 717 428 135 -556 20 968 -129 -828 587
2390 587 84 306 502 454 -909 51 -137 -522 99 -260 -129 912 285 -50 88 393 524 -1292 259
2409 259 -523 -388 -148 -50 -410 -121 321 -34 -127 -205 -292 -611 -240 -60 -165 475 -908 150 496 685 -8
2430 -8 -752 201 -373 1208 -646 -280 -118 -1132 -431 298 -864 453 825 -149 -11 -759 -53 79 610
2449 610 -767 109 -515 427 500 -795 450 1114 453 -105 286 -507 199 339 -815 -327 498 -52 -180
2468 -180 -135 264 -641 695 -16 -1235 208 702 46 313 -929 317 74 -344 188 -558 -360 793
2486 793 -118 -402 -23 -277 859 23 49 246 317 -25 -102 -119 236 -99 -830 145 -127 -270 -138 -472 176
2507 176 720 -382 137 -364 -197 -152 684 -533 -331 653 295 -72 -251 -1444 -149 833 -467 -99 15
2526 15 156 128 -493 3 205 310 -118 172 -550 387 -263 -87 -32 -1363 721 61 24 -36 469 -83 770
2547 770 37 553 163 -387 -173 -90 294 647 -617 -210 -384 589 420 -404 -91 -516 -1251 -695 144 -39
2567 -39 -226 350 118 358 -266 -608 -623 -606 54 151 -899 370 -343 209 -167 93 641 127 943 -275
2587 -275 120 157 1235 -395 282 188 175 70 751 -134 -558 -17 -166 -303 599 391 -459 -66 -20 -240 1189
2608 1189 219 -587 -172 -117 256 986 -504 -65 -599 343 693 -514 697 -394 1098 -887 132 320
2626 320 -230 274 78 -623 -971 -95 635 93 726 -393 185 -407 -351 -279 -48 -477 136 334 129 -109
2646 -109 316 397 81 240 140 -1088 359 -531 -442 281 391 461 -80 -386 -101 197 -323 -296 473 -25 -310
2667 -310 60 303 -268 -123 163 -15 -376 177 256 -11 -74 130 57 392 -328 188 684 164 268 -30 -704
2688 -704 -62 598 343 -624 316 518 -109 618 1325 255 318 1037 700 -1023 -220 380 111 83 488 68
2708 68 -228 646 -305 -177 -272 359 424 -373 -243 -589 -187 -107 90 55 345 253 -239 114 548 -260 -1014 -398
2730 -398 1084 204 331 91 129 -189 404 -67 -499 -1173 -68 184 -182 -621 79 446 -87 -221 -382 -129
2750 -129 -1027 -1088 -1154 66 -805 -477 411 688 -678 621 307 -376 295 -107 459 -202 -310 68 -493 -348
2770 -348 947 94 296 -307 -29 -597 -25 694 78 387 6 -548 -206 -295 856 270 949 173 -282 583
2790 583 58 -899 -328 -154 -450 -149 149 380 -120 452 -40 -90 139 -487 285 50 -144 847 -256 -636
2810 -636 912 -390 -162 57 423 525 -231 -94 -461 415 -397 -562 -92 427 22 -194 -58 658 -36
2829 -36 -304 435 521 -91 -343 -683 -227 69 -496 -821 773 506 -67 -712 -278 -427 212 -26 -407 690
2849 690 -178 -426 339 -662 415 -202 -299 -274 -77 604 -261 107 302 892 -10 -300 -491 -1148 -361 40
2869 40 -978 -11 483 -678 201 -803 -269 1365 -69 -359 450 933 286 -762 562 384 -85 463
2887 463 572 136 275 0 847 276 477 -455 55 -25 -172 -834 -299 -323 -73 -7 561 -100 203 758 -626
2908 -626 400 556 -651 818 361 416 276 741 133 14 -331 -51 -354 -509 786 -53 446 -1126 -311
2927 -311 -102 -73 -1004 -52 45 -35 297 -426 -490 321 -824 709 -1584 -753 -1156 107 -888 -323 187 183 -411
2948 -411 327 -165 123 695 62 -789 135 592 -281 859 82 -98 -179 50 -631 270 -130 -117 76 -514
2968 -514 73 141 722 712 -573 499 -97 876 246 380 10 636 -880 -206 -495 -538 100 -258 925 -303
2988 -303 -223 -410 -242 152 -190 -58 -255 -124 -295 74 -153 316 913 436 976 -275 -108 -89 142 469
3008 469 338 -309 16 511 523 -135 -89 -105 -117 129 -261 410 2 -14 689 285 -696 220 10 -656 -293 455
3030 455 -854 -606 77 696 787 27 -741 194 -436 597 -360 -37 -313 267 -458 -138 -23 -26 -422 260
3050 260 397 1077 105 391 77 1213 624 -375 152 -668 725 -388 -458 -478 -116 -430 -89 -8 -145 230
3070 230 575 -329 978 585 -612 -3 -491 528 292 1 -216 -7 -1020 245 -1241 53 -504 -131
3088 -131 553 11 -339 677 739 106 800 301 367 73 -354 442 -678 -711 -675 -638 -14 -267 175 958 -263
3109 -263 -125 -557 124 97 -126 -749 -155 -745 504 164 -413 -546 312 627 -266 -162 336 -340 311 385
3129 385 -600 1209 -389 625 292 -600 506 775 -53 226 365 -85 -531 507 433 251 -135 -349 620
3148 620 279 -329 -429 -424 -86 -373 -245 86 590 -271 -188 959 -871 543 441 -519 156 104 -759 370
3168 370 -6 168 100 649 161 -483 1361 1144 -825 198 -11 343 -754 235 -525 166 -1024 -334 501
3187 501 177 391 156 1145 116 132 -519 -768 -398 806 29 155 -180 -711 21 -16 -40 -558 740 -152
3207 -152 -243 -339 -108 368 -251 3 481 530 -244 258 397 -369 239 409 -896 266 -108 420 -482 454
3227 454 -376 -179 228 115 270 -386 -662 440 834 321 321 48 -57 100 221 -747 1318 -273 537 -623
3247 -623 -756 15 -110 -182 -207 359 465 862 60 180 35 1070 -139 -64 -39 319 442 -118 -652 163 -626
3268 -626 -841 -472 -427 286 -159 -157 445 -158 -735 -287 -140 526 935 -268 582 838 -279 -558 -74 380
3288 380 426 475 -328 -360 -146 -717 902 -114 68 147 683 -912 -388 1024 -825 24 -616 705 -115
3307 -115 944 -291 -247 422 -456 -30 38 -171 -254 -144 -93 -330 277 -533 476 572 171 634 596 -634 -267
3328 -267 -132 -203 586 -362 -61 -724 417 -555 -379 -78 294 63 -864 289 65 -568 -1103 310 -136
3347 -136 -551 -27 31 226 -928 680 445 738 701 563 455 -38 86 142 570 308 400 313 -35 -1 -254
3368 -254 -17 49 228 277 -607 201 -48 408 177 42 693 53 278 534 483 375 228 165 -731 39 656
3389 656 282 -398 -303 -104 156 752 747 -412 93 -65 106 328 498 454 62 -225 -733 119 1156 353 1176
3410 1176 640 106 -533 -800 522 -73 21 -416 0 -498 151 403 -54 372 219 -413 858 616 126
3429 126 -412 -277 -610 291 150 -63 -141 187 -83 208 37 -81 -552 561 76 -314 -72 -98 517 215
3449 215 -342 200 -6 558 525 294 -161 454 167 42 -118 -472 -18 1230 457 211 -80 -256 586 291
3469 291 -644 267 625 -450 365 497 -104 -538 -361 663 334 -815 -353 -799 267 20 -242 -468 544
3488 544 560 -226 -85 303 -687 268 -650 -664 -414 648 -159 -35 325 -95 -129 -514 -295 595 93 512 -238
3509 -238 494 1706 -470 63 495 892 -305 8 529 555 -1304 76 124 -366 -796 197 -95 -396 508
3528 508 -175 -314 563 -116 -490 557 -574 -457 -278 -508 -279 -159 -656 -9 -495 -958 -274 561 -625
3547 -625 882 139 39 -298 132 -48 7 275 166 907 -26 -536 -345 -188 -71 -98 -330 -550 -322 291
3567 291 48 -345 -303 352 680 -904 401 -976 -27 435 35 48 618 -1021 -161 1166 52 -732 31
3586 31 167 429 685 299 371 75 -275 609 -328 -285 -295 -556 -152 -31 152 -496 -594 -256 206 -408 -618 228
3608 228 -500 720 -189 -268 662 135 135 -486 268 38 -552 -86 85 -528 -353 19 -729 -530 1010 -115
3628 -115 -264 3 -551 -298 -552 80 220 -76 -52 619 -209 -418 12 -174 -343 -427 326 -93 -129 480 803
3649 803 18 666 0 -273 373 314 782 309 -219 -634 -938 248 -453 769 207 195 27 214 -667 -308
3669 -308 -705 474 185 -307 -190 137 181 -249 -591 560 -975 121 1110 -82 -513 0 -1271 -345
3687 -345 -30 439 -397 799 522 -925 223 193 206 -238 95 257 175 -495 -174 467 -891 426 -46
3706 -46 -409 47 -278 -379 685 1161 -921 15 -80 -147 -518 133 -659 -473 299 248 213 339 530 212 885
3727 885 525 593 544 36 -56 293 190 1 -222 489 471 209 166 -394 506 11 742 520 385 -120 116 415
3749 415 -602 72 79 633 -433 -285 -443 -448 278 3 234 -305 418 24 443 634 417 -318 149 -724 -1076
3770 -1076 82 -81 269 -588 954 -162 56 365 -87 197 -136 -77 -276 332 -1138 787 1020 -760
3788 -760 131 -42 106 -69 641 -663 833 -379 16 -687 -169 -340 627 109 -66 -667 410 360 418
3807 418 -351 -518 770 -93 1003 -238 302 240 491 -322 -585 272 392 196 -627 -908 320 464 -533
3826 -533 39 -486 -102 762 -431 189 -51 852 -30 535 -369 -42 -625 314 1 -296 -1041 106 -168
3845 -168 254 68 131 126 -195 -635 -298 -678 -938 -416 562 158 422 159 -133 -87 -783 -810 495 531 95 -202
3867 -202 -29 50 318 802 -505 448 -827 -119 -727 -104 -209 -594 -639 -1787 197 385 87 -180 -395
3886 -395 -378 911 248 -4 159 -148 -593 -520 838 44 -263 204 368 -673 -1159 532 -573 -91 567
3905 567 -522 351 -351 -1013 11 385 -426 206 -664 -1180 877 470 -62 -252 224 425 -382 -4 78
3924 78 115 373 429 -229 -293 -55 -815 641 -6 -287 -102 -1551 -440 -203 397 -56 684 -469 794 47
3944 47 434 79 -581 -218 -402 44 878 -311 -1103 478 604 193 -574 988 -211 -315 91 781 12
3963 12 -505 -257 -642 1077 -153 -61 101 36 185 302 971 -47 189 -90 564 81 135 571 -424 126
3983 126 -173 153 -1868 510 779 634 147 -802 -10 -37 -449 -445 -214 565 -186 443 -625 35 8 -97
4003 -97 362 -463 -141 754 133 639 215 -38 -81 794 585 -565 -172 -230 89 -163 519 -1513 709 1041
4023 1041 540 292 -58 -476 -355 -635 68 -537 181 -379 156 854 -554 -636 100 354 641 -849 -44
4042 -44 394 890 -323 -343 -123 -249 59 -582 -678 50 103 -37 -372 -276 579 -4 521 -368 -97 -284 48
4063 48 -125 -151 516 -73 -108 401 -464 -431 468 -644 -74 313 787 -213 835 -123 -440 -263 -495 -457 -70
4084 -70 -71 280 185 -804 259 42 216 -340 394 54 335 -278 92 -58 -118 216 -930 -413 126 -73 90
4105 90 -112 -647 307 -465 282 260 961 536 -60 412 384 686 -271 -374 -228 363 -208 -440 -704 -190 -539
4126 -539 459 636 112 -825 -370 185 528 596 933 -116 -107 675 376 -853 203 -416 -234 375 188 110
4146 110 -96 -686 147 -82 -1109 189 364 -631 704 -473 113 -172 -132 -18 -229 511 394 560 -7
4165 -7 371 96 497 -42 -159 1355 -107 338 56 -454 -366 363 177 628 -22 -41 86 -188 269 650 -907
4186 -907 484 607 162 372 -52 171 -44 86 227 -124 483 -380 15 124 555 64 -339 7 73 581
4206 581 747 -806 -235 -562 -609 -835 -471 238 194 609 626 -381 133 -368 -922 195 -691 1374 495 477
4226 477 -229 407 873 -553 -43 -505 253 -59 -176 -1131 -2 -507 -1163 273 621 1424 346 -706
4244 -706 80 47 733 -597 -824 253 629 -400 -340 411 -527 26 -238 -65 -329 912 565 -722 693
4263 693 419 304 -417 -255 128 666 635 -561 338 -161 95 105 -130 -69 -79 -534 218 -282 -11 -480 -966
4284 -966 157 185 429 -200 811 -559 8 -575 -83 -714 826 458 -564 679 394 -429 -400 -85 -55
4303 -55 -469 55 -192 782 164 393 -230 25 208 170 -144 -754 1001 255 642 -270 43 332 135 -66
4323 -66 706 -815 490 -298 -754 -176 -345 -95 375 -144 647 343 -533 255 818 193 -580 759 -1191
4342 -1191 891 60 693 412 205 -292 -387 -146 -144 365 288 -665 407 -217 417 -414 -199 231 405 9
4362 9 -1099 804 245 281 -135 -308 -619 -126 -179 291 -271 -178 -30 -59 -202 -59 -806 158 -682 -26 326
4383 326 9 140 192 422 671 29 -457 878 -104 -181 419 76 -60 512 -490 1068 640 -858 -30
4402 -30 147 516 -241 581 -206 91 557 -18 -935 -32 -80 237 -126 47 588 -186 555 392 230 672 -5
4423 -5 -433 -43 308 433 -582 -361 90 557 -310 -580 -149 -190 906 274 572 -176 1423 -1000 -148 473
4443 473 127 -354 -191 78 1113 301 -273 -730 -758 -251 -437 85 82 -430 673 -247 384 -145 176 88 -389
4464 -389 -13 275 -453 -716 1010 426 296 490 0 -265 -217 -443 503 511 -152 -417 689 1 -457 -509 -72
4485 -72 200 -52 100 -623 -751 -149 -32 -528 -80 -230 851 76 406 205 -874 51 891 -322 -94
4504 -94 224 462 376 -575 234 -89 188 -553 766 -89 -557 -3 373 -392 504 870 206 431 -458 24
4524 24 -451 -360 0 591 618 -75 -1178 647 -463 -883 -145 -1376 204 100 515 983 -1121 307 -479
4543 -479 499 -154 44 -782 -1094 203 -239 -381 -226 207 -217 -539 175 -637 64 249 136 103 94 -179 -562
4564 -562 527 99 -213 -457 23 -106 421 175 -385 -83 -416 -242 733 414 -267 804 264 568 -124
4583 -124 213 762 -1142 -534 -81 126 -191 -18 362 45 -365 564 664 -195 -233 702 187 -365 759 363
4603 363 118 -344 -747 -177 -597 97 -123 -648 391 178 -181 -210 -236 114 229 -423 -305 268 -428 -6
4623 -6 517 -410 -1406 -80 671 93 447 561 -90 487 243 583 -94 632 -165 -348 304 178 95 127 -438
4644 -438 594 169 644 86 439 -703 263 -633 -113 874 -948 96 295 -472 -6 690 -770 541
4662 541 -317 -366 331 704 1418 -130 -712 -203 -327 387 35 538 883 482 -320 705 237 879 518 -770
4682 -770 -482 -258 -141 -149 391 -843 97 470 -559 -527 168 642 701 -37 311 -115 241 -545 748 -323
4702 -323 465 323 941 157 231 290 -42 213 -391 -751 491 400 -656 -358 357 -371 755 -579 -157 640
4722 640 -39 -354 59 -876 -47 -296 654 9 -256 -568 248 46 242 280 20 -480 318 606 -90 -298
4742 -298 -134 578 291 166 -963 -251 -532 96 95 350 -515 -447 -361 52 -70 341 -150 45 242 587 -497
4763 -497 168 -321 -204 50 257 457 -349 625 915 358 -584 -134 -959 -114 58 51 35 -269 -307 313 -83
4784 -83 -381 -129 25 67 -401 -540 -272 10 16 -264 810 -369 138 453 -105 308 -547 765 339 839
4804 839 119 -107 71 1794 180 19 -773 848 869 -923 -340 622 -76 34 1052 319 157 -340 -517
4823 -517 180 74 -344 692 -214 -196 -195 316 -189 -1046 -263 -198 -243 -83 112 -408 -550 -98 -343 -159 316
4844 316 19 786 143 837 846 -559 -454 -167 -653 -79 -28 -19 -453 245 -139 188 388 -547 1477 -100 -136
4865 -136 -634 204 243 -443 -955 -201 -639 -845 -199 -303 312 -726 -329 356 -300 793 -264 55 699
4884 699 -571 -2 264 891 534 -203 -500 565 566 1113 -80 708 803 -108 350 -622 253 -425 -131 -1145
4904 -1145 -264 -21 277 167 -267 124 192 -383 602 46 -751 649 225 -48 -650 -106 850 224 -110 630
4924 630 -48 316 -106 104 273 -127 448 -493 293 834 -643 721 -674 -389 -633 10 141 -441 279
4943 279 649 -679 1000 -22 433 323 -534 223 -175 -330 521 -2 427 407 -105 -171 -1146 -52 448
4962 448 1168 636 881 154 -666 -420 -298 -330 -349 295 -192 -154 -528 425 -297 290 163 42 1076 161 958
4983 958 -892 -187 1151 135 374 183 -134 -484 -199 -88 103 -106 247 -1220 1141 45 -364 596
5001 596 743 229 958 -268 -787 656 -97 -146 -599 1116 -166 263 212 -928 -67 -277 496 100 80
5020 80 -339 471 77 -488 321 181 -348 304 -117 -36 -332 228 240 -235 -423 435 309 -343 -832 -306 -295
5041 -295 -881 -358 72 136 -23 898 1127 -269 775 487 643 710 -261 770 596 -334 -315 -494 108 570
5061 570 368 -419 853 -134 321 -143 321 -94 -365 -469 138 54 -52 -201 -778 34 -306 1341 -881
5080 -881 26 2 -207 -22 -19 -33 196 378 115 332 1023 -388 -399 -27 203 -57 -208 25 -161 259 -314
5101 -314 -189 613 -888 -497 -799 -270 327 34 1035 943 60 178 675 -132 267 49 594 -675 484
5120 484 52 -779 1380 409 155 419 564 -411 351 595 43 117 -669 -190 -1057 -719 593 -670 637
5139 637 447 -515 545 -389 -489 -524 92 295 -286 257 71 182 103 -257 52 1409 -174 185 371 -563
5159 -563 156 -599 700 34 789 291 -84 351 -76 626 -66 300 182 416 -170 76 -119 -116 282 -535
5179 -535 253 456 687 -111 3 -200 115 946 -223 -169 -239 -344 -499 -177 -1321 1 285 594 -658
5198 -658 -511 127 -508 876 466 -738 754 63 298 476 862 288 144 -400 -295 448 199 -188 -327
5217 -327 523 -317 -171 -651 469 21 214 418 618 -310 -485 -176 307 1302 489 11 -361 -562 -1207 -928
5237 -928 -500 -43 39 642 109 357 -227 118 354 -85 92 -784 -492 -116 598 -118 -126 468 -35 -163 -143
5258 -143 811 -311 401 1502 -31 -626 -294 655 147 -196 -353 -300 12 584 -533 265 86 758 858
5277 858 411 271 -568 352 -594 303 676 -718 160 -269 623 220 176 651 208 718 -325 -287 5 51
5297 51 -356 -124 -106 -527 -146 -115 -234 -174 508 -36 -43 105 544 -704 -14 -613 -761 -50 -1245 41 -241
5318 -241 359 -50 287 -9 -375 132 1103 -336 324 13 -611 -669 706 145 -127 30 175 -869 75
5337 75 -600 -464 -7 -978 -96 -1022 511 110 -22 -192 -474 261 191 -416 658 -622 308 258 -778 -250
5357 -250 470 -239 31 577 409 295 -596 330 430 -468 261 267 -122 -1455 267 -27 -301 -165 1101 -235
5377 -235 73 129 -79 610 319 -285 -178 -197 378 153 597 833 -60 213 -134 -1085 -195 -675 27 -536 690
5398 690 -915 980 -798 505 578 -780 277 175 73 691 -894 -739 330 374 250 -244 -599 -706
5416 -706 21 -9 572 -193 860 563 237 -304 466 -276 -562 355 -102 201 -295 -827 138 -56 -129 -198 -251
5437 -251 -799 50 142 -309 364 461 19 535 -454 360 -277 225 -146 -152 -502 171 -193 -90 -19 596 -557
5458 -557 1251 -81 -414 -3 628 -1024 953 450 -555 -100 440 480 498 284 -352 497 114 -716 -136
5477 -136 341 -305 -335 -152 -212 424 -317 626 -440 -67 171 -505 239 -240 -968 1137 -319 -190 -230 -634
5497 -634 77 -930 -444 419 43 7 -107 463 1301 -278 -340 595 -125 -275 -404 -79 -170 -278 -44 -111 -415
5518 -415 135 674 701 -369 -389 -56 366 -13 -514 -184 -135 719 429 -703 -697 743 -857 -28 -526 -333
5538 -333 -62 467 388 675 842 -71 97 453 722 525 -633 179 -141 -166 -453 34 318 -660 -467 -347
5558 -347 880 -33 366 529 287 466 215 120 -71 -322 268 74 216 156 -125 -316 -617 -217 163 166 114
5579 114 573 125 -102 174 -617 -597 461 -1031 -82 -292 230 -1055 -303 -102 -513 480 624 98 178 -216
5599 -216 -165 495 -211 508 -99 234 505 195 172 -1103 757 -531 629 -316 148 -346 -238 233 229 469
5619 469 291 322 -736 573 -108 152 121 -718 -458 4 -354 77 -784 604 -714 114 242 149 -434 584
5639 584 -95 321 195 -363 -57 -207 -367 -603 56 -344 -174 224 -44 -625 73 857 -310 111 -278 -220
5659 -220 57 117 -60 158 128 935 46 -194 309 -1298 -370 -277 642 -27 -180 513 -121 -137 393 1054 -195
5680 -195 -355 417 221 9 -823 -400 -839 133 -662 699 47 195 -39 -1262 -94 -380 201 518 231
5699 231 -218 40 -92 753 111 -515 -517 298 -536 876 958 -245 -297 162 723 -254 199 -454 -313 -149 -1083
5720 -1083 -488 297 73 548 -352 -639 -394 393 164 -187 32 171 1139 -672 -383 565 172 -65 -547
5739 -547 157 119 385 -255 513 8 -30 850 166 396 -385 -179 34 -649 586 567 51 334 208 638 -235
5760 -235 -342 -17 -62 -842 -308 442 145 -96 -264 -572 -566 -674 -1100 94 434 482 -424 -270 259 -508 299
5781 299 -364 318 -114 -130 362 484 -113 -1169 -126 -581 -466 -437 -331 354 -733 191 -461 628 -1111
5800 -1111 131 -161 278 223 120 120 -151 -1340 476 -10 -113 646 174 -139 -836 687 143 315 190
5819 190 908 -836 -277 -59 201 7 1070 -61 441 -186 102 -3 -534 535 615 -1070 -673 -44 334
5838 334 743 272 -262 189 220 -73 -123 -142 266 -258 -517 -221 101 -10 264 -498 238 966 -628 184 -228
5859 -228 -372 56 423 619 974 165 -600 -546 -283 -648 -873 1210 248 -537 -139 487 930 -394 239 202
5879 202 -96 -1247 -112 223 82 -288 608 -1079 -606 -247 -6 -979 -366 -352 401 -671 106 173 573
5898 573 314 -1019 -410 -630 -18 -264 -757 161 -560 259 978 -11 -266 -783 48 -579 -324 112 212 -497
5918 -497 108 -560 8 -233 -359 933 -236 -98 1247 1209 386 0 -134 -616 276 915 -147 -937 -100
5937 -100 -381 803 -384 1164 -584 -189 -323 -46 505 -82 815 447 -1071 440 292 -257 979 -341
5955 -341 -234 -533 -253 -171 396 95 352 74 628 656 -424 299 -701 -160 494 737 365 892 -412 -931
5975 -931 -632 1411 717 -139 110 621 947 261 618 -195 -10 202 -646 -77 151 -901 -138 -1000 110
5994 110 -294 500 -357 458 605 -121 462 1103 224 1114 30 -1036 195 273 243 -120 30 57 30 1070
6014 1070 -470 -92 -593 -567 177 -561 -327 -483 167 1176 -762 -355 -226 -109 395 -15 -267 451 -128
6033 -128 275 90 714 -237 -296 126 -117 -239 27 -435 98 1174 501 310 305 216 -3 -546 -49 144 244
6054 244 402 9 -929 -269 1031 768 -640 -860 -859 -767 -338 492 783 -842 -27 491 190 360 207 1264
6074 1264 513 -309 328 -129 -11 -509 108 -536 -7 -192 -592 357 50 89 -264 159 -678 -713 -75 -72 -133
6095 -133 454 -1075 373 1120 61 -633 -184 59 472 -216 752 -18 -117 41 481 360 -372 678 -490
6114 -490 672 -1051 -22 237 628 38 49 -4 -811 260 -68 -593 13 -499 225 -362 420 574 194
6133 194 -366 -426 648 280 550 -477 -430 906 560 -126 -24 -950 -306 248 -210 -24 -308 1060 8
6152 8 -864 471 466 1263 278 69 -819 -113 -271 43 417 644 -10 -574 -560 -139 -696 -51 433 460 -1060
6173 -1060 -199 -669 257 -86 675 220 -154 -815 350 904 -561 -499 131 300 70 415 154 643 -457
6192 -457 -215 -542 524 -248 -378 773 -517 42 582 225 -418 -123 -12 -278 322 -251 -299 952 -305
6211 -305 -644 -436 270 73 -410 105 -528 -248 -58 -585 782 -750 60 -221 -747 -131 0 770 101
6230 101 20 222 -226 -3 -486 -459 -255 -302 -81 343 -111 322 -935 -538 186 -299 303 -491 1063 -212
6250 -212 651 344 483 399 -328 -707 -108 238 -203 440 162 -409 611 -295 362 -264 267 -253 221 -513
6270 -513 -755 -81 262 434 873 68 -746 -224 -282 -387 -529 -847 1131 528 -688 -170 350 596 1106 -240
6290 -240 348 -700 85 144 -1259 -480 220 295 410 163 593 165 -363 388 -452 -548 581 421 882 100
6310 100 528 -647 110 128 -15 -618 25 -179 -321 491 226 486 -3 -275 223 -733 637 -57 -74 318
6330 318 -98 -852 -105 -1190 -370 -289 -640 -336 219 532 151 356 233 782 -717 483 -46 -601 36
6349 36 -66 -455 -507 -179 37 619 793 -632 15 498 200 218 727 551 -874 259 -450 -285 -9 -112
6369 -112 6 206 270 -790 -318 -660 82 214 -474 -43 -113 939 -90 -1121 -1241 -82 545 -47 154
6388 154 -69 -1156 140 497 264 -754 -374 -188 161 -194 214 96 -50 317 -330 536 507 -396 -202
6407 -202 176 -1392 -84 160 -241 714 -901 147 326 -604 -605 -525 469 -519 293 -222 -606 340 -557 25
6427 25 -414 166 265 274 119 612 314 -403 -191 -501 486 -257 -569 -625 1229 -77 -724 117 1747 476
6447 476 -101 366 -1154 388 -100 -108 299 359 229 -273 19 -514 87 156 215 -657 -17 807 -551 -615 -220
6468 -220 -473 -118 -245 86 134 -369 283 -109 499 379 363 -439 1175 107 67 156 157 -403 -588 339 -517
6489 -517 435 -247 -37 -245 -53 107 -191 35 -979 49 -172 732 -1146 654 -435 -434 535 790 38
6508 38 -186 -391 11 -127 -156 1086 524 -1258 12 -1108 433 354 394 -732 -459 -262 -173 494 384 142
6528 142 -763 426 445 -57 -1038 180 59 -225 -1086 29 -699 484 -33 465 -141 -513 -187 -79 288
6547 288 -190 -76 -257 318 452 -425 -176 717 -362 -236 60 216 624 140 240 290 -658 614 -807
6566 -807 133 -1101 -438 -101 -63 470 -522 889 578 811 212 887 265 -1148 640 148 -618 822 -842
6585 -842 91 -268 -196 -236 427 906 173 624 -375 -408 -131 -264 582 -129 778 -310 134 -476 -347 358 688
6606 688 315 804 171 481 827 765 287 -136 -128 -425 -723 -750 -116 -583 48 14 544 -283 -197 728 242 145
6628 145 -424 -359 -343 288 296 -170 79 59 19 823 -910 -363 79 1055 681 -546 -112 706 127 468 163
6649 163 -132 391 468 -89 -430 1155 -52 -472 82 126 -602 96 -454 -359 768 -6 217 689 -164 209
6669 209 -1338 -228 -448 -119 398 -300 22 -657 177 -262 -140 91 -1321 -2 466 630 686 233 -896
6688 -896 -348 111 -568 141 436 -257 103 -218 499 557 -536 122 -599 -113 -68 588 357 -255 237 -478
6708 -478 -790 -631 145 457 -448 12 617 379 -308 513 131 -364 638 -201 -98 26 429 -764 -366
6727 -366 67 1056 -383 395 -442 10 1205 304 -450 -881 12 891 -211 -392 -150 -266 105 -62 -832
6746 -832 -821 -171 753 -809 -441 939 397 -51 8 -496 358 102 141 -490 708 -780 -265 669 -216 -978
6766 -978 739 -407 -800 20 -889 -376 -654 283 -274 -87 942 -333 310 -469 -378 774 708 468 191
6785 191 614 -122 1107 91 -106 -379 -234 -36 345 465 19 278 52 272 -75 1081 -449 632
6803 632 -702 -415 -119 541 -427 381 -1007 -749 388 276 -171 -327 217 290 167 50 -489 647 746
6822 746 957 -60 435 -316 -577 -67 356 -799 -347 -379 -748 217 50 -679 390 -603 318 931 956 -1123
6842 -1123 -599 -249 1018 -276 96 -298 -4 -102 -75 11 33 -95 -758 -396 473 330 569 229 -268 -73
6862 -73 21 580 2 434 637 265 417 -349 237 256 313 36 -23 -175 -924 802 57 -368 -775 910 279
6883 279 -135 -74 -376 -1002 72 269 667 129 694 -29 885 526 -292 85 271 -765 -564 377 -461 787
6903 787 -746 -63 -439 -21 410 813 -12 -367 380 -255 175 395 -1 -485 -517 133 48 186 -59 319
6923 319 -292 408 -179 -70 -64 -451 485 -295 292 -547 452 -206 893 -403 -329 128 93 582 -609 344
6943 344 303 -118 104 264 -570 210 288 -734 -1280 -126 787 81 -454 105 -605 212 185 1113 473 -587
6963 -587 48 275 342 -167 384 -292 664 749 262 100 -179 -154 -712 262 885 412 -235 -13 -255 -1011 -430
6984 -430 -318 1163 690 -654 -227 511 -410 630 -687 -293 40 -492 -166 -764 -293 577 -519 -310
7002 -310 188 -1014 460 -637 709 -683 -780 465 212 250 -307 -748 53 303 -194 216 309 -252 65
7021 65 -275 -799 -277 388 468 -5 149 -16 331 -959 49 399 -570 -1236 -106 559 639 -445 673
7040 673 -370 262 617 -1391 -362 664 -560 -682 -379 -223 607 242 -282 -202 448 519 -698 -37 -349
7059 -349 705 -103 414 285 564 -187 148 185 347 -131 224 -49 -463 -750 320 -684 370 -423 -213
7078 -213 151 560 348 -684 737 -635 44 -457 1433 455 -299 -197 -428 333 -34 625 -142 436 -10
7097 -10 -257 -81 -619 794 -257 359 4 -245 166 236 322 710 -411 -403 497 357 411 538 480 -314 169
7118 169 234 1462 -847 -25 306 -282 62 -522 558 1081 1077 371 595 48 876 950 116 78 -285 380 -15
7139 -15 252 178 1049 537 -237 59 -169 82 566 53 -300 533 -513 -107 190 1037 -113 279 -583 -320
7159 -320 427 -621 -55 -566 -809 119 1183 119 350 -184 -567 206 590 -178 -555 935 -73 653
7177 653 328 -313 49 -498 812 -513 -145 -128 1234 162 14 -465 -1281 -47 947 -27 7 -736 -2
7196 -2 145 -198 -340 -24 -498 -544 1301 748 -662 -161 996 -232 321 834 -523 -313 -201 642 -796
7215 -796 -527 -290 285 -666 -811 -1051 350 -567 -147 544 -239 125 -1164 433 420 750 -265 196 -175
7234 -175 -787 193 -203 -463 -484 125 59 -787 -473 472 208 -386 -995 429 283 -807 82 161 756 156
7254 156 -337 -387 243 676 -263 937 -172 981 -35 -190 -518 -139 -381 -985 -86 623 804 -835 355
7273 355 -693 -944 466 842 231 -361 -481 -1249 22 -618 1210 799 -458 -654 589 239 -596 -615
7291 -615 -130 390 418 1039 -70 769 41 -114 348 -282 -533 761 59 -810 825 -322 235 -676 -734
7310 -734 -13 -287 180 -336 -192 -92 628 231 -183 -262 28 -227 -131 904 663 207 -88 -100 -62 -457 143
7331 143 470 -81 821 519 -836 75 327 27 -919 -511 -312 -619 -555 198 -711 -142 10 887 19 -512
7351 -512 328 285 -452 -875 311 -481 33 -330 53 965 -115 291 -949 205 430 -548 -197 -933 -111
7370 -111 378 591 233 311 267 375 -588 155 -506 345 -1015 -116 430 -70 557 543 74 -130 393 413 -120
7391 -120 525 -237 175 -667 651 -101 90 583 -168 -352 -201 -143 -32 -620 717 -27 -449 373 -172 378
7411 378 1064 383 372 -52 415 -1147 -119 305 -169 5 -33 -373 -143 88 -366 -399 353 628 619 266 -564
7432 -564 512 -222 643 682 360 302 13 382 -128 -574 -570 22 460 -556 260 718 -730 -392 273 -1354
7452 -1354 -576 -418 633 -88 38 726 722 1190 339 -551 -12 390 158 -616 -1177 -212 158 822 659 -424
7472 -424 304 188 375 1038 -25 411 260 -766 -1057 -833 -24 -392 -820 -860 523 694 363 -460 937
7491 937 118 -308 679 368 -105 18 284 -359 -101 434 -44 464 -125 195 319 116 -2 469 -80 326
7511 326 -183 636 742 263 77 -124 -88 77 -510 -508 39 -539 -111 50 529 -201 178 247 82 11 -405 245
7533 245 -447 747 740 -411 -187 968 -376 -464 227 286 191 65 -365 591 -120 976 224 -494 -325 473
7553 473 -709 -8 -655 -171 724 748 -583 712 -353 -518 -327 513 -380 -13 -650 -429 -1448 -866 315
7572 315 631 -23 -105 -854 -304 -1011 362 -85 732 494 -780 50 -240 -212 -266 32 290 275 -177 53 -568
7593 -568 596 -64 -127 -115 -479 -46 19 92 -475 -629 -467 -12 34 -515 285 349 951 -117 23 420 -209
7614 -209 -166 -804 -287 -964 477 373 -744 -111 -581 -435 -39 455 113 -23 396 -707 -426 241 23
7633 23 485 -360 -807 -935 -150 -672 263 622 -13 -113 228 -360 138 910 566 256 653 75 443 517 -28
7654 -28 935 -582 221 125 343 -291 677 83 710 -60 157 354 325 251 -704 -394 883 -260 68 -929
7674 -929 -5 -690 -55 -8 43 -74 -466 360 172 1116 380 -45 -276 -317 120 89 1467 507 1238 -884 -197
7695 -197 899 572 -352 -852 301 -452 -599 -348 359 -343 189 -788 548 -290 -225 97 198 -587 -362
7714 -362 192 194 597 384 -321 -221 -685 -464 -148 92 42 -262 -343 279 575 271 -75 922 -272 -446 -79
7735 -79 148 -85 438 285 605 -894 -760 167 3 -425 -571 184 479 588 162 -267 -442 -471 -376 546 -444
7756 -444 -598 358 -451 204 -479 493 -644 22 140 -589 -583 -698 211 -292 -441 922 -675 32 235 -292
7776 -292 596 591 684 67 1090 269 -1256 89 61 -329 1101 -879 -335 -591 203 9 -64 -279 -127 -183
7796 -183 -242 -25 -449 -691 424 -343 84 1002 -31 -429 -328 188 541 -349 38 447 420 -403 91 25
7816 25 -319 -111 32 -358 390 863 182 286 88 -733 -4 717 698 1128 -352 -1168 -251 282 -219 -193 -70
7837 -70 1294 904 49 616 -360 121 -128 -459 39 199 -329 -22 549 -129 315 -375 407 -251 1204 -556
7857 -556 -587 336 747 -862 456 -1328 191 698 210 206 -406 663 -1056 -676 -579 797 347 309 1329
7876 1329 -384 844 229 -416 383 27 953 -263 201 -781 534 391 -596 -986 593 3 137 289
7894 289 155 352 -229 12 115 -98 216 311 56 675 53 -438 135 452 -99 975 -314 431 -53 363
7914 363 543 -61 -17 -4 -855 311 -336 395 578 192 -615 158 -174 335 -458 752 -559 -57 -440 -454
7934 -454 -462 168 102 -868 719 404 -293 -249 -2 1466 220 933 -373 -210 250 289 -742 431 566 -399
7954 -399 -616 -380 50 -219 848 -237 707 -1 1045 -299 -568 145 95 -133 147 -247 -239 55 -65 88
7974 88 -196 -410 151 431 -591 1027 830 39 213 1442 -880 67 602 382 -183 466 136 -190 -440
7993 -440 586 68 -120 791 34 -606 531 -28 414 -649 1312 528 509 -263 429 -319 -204 93 -815
8012 -815 -120 -311 455 35 312 -574 -602 -67 -254 718 69 -47 -36 -238 -308 -518 114 209 -42 250 741
8033 741 411 -653 -204 -728 150 -34 -548 -247 -336 -299 45 513 384 353 228 474 -681 -47 574 162
8053 162 -1843 157 521 -542 509 53 -846 -580 518 -1080 310 396 -364 777 -60 -1075 473
8070 473 -259 347 -132 893 126 237 -309 254 533 -542 -940 -90 -532 -324 855 216 -94 -948 208
8089 208 52 -751 -102 -471 -111 840 -280 -560 -377 -232 -234 -82 1425 734 707 -465 -207 -848 588 407
8109 407 571 7 246 388 455 -391 52 786 -150 -276 -442 -121 -276 -1218 -10 37 -1788 231 -715 301
8129 301 45 -201 -134 -279 -190 -447 -1195 -387 32 -138 -73 642 -518 43 -377 -248 1 215 -958 589
8149 589 -348 479 609 -179 -430 762 -162 1387 728 -758 254 168 -118 -402 -240 -45 209 -40 299
8168 299 208 313 -208 -144 157 -239 -382 -528 651 -113 760 941 -304 1 522 453 -244 -700 -233 -111
8188 -111 -530 -166 -752
8191g52
$$ Imaginary data points
##PAGE= N=2
##DATA TABLE= (X++(I..I)), XYDATA
0 0 0 0 0 0 0 0 0 0 0 0 0 0 0 0 0 -33 108 -108 108 -108 108 -216 216 -216 298 -324 333 -432 506 -545 648
31 648 -748 840 -942 1062 -1188 1312 -1486 1647 -1840 2048 -2271 2517 -2790 3090 -3409 3757
47 3757 -4141 4553 -5021 5527 -6097 6720 -7413 8203 -9099 10116 -11288 12671 -14307
60 -14307 16301 -18766 21923 -26120 31991 -40757 55318 -83559 158292 -772520 -1546249
71 -1546249 961815 1009444 -647766 -432398 664352 231597 -201105 22978 46104 -169549
81 -169549 -46340 -88871 -265435 48701 665756 373439 -497811 -391105 477457 250708
91 250708 -642056 -304254 732201 413840 -630416 -352944 663445 375331 -557436 -321959
101 -321959 362012 97948 -288238 -43692 105919 89671 262362 -5734 -481478 -33588
111 -33588 548387 -61905 -601169 159335 620072 -241516 -652604 221252 622888 -137453
121 -137453 -499276 83329 353125 -59523 -245781 -7420 133699 82461 -39648 -177015
131 -177015 -47761 292302 187341 -324147 -279369 318766 299313 -367939 -346315 393499
141 393499 396887 -343019 -330604 360342 286994 -343131 -251340 239174 138777 -163661 -78070
152 -78070 47416 63946 149837 5747 -285777 -43849 367734 19045 -453723 -19923
162 -19923 469936 4227 -444549 31865 432643 -15866 -387195 -33029 278096 39943
172 39943 -195969 -65688 107583 87341 -20654 -91037 -34237 124564 104160 -165103 -209024
183 -209024 163885 275194 -170731 -311539 204369 353170 -203217 -330809 207180 288709
193 288709 -187931 -228617 128421 136384 -68985 -54346 14586 21880 79627 11618 -175019
204 -175019 -52737 232033 70189 -274699 -80738 289714 79220 -284111 -60251 286304
214 286304 61155 -277465 -90171 219907 93246 -155857 -81127 98087 73443 -29323
224 -29323 -60773 -40664 49341 100213 -55416 -172855 49325 219546 -55182 -237634 83257
235 83257 256859 -99455 -257838 97274 231403 -84999 -186522 63026 132865 -29091
245 -29091 -69938 1762 31686 46992 4061 -101960 -46390 140031 80311 -159491 -101091
256 -101091 168218 110386 -167520 -110427 163382 104371 -157586 -103521 135560 93422 -106691
267 -106691 -76790 74179 57788 -35560 -45440 -14512 29877 65397 -17684 -117827 7404
278 7404 157802 -4112 -181989 11681 195204 -21650 -192889 25648 174362 -20708
288 -20708 -139877 13873 98100 -3179 -54747 -6943 20752 25310 11329 -46546 -38166 70589
300 70589 66906 -83849 -87140 93976 101733 -99281 -108473 101074 111649 -95525 -106151 84271
312 84271 92853 -67754 -72048 44963 47159 -20995 -24613 -6729 7067 41806 7223 -75055
324 -75055 -21820 98143 23196 -115095 -20287 126438 15650 -127025 -10767 120900 10360
335 10360 -105247 -14160 77908 15301 -48838 -15833 24630 23440 8407 -25424 -32221 29828
347 29828 54252 -34821 -71297 37906 82347 -39799 -87036 46662 89752 -48329 -85439
358 -85439 43194 73228 -40136 -58815 31338 40320 -16499 -20075 -1209 2383 21766 13240
370 13240 -44452 -29433 58568 36352 -70337 -35955 79153 36428 -79197 -32625 73702
381 73702 25009 -67722 -22859 52494 16340 -35948 -13046 21008 12790 -2907 -13193 -18070
393 -18070 8533 32656 -8947 -46407 10466 61867 -8363 -66162 12546 70751 -14425 -68699
405 -68699 14508 59158 -14781 -43925 16723 31031 -9922 -13051 3629 -1910 3123 12419 -17931
418 -17931 -24962 28668 32332 -38997 -34484 46846 34659 -49557 -33843 44195 26787 -41870 -23882
431 -23882 33670 21232 -21250 -14011 12679 7955 -3640 -3143 -8990 -2644 20193 6670 -29037
444 -29037 -7379 39940 8175 -44420 -4201 46979 -1859 -49373 4663 46452 -3244 -35328
456 -35328 7266 24893 -6754 -11552 3931 -1828 -2504 11381 -4123 -20187 11637 29314 -14579
469 -14579 -30691 19324 27170 -23905 -27686 21636 25276 -21883 -22383 18599 17495 -16124 -11042
482 -11042 12314 4266 -8897 -1475 -192 -4309 10183 10497 -17433 -13170 23310 12874 -27417
495 -27417 -13121 28738 8489 -30093 -5187 29928 2264 -23788 3923 18367 -6520 -11347
507 -11347 8014 2118 -5804 6637 3617 -13673 1072 18841 -2873 -20601 4681 20076 -8769
520 -8769 -22848 9849 22936 -9482 -20618 9322 15643 -11395 -10278 10328 2015 -12560 727
533 727 5744 -4547 1861 10590 -6390 -13226 9916 13894 -14440 -14398 17112 11995 -19669 -8138
547 -8138 20389 5598 -16815 524 13824 -3240 -8121 3708 1735 -3579 3865 3518 -7840
560 -7840 -4580 9090 4270 -10703 -3165 11968 1532 -15586 1933 18555 -1833 -15436 4673
573 4673 12294 -6994 -9088 5962 3850 -6327 843 6437 -3804 -4299 8847 1254 -11198 1723
587 1723 12225 -5674 -13486 8594 11950 -10127 -7953 11786 3054 -11522 -495 9378 -1277
600 -1277 -6600 2667 5331 -2687 -1603 3661 -2105 -5194 4014 6849 -6912 -7941 7167 5785 -10064
615 -10064 -2462 10628 -1062 -11074 1492 8938 -3406 -7145 4746 3805 -6035 -889 6850 -1390
629 -1390 -6108 4394 3677 -6690 -1749 8618 -1325 -7541 4753 7974 -4958 -6089 5819 4342
643 4342 -4262 -1929 5049 617 -5085 697 4995 -2241 -4456 3673 2030 -5255 39 5490 -3011
658 -3011 -5740 4215 5496 -4971 -3572 6339 2109 -7214 373 7474 -1749 -6292 3431 4329 -4077
673 -4077 -1814 5937 -788 -5804 2139 5331 -3759 -3056 4986 925 -4517 710 3983 -1234 -5127
688 -5127 2686 4162 -2985 -3039 3101 1861 -3061 102 4620 -2428 -4363 2164 4455 -3010 -2515 2996
704 2996 392 -4083 1096 5000 -1797 -3912 4085 3001 -4592 -1088 5514 -21 -3943 1763 3907
719 3907 -2683 -3754 4066 1077 -2984 788 3821 -1933 -3279 2865 2520 -2410 -1304 2247 893
734 893 -3986 670 2933 -1655 -3669 1621 2841 -2175 -1171 2626 -211 -3350 713 3664 -1459
749 -1459 -3711 2621 2198 -3427 -1049 4206 -592 -4135 2824 3631 -2117 -1979 2769 860 -2953 1185
765 1185 2904 -2375 -2583 1693 1644 -2139 -1173 2063 -1143 -1650 842 2010 -1124 -2670 1149 1281 -2174
782 -2174 -564 2595 -412 -3411 -198 1636 -998 -2268 2235 1409 -2464 -306 2919 319 -2058
797 -2058 995 1496 -2717 -1882 1666 307 -1894 616 2075 -1491 -999 1130 1173 -1266 -879 1707 -744
814 -744 -1708 647 1719 -1298 -2305 973 659 -1831 -369 1734 -156 -2076 765 2430 -829 -1453
830 -1453 2029 1520 -2019 -856 1802 -695 -1503 716 1880 -1276 -808 2854 106 -1970 402 1004
846 1004 -683 -886 1493 1635 -2145 -178 1272 1 -1284 791 2531 -1654 -486 416 339 -263 -749
863 -749 1050 220 -1420 1718 1173 -319 -1648 1604 1109 -1526 -33 1104 179 -1422 2378 1776 -2624
880 -2624 281 1147 -167 -977 1119 676 -1065 -1270 725 987 -1568 8 1265 -178 109 567 859
897 859 -430 -973 1292 -254 -1070 598 1918 14 -1296 506 1322 -69 -833 460 542 -1049 -178
914 -178 1389 625 51 1497 483 -1462 384 1531 854 -1132 338 801 -204 -705 798 1388 -1062
931 -1062 196 643 79 -567 -356 -234 -469 -667 -113 -645 -163 298 994 -1170 -733 1311 1281 -725 -964
950 -964 464 178 -434 -681 -39 97 -972 -101 218 296 -955 392 13 -726 370 428 -538 805 946
969 946 -484 -252 -182 1725 -424 -672 357 366 -318 -145 511 260 -258 -417 1470 -2 221 242 65 -953
989 -953 74 316 -1247 -1242 426 684 -305 -1005 651 216 -877 -259 1390 262 -362 889 106 258
1007 258 363 1159 316 -421 220 899 -241 -35 1816 -117 -1349 461 899 168 -757 -482 2199 50
1025 50 -364 -163 799 464 -293 585 717 -181 726 113 -426 -65 1533 -518 -739 846 556 -306 -382 163
1045 163 19 -467 -245 2308 504 311 561 510 345 544 -83 285 -22 386 562 336 -196 875 1464
1064 1464 -366 345 -37 421 -1381 201 314 -331 -779 592 933 -141 275 -1319 -470 -286 736
1081 736 -84 -65 -77 1030 -69 -1478 -1086 487 -517 -493 610 -331 -371 -629 617 565 -978 1170 41
1100 41 255 132 171 756 -828 -252 -417 -686 62 309 10 -412 -41 1469 130 -724 -117 829 543 -304
1120 -304 -46 703 -241 -690 22 -923 -425 -306 341 244 90 -209 29 -90 -67 1246 -165 -738 -843 1022
1140 1022 -821 42 -287 -416 784 24 -134 542 -732 812 -634 -422 -269 -1120 596 -185 -543 80
1158 80 755 -14 137 907 222 -207 236 -129 -272 -148 -371 -498 599 -223 -1038 -482 346 -898 -237 -374
1178 -374 931 -382 362 40 -332 -674 -445 460 1277 206 -132 -380 1132 -422 -128 996 464 -140
1196 -140 235 -408 -158 -367 337 272 -442 386 -206 -956 175 305 190 71 -927 77 -408 704 169
1215 169 -99 121 43 398 -326 469 -665 -1008 210 -923 -76 -103 -11 42 -1 -114 -728 277 437 -506
1235 -506 -337 -728 734 79 542 -452 -174 251 -1002 1070 481 -116 -171 69 296 658 218 -27 275
1254 275 341 -606 -203 -318 529 133 184 647 -307 578 36 290 457 -359 -558 590 -510 854 -452
1273 -452 738 -494 647 -747 -797 233 -755 100 -564 -493 364 290 -225 -375 -861 -195 -57 226 498
1292 498 151 -507 -239 222 628 -172 -418 -6 687 -182 748 -331 -224 -524 -651 130 277 -6 882 20
1312 20 1109 99 -565 -522 21 481 -336 -8 375 333 -431 109 -343 -454 -317 -63 -95 -654 -641 -145 527
1333 527 -1200 356 -181 348 -69 -469 91 -354 -454 -344 817 501 -218 -707 937 744 -229 467 -516
1352 -516 -142 7 -192 -182 311 645 293 -243 -372 1387 537 689 564 -57 -297 -808 -547 -731 12 -576
1372 -576 148 -94 187 -594 -582 451 178 -885 398 491 -442 104 -602 246 360 -524 180 -280 -749 -55
1392 -55 66 2 -92 599 425 421 137 58 -528 780 -293 301 280 -188 401 554 -7 -45 264 454 -809 768
1414 768 487 -45 -66 -328 -155 263 -45 104 301 -253 9 -1133 351 -281 -654 -252 174 1278 657
1433 657 -706 225 590 -195 -42 -376 -652 255 -60 -605 43 -171 -772 364 -70 -430 -140 -635 525
1452 525 -550 216 581 271 -60 194 -739 98 617 -191 -286 -99 -369 732 232 84 -85 149 -852
1471 -852 346 -168 -682 158 481 908 254 -199 -149 207 -742 -293 924 434 -163 642 -615 -775 113
1490 113 -626 543 404 187 -544 -963 -494 -491 546 241 -417 -621 -614 -12 -454 -530 -285 98 -685 201 228
1511 228 -412 191 102 -78 311 511 -816 -190 935 581 -87 -172 -399 210 18 -278 -150 142 449 -747
1531 -747 -104 -459 696 -111 -622 -644 -248 599 -539 -232 446 -5 -665 -153 159 74 -177 -361 -549 -155
1551 -155 -453 -88 37 -1089 -16 -58 -599 441 927 128 605 168 232 112 26 -952 -154 -174 -529 -726
1571 -726 319 330 -104 258 -110 460 652 -231 -300 741 -82 -7 -227 -108 697 251 234 -1056 489 -312
1591 -312 440 -276 -537 521 -6 -9 -281 74 -553 -130 171 -515 301 -129 335 -318 -407 462 211 -501 -185
1612 -185 172 351 1114 103 -203 -1026 -1364 171 600 568 207 -216 -402 -39 67 621 988 -484 -923
1631 -923 -17 322 201 462 -104 -279 708 -135 153 595 168 544 -309 -516 -220 524 -1323 -652 -205 175
1651 175 -745 234 259 -343 -864 -338 547 1166 -723 -288 -113 119 -34 -91 -32 339 1476 273 -120 211
1671 211 98 -293 267 663 -265 -490 -101 -160 454 747 -43 351 -127 511 87 -1087 754 -57 144 -738
1691 -738 249 547 74 -177 -1064 -9 -637 -244 -557 321 140 2 493 -411 676 -101 -285 73 384
1710 384 763 58 397 180 361 458 -67 -407 -716 75 35 571 535 625 392 529 326 218 -1007 673 -192
1731 -192 447 1451 503 -306 105 6 429 -682 165 46 1498 -162 542 -401 -299 266 -454 -567 321
1750 321 279 584 781 428 197 372 29 -248 56 -209 965 309 -254 322 631 392 98 -665 -12 -49
1770 -49 480 -301 253 372 -199 -306 311 10 175 -80 -455 -18 -741 -301 183 738 -300 -66 268 -64
1790 -64 -534 -206 195 -413 -167 635 -225 -476 -872 -922 -511 -426 665 12 -408 1168 28 -182 45 -144
1810 -144 -93 -414 -382 187 231 -371 -808 571 371 -361 432 299 -477 -664 -459 204 -50 -198 67 -335 472
1831 472 26 -565 329 -686 550 -276 202 -171 -107 221 259 496 258 -599 -1074 350 940 -317 -187
1850 -187 408 -521 -60 -282 302 161 162 -740 -364 168 -790 -955 -320 956 461 -186 -234 -502 -275 399 -713
1871 -713 318 789 326 -449 68 512 235 3 27 180 -155 -137 -139 324 -1138 -453 68 -162 -669 363
1891 363 -50 -1363 396 394 53 601 241 24 272 173 861 140 -245 221 -5 178 -31 -657 545 -684
1911 -684 466 373 508 393 -41 257 -426 -149 587 64 -872 -330 35 580 -270 376 57 357 410 -268
1931 -268 402 -81 42 -18 1303 93 345 427 462 -642 56 -1201 -329 532 659 539 123 120 260 -240
1951 -240 -129 896 -326 -35 -470 328 370 284 160 139 -947 243 151 -1240 909 731 116 -360 1081
1970 1081 645 -305 -498 23 -237 -264 29 521 160 620 -428 -77 493 -196 -524 541 -124 8 -185
1989 -185 -346 232 502 1093 -39 -65 727 -1198 435 -1173 317 359 779 679 -273 26 -27 -562 31
2008 31 1195 441 -461 415 308 -398 167 -272 502 258 -47 131 -317 1041 -56 607 218 642 -239
2027 -239 -168 -224 120 -704 911 500 624 -16 565 355 468 700 250 -433 108 212 122 -84 229 -559 -314
2048 -314 187 259 -152 -341 -159 -55 -722 72 211 -575 53 864 -620 -427 72 67 796 231 452 880 -134
2069 -134 111 -592 -518 -277 118 383 -493 -691 145 -316 484 -20 -25 224 510 775 -209 155 -512 -253 -603
2090 -603 -382 -869 -331 -252 867 -78 228 -27 864 4 326 33 137 171 -311 476 -7 240 544 264
2110 264 217 115 -616 -236 -636 -881 105 284 152 -548 573 -83 769 -347 -222 335 296 526 -196 -968
2130 -968 -47 97 -1122 54 66 85 -551 1218 -661 233 48 281 -340 -779 143 -667 526 180 626
2149 626 -452 -171 883 16 -782 -127 -1172 -1205 -474 -27 -611 34 202 -462 150 201 227 -441 -301 -638
2169 -638 -90 -281 -743 -101 664 -425 -540 277 -157 216 -132 -528 -1084 -303 -150 -498 -5 757 -760
2188 -760 -563 -410 177 -575 -133 -98 -958 -5 195 489 154 -317 -66 -834 191 599 135 269 6 -324
2208 -324 -50 448 -221 1156 -692 -515 924 114 446 -553 762 -430 -1187 1228 -216 55 -272 -18
2226 -18 -425 -223 184 -132 213 456 629 -7 414 -1780 -561 226 -196 -92 514 -605 -477 -223 925
2245 925 163 344 -388 157 297 -79 1097 -88 -497 -30 -446 236 1192 -840 -128 243 -255 408 218
2264 218 37 162 494 -619 -483 340 -833 170 769 -247 -397 143 -747 -484 -95 -620 -421 -245 53
2283 53 45 -228 -515 -300 41 33 23 69 71 51 -307 68 -465 342 -223 275 84 -550 812 -925 -13 455 350
2306 350 141 1720 63 456 -45 -386 -218 646 -299 -55 -44 472 1264 500 -124 -92 114 998 -468 -515
2326 -515 -326 -267 489 211 -110 179 352 436 -143 -77 -179 -530 1020 -234 389 84 -259 518 304 -324
2346 -324 633 -404 -309 -806 35 1212 662 -340 327 -304 600 -994 -184 442 -26 996 -667 203
2364 203 282 -608 -558 366 105 308 -303 -311 -551 470 -223 -178 63 -429 698 -118 636 116 -212 -424 -157
2385 -157 99 -992 -99 -75 127 345 59 -244 33 -706 590 179 629 28 200 -332 336 482 -32 202
2405 202 -274 424 641 -639 -32 -221 -116 -83 -689 939 -645 710 276 -311 174 189 492 -685 -71
2424 -71 -613 -94 -418 444 208 348 145 -330 -138 -813 632 -133 307 -142 569 671 -429 517 440 -152
2444 -152 -463 133 708 121 -48 -312 -683 1250 455 -161 145 -349 -557 745 -45 13 254 -823 218
2463 218 -441 -38 181 -331 -471 -240 -950 754 -408 1300 -36 -212 203 -194 -142 142 -487 -275 59
2482 59 -49 44 -486 -498 457 -351 -137 588 266 821 -293 -76 375 245 -513 -282 207 -745 -142 -522 56
2503 56 810 622 546 581 -234 529 253 -181 756 231 -429 -199 -502 -624 0 -517 20 -359 -478 -306 -265
2524 -265 373 382 -138 -603 484 298 -599 337 954 -282 -212 131 -353 11 -5 -111 279 -1042 -315 808
2544 808 176 749 -704 44 -343 301 342 367 832 -183 -218 -883 328 -244 -327 -408 524 -718 -5 -291
2564 -291 -501 753 -721 944 -1127 -849 -87 -183 -209 -437 -859 -110 85 118 -489 1059 -224 361 1273
2583 1273 131 165 387 446 -141 -551 -563 -75 -584 59 -307 -135 -190 733 -867 -389 422 211 -93 -224
2603 -224 289 763 77 345 193 -304 199 476 -176 183 203 -103 -709 -685 431 -258 716 -558 -263 -527
2623 -527 -710 661 372 -696 -43 -121 297 147 -447 -366 559 -408 -204 -210 262 -582 -919 488 709 121
2643 121 849 823 -466 1003 -259 -630 850 -377 15 549 42 316 403 445 443 -858 -764 273 -383 -1078
2663 -1078 612 -258 897 -491 -776 490 -281 -55 -70 697 -739 655 167 -427 -36 -252 64 -86
2681 -86 -271 -255 217 -1047 -234 724 -88 867 44 -319 155 575 -93 -296 -896 265 529 -457 592 0
2701 0 -476 -78 -278 152 -757 -121 1543 -220 328 -217 -461 300 327 139 -1285 110 307 391 -260 -589
2721 -589 774 559 29 -397 489 -766 -1667 308 263 -228 117 -276 -2 -452 -427 -387 -253 -402 367 -809
2741 -809 -344 103 135 -256 -414 563 495 -52 -318 -594 190 -105 -750 -545 -80 -237 115 -62 -804 6 595
2762 595 80 525 -376 721 -235 -146 -354 109 734 -637 -151 506 -20 -545 22 147 -237 -571 433
2781 433 219 1252 241 455 -1340 -151 -236 -261 593 550 152 -63 109 -56 385 -297 -305 -108 41 127 -72
2802 -72 643 55 722 150 -208 -452 222 133 130 -416 -803 -335 -1116 -756 566 -413 -261 -375 -544 -989 -251
2823 -251 321 544 -68 -246 -197 17 912 -410 39 375 -313 524 505 485 -349 -405 810 -243 -1058 -758
2843 -758 786 -79 281 145 -8 427 692 -721 -784 -608 445 418 389 36 -560 1147 -230 -8 715
2862 715 -809 -262 585 -69 -216 275 170 979 555 58 29 71 654 -206 -371 558 559 330 196 176 -921
2883 -921 -186 434 -623 -775 95 37 -164 833 126 964 225 157 126 -630 -15 235 -165 297 664 -227 -582
2904 -582 541 -96 -55 490 -446 -60 -391 160 -168 -29 17 84 95 394 325 -878 -218 397 -331 -769 -781
2925 -781 -99 -752 -379 487 -172 -343 -1282 341 193 -834 -289 -126 -128 -274 392 -153 -427 -208 -810 483
2945 483 416 -612 301 -117 230 -65 -87 201 -61 -555 342 96 -100 450 997 391 -44 199 -16 -489
2965 -489 -393 356 -343 373 743 333 -599 -335 370 437 319 486 164 172 759 -89 -257 -41 -78 742 407 533
2987 533 153 -15 458 653 -609 -50 454 -485 -277 -284 322 -756 -243 190 -754 -268 -405 -330 -560 277
3007 277 -171 -420 299 -135 488 -476 -177 -162 -917 -158 -1089 393 148 -83 -424 570 164 8 323 233
3027 233 -108 153 -257 441 332 239 -227 384 36 -823 -836 -131 328 -635 682 -576 -467 341 -183 53
3047 53 -436 1057 821 312 31 764 706 283 -71 821 338 65 132 13 -453 178 -278 -478 -106 -747 -346
3068 -346 -563 912 477 3 859 223 81 -710 -325 318 -456 111 -230 735 328 262 617 505 -393 1057
3088 1057 923 56 -195 98 416 537 660 506 -391 47 702 -199 947 -1056 -306 155 249 600 333
3107 333 74 -206 162 -536 1011 66 51 258 -98 -554 17 -326 -408 1 144 482 317 -120 55 -354
3127 -354 -584 795 341 110 -377 -565 115 -271 204 -639 136 163 129 202 -726 -480 861 -183 418 -82
3147 -82 626 34 -488 -46 -22 -775 345 198 -70 93 528 48 -861 198 -3 -519 613 -323 -905 -358
3167 -358 -149 421 -112 45 -1189 346 -40 -471 1579 -60 122 138 -91 274 -335 243 -525 248 29
3186 29 -336 553 685 189 214 425 -220 -89 -1156 183 -626 -24 -168 726 854 205 0 -165 77 1103
3206 1103 -862 -451 30 -227 -602 -307 -476 571 -2 723 149 -710 -451 -679 422 -357 -512 634
3224 634 79 193 1147 315 -616 16 -192 666 -818 48 506 -546 -339 22 -580 269 -196 -508 -383
3243 -383 469 39 -452 182 104 234 1084 98 502 2 -587 276 1203 -464 -448 -234 318 -221 224 147 -1091
3264 -1091 -23 -53 753 399 1410 278 174 -531 -222 345 250 803 -77 -375 48 247 -627 52 141 -790
3284 -790 510 -95 93 439 217 -704 119 -365 -222 -156 -220 689 -365 -575 868 696 153 -102 -45 -261
3304 -261 -93 -152 -587 354 -177 -345 25 294 327 97 236 -166 406 -556 18 790 935 -285 -366 320 809
3325 809 162 623 97 350 216 495 -222 -1043 -407 724 -822 348 497 761 -670 364 -273 -201 581
3344 581 -477 -91 451 -80 717 1128 -152 -755 -1222 -193 412 240 -1010 -518 -126 -688 3 -54 -513
3363 -513 76 133 -899 -408 477 779 -181 563 -746 140 198 -247 -319 168 -821 -57 446 -357 -414 393 357
3384 357 -104 -869 -513 301 670 -128 -280 547 -81 146 -30 284 457 82 -307 790 432 -649 146
3403 146 621 677 470 315 346 -524 588 9 -696 -140 89 209 38 -104 25 -109 -951 -323 23 -39 -1046
3424 -1046 50 965 431 39 -416 608 52 -108 -223 861 387 29 -66 -1191 -31 1214 9 -310
3442 -310 -336 995 -8 205 -124 -343 1097 -988 255 -189 461 215 -624 -425 -346 263 301 23 -11 173
3462 173 26 681 -248 -495 -56 579 -331 -857 857 325 722 -116 -642 -634 477 -499 63 -439 239 324
3482 324 178 508 201 -602 1608 1060 226 643 -438 48 -359 1164 653 442 88 560 -473 681
3500 681 -5 837 -336 -417 -832 -52 346 -275 5 504 -705 547 -547 -529 -279 234 140 -848 -843 1273
3520 1273 208 -76 72 162 -763 -146 294 567 -557 -806 -372 -125 -537 -88 -176 -348 -488 -551 106 277
3540 277 399 841 -1 88 97 -637 531 245 342 162 20 -1136 -248 152 -197 -740 408 -300 -222 -55 -172
3561 -172 -155 -461 -849 570 -897 997 187 -298 606 -464 91 -37 -71 -53 389 551 400 113 -132 493
3581 493 208 -362 438 -389 -766 -1098 211 224 -703 636 186 296 282 124 0 74 -537 -833 19 -175
3601 -175 -140 154 -1121 529 -553 -476 -180 -1236 340 -445 -409 601 -1151 198 441 2 489 621
3619 621 149 526 -532 9 679 168 -98 -433 272 303 -466 -511 118 58 777 -506 382 -7 537 -130
3639 -130 41 53 162 -66 527 154 -1056 274 -239 49 120 -304 -479 -505 127 254 603 116 -929 -452
3659 -452 -99 -279 -530 205 536 344 -5 -223 -836 62 1351 -120 -22 -1079 648 43 239 266 -414
3678 -414 -533 3 218 -1567 -30 -637 -87 425 -117 235 -133 263 143 171 -114 43 441 -394 -75 593
3698 593 168 124 208 -348 -170 146 -491 -933 -203 -172 439 441 659 844 -72 119 -835 -645 677 325 199
3719 199 -226 -76 85 -163 -51 -744 634 150 81 1208 -488 276 -183 145 175 888 372 -450 51 227
3739 227 -344 365 -521 -68 373 -94 -594 145 -906 53 845 -505 304 407 480 -10 -632 227 -119 523
3759 523 1141 289 -569 -1301 -601 -685 -282 631 -1007 747 142 -208 593 -535 -158 559 -313 -147 -114 -247
3779 -247 -325 -393 47 -159 -354 391 -285 -974 78 -1056 821 -11 80 -530 308 -969 -186 -323 -619 -374
3799 -374 -46 202 -76 -126 989 -448 -259 281 -562 -147 -335 -102 -515 -194 259 817 -612 835 532
3818 532 -620 -40 -489 327 -371 255 636 -133 -551 -308 852 235 -49 130 208 -161 96 -886 983
3837 983 629 -252 -487 -857 41 2 89 -713 331 19 181 -430 281 929 154 -609 443 -202 -483 -34
3857 -34 -651 -517 -160 -75 208 260 -255 -242 89 -77 -86 118 726 -298 93 846 -446 -501 773 -476 -787
3878 -787 -241 148 511 562 316 -33 135 90 -263 -489 -584 238 27 519 -359 -240 -149 -382 392 -750 -256
3899 -256 483 -187 163 575 101 -470 -277 -20 856 153 -383 170 -11 -169 -864 -362 371 237 -263 592
3919 592 317 -148 577 434 -582 -444 582 -841 -581 -591 -78 91 -201 233 -733 239 773 169 -725
3938 -725 -3 -358 239 101 -86 177 540 -195 639 612 187 -2 -240 201 473 319 365 174 107 259 196
3959 196 -541 975 611 66 -176 377 -147 -140 439 224 145 608 -729 -280 90 -70 157 -615 949 -6
3979 -6 -19 253 481 41 -259 206 -581 296 283 354 46 -382 494 350 -318 -441 -698 -426 12 328 12 -1013
4001 -1013 366 -318 -538 742 -72 -409 41 -975 235 -543 186 -278 -322 -99 214 156 -378 833 751
4020 751 301 765 -136 777 51 -165 618 1012 461 -192 365 -918 -396 270 369 -178 746 -581 574
4039 574 -281 -364 -623 250 -592 258 -718 -47 -248 248 77 356 204 -91 759 11 644 -962 163 -110
4059 -110 638 -835 -715 271 -217 -639 -3 105 -356 -355 -524 270 -5 243 488 -311 240 356 -645 1026
4079 1026 514 365 163 426 -193 210 -174 125 274 254 704 184 69 231 -157 22 -246 -472 248 -7
4099 -7 -751 -496 962 348 -160 299 174 82 443 -75 563 159 190 -505 -600 -542 338 -287 -878 63 389 -73
4121 -73 -712 -48 253 -461 -178 -643 58 355 33 -1009 -54 553 -138 161 391 463 344 117 -312 -392 -796
4142 -796 -93 -107 654 405 -419 274 -631 -332 -106 -70 -420 449 -169 -216 107 706 -872 -138 192 -22 -381
4163 -381 -392 632 49 -877 -295 -302 264 -234 -355 23 384 234 571 493 326 225 -343 322 319 694 710 -295
4185 -295 -18 584 -153 226 -14 -94 -180 112 -557 -779 -311 -30 715 -75 -428 -212 36 228 734 623 -701
4206 -701 -58 127 -396 -151 -153 280 618 503 43 406 535 -420 -1039 -223 618 423 -184 -163 -220 -246 -541 -380
4228 -380 -581 517 459 244 168 679 -702 -94 124 174 383 375 -207 102 -155 1118 -287 -501 -63 -239
4248 -239 -363 474 42 1182 391 268 -50 -283 -559 27 -327 -730 -427 7 789 -280 123 706 539
4267 539 -307 164 -159 -185 -677 -243 111 48 612 71 484 -648 442 1039 -181 -185 -245 -1200 -631 -214 93
4288 93 53 236 286 698 -193 -533 505 459 188 -292 -353 459 -485 321 938 -307 317 238 -188 -649 817
4309 817 -500 -189 -59 894 271 832 -583 433 -687 527 278 41 379 253 4 -786 -251 -693
4327 -693 1121 -282 -280 -397 -195 -484 355 -646 -487 -144 -5 -383 99 613 -148 -676 -4 -705 264 -29
4347 -29 -214 -128 638 -215 738 -289 432 994 -54 -109 -16 591 -131 612 144 222 210 244 -173 37 2 -177
4369 -177 -340 690 700 294 228 1 -610 -282 639 -764 114 -638 30 -233 -36 550 -287 705 330 -611
4389 -611 784 60 196 -274 177 -187 -123 -178 -100 605 -125 -306 710 -466 907 -316 551 -467 -588
4408 -588 -487 159 903 -269 -158 815 -20 -23 271 196 -1444 -15 -432 -81 -172 822 682 131 -238 834
4428 834 376 -101 144 23 567 -109 1231 620 310 715 129 -620 -69 578 -238 -321 898 570 -690
4447 -690 187 -195 -859 -145 -715 -824 239 282 -601 -562 349 480 103 -117 435 405 -357 -676 -40 -181 -785
4468 -785 247 -411 -7 359 -646 103 159 -218 1124 126 89 144 73 -46 -1007 55 413 230 -136 -468
4488 -468 -568 -53 -506 -790 107 787 -287 -577 -353 -48 -1010 -986 -88 -461 -62 311 -867 -500 517
4507 517 519 38 456 521 352 225 679 414 -600 -160 192 343 -966 -535 -195 50 -5 708 -71 -359 -107
4528 -107 230 216 706 504 461 -427 30 71 515 653 974 59 -35 487 -933 887 467 87 859 -669
4548 -669 217 202 -697 303 101 367 886 716 556 643 -1318 550 -1191 250 19 -354 366 -993 -166
4567 -166 -711 131 443 -639 -535 274 464 -4 584 -289 624 75 226 551 -608 -514 290 -30 590 -61
4587 -61 653 493 348 559 -662 -337 -621 -257 -1069 -689 95 -100 455 107 -166 -104 -577 -137 311 38
4607 38 363 -335 575 -352 -529 236 -405 1121 222 253 -100 102 -249 -351 -185 -227 435 468 369 -558 10
4628 10 270 -598 145 -95 7 -141 -86 -496 656 -432 470 -228 -607 49 -166 -123 64 208 234 535 145
4649 145 467 442 -47 17 -179 -522 414 54 -967 -51 -368 229 140 10 49 -382 75 197 414 -209 199
4670 199 162 543 296 96 531 -21 -64 246 88 97 297 32 451 243 128 184 873 538 110 304 94 121
4692 121 -115 -348 1564 613 274 -264 564 503 -352 599 741 -37 -533 -260 -28 484 1253 916 111 -456
4712 -456 -478 -520 -649 -147 -1157 504 922 150 -127 81 -521 -223 789 192 415 33 64 482 1129 -498
4732 -498 176 104 -245 -297 5 106 391 1204 0 -134 -81 394 137 -731 -211 240 -464 -821 -197 -11 667
4753 667 144 -380 500 -186 -740 845 9 -197 -88 688 347 136 -164 -137 543 -128 270 259 285 613 451
4774 451 244 387 -256 -592 -488 165 -1055 -413 43 485 -205 722 757 -39 100 -54 -78 210 -204 -237 -12
4795 -12 -208 -279 -179 673 139 -784 -254 207 107 477 -81 454 187 256 -449 137 -202 340 -236 166 -110
4816 -110 -109 637 -800 20 388 -236 -298 681 1074 392 -557 779 -408 360 -506 511 -463 -1170 -25
4835 -25 35 -1277 -431 -143 288 644 11 -740 313 -913 639 -520 299 144 72 221 -543 -186 645
4854 645 -634 -681 -279 -760 399 797 413 -244 -670 114 844 -91 90 131 -210 -309 -156 -189 -128 116 615
4875 615 206 -868 210 -694 708 782 -135 -189 -398 -487 75 475 1503 356 -790 -230 56 -672 177
4894 177 243 316 -500 -487 337 -1199 -288 620 481 217 443 -765 823 285 -90 530 714 58 -66 275
4914 275 959 211 -148 -145 -820 -358 412 -710 -336 740 183 71 -544 -885 696 500 -493 -710 -1065 -324
4934 -324 -294 -696 716 -857 -355 802 174 -190 388 -378 65 584 -687 -904 618 -283 -228 -1016 673
4953 673 -247 580 450 -979 -151 239 71 -79 594 542 -527 -366 1606 -422 -284 -67 36 145 -228
4972 -228 -753 -117 -82 -155 -323 -3 89 -687 -249 -553 -180 463 -133 448 47 -343 -495 -68 -29 230 8
4993 8 -298 488 145 656 -660 7 432 551 648 -404 82 -233 518 -228 892 -348 -343 -311 -235 49 -422
5014 -422 112 -281 195 190 -689 572 222 139 -326 -717 1268 -808 -56 34 27 -27 857 -35 87 -393 -300 436
5036 436 -240 114 -402 201 443 447 -44 -37 -182 711 -607 768 -4 -252 451 393 -716 -590 666 333
5056 333 -49 -737 -282 -111 -333 335 -118 -72 -271 256 -671 166 36 511 -183 -53 -192 689 -146 -858
5076 -858 120 799 489 -243 -722 23 -651 -455 589 -680 240 -303 -91 475 -206 180 -653 381 283
5095 283 -690 713 277 248 -583 -55 804 445 -719 200 576 -344 170 -99 -160 -259 13 914 345 1
5115 1 -347 504 -93 -468 -538 675 118 -593 -436 -899 741 -107 235 890 -85 -545 613 -625 -411 17
5135 17 -620 598 -242 -114 378 -251 -814 -191 240 -498 817 -530 -256 222 -323 -178 -629 -5 270
5154 270 -129 208 237 -171 397 -415 -629 30 -182 -304 490 1303 -270 3 -280 238 -160 -126 169 -5
5174 -5 121 -17 -415 348 -187 -135 -160 439 73 -309 -61 70 -227 -1075 -1197 -232 340 465 249 253 70 -235
5196 -235 515 -276 454 172 -156 632 20 192 -30 -73 818 -68 -101 169 -20 -439 88 294 230 -545 -340
5217 -340 -181 -140 -177 -768 626 551 49 -69 449 -309 -231 -428 164 150 207 428 -278 76 -106 456 225 -867
5239 -867 77 1001 -564 -803 267 144 -743 -83 334 -205 829 -235 1021 -355 -520 466 884 -492
5257 -492 132 359 -824 355 805 602 441 398 482 -425 453 -535 -329 -418 -638 260 299 -463 -65 -226 151
5278 151 -17 -253 46 844 -158 917 -195 454 -3 -145 1016 -79 738 -101 411 -756 396 161
5296 161 12 142 -52 72 384 594 -470 1342 542 -428 -256 -558 -649 204 -316 918 445 455 101 -436
5316 -436 -124 675 -438 -199 348 -57 203 -634 -338 1274 -120 749 258 53 506 -277 140 -34 502
5335 502 -332 -287 -387 232 532 -67 455 -182 -532 657 67 187 352 -527 18 351 -262 -1179 -24 -519
5355 -519 -751 -134 -244 244 -398 -621 -468 -1 -423 363 393 -102 -739 -103 463 347 -159 -121 -139 182 45
5376 45 -104 149 579 -221 -500 351 252 402 140 -831 -176 53 202 211 61 -669 -365 -277 -598 -395 194 -298
5398 -298 -125 629 -330 -597 31 -248 287 -415 -370 -110 -581 -211 -55 83 48 -1099 -1019 -835 -804 442 -386
5419 -386 -1230 975 375 -74 -332 310 -509 -592 -116 -321 112 52 -423 -551 -247 -391 -762 -178 -143 209 293
5440 293 -255 676 142 -1437 -708 -397 874 415 -458 -195 542 25 117 168 1182 -283 256 -294 187
5459 187 632 456 868 -72 -275 995 -379 -606 346 -446 -504 -772 -332 -111 -501 177 857 327 -80 87
5479 87 16 -223 -311 -1255 -78 305 -209 393 119 -254 -2 -213 900 262 -77 -493 -595 -218 133 124 -191
5500 -191 86 283 256 -321 465 202 39 327 -384 373 -289 -47 -558 117 11 309 -245 563 -807 -264
5520 -264 686 175 -143 -338 110 -671 323 261 74 -742 -476 7 636 271 -654 -548 -322 586 -519 22
5540 22 367 947 253 -4 90 -4 -545 250 -613 89 -152 -782 25 1539 -113 -297 133 360 519 176
5560 176 535 -549 -420 -869 84 -133 124 -407 -665 -509 287 733 13 37 413 -319 169 -140 219 210 940
5581 940 617 -131 331 1067 -413 -77 973 -80 -332 531 281 948 759 -30 -285 167 425 550 -368
5600 -368 -68 -914 -263 -246 909 -743 -403 289 -372 -500 317 292 725 411 1001 31 -181 -30 -784 -470
5620 -470 756 655 305 230 -1171 312 102 147 -83 116 -722 693 -213 267 261 -694 -705 345 729 -397
5640 -397 -23 229 -502 -846 -428 -456 942 -433 -352 -164 233 -514 555 279 -310 -49 37 416 439 -1221
5660 -1221 -40 462 289 -19 -23 -499 -476 775 86 188 282 -343 857 656 102 -503 978 -334 69
5679 69 -256 -214 118 698 27 102 -699 -376 50 -1281 -247 69 520 -680 -655 469 -302 148 564 -879
5699 -879 220 -594 845 -496 -87 1446 752 -344 61 -564 -227 748 -198 -572 -416 179 611 -279
5717 -279 296 -166 -759 -551 -370 -198 -414 279 -382 402 8 853 -427 22 17 -168 36 -365 87 283
5737 283 -1259 -457 -441 342 21 -369 574 -137 402 746 -905 811 844 -401 732 534 -344 -509 -940
5756 -940 -147 -88 445 -179 -681 537 -1187 776 -93 895 282 270 -50 681 308 -73 -97 349 284 -440
5776 -440 481 266 58 58 626 -106 250 -129 153 -425 -430 -188 533 83 -423 -579 -239 100 322 266 -875
5797 -875 -1015 -352 365 -128 -213 -162 -1066 158 376 -1003 543 188 92 115 1041 -286 -372 -501 -10 -211
5817 -211 83 311 53 -737 1117 223 540 -843 344 890 538 -221 327 -352 -659 -518 102 906 -556
5836 -556 538 592 -103 462 -321 -124 185 711 -294 330 140 -520 283 -373 856 283 207 518 -549
5855 -549 -405 -645 263 174 707 1091 429 485 102 -110 -119 113 -121 -437 -249 182 -245 -236 533 226 677 -276
5877 -276 144 59 -409 270 210 -200 -227 -114 0 83 729 -450 -498 89 128 718 -220 362 418 -296 411 643
5899 643 -690 555 -630 695 -340 218 -452 184 50 -227 1120 625 616 -609 -55 35 253 468 -253
5918 -253 22 186 -245 54 1452 126 156 -255 -118 254 954 1200 -354 465 366 -808 -75 -93 -111 561
5938 561 691 -328 -159 524 -256 61 112 -290 176 73 308 400 -944 329 -577 -365 -227 -171 -66 231
5958 231 -480 28 542 -217 386 -112 -1002 -459 257 447 331 709 295 -264 331 381 319 150 -442 75 473
5979 473 248 53 -19 -393 -260 131 -249 -337 -737 262 328 187 101 395 312 -461 -213 528 -473 614 132
6000 132 279 -255 433 895 -646 -543 163 -443 -240 -329 -1081 -96 -88 96 314 382 120 -77 -51 48 103 -320
6022 -320 -238 -12 -95 -384 -448 -655 -224 10 -68 234 827 14 202 57 -233 376 691 51 -484 -86 1192
6043 1192 386 -615 31 -539 263 282 843 39 -644 -1339 324 555 -369 529 -170 196 -1365 -714 822
6062 822 -270 -497 59 -612 -369 -450 149 616 -83 82 -863 -265 196 199 311 319 -521 -740 -922 184 54
6083 54 -462 -265 -104 -59 190 1 -512 1126 -1092 -318 -294 -95 25 -50 14 -478 724 158 629 -17 -315
6104 -315 -440 476 -509 -214 -367 -14 -895 -603 618 -146 -415 -427 -622 400 317 -966 420 11 -552
6123 -552 389 382 1019 -312 -194 59 562 1587 685 -137 -171 699 577 440 1167 482 580 -589 392 235
6143 235 -36 -317 -245 -17 -663 165 353 367 312 45 -561 -206 -724 681 167 700 368 -57 73 -430 603
6164 603 101 273 -9 452 -375 -193 -193 877 410 -484 620 373 637 -170 573 154 426 1341 -90 567
6184 567 -159 -183 -365 234 615 562 -74 618 413 -45 -640 173 487 -646 717 -1065 -264 331 -345 -7
6204 -7 -134 508 -961 671 -70 646 167 -123 -587 973 200 -711 -198 503 368 448 -209 1268 29
6223 29 -604 -307 -979 607 -329 149 -176 84 175 -37 -93 299 -463 -1171 -36 475 -7 -806 152 -52
6243 -52 71 460 12 325 -34 -183 -192 226 342 231 -172 -425 1071 86 584 -363 631 262 156 865 -1010
6264 -1010 3 324 142 219 -123 263 260 -384 -133 204 -476 440 -620 -694 -230 -155 77 257 -310 -214 -666
6285 -666 531 158 7 1011 -111 -200 12 504 186 -278 245 173 -270 217 -1181 249 721 183 466
6304 466 -201 133 206 -83 911 -463 -229 -512 713 207 -156 155 -469 245 -13 -18 351 -126 -6 -328
6324 -328 -17 939 -300 38 -234 -274 -128 -806 819 -901 -374 234 -13 -48 78 566 70 201 340 -197
6344 -197 105 -182 -289 -163 391 -566 -752 -154 302 116 478 -555 -333 646 -86 -336 -1176 122 -1071
6363 -1071 -248 -96 369 -137 248 89 -175 377 -749 -699 -517 1439 -161 -12 -506 90 -719 323 861
6382 861 -56 421 -1261 -89 802 60 648 863 -446 -178 -155 -559 -115 214 841 21 -527 -265 122
6401 122 149 -677 930 -578 349 376 1022 -268 -489 -542 -461 -176 -414 -431 -65 489 188 -113 -144 -101 -189 -221
6423 -221 192 188 154 587 1141 382 -523 -632 313 209 689 -713 101 -236 337 316 85 2 846 10 -666
6444 -666 -99 -38 725 -325 275 -636 121 717 460 -714 183 20 221 172 -269 -1197 -269 -417 249 48
6464 48 939 -689 -138 282 -926 179 -297 17 -119 475 -396 349 204 486 -1210 -141 1279 -911
6482 -911 -234 48 31 97 -5 474 238 499 134 -142 296 -339 221 -714 458 -104 -119 33 -181 285 -454
6503 -454 -432 214 133 669 906 -867 397 581 426 1002 -126 314 -644 438 -134 153 125 -537 -57 16
6523 16 -682 464 378 240 774 -596 -237 -16 766 -616 263 325 -240 -1126 -27 617 167 -734 177 179
6543 179 -375 -708 635 81 363 -673 -471 604 746 -646 -613 -82 692 -822 209 17 -934 779
6561 779 -136 314 -94 850 -489 -396 219 -96 -376 -475 -60 -60 -348 77 6 762 -577 -119 -126 98 -7 185
6583 185 -649 -165 -337 -75 412 -280 617 95 471 -116 -394 73 -196 81 466 128 562 397 -277 368
6603 368 -153 -307 -406 -455 109 172 1221 573 667 521 -375 19 1050 432 -538 671 -680 657 192 -293
6623 -293 308 -447 668 69 -725 -239 -72 96 376 773 -677 -529 -508 -325 -342 -373 259 342 89 468 258
6644 258 245 908 999 513 -891 510 351 -272 -41 183 310 -198 454 -535 -92 400 603 107 -164 142
6664 142 239 -183 -125 -14 -739 441 -676 304 90 -399 -954 430 -238 255 209 -396 -582 -44 277 58
6684 58 -649 -324 -606 -708 -131 724 304 -771 704 -186 434 379 -1341 -386 -251 343 -355 -101 -755 -16
6704 -16 -90 -90 177 200 1253 -978 -270 281 123 -737 1300 616 267 780 128 -87 836 -706 -279 730
6724 730 87 -62 124 343 89 173 332 74 62 -677 940 759 -797 104 -447 630 123 705 -227 295
6744 295 510 13 -291 -12 458 273 -209 -65 -649 -175 -201 178 -257 -109 11 349 552 371 322 -266 304
6765 304 -286 -89 227 -49 -608 -790 1365 -669 96 281 -63 -99 -36 -824 245 108 22 7 -95 51
6785 51 374 -573 534 -317 162 -811 165 981 47 -61 -534 -59 -30 260 1015 976 756 -220 104 247 527
6806 527 666 304 -150 219 684 75 -459 -1375 469 98 -306 726 650 1096 585 839 -13 -880 -378 238
6826 238 -314 -137 -238 -821 21 -314 666 -226 193 -22 -691 347 -36 -7 490 -64 714 632 -1365 -31
6846 -31 -50 549 44 -120 -232 -428 441 -275 455 273 405 172 388 1007 491 108 887 603 472 -16 597
6867 597 950 -105 427 -40 -464 447 117 94 712 251 424 -614 -289 135 1314 -269 727 395 104
6886 104 443 291 110 259 -516 944 379 -490 19 -497 56 410 637 364 -490 -701 -453 -425 11 -833
6906 -833 -138 437 -521 -326 -81 -504 148 661 385 -78 140 475 -208 -98 -452 373 -689 -1137 -385 -669
6926 -669 -987 -546 -164 -1093 122 -180 -136 -1027 477 564 -877 401 -968 114 -555 -16 119 114 -682
6945 -682 465 152 -347 -598 -2 822 -554 436 152 -205 417 558 -323 -931 742 308 -235 156 156 -284
6965 -284 201 -718 -552 234 -768 911 -183 -503 240 -55 -2 161 -104 -124 -971 105 -356 -327 81 122
6985 122 368 -56 -438 -426 -65 -75 150 69 -252 8 -170 433 107 -70 -276 -111 -465 -226 597 190 -725
7006 -725 39 -551 -654 -44 -96 -173 373 -645 -163 147 132 707 -474 -40 -73 414 -282 -766 295 91
7026 91 -363 1357 -204 164 219 -623 -49 754 -350 840 7 -713 -436 560 149 -67 -550 -406 -162
7045 -162 295 60 -231 791 -136 282 -373 444 -215 276 -70 -127 193 -460 197 221 322 -91 489 639
7065 639 -1160 137 -70 171 -23 207 17 258 -406 13 -367 -577 740 -44 285 599 -329 -68 508
7084 508 142 219 -400 213 -11 1113 842 -1067 437 476 6 -317 -182 616 145 584 -389 -532 -195 68
7104 68 -135 842 -463 584 53 222 915 626 1166 61 -123 352 727 -524 -8 24 -60 143 537 -467
7124 -467 167 -630 -295 285 450 -111 -549 142 -312 -96 80 432 642 -158 -597 -685 0 129 184 64 -424
7145 -424 -236 -387 852 -322 -262 202 493 -360 951 -930 -21 464 126 290 -189 -369 363 -143 -667
7164 -667 69 151 -1004 -127 890 -116 -381 -425 -383 248 813 -773 1107 188 -513 -563 -247 -280 -1130 -146
7184 -146 -17 324 356 -45 214 720 -798 -323 1153 1269 -825 351 105 -65 -480 1964 881 226
7202 226 329 -877 -132 -693 1260 140 -676 48 -323 471 356 568 -128 -297 -320 1232 241 15 463
7221 463 178 -336 575 -148 -163 -436 -43 -26 287 1220 -43 -769 -269 9 -199 480 1000 -446 -219 -984
7241 -984 790 -588 -1003 -227 101 664 763 312 208 -508 281 300 236 -493 163 188 36 -481 109 145 445
7262 445 -715 -237 -546 -64 318 -240 -139 -690 -857 149 335 -863 1174 521 -250 342 410 -495 814
7281 814 165 194 -533 -26 795 -425 370 -3 380 661 212 -722 1018 1182 43 -512 291 1037 -155
7300 -155 148 862 274 332 826 -765 625 49 -542 -608 -214 -431 -758 802 403 268 -31 -555 -887 -247
7320 -247 914 333 197 77 -231 401 -78 -381 249 722 -122 303 470 -664 103 1229 -271 -933 124
7339 124 514 189 251 156 -598 66 357 250 608 480 -416 -193 566 650 71 773 -145 247 250 150 -305 856
7361 856 10 -391 207 -201 -757 -527 195 -98 534 10 715 14 -415 -215 -690 1135 -452 -216 477
7380 477 219 515 -237 -1205 117 -486 488 -330 -258 281 -346 232 322 -50 -34 -450 121 157 10 144 47
7401 47 404 -414 249 -802 -461 -184 468 249 -328 816 -655 255 -215 -631 567 150 106 271 -126
7420 -126 191 104 419 -149 -167 -18 -241 507 723 -428 -908 238 595 246 -159 -1077 645 548 -188 -404
7440 -404 -95 -410 -99 -30 366 50 138 -106 -577 76 -172 -167 -66 718 250 631 28 612 127 -305 796
7461 796 247 -107 559 384 83 -76 -438 -397 -100 632 -821 233 43 164 -355 -615 188 -449 572
7480 572 582 277 140 12 -56 206 -734 -72 510 -204 358 -24 -42 -38 22 763 596 -100 -56 445 -947 -340
7502 -340 246 391 -423 -1103 498 901 561 -16 -36 132 214 419 820 729 -708 -111 -106 -490 -340 211 -443
7523 -443 -18 -287 -150 -333 361 252 -1163 460 -692 -209 399 267 -363 275 -344 242 745 358 -546
7542 -546 -343 -751 359 -312 421 -214 336 607 -136 -68 -140 -138 519 605 -749 703 -188 115 9 294 -227
7563 -227 689 -141 26 93 -688 305 518 -171 581 92 -1358 310 709 -234 574 -109 -336 -600 -547 -367
7583 -367 1082 -137 -404 127 284 -358 766 171 725 -48 504 -438 -471 314 231 128 -359 -542 105 197
7603 197 -784 -309 -59 -99 280 -529 767 -765 835 -41 -182 491 -421 -225 370 -190 -148 149 796 -7
7623 -7 -455 -277 -376 -107 700 686 312 14 -372 760 86 561 374 -161 -339 508 92 -187 -313 -29 -639
7644 -639 -19 -16 263 50 -273 262 1091 296 269 10 493 -577 56 460 -220 -405 434 -333 350 -487 1215
7665 1215 283 -324 155 -63 -154 -277 -128 151 452 826 -34 -312 -52 502 -145 -623 840 -244 -616
7684 -616 175 -117 733 611 -249 -131 -897 -249 188 135 179 -732 -914 128 49 -345 -210 221 -1048 541
7704 541 139 215 179 -26 -15 1101 -32 -596 -510 469 -82 859 192 -76 -175 -78 251 -2 176 -383 180
7725 180 -256 51 -109 -242 -40 -745 969 19 -409 -96 -88 -121 -238 1145 -154 -858 -648 508 -23 -112
7745 -112 -178 -10 -465 -495 1157 414 284 -775 84 183 700 107 831 530 176 119 769 291 -458 -160 171
7766 171 146 42 241 217 391 -89 -639 -137 578 -584 464 500 -164 516 98 525 236 804 -269 625
7786 625 127 635 98 427 -183 0 333 -150 303 -95 -151 412 -379 405 -414 -148 -17 142 547 542 -158
7807 -158 -330 179 563 653 319 782 106 -125 126 -345 -464 -858 -416 509 419 238 -539 591 -309 -276 622
7828 622 -441 530 -257 11 -521 -405 129 31 -136 283 -859 277 99 826 -166 245 413 147 834
7847 834 168 624 -768 -329 -10 -162 329 47 343 -219 -614 617 -578 -300 58 101 107 244 592 407
7867 407 -392 99 651 99 -885 702 -253 -432 -12 -948 0 -2 543 -56 -478 -34 -131 603 -163 -697 -725
7888 -725 -559 -464 394 242 -461 -616 102 826 -122 -298 -456 -700 81 -286 705 926 -798 -507 127 -1155
7908 -1155 -961 1202 -357 -716 -1279 -91 209 -135 -630 530 -8 -930 -803 -575 -234 116 96 908 219
7927 219 56 126 117 -274 200 858 910 1059 -293 -356 983 -251 265 -459 520 -427 -70 85 -214 -320 -177
7948 -177 142 -454 552 185 134 -599 196 250 166 -168 -941 -187 -243 675 -201 -533 412 8 463 927 899
7969 899 659 -62 186 18 382 1023 1110 104 509 590 -296 184 -93 559 194 -556 766 -453 248 -551
7989 -551 29 -261 -12 -58 -1024 214 90 -275 385 611 -126 -318 944 194 209 -20 -12 372 52 617 875
8010 875 237 733 317 -351 -59 573 161 -303 32 835 753 -111 -887 -407 1032 506 508 268 -335 365 -966
8031 -966 83 355 -34 238 716 183 676 399 -223 32 -201 54 -366 323 -223 -735 80 514 -608
8050 -608 -321 -161 1296 -514 -65 532 -323 711 -462 -677 302 971 741 -718 371 613 -235 38
8068 38 630 113 -171 -433 189 148 -391 -204 837 146 -1152 -51 -365 -261 224 1062 -696 442 1283
8087 1283 -212 -110 947 -386 -718 570 954 555 490 425 -104 -249 671 112 259 -901 450 458 -529
8106 -529 19 360 -299 -13 624 -141 101 -320 -709 -192 331 -252 122 647 -591 -624 -556 682 172 -335
8126 -335 -515 -799 33 196 -378 134 273 -74 -225 -11 -521 -1294 345 218 -718 -20 47 -317 -265 -728
8146 -728 1128 -566 -315 273 247 514 -763 780 774 -321 -134 927 650 290 228 -294 429 365 358 -911
8166 -911 -179 -85 -208 -338 246 476 -486 28 485 328 -664 922 517 -352 542 -665 185 -179 101 -283
8186 -283 -126 74 -579 66 -964
8191i64
##END NTUPLES=NMR FID
##END=
