##TITLE=1H_AT-39
 CCl4+Pyr-d5, 56 sc, 
 14.3.2019
##JCAMPDX= 6.0         $$ Bruker NMR JCAMP-DX V2.0
##DATA TYPE= NMR FID
##DATA CLASS= NTUPLES
##ORIGIN= UXNMR, Bruker Analytische Messtechnik GmbH
##OWNER= root
$$ XWIN-NMR		Version 3.5
$$ Thu Mar 14 15:42:21 2019 Russian Standard Time (UT+4h)  she@DPX200
##.OBSERVE FREQUENCY= 200.1315
##.OBSERVE NUCLEUS= ^1H
##.DELAY= (6, 6)
##.ACQUISITION MODE= SIMULTANEOUS
##.ACQUISITION SCHEME= undefined
##.AVERAGES= 64
##.DIGITISER RES= 18
##SPECTROMETER/DATA SYSTEM= spect
##.PULSE SEQUENCE= zg30
##.SOLVENT NAME= Pyr
##.SHIFT REFERENCE= (INTERNAL, Pyr, 0, 15.7039)
##AUDIT TRAIL= $$ (NUMBER, WHEN, WHO, WHERE, WHAT)
$$ ##TITLE= Audit trail, XWIN-NMR		Version 3.5
$$ ##JCAMPDX= 5.01
$$ ##ORIGIN= Bruker BioSpin GmbH
$$ ##OWNER= she
$$ F:/spectra/data/she/nmr/H-F/1/audita.txt
$$ ##AUDIT TRAIL=  $$ (NUMBER, WHEN, WHO, WHERE, WHAT)
(   1,<2019-03-14 15:41:29.26 +0400>,<she>,<DPX200>,
      <continue with go, POWCHK disabled, PULCHK disabled
       configuration hash MD5:
       00 E9 B6 7A A2 85 ED C7 34 08 36 98 17 FE 4E 26
       data hash MD5: 16K
       58 55 02 6B 07 74 C4 F8 53 53 B0 94 BA F8 C6 44>)
$$ ##END=
$$ 
$$ hash MD5
$$ F6 51 0C 56 22 13 8D 22 76 52 07 F6 11 9E AE 32
##$RELAX= 
##$RELAX= 
##$RELAX= 
##$RELAX= 
##$RELAX= 
##$RELAX= 
$$ Bruker specific parameters
$$ --------------------------
##$DU= <F:/spectra>
##$EXPNO= 1
##$NAME= <H-F>
##$PROCNO= 1
##$TYPE= <nmr>
##$USER= <she>
##$AMP= (0..31)
100 100 100 100 100 100 100 100 100 100 100 100 100 100 100 100 100 100 
100 100 100 100 100 100 100 100 100 100 100 100 100 100 
##$AQSEQ= 0
##$AQ_mod= 1
##$AUNM= <au_zg>
##$AUTOPOS= <>
##$BF1= 200.13
##$BF2= 200.13
##$BF3= 200.13
##$BF4= 200.13
##$BF5= 200.13
##$BF6= 200.13
##$BF7= 200.13
##$BF8= 200.13
##$BYTORDA= 1
##$CFDGTYP= 0
##$CFRGTYP= 5
##$CHEMSTR= <none>
##$CNST= (0..31)
1 1 145 1 1 1 1 1 1 1 1 1 1 1 1 1 1 1 1 1 1 1 1 1 1 1 1 1 1 1 1 1 
##$CPDPRG= <>
##$CPDPRG1= <>
##$CPDPRG2= <>
##$CPDPRG3= <>
##$CPDPRG4= <mlev>
##$CPDPRG5= <mlev>
##$CPDPRG6= <mlev>
##$CPDPRG7= <mlev>
##$CPDPRG8= <mlev>
##$CPDPRGB= <>
##$CPDPRGT= <>
##$D= (0..31)
0 1.2 0 0 0 0 0 0 0 0 0 0.03 0 0 0 0 0 0 0 0 0 0 0 0 0 0 0 0 0 0 0 0 
##$DATE= 1552563510
##$DBL= (0..7)
120 120 120 120 120 120 120 120 
##$DBP= (0..7)
150 150 150 150 150 150 150 150 
##$DBP07= 0
##$DBPNAM0= <>
##$DBPNAM1= <>
##$DBPNAM2= <>
##$DBPNAM3= <>
##$DBPNAM4= <>
##$DBPNAM5= <>
##$DBPNAM6= <>
##$DBPNAM7= <>
##$DBPOAL= (0..7)
0.5 0.5 0.5 0.5 0.5 0.5 0.5 0.5 
##$DBPOFFS= (0..7)
0 0 0 0 0 0 0 0 
##$DE= 6
##$DECBNUC= <off>
##$DECIM= 24
##$DECNUC= <off>
##$DECSTAT= 4
##$DIGMOD= 1
##$DIGTYP= 9
##$DL= (0..7)
0 120 120 120 120 120 120 120 
##$DP= (0..7)
150 150 150 150 150 150 150 150 
##$DP07= 0
##$DPNAME0= <>
##$DPNAME1= <>
##$DPNAME2= <>
##$DPNAME3= <>
##$DPNAME4= <>
##$DPNAME5= <>
##$DPNAME6= <>
##$DPNAME7= <>
##$DPOAL= (0..7)
0.5 0.5 0.5 0.5 0.5 0.5 0.5 0.5 
##$DPOFFS= (0..7)
0 0 0 0 0 0 0 0 
##$DQDMODE= 0
##$DR= 18
##$DS= 0
##$DSLIST= <SSSSSSSSSSSSSSS>
##$DSPFIRM= 0
$$ [...]
##$SUBNAM2= <"">
##$SUBNAM3= <"">
##$SUBNAM4= <"">
##$SUBNAM5= <"">
##$SUBNAM6= <"">
##$SUBNAM7= <"">
##$SUBNAM8= <"">
##$SUBNAM9= <"">
##$SW= 24.9337058887773
##$SWIBOX= (0..15)
0 0 2 0 0 0 0 0 0 0 0 0 0 0 0 0 
##$SW_h= 4990.01996007984
##$TD= 16384
##$TD0= 1
##$TE= 0
##$TE2= 300
##$TE3= 300
##$TEG= 300
##$TL= (0..7)
0 120 120 120 120 120 120 120 
##$TP= (0..7)
150 150 150 150 150 150 150 150 
##$TP07= 0
##$TPNAME0= <>
##$TPNAME1= <>
##$TPNAME2= <>
##$TPNAME3= <>
##$TPNAME4= <>
##$TPNAME5= <>
##$TPNAME6= <>
##$TPNAME7= <>
##$TPOAL= (0..7)
0.5 0.5 0.5 0.5 0.5 0.5 0.5 0.5 
##$TPOFFS= (0..7)
0 0 0 0 0 0 0 0 
##$TUNHIN= 0
##$TUNHOUT= 0
##$TUNXOUT= 0
##$USERA1= <user>
##$USERA2= <user>
##$USERA3= <user>
##$USERA4= <user>
##$USERA5= <user>
##$V9= 5
##$VALIST= <valist>
##$VCLIST= <CCCCCCCCCCCCCCC>
##$VD= 0
##$VDLIST= <DDDDDDDDDDDDDDD>
##$VPLIST= <PPPPPPPPPPPPPPP>
##$VTLIST= <TTTTTTTTTTTTTTT>
##$WBST= 1024
##$WBSW= 4
##$XGAIN= (0..3)
0 0 0 0 
##$XL= 0
##$YL= 0
##$YMAX_a= 753817
##$YMIN_a= -688182
##$ZGOPTNS= <>
##$ZL1= 120
##$ZL2= 120
##$ZL3= 120
##$ZL4= 120
##$ABSF1= 10
##$ABSF2= 0
##$ABSG= 5
##$ABSL= 3
##$ALPHA= 0
##$AQORDER= 0
##$ASSFAC= 0
##$ASSFACI= 0
##$ASSFACX= 0
##$ASSWID= 0
##$AUNMP= <proc_1d>
##$AZFE= 0.1
##$AZFW= 0.1
##$BCFW= 1
##$BC_mod= 2
##$BYTORDP= 1
##$COROFFS= 0
##$CY= 11.3945322036743
##$DATMOD= 1
##$DC= 2
##$DFILT= <>
##$DTYPP= 0
##$F1P= 18.9103706918063
##$F2P= -1.10871071338519
##$FCOR= 0.5
##$FTSIZE= 0
##$FT_mod= 4
##$GAMMA= 1
##$GB= 0.15
##$INTBC= 1
##$INTSCL= 1
##$ISEN= 128
##$LB= 0.24
##$LEV0= 0
##$LPBIN= 0
##$MAXI= 10000
##$MC2= 0
##$MEAN= 0
##$ME_mod= 0
##$MI= 1.114404
##$NCOEF= 0
##$NC_proc= 0
##$NLEV= 6
##$NOISF1= 3.799351
##$NOISF2= 2.8
##$NSP= 1
##$NTH_PI= 0
##$NZP= 0
##$OFFSET= 15.70392
##$PC= 1
##$PHC0= -9225.313
##$PHC1= 18.40026
##$PH_mod= 1
##$PKNL= yes
##$PPARMOD= 0
##$PSCAL= 0
##$PSIGN= 0
##$REVERSE= no
##$SF= 200.130013532006
##$SI= 16384
##$SIGF1= 3
##$SIGF2= 2
##$SINO= 400
##$SIOLD= 16384
##$SREGLST= <1H.CDCl3>
##$SSB= 0
##$STSI= 0
##$STSR= 0
##$SW_p= 3612.71676300578
##$SYMM= 0
##$S_DEV= 0
##$TDeff= 0
##$TDoff= 0
##$TI= <>
##$TILT= no
##$TM1= 0
##$TM2= 0
##$TOPLEV= 0
##$USERP1= <user>
##$USERP2= <user>
##$USERP3= <user>
##$USERP4= <user>
##$USERP5= <user>
##$WDW= 1
##$XDIM= 8192
##$YMAX_p= 0
##$YMIN_p= 0
$$ End of Bruker specific parameters
$$ ---------------------------------
##NTUPLES= NMR FID
##VAR_NAME=  TIME,          FID/REAL,        FID/IMAG
##SYMBOL=    X,             R,               I
##VAR_TYPE=  INDEPENDENT,   DEPENDENT,       DEPENDENT
##VAR_FORM=  AFFN,          ASDF,            ASDF
##VAR_DIM=   8192,          8192,            8192
##UNITS=     SECONDS,       ARBITRARY UNITS, ARBITRARY UNITS
##FACTOR=    0.0002004,     1,               1
##FIRST=     0,             0,               0
##LAST=      1.6414764,     0,               0
##MIN=       0,             -688182,         0
##MAX=       1.6414764,     753817,          0
$$ Real data points
##PAGE= N=1
##DATA TABLE= (X++(R..R)), XYDATA
0@%%%%%%%%%l9J03j28J28j28J64k28K56l20L84m48N24n88P04q32R60j088J227
27F51j399J593j802K038k293K565k869L211l582L985m429M917n455O046o692P411
43C896q209R088j0074J1188j2449J3882j5536J7474j9781K2573k6037L0481l6415
56a9919M4793n7623P9989j30314M68378j13712m77280O59736K99769m77543m76885
67b00611M50540L94478l90571n27165L20660M86257k35332n39486J76815N10581
77D46166r3917n23032M5116M84290J3044n06081r4960M30561J22059m37093j95793
88c09640L49695J94814l47795k40056K90000K56327k62465k78658K17151K96726
98A66099j75067k93771J40773L00386j08539k99871P3300K95371m6099k93254
$$ plain form
0 0 0 0 0 0 0 0 0 0 0 -39 64 -64 64 -64 100 -128 128 -192 192 -256 268 -320 384 -448 512 -576 651
27 651 -748 845 -957 1081 -1212 1353 -1516 1695 -1887 2098 -2331 2586 -2869 3177 -3515 3896
43 3896 -4313 4775 -5299 5889 -6560 7322 -8214 9260 -10521 12052 -13985 16496 -19919
56 -19919 24874 -32749 47240 -83074 385304 271592 -205688 454048 753817 276274 -200611
67 -200611 249929 644407 253836 -273329 47331 533588 298256 -241230 -64415 446166
77 446166 352249 -170783 -125667 358623 371667 -134414 -229374 201187 323246 -113847 -309640
88 -309640 40055 234869 -112926 -352982 -62982 193345 -69120 -347778 -130627 166099
98 166099 -8968 -302739 -161966 138420 29881 -269990 -196690 98681 52582 -240672
108b40672J0233K73205O496k63050k6126K51364M3303k38283m9572K41985P8706
119H7589k15314o9633K26408R8386k10782j02653K11110J24493k05858j56710
129b12964J79775J63711j69208j83845J46453J97725j19094j93405J16191K20726
139A46065p3623k05775P0086K18305m6536k22972K6701K21397j8483k43753j9290
150a47878K33618L8730k40303o5367K40285J02290k25300j19060K33437J69522
160B19974j99988j91716J83377K22968j51497k47021J12570K53059r1871k80263
170a70408M0610K73151o506k76111l3274K66796P3417k44558r4714K37785J35226
181B01414k06707j53739J83311J79894j52883j95355J16755J96009r4633k11650
$$ plain form
108 -240672 -230439 42766 49262 -213788 -239914 11450 54753 -183530 -233102 8883 87589
119 87589 -127725 -197358 29050 127436 -83346 -185999 25111 149604 -56254 -212964
129 -212964 -33189 130522 -38686 -222531 -76078 121647 2553 -190852 -74661 146065
139 146065 72442 -133333 -63247 155058 108522 -114450 -87749 133648 115165 -128588 -147878
150 -147878 85740 124470 -115833 -181200 59085 161375 -63925 -182985 50452 219974
160 219974 19986 -171730 11647 234615 83118 -163903 -51333 201726 109855 -170408
170 -170408 -129798 143353 136847 -139264 -172538 94258 167675 -76883 -171597 66188 201414
181 201414 -5293 -159032 24279 204173 51290 -144065 -27310 168699 74066 -137584
191a37584N6964K07002l1954k06871L092K07012L6442j81439m7349J81063Q7198
202A73576j47702r4332J34925J14565j09692j26014P6392J22586n8532j26797
212d1025L2434J14571j4882j06981K326J01144J3514q5074j7462P1778J8810o6083
224B3070k6330N1581J4375o0118k8811M2636J6945n1515k9311L6285K1832m1292
236c0653k7728L4768K9083l0245k9933K4377K9454k0235k6739J6193K0247j9465
248c0876k3041J1724J7877j7319j9472J3812J8253j7475j4585K4956K7003j5540
260b4683k2877K5841L8958j2805l3801J5587M4044o147m9068l563M7855R900n2500
273b3259k1749M4359L0967l8947l4266L8717M5998k3862m4933K1953N2511j2083
$$ plain form
191 -137584 -80620 126382 94428 -112443 -109351 97661 134103 -47336 -94685 86378 173576
202 173576 25874 -68458 66467 181032 71340 -54674 21718 144304 85772 -41025
212 -41025 -8591 105980 91098 -15883 -13557 87587 101101 16027 -1435 70343 89153 23070
224 23070 -3260 48321 62696 2578 -26233 16403 33348 -18167 -47478 -11193 10639 -30653
236 -30653 -58381 -23613 5470 -24775 -54708 -30331 -877 -21112 -47851 -31658 -11411 -30876
248 -30876 -53917 -42193 -24316 -41635 -61107 -47295 -29042 -46517 -61102 -36146 -9143 -24683
260 -24683 -47560 -21719 17239 4434 -29367 -13780 30264 24117 -24951 -28514 19341 29241 -23259
273 -23259 -45008 -649 30318 -8629 -42895 -4178 41820 17958 -26975 -5022 47489 35406
285C5406n3498n36M8114J024n4881j7181M6403J5355n0689k7959M4657L6257l7925
298a5453m2466L3653N3049k1548n5018J2914O0855N82o2926j5583N8801K5498
310C2358n4863m2734M3165M9816l2473n6722K0255O4286l304o2025o067O1884
322A3576K4970n3088l1878M6797M1265l7283m7682K5439M8642j7700n1896O090
334c2748M9316P5m7155n287M4612J6518m0830j4712M1650K5918l3866k7910L2668
347H249L2883k6316l7849K0139L8796j6113m2314R375M3104J769m0338m720M2148
360B8813J6532l1594j6296L2523K3513k4676k2671J7327K4061j4538k5120P229
372A5103J8795p767j9477L285J5136n272j5399L768J3951m642j4345N953J3583
$$ plain form
285 35406 -18092 -18628 29486 30510 -24371 -41552 4851 20206 -30483 -58442 -13785 22472 -15453
298 -15453 -57919 -24266 28783 7235 -47783 -34869 25986 26568 -36358 -51941 6860 32358
310 32358 -22505 -65239 -22074 27742 -4731 -61453 -41198 23088 19784 -42241 -48308 13576
322 13576 38546 -14542 -46420 377 41642 4359 -43323 -17884 30758 13058 -38838 -32748
334 -32748 16568 16643 -30512 -35799 8813 25331 -15499 -30211 11439 37357 3491 -24419 8249
347 8249 41132 14816 -23033 -2894 35902 19789 -22525 -13150 29954 31723 -8615 -13335 28813
360 28813 45345 13751 -2545 29978 53491 28815 6144 23471 47532 32994 7874 15103
372 15103 33898 26131 6654 9939 25075 19803 4404 8172 22123 17481 3136 9089 22672
385B2672p426j6615L439J3184l731j8841p06J2186l459j4729Q9J2035j461j3102
399a6465J987J3540k510j1314O562J4362o578j6183R316K2886r935k5703O163
412a3872L0487j389l4683k398L8913J2396l9273j6905M1636K9165l5171l3332
424b4426L3079M0592k5894m5989J8044M7413j3617n3823P69M9575K111n1612j3478
437c7256M6709J5902m7241k4787M2259K7678m2608l2150L3991L5743l2410m2141
449e6311K5097M3720k3020m9373J3659N0272q876n2175N67N0909P853m5385j3338
462e6401M5502K1507l8125k2303L6215K7176k7241k5065K3554K7538j8244k5446
474c1333J7699K4804j3491k2627J4144K4776j1261k0727J4923K4572j2111k2681
$$ plain form
385 22672 15246 -1369 2070 15254 11523 -7318 -8024 4162 703 -14026 -13937 -1902 -3363 -16465
399 -16465 -14478 -938 -3448 -14762 -8200 6162 -416 -16599 -7283 15603 5668 -20035 -13872
412 -13872 16615 15226 -19457 -21855 17058 29454 -9819 -26724 14912 44077 8906 -24426
424 -24426 8653 49245 23351 -22638 -4594 42819 29202 -24621 -23852 25723 27834 -23778 -37256
437 -37256 9453 25355 -21886 -46673 -4414 23264 -19344 -51494 -17503 18240 -14170 -56311
449 -56311 -31214 12506 -10514 -59887 -46228 4044 -4832 -57007 -56440 -5531 2322 -43063 -56401
462 -56401 -10899 10608 -27517 -49820 -13605 13571 -13670 -38735 -15181 12357 -5887 -31333
474 -31333 -13634 11170 -2321 -24948 -10804 13972 2711 -18016 -3093 21479 9368 -13313
486a3313J3796K8441r634k9735R191K9458n325l1402J012L3512Q45l1797l426
499h377L2409Q297k9078r037L1124J0438k7921j1588K9327J3079k8324j6153K8278
512B2474J7630k9186k1116L0522K3001l1058l0223L0708L5833k8882m0689K3689
524B703M5123j8642n0870J1950N3437p223n5615l556N4266Q686n5318j7299N1309
537A8951K0331n1428k8593M7635L2623m4212l9069L8055M3891l5929m7559L1590
549a3714N0312k6743n4778J8347O0236j3889o2267L786O2280N292o2193j3077
561d6408O1642K2349n5775k8630N3260L7253m3346m0698L9314M3821l1033m4788
573c3039K5154M6906j9626m7591J3333M6058q417m5329M814M3221k640m3196r78
$$ plain form
486 -13313 483 28924 19290 -10445 -1254 28204 22879 -8523 -7511 26001 26846 -4951 -8377
499 -8377 24032 32329 3251 -5786 25338 35776 7855 -3733 25594 38673 10349 -5804 22474
512 22474 40104 10918 -10198 20324 43325 12267 -17956 12752 48585 19703 -20986 2703
524 2703 47826 29184 -21686 -9736 43701 36478 -19137 -22693 31573 40259 -15059 -32358 18951
537 18951 39282 -12146 -40739 6896 39519 -4693 -43762 -5707 38184 2255 -45304 -13714
549 -13714 36598 9855 -44923 -26576 33660 19771 -42496 -38710 23570 28862 -33331 -46408
561 -46408 15234 37583 -18192 -46822 6438 43691 345 -40353 -1039 42782 11749 -33039
573 -33039 -7885 39021 19395 -28196 -14863 31195 22778 -22551 -17737 25484 22844 -20352 -21330
586b1330M3138J643m4145o522M2995Q523m3837j5006L9793J9168m2897k3858L8113
599d222K5739l7597k9603L2448L2763k9726l3942K6432L7788k2763l7631J8810
611b1504M0104j5172m1069J2925M2076r059m3824Q166M6299l818m5316r02N2130
624B1036P606n1183r528N1203K0149m9745k4874M6996L2084m2297l8653L9245
636B039M2204l3097m5014K7305M9735k1857n0959J6054N4008j0113n4284L258
648b0721N5023m26n3571o018N2071J1567n3062j8687N1746K5427n0801l1409M7235
661H374L7729m3170m5370L6132M9753k9295n3591K1988N6678j3257n6766N658
673b5137N8104J304n4895j1224N2940J6071m9858k1765M3951K5272l9143k9397
$$ plain form
586 -21330 21808 23451 -20694 -27216 15779 24302 -19535 -34541 5252 24420 -18477 -42335 -4222
599 -4222 21517 -16080 -45683 -13235 19528 -10198 -44140 -17708 20080 -2683 -40314 -21504
611 -21504 18600 3428 -37641 -24716 17360 8301 -35523 -27357 18942 15124 -30192 -31094 21036
624 21036 28642 -22541 -32069 19134 39283 -10462 -35336 11660 43744 1447 -37206 2039
636 2039 44243 11146 -33868 -6563 43172 21315 -29644 -13590 40418 30305 -23979 -20721
648 -20721 34302 33876 -19695 -25713 26358 37925 -15137 -33824 17922 43349 -7452 -38861 8374
661 8374 46103 2933 -42437 -6305 43448 14153 -39438 -17450 39228 25971 -30795 -25137
673 -25137 32967 34271 -20624 -31848 21092 37163 -12695 -34460 9491 34763 -4380 -33777
685c3777L5447L0931k9195l2277K5655L5540k2098l5351J8252L6214j5565l7593
697b3817R767L7920n737l9501J256L6531L271l5128n838L4788J0348k9953j4086
710b0179K9118J4667k5185j6549K1571J6985j9818j6759J7204J7552j4495j7575
722a3463J4476J9806j4081j8939J4393J9504j2665k2929J2405K3414r579k5621
734a3279N702K7084m921k7225pK7460J661k6854p686K6362R206k6374j2369K2750
748A510J3283k1807j6243J9628J6435j7527j8526J7102J7515j4017k0762J2301
760a1108K1476j2116k4232R674K4832m397k8011K881K8343L473k7346o588K6870
773C751R845k3537j3971K2450J6611j8300j9601J5471K0106q790k0887P265K0896
$$ plain form
685 -33777 1670 32601 3406 -28871 -3216 32324 10226 -25125 -6873 29341 13776 -23817
697 -23817 -14050 23870 18133 -21368 -20112 16419 19690 -15438 -21276 13512 23860 -6093 -20179
710 -20179 8939 23606 -1579 -18128 3443 20428 610 -16149 1055 18607 4112 -13463
722 -13463 1013 20819 6738 -12201 2192 21696 9031 -13898 -1493 21921 12342 -13279
734 -13279 -7577 19507 14586 -12639 -12646 14814 16475 -10379 -18065 8297 17503 -8871 -21240 1510
748 1510 14793 -7014 -23257 -3629 12806 -4721 -23247 -6145 11370 -2647 -23409 -11108
760 -11108 10368 -1748 -25980 -16306 8526 4129 -23882 -21001 7342 10815 -16531 -23119 3751
773 3751 13596 -9941 -23912 -1462 15149 -3151 -22752 -7281 12825 4035 -16852 -9587 11309
786A1309k574j9603J284J8431L438j7374l488J4560M919j3526o214J2038P605
799A0805j1435q555R548Q501p265r982N046J1674l993j1796K050R189K785r671
813c099m309P819O293n345o951K606Q516m26q004k391O875N395n244n834L551
828e48O313L62p170j319P841L290n543n045N214O206l985p283L233O656k816o085
844f79K249O458j832p313Q33Q410l70r326j75Q997K835j1440m208R991O826j2921
860a665o076R630R249p854j1769P340J1316m757j2714L089J3014j012j3406m23
874f038J2369R90j0066k692J0128L079j0286l877J1507K420j0297m135J1016M811
888H929j2151o326J1385P879j2731q875J1697R895j0214j3030R478J2904p918
$$ plain form
786 11309 8735 -10868 -9584 8847 12285 -5089 -8577 5983 10902 -2624 -8838 3200 10805
799 10805 -630 -9185 363 8864 1599 -8383 -3337 8337 4344 -7452 -5402 3787 6572 -3099
813 -3099 -7408 411 6704 1359 -5592 -2986 5530 5104 -2900 -5291 1584 6979 1735 -4099 -548
828 -548 5765 6127 -1043 -2362 5479 8769 3226 -1819 3395 9601 5616 -1667 1566 8222 5406 -679
844 -679 1570 8028 6196 -1117 -284 8126 7756 -1570 -1745 7252 10087 -1353 -5561 4430 11256 -1665
860 -1665 -7741 1889 11138 3284 -8485 -1145 10171 5414 -7300 -4211 8803 7791 -5615 -6038
874 -6038 6331 7321 -2745 -5437 4691 7770 -2516 -6393 5114 7534 -2763 -6898 4118 8929
888 8929 -3222 -9548 1837 9716 -3015 -11890 -193 9702 -512 -13542 -4064 8840 922
901I22j5802O356J6606n286j7683K727J6542j143j5733J62J5817J695j5955k385
915a3160J6686L996j6904o004J7799P517j8053r401J8380J2829j7169j4748J6792
928a440J7922j3991j9456J2485K1706q585k3798O278K5084k967k4806j041K5871
941A3262L489k4475o060K2516Q568k0870j0491J9813J2582j9171j4306J7765J4915
954A7537j5917j6960J4021J8710j3838k0540J0972K2387q334k4753O192K4054
966A3531j396k5672j489K5606M275k4900o379K3089J0460k2299j1727J9446J3837
979A6382j6930j6164J6981J5576j3596j7720J3171J7507j1682j8782J1037J9645
991A5425p848k1092O596K2353m533k3067J685K3604O46k4038l233K4118N443k2192
$$ plain form
901 922 -14880 -8524 8082 2796 -14887 -12160 4382 3239 -12494 -12332 3485 5180 -10775 -13160
915 -13160 3526 7522 -9382 -15386 2413 9930 -8123 -17524 856 13685 -3484 -18232 -1440
928 -1440 16482 2491 -16965 -4480 17226 8641 -15157 -8879 16205 13238 -11568 -12609 13262
941 13262 16751 -7724 -13784 8732 17300 -3570 -14061 5752 18334 -837 -15143 2622 17537
954 17537 1620 -15340 -1319 17391 3553 -16987 -6015 16372 8038 -16715 -10523 13531
966 13531 12135 -13537 -15026 10580 14855 -10045 -16424 6665 17125 -5174 -16901 2545 16382
979 16382 -548 -16712 269 15845 2249 -15471 -2300 15207 3525 -15257 -4220 15425
991 15425 7577 -13515 -6919 15434 10901 -12166 -10481 13123 13769 -10269 -13502 10616 16059 -6133
1005f133q983K1799J1866k0681j4013J8438J5321j5996j6452J4153J6521j0934
1017D906j8539R253J8606p473j9266N876K0351m779k1715L174K1844J07k2499
1030a0154k879K2267N169k2216p304K1571R730k0608j1906J8472J5060j6764j7042
1043a6604J3542J7834r874j9516P030J9766m589j8863J704J8455r75j7820o03
1056a0513J6866K899j6773l762J6108M608j4984o725J4279R528j5911r005J3307
1069g8J0609j1997j1824J1548J2728q583j3985P171J4980n927j4208L247J4212
1082G893j094j3325m36J2435J222j1672k507J1424K099j0155j719R280L219r779
1096c115m160R362N587j0616n185R334O191r327p433Q739P279p190r009N710J0754
$$ plain form
1005 -6133 -15116 6683 18549 -2132 -16145 2293 17614 1618 -14834 -681 15840 4906
1017 4906 -13633 -4380 14226 6753 -12513 -6637 13714 8935 -12780 -9606 12238 12345 -10154
1030 -10154 -13033 9234 14403 -7813 -15117 6454 16184 -4424 -16330 2142 17202 438 -16604
1043 -16604 -3062 14772 4898 -14618 -7588 12178 7589 -11274 -9570 8885 7910 -9910 -10513
1056 -10513 6353 9252 -7521 -11283 4825 9433 -5551 -12276 2003 11531 -4380 -13385 -78
1069 -78 10531 -1466 -13290 -1742 10986 2403 -11582 -4411 10569 4642 -9566 -6319 7893
1082 7893 6799 -6526 -6962 5473 6695 -4977 -7484 3940 6039 -4116 -5835 3445 6664 -3115
1096 -3115 -7275 2087 7674 -2942 -8127 1207 7398 -1929 -9362 -623 6656 -534 -9543 -3833 6921
1111F921n477r707K489J0494j036j0763j57R933P62r162j501R018K891r314j878
1126f487Q047K394p572k836P240M349p280n445Q173N688o609p389O243R785n966
1141B335q035K783R275j253j0178q1J0334J410p950l768P894M263o221m704M705
1156H09N073k837n640L200L503j039m365R75M460k238l067P43L028n4m309J288
1172d70L653p24l655K78J681J411k694k001L194J010j065j710p44K950N30j541
1188A03k045K491M09j36n92j512R37J257N86l178j88K638J008k449j902K126L011
1205B564k003l062M18M426j668l607K18L707J533l886n14J424J879k292j017J921
1221D1P13j003j703K424M50j735j431L073P36k148k225R16M382j933l612R99L989
$$ plain form
1111 6921 1444 -8263 -5774 4720 3684 -7079 -7236 2697 3459 -5703 -7204 1814 4705 -4609 -6487
1126 -6487 1560 3954 -3618 -6454 786 5135 -2145 -7590 583 6271 -338 -7727 -1484 8301 2335
1141 2335 -5700 -2917 6358 5105 -5073 -5154 5180 6590 -1360 -5128 2766 7029 808 -3896 809
1156 809 5882 3045 -2595 605 4108 3069 -1296 -321 4139 1901 -1166 -423 2605 2551 -1758 -470
1172 -470 3183 2459 -1196 -918 763 2174 -520 -2521 673 1683 618 -1092 -1836 1114 1644 103
1188 103 -1942 549 958 822 230 -1282 -345 912 1498 -1680 -1868 770 1778 -671 -2573 -447 2564
1205 2564 561 -2501 -2083 2343 675 -2932 -2714 993 2526 -1360 -1874 -450 1429 -863 -1880 41
1221 41 754 -249 -1952 472 922 -813 -2244 829 1565 -583 -2808 -1892 2490 557 -3055 -2056 1933
1238A933k55m630O26L353R07k947k188L905J081k424k137J944K729j161j914L70
1254h08Q42n15N27o02N89m75P6J069o65j294O62J362M78k442J13J594j08j560
1272a157j98K047l17j318q81K289P7j070m82J544L33j349j546K666J349l462p28
1289b203L659J963l314l097L959L215l180l742J005N993j698n714J299N569p5
1304C639n231k821O778K625n308m173N226K981k608m067K109M370k718l560J842
1319i16M370k905k942J172L848j921m480L313L024j128l915q14N988m76m558n91
1335b931M791J198l986j698M226J731l914j471K654K613l301j815K293J616j435
1350E71k964K369J326j870j470K327J236k490k187L618L368m225l493K844M236
$$ plain form
1238 1933 1678 -2952 -2326 1027 1934 -1013 -3201 704 1785 -639 -2776 -832 1897 736 -1178 -808
1254 -808 34 -481 46 -556 33 -442 -366 703 38 -1256 -594 768 1246 -1196 -1083 511 403 -1157
1272 -1157 -1355 692 375 -943 -1824 465 542 -528 -1010 534 867 -482 -2028 638 1987 -1475 -2203
1289 -2203 1456 3419 105 -2992 967 4182 1002 -2740 -1735 4258 2560 -3154 -1855 3714 3639
1304 3639 -1592 -4413 2365 4990 -318 -4491 735 3716 1108 -2959 -850 3520 802 -2758 -916
1319 -916 3454 549 -2393 -1221 2627 706 -3774 -461 2563 1435 -2480 -3294 2694 2218 -2340 -2931
1335 -2931 1860 3058 -928 -2626 1600 3331 -583 -2054 600 3213 -88 -1903 390 2006 571
1350 571 -2393 -24 1302 -568 -2038 289 1525 -965 -3152 466 3834 -391 -3884 -1040 3196
1365C196l072m404K514N059j715n636K100N040q37n125K08N007P54n328n66M629
1381A824N37m271r66M440K454n679j481N921J870o280l738O556M121n882n649
1396f223O245O606n168p963M527Q399l806q389K190R167n58r713m92R358O98q406
1412c528k470Q805L326p971m510Q812L072o567n210O814M835o404n882O607O150
1427E879m847p757M419Q332m250q237K415R024j253q258K9R578N58r424k349J0109
1443C968K250r360l464R291M115q159m860O922O053p248n678O733O539o520o620
1458f038N812P057n213p856M439R073m623q839L185R890r23j1944R04J1166J297
1473G387j1582l333J1441M397j0585o140J0636O288r568o169Q848O222p653p998
$$ plain form
1365 3196 124 -4280 -1766 3293 1578 -4058 -1958 3082 2245 -2880 -2672 2335 3089 -2239 -2805 1824
1381 1824 2361 -1910 -2876 1564 4018 -1661 -3142 2779 4649 -1631 -5369 1187 5308 -574 -6223
1396 -6223 22 6628 1460 -6503 -1976 6423 2617 -5772 -3582 5585 5027 -4686 -5178 4180 4878 -3528
1412 -3528 -5998 2807 6133 -1838 -6348 2464 5536 -1031 -6241 573 5408 -996 -6878 -271 5879
1427 5879 1032 -6725 -2306 6026 1776 -6461 -4046 4978 3725 -4533 -4504 5074 5632 -3792 -6141 3968
1443 3968 6218 -3142 -6606 2685 6800 -1359 -6219 703 6756 -492 -6170 563 7102 582 -6038
1458 -6038 -226 6831 1618 -6238 -1799 7274 2651 -6188 -3003 6887 5964 -5980 -5076 6090 7387
1473 7387 -4195 -7528 3913 8310 -2275 -8415 2221 8509 -1059 -7228 1620 7842 189 -7809
1487g809P697Q551o464r020N153J0134m554j0759L987J1478k330j3068J543J2194
1501F733O68j2865j675J2868K991j2226m981J1075P513j1202p556R717Q573r802
1515a69r253P648J0686o467j0568M781J2317m660j1854L543J1366j096j2447Q41
1529e332J2301K12j2111k696J2835L771j3163n094J2678O021j1516p296J1153
1542A763Q893j0498r890Q475J0165n913j1480N141J1607l908j2160K745J1637
1555F577q47j2388N64J1301K385j3057j669J1630L345j1770m264J1327M642j0880
1569c104m766R201P027q984q758Q643J0232q135j0667O948J0765l805j2700L322
1583d781J1835r15j3145J659J0846J609j2434k309J1612M144j1820m349J0681
$$ plain form
1487 -7809 -112 8439 1975 -7045 -1892 8242 3688 -7071 -3084 8394 6064 -7004 -5461 6733
1501 6733 7401 -5464 -7139 5729 8720 -3506 -8487 2588 10101 -1101 -8657 1060 9633 -169
1515 -169 -9422 -1774 8912 2445 -8123 -3342 8975 4315 -7539 -3996 7370 6274 -6173 -5332
1529 -5332 6969 7181 -4930 -7626 5209 8980 -4183 -9277 3401 9422 -2094 -9390 1763
1542 1763 10656 158 -9732 -1257 8908 2995 -8485 -3344 8263 4355 -7805 -5060 6577
1555 6577 5730 -6658 -6094 5207 7592 -5465 -7134 4496 7841 -3929 -8193 3134 7776 -3104
1569 -3104 -7870 1331 8358 -626 -9384 -741 9491 1356 -9311 -2363 8402 4597 -8103 -4781
1583 -4781 7054 6139 -7006 -5347 5499 7108 -5326 -7635 3977 8121 -3699 -8048 2633
1596B633O037j1075o146J0143P259q060j0135R559R010q325r718O280J0736m952
1610C246j1089L355J1991j647j2327J5J3187J143j2097k747J1556L237j0026n252
1624g455J0445M757r280n820P887O984o497r200P784P695n589r580N611J0039
1638G781m463j0836L812R733j705j0858L11J1484L53j0425j956R966M171r710
1652b342n768Q811O743p747p443O583Q227n814q376N259P665l128q760K348Q906
1667E164k446p790O45Q218R14r393p3Q779J12o964l275P895L614q053l737O712
1683C22N354o435n271N629O427n217o462L339O415k659o783L177O553k517n690
1698c818Q50O965j311n631k40N081J595n670k130O721J994o027k077N326K973
$$ plain form
1596 2633 8670 -2405 -8551 1592 8851 791 -9344 215 9225 900 -8818 -2538 8198 3246
1610 3246 -7843 -4488 7503 5856 -6471 -6456 6731 7874 -4223 -6970 4586 7823 -2203 -7455
1624 -7455 2990 7747 -1533 -7353 534 7518 1021 -8179 -395 7300 1711 -7869 -2258 7781
1638 7781 3318 -7518 -3706 6027 4322 -6536 -6225 5259 5612 -4813 -6769 3197 7368 -2342
1652 -2342 -8110 701 7444 -303 -7746 -1163 7064 1250 -7126 -1867 5798 2670 -6090 -3742 5164
1667 5164 2718 -5072 -4427 3791 4705 -4688 -4761 4018 4130 -2834 -6109 1786 5400 -2653 -6390 322
1683 322 5676 -759 -6030 -401 6026 809 -5653 -2314 4101 1442 -5341 -2164 4389 1872 -3818
1698 -3818 -2968 3997 2686 -2945 -3185 1896 3491 -2179 -4309 2412 4406 -1621 -3698 1628 4601
1713D601n836m625N905M614m309m972L216N910l276m847J615N796r50n903k04
1728c265N319J108o049o81O412O51m705k319M361K099l041l568L151M112m234
1743f49l135M355K823k574l925K472L278j126m891M62O202j53n639M51L245K472
1759C668m456k902M802J601k707l609K988M276k775m636K379L391j470k309p65
1774b524M077j69l020r6K500J223l822M04K616J225k630k396K039K405k001j753
1790a922J130L201j932k806N10L741P51n110Q1L745N26k270k266K912R93j583
1806b99l109L177K614j930k243K043J201j367j745Q35K416j828l96o12J905K06
1822H68k200l7J957K06k087j49K563O30j728j830K246J355r97j714K68K324k00
$$ plain form
1713 4601 -1235 -5860 45 4659 350 -4622 -1406 4504 1228 -3619 -2004 3792 2842 -3061 -3265
1728 -3265 2054 3162 -2887 -3568 2844 3495 -1210 -3529 832 2931 -110 -3678 -527 3585 -649
1743 -649 -3784 571 3394 820 -3105 -633 2645 1519 -3372 -2910 3292 3139 -2500 -2049 1196 3668
1759 3668 -788 -3690 1112 2713 6 -3603 -615 3661 886 -3750 -1371 2020 550 -1759 -2524
1774 -2524 1553 1384 -1636 -1732 768 1991 -1831 -1427 1189 2414 -216 -2612 -573 1832 -169 -1922
1790 -1922 -792 2409 477 -2329 -1819 1922 2673 -2437 -2356 1389 1915 -355 -2621 291 1284 -299
1806 -299 -3408 -231 2383 453 -1790 253 1454 87 -1658 -823 1593 -235 -631 -1243 662 868
1822 868 -1332 -1369 588 794 -1293 -1442 1121 1751 23 -1807 439 1794 797 -917 -649 1675 1475
1839A475l068O0L198n04k606MK669o08j835m2J967P92k063p20K713P07l058j529
1857b448L709N95k858j441L302O66j870k392K424K863k416k060J209L286m22m524
1873b377M13L893q6l791j49L433J326l033k392L250J110k654r55K118K531k492
1889A45j689J936K000j672l118K321K346j181l252J066L165om837J205L303M18
1905B150m206m93L958J625m000k104L656K836l583l076L198L153k270l463J680
1920i39L468j507l957K134M052j275m249J084L290Q4l703n34L012J756l970j762
1936c016M497J040m201j236L247K651k825k955K562M042l566k843J306M248j753
1951A198l732J282M107r32l407L90K724l81l372j81L449N83l058p96K727K032
$$ plain form
1839 1475 -1593 -1533 1665 1161 -1445 -1441 1228 620 -1215 -1257 710 1502 -561 -1281 1432 2139 -919 -2448
1857 -2448 1261 1856 -1002 -2443 859 1525 -345 -2737 -313 2550 134 -1926 -717 2569 2147 -2377
1873 -2377 -1964 1929 1843 -1948 -2097 1336 2662 -371 -2763 487 1597 -1057 -2012 106 2637 145
1889 145 -1544 392 2392 720 -2398 -77 2269 1088 -2164 -1098 2067 2061 -2776 -1571 1732 2150
1905 2150 -2056 -2549 1409 3034 -966 -3070 586 3422 -161 -3237 -39 3114 844 -2619 -939
1920 -939 2529 1022 -2935 -801 3251 1976 -2273 -1189 2101 2185 -1518 -2052 960 2716 -1254 -3016
1936 -3016 1481 2521 -1680 -2916 331 2982 157 -2798 -236 3806 240 -2603 -1297 2951 1198
1951 1198 -2534 -1252 2855 1923 -1484 -1094 1630 1249 -2123 -2304 1145 1728 -1330 -2126 601 2633
1967B633m037j564M483Q2l199j284L300K725l210k796K277K950j783m031K653
1982h01L313j023m539R71M095j037k608q27N127r69l400m50M243n52l012l01L520
1999A750P40m017l56L162J635l703l029M688K679m281k686M180L049l899k368
2014b456J876L205j638l981J339M933k068l882P46L663J10l611O4L471L7l576
2030a768n18K707J894k848k042L379K753l885k337K824L515l737l647L122M543
2045C955l849k902J223M152p53m150K99M616l10l639j813M978N11l454j512L735
2061A087J452l476k198M493J215l002k881L498K871l187l002L983J811l381j915
2076b632J590L852j668m147J487L337m65k638p7L645O1l558j324L984J033k197
$$ plain form
1967 2633 -1404 -2968 1515 1597 -1602 -2886 414 3139 -71 -2867 -590 2360 577 -3454 -801
1982 -801 2512 1489 -3050 -2079 2016 979 -1629 -2456 2671 1702 -1698 -2148 2095 1543 -1469 -1770 1750
1999 1750 2490 -1527 -1883 1279 2914 -789 -3818 870 3549 -732 -3418 762 3811 -88 -2456
2014 -2456 -580 2625 987 -2994 -1655 3278 1210 -2672 -1926 1737 1847 -1764 -1700 1771 1808 -1768
2030 -1768 -2286 421 2315 -533 -2575 804 3557 -328 -2665 159 3674 -63 -3710 -588 3955
2045 3955 106 -2796 -1573 2579 1826 -2324 -2025 2591 2281 -1358 -3171 1807 2318 -1136 -2648 1087
2061 1087 2539 -937 -3135 1358 2573 -429 -3310 188 3059 -128 -3130 853 2664 -717 -2632
2076 -2632 -1042 2810 1142 -3005 -1518 1819 1354 -1284 -1361 2284 2345 -1213 -2537 1447 2480 283
2092B83k877L263K039k747k097K557K016k649k568L036K292k687k661K216K712
2107B128j357l240J465L853l028k337J134M289j256m174R56L158K45m030j72L467
2123A101J409n253N06L487J312l322j250K646J373k086k376L921J303k707k828
2138b764L019K501j845m361L229K924j766m156N54N243j21n101L20M530Q9m282
2154a987j334M259J479l553k013L743K633l618k424K184K466p90m143K491K546
2169A939j087l123J676K675j254k718L49L435K14m858L79M227N60l839q39J965
2185b99L098l531k353M106K234l290l057L009L125k546j894N17K588j793j994
2200b080J541K415p40k577n70M570j308k173K44J308J265k455j093K131J130k590
$$ plain form
2092 283 -2594 669 2708 -39 -2136 421 2437 -212 -2780 256 2548 -139 -2800 -584 2128
2107 2128 771 -2469 -1004 2849 -179 -2516 -1382 2907 1651 -2523 -1567 1591 1836 -2194 -2366 1101
2123 1101 2510 -2743 -2237 1250 2562 -760 -2010 636 2009 -77 -2453 1468 2771 64 -2764
2138 -2764 255 2756 911 -3450 -221 2703 937 -3219 -2665 2578 2457 -2644 -2324 2206 2295 -1987
2154 -1987 -3321 938 2417 -1136 -3149 594 3227 -391 -2815 -631 1835 1045 -3098 -607 1939
2169 1939 852 -2271 -595 2080 826 -1892 -1543 1892 2106 -2752 -2373 1854 2414 -1425 -2264 -299
2185 -299 2799 -732 -3085 1021 3255 -35 -3092 -83 3042 496 -1398 -881 1707 -86 -2080
2200 -2080 -539 1876 1136 -1441 -2011 2559 1251 -922 -678 630 1895 -560 -1653 478 1608 -982
2216i82j075K636Q19j326j516R38J639j105j985Q39L292j952j299R50N74o86j091
2233a330j44K480p59j600o43L194l55k738R68K187M83l223L75K222rk895K24J876
2251C13J267j644j240J558J473k026p85J120J495j024j737j8K731q3k139J91N06
2268d2R66k222M56J518P45k646j64J472J395k103k79Q64K094k036j911J746K227
2285B080j738k548K353J268j319j195j6K066J244l431r1Q63R25j085o75J810M37
2302I48q24q05M56O22l03p10J76Q53j012m90M88J595o31j028k2J161J087j769
2320b08m17J055P57k199k74R88J736j311p67j2J655J9j605K12L30J01n76p29J035
2339b10Q99o17k78l76J125n32O3n82R09k72Q33o99jr8m86n75M49O59n81j27L85
$$ plain form
2216 -982 -2057 579 1398 72 -1444 -506 1133 28 -1957 -1118 2174 222 -1077 -127 447 -239 -1330
2233 -1330 -1474 1006 247 -1353 -1996 1198 843 -1895 -927 1260 1743 -1480 -1105 1117 1108 -1787 -1563 313
2251 313 1580 -64 -1304 254 1727 -299 -1084 36 1531 507 -1230 -1248 1483 1400 -739 -548 -42
2268 -42 924 -1298 -842 676 1421 -1225 -1389 83 1478 -625 -904 -40 2054 18 -1893 -147 2080
2285 2080 342 -2206 147 1415 96 -1099 -1115 951 2195 -1236 -1327 -464 461 -624 -1299 511 948
2302 948 124 -681 -225 397 94 -616 -440 413 -599 -1089 -601 994 363 -665 -687 474 1561 -208
2320 -208 -625 430 1187 -1012 -1286 -298 1438 127 -640 -652 1003 1022 -583 -371 -41 60 -516 -1245 -210
2339 -210 689 72 -206 -582 543 11 74 -508 401 129 962 263 262 164 -322 -897 -448 211 -370 -497 -112
2360a12K73K88k71o44Q61k2n30P7J079j547M68r67J418m74O45j138m9J036Jj098
2380g06k13J259P61j290q57J320L77j269M95j23N37m82p91J664p11k59J95M5M87
2399D39m73n16N01P4j326K03K041j94j055n84J331L12J24k372J106J026q20j079
2417a262J775J81q3n72m59R83K19j501k29K070l88j141k60P78R70j996K96Q40
2435B21J405k208j345K007J606j958j503K056J114j191j655K5K728q63k402J262
2451g01J424J147k275r54K201M65j724j402J675J581j554j550J934J005j200j581
2467a509J061J985j168j717P77J558k21k218K94K076J98k529k89L395k23k442
2483i72q39K501Q0j715J95J406N96j634o76K151P55j347j870L62K706j227j731
$$ plain form
2360 -112 161 449 178 -466 395 373 -157 -80 999 -548 -80 -1047 371 -103 542 -596 -645 391 392 -706
2380 -706 -919 340 1101 -189 -1046 274 651 -618 -123 -246 291 -191 -982 682 -29 -288 -93 -48 439
2399 439 -34 -550 -49 25 -1301 -1098 943 749 -306 -890 441 753 877 -1495 -389 637 -183 -1262
2417 -1262 513 694 611 39 -420 563 782 -719 -948 1122 734 -407 -667 111 1081 -915 -619 221
2435 221 1626 -582 -1927 80 1686 -272 -1775 281 1395 204 -1451 -1426 1302 439 -1963 -701
2451 -701 723 1870 -405 -1359 842 1307 -417 -1819 -144 1437 -117 -1667 267 1272 72 -1509
2467 -1509 -448 1537 369 -1348 -571 987 766 -1452 -1158 918 1116 -1413 -1702 1693 1470 -972
2483 -972 -1811 690 770 -945 -750 656 1252 -382 -1058 1093 1848 501 -1369 -1007 1699 472 -1259
2500a259o1K532o45j813O21J411N54k112J019P88k25j576k59J694L78k500k4K145
2518F68Q67k282o52K204L24j285m88M30Q90j479n76J006O71k97j732J575J865
2535A709o96j925J004J078p45j353l13L123q28j520n08J406J351k595j325J803
2551c34J668j765j069J418J053j525j396K263J306j268j607R79J299m50j514K21
2567g21J966q08o32l93J142j15j005j204K141O82k027k28J457N81n05j300J391
2584D22O40r46j544K70K241l97j390r56L103r87q17j88N43Q21q63r71J70J904
2602A055j031l09R48M20k06k234J650j5p04J66P59N59o91j610N50J383j261J97
2620c74N56O44j31j163L20P94J19j826Q13R57J02j107j24O46M38j069j96P75Q06
$$ plain form
2500 -1259 -1320 1212 567 -1246 -625 786 1340 -772 247 1035 810 -766 -1025 669 1047 -1453 -1477 668
2518 668 1535 -747 -1399 805 1129 -156 -644 -214 676 -803 -1379 -373 298 1 -1731 -156 1709
2535 1709 1013 -912 92 1170 425 -928 -1241 1882 1054 -466 -974 432 1783 -812 -2137 -334
2551 -334 1334 -431 -1500 -82 971 -554 -1950 313 1619 351 -1256 -277 1022 572 -942 -721
2567 -721 1245 437 -195 -588 554 439 -566 -1770 371 1053 -974 -1202 255 836 331 -969 422
2584 422 1062 116 -1428 -1158 1083 686 -704 -1660 1443 456 -361 -549 -6 815 -48 -1019 -849 1055
2602 1055 24 -285 663 1083 877 -1357 293 278 -426 -260 499 1058 367 -1243 -693 690 -571 -374
2620 -374 182 826 695 -468 -148 646 765 -1061 -248 709 811 -296 -420 226 664 -405 -601 174 980
2639I80r24K3L49Q38j065q28J021L95q56m90J98L47Q0m24Q99j13O98k587J702
2658B43j27K88r37L3J80J685k492M70J048J25n26n70J528o26n5j029R31O39q1
2677G27j687R57O73k99o06P82j14l55k16Q79J56n85l54k95P75P27j321K7P41l8
2697E74R8j286O43O96m19l59J37l8P70j32n07l53L93j61l17P6N02l8L18m91l15
2718b09R57q02N58j203R96P57r68J76k45j11M57j333P09k5K9j05O31o7k55k26
2738b79K94K8o85J209q68N68M17j310l6L60R39r72k29L3J225j41p67m27J394R3
2758H46j546J125J57P18j337r16J254K91r22N44J6P76j355n04J105m13l55J52
2776c64j50J643j095K48o80J132j166M24m05K10Q14j026rN03n45k26N07Q04o80
$$ plain form
2639 980 56 79 428 1266 201 -627 394 789 -67 -557 -359 -12 68 -356 543 430 1128 -1459 243
2658 243 116 404 -533 -500 -320 1365 -1127 -657 391 516 -10 -580 948 322 267 -762 169 808 727
2677 727 -960 -3 670 371 -235 547 433 78 -138 741 897 312 -42 -337 438 1165 -156 -129 612 574
2697 574 672 -614 29 725 306 -53 84 46 816 684 177 -176 217 56 -261 -185 317 279 597 106 -209
2718 -209 748 -54 504 -699 297 1054 86 262 17 -94 363 -970 -261 -286 -257 -362 269 202 -53 -279
2738 -279 15 43 -642 567 -301 267 684 -626 -662 -302 637 -335 -564 -531 694 553 -214 -641 753 846
2758 846 -700 425 582 1300 -37 -953 301 592 -330 214 230 1006 -349 -853 252 -161 -516 -364
2776 -364 -514 1129 34 282 -398 734 -432 -8 -413 -203 611 -415 -424 79 -466 -692 -185 619 -61
2795f1k75K49o48O96P8l33J100j817R43O49p45M09q27O79R55q05l94M89O40o01
2815C81p03m27J299p11m52P80j49Q04q3k370J125P54j61m81K60J059p43n81j69
2834e68P49L41r50k31R33j14q61Q92R03l36j105n49J581m27r58n26J126O89q17
2853b28l9l6J270r58m37M19J175j16j757L73R36k68j106M95M84J228j395k09J9
2872a50Q33r96l55R33n12M83k29m7M28j172Q38Q0k41l62j202K164L33q20P3n18
2892d39J48j7R8r8J313p71n55o65J577j260J74J32R92o6j543J091k00J29p31M79
2912b12N59J02p60o79O98R73l89o7j23J198j053q34J423r84P88m50l15M5J73q43
2932g50P78R48q94J08l72J000q61m59Q90J27K8n15j367J392L77p55p46J86J252
$$ plain form
2795 -61 -336 -87 -735 -39 39 -294 806 -1011 -68 581 -164 245 -582 97 1052 247 -147 342 982 381
2815 381 -322 -749 550 -161 -613 167 18 822 739 -1631 -506 248 87 -394 -134 925 182 -399 -568
2834 -568 181 522 -428 -659 274 160 -701 191 1094 758 -347 -896 685 258 -700 -1226 -100 589 -228
2853 -228 -267 -303 967 9 -428 -9 1166 1050 -707 -334 602 334 -772 -277 207 1435 40 -169 -150
2872 -150 683 -313 -668 265 -247 236 7 -40 388 -784 54 134 -107 -469 -1671 493 826 6 79 -439
2892 -439 -291 -308 -210 -308 1005 234 -321 -986 591 -669 -495 -363 629 563 -980 111 -89 40 -691 -212
2912 -212 347 449 -311 -990 -292 681 292 225 102 1300 247 -587 836 -148 640 190 -125 -80 93 -750
2932 -750 28 976 82 190 -182 818 -43 -502 388 515 543 28 -1339 53 430 -325 -1071 -885 367
2951C67r89J27J290j094l17n98N26K465j351j479O60J856j007r93JJ581l97j084
2969d36K83J55L07M0j169J357l13r22k27J369K32p75p85J760l44l94n78R61j05
2988D16q66K26l16J478q62m12L45M96N53r33q53J361n96j90j326K241m02p57p12
3007a109J769k73j413M81J043r0r59P1J012N73j501M02j15O91l10j228J971l87
3025F28k95j240Q16P5j64K13m35Q24M43j179K56L69k06j149J278J25Q3p45m90
3044g93J874r1j234K33Q4K93q67N43M03K49l29j366M43J614o14j093p72K867p99
3063F45j816P66P7J281o99j005J392M23j306m12R94P95j453k29J238M48r08m88
3081b57K73L43O3j453Q70Q84j42j012o4J541q02j184N79L57N16j037l86J004P60
$$ plain form
2951 367 -622 -495 795 -299 -616 -1214 -688 1777 426 -1053 -393 1463 456 -537 -536 1045 648 -436
2969 -436 -153 2 309 349 -820 537 224 -698 -925 444 676 -99 -884 876 532 138 -440 521 416
2988 416 -450 -224 -540 938 76 -336 9 505 1058 125 -728 633 37 -153 -1479 762 360 -397 -1109
3007 -1109 660 387 -1026 -545 498 408 -551 -480 532 1105 -396 6 -109 582 272 -956 1015 628
3025 628 333 -907 -91 -16 -180 33 -402 422 865 -314 -58 311 105 -1044 234 359 442 -303 -793
3044 -793 1081 990 -244 -11 73 366 -501 42 445 694 365 -1001 -558 1056 442 -651 -1423 1444 645
3063 645 -1171 -405 -328 953 254 -751 641 1064 -242 -654 340 1135 -318 -547 691 1139 231 -257
3081 -257 16 359 422 -1031 -161 723 581 -431 -495 1046 244 -940 -361 -4 512 -525 -911 93 853
3100H53q72p67J026N88j239n26Q64P45j99j262P85K46j135l3P49J163m34j411
3118h59M6J482r31o68Q80R52p95p77M17O25K27l66j541O14O55j030N81P45o8J189
3138A378j890M11Q84p42j011J367J31k96n03p40K403q58r66M9P09p42Q2j49J099
3157F16o46o30K79L40J051j036k96O58M21o92l89O38k47L44q37J0Q90K64q84l07
3177d53P66k03j119O90J012l50k47l88N54K33m1j127J120R5k71j082J091J8l39
3196d1l34K68M70L9o28j2N83k32j56m2K26R82j521R6M49p84P1L81K36L98j77k08
3218F4l57O42k49m82L20k47K31m54P9J357j052j49l56m79J109O5O4k88J52j5J17
3239G2O88m93J84r01m83K157j001p70Q85m78j05K52n7m43R42r43k20J159l50j366
$$ plain form
3100 853 -19 -786 240 828 -411 -937 -73 672 473 -789 -4 242 -893 -926 -177 986 552 -859
3118 -859 -813 669 -262 -930 -50 902 107 -670 -253 372 599 233 -1308 -694 -39 -1069 -488 257 189 1378
3138 1378 -512 -101 783 41 -970 397 528 232 -271 -1011 1392 534 -432 -383 326 -416 -334 -483 616
3157 616 -30 -660 -381 -41 1010 -26 -322 336 757 65 -324 314 67 411 -426 -416 474 738 -146 -453
3177 -453 313 110 -1009 -319 693 343 96 -292 262 495 454 -673 447 542 271 -811 280 298 -41
3196 -41 -375 -107 363 402 -226 -238 345 113 -43 -85 141 1123 -398 -302 147 -637 -566 -185 51 449 272 64
3218 64 -293 349 100 -382 -62 -309 -78 -532 -453 904 -148 -297 -653 -1132 -23 42 106 -182 -30 -45 72
3239 72 760 267 451 -450 -933 1224 223 -547 338 -140 -245 7 -50 -493 449 -494 -714 445 95 -1271
3259a271r1K249k06o29m45O97q1j16n69P89n71L04n55R45%N79j571n5P84j34k64
3280b11p07J199r46N45k81L45L24j7l27P72m07L38j47j4M7l84j72j51l79O61p3
3301A5k6P65o53m22M0J53K66k32k49K57J50K85n92k03L79M35o00L6M21P65j257
3322b67p51J872k74j453L05O75l37L0K81J16k33L74r04N21P85q51n78Q45j6l61
3342b21K98p45N99L44q25J90J187l21q03j60P44P01r68o42Q88m22K87o36O26k63
3362a42k39j31M84J28M1o6k14n70M64K87n34Q81o69j70O24J094j124M70q05N02
3382C11N00J48j506Q10L4k58p76J512J88j289k26P50J16l50j18J10O71q11J73
3401a1m95O80r9m15P50R8O3j711N07J2P92q12J27R0K32k74K09k35L46K89r55K86
$$ plain form
3259 -1271 -1362 887 681 52 -393 304 223 107 -462 327 -244 60 -495 450 450 1029 -542 -597 187 53 -211
3280 -211 -918 281 -665 -120 -401 -56 268 251 -76 696 289 627 480 466 513 129 -43 -194 -573 88 15
3301 15 -11 754 101 -321 -281 -128 138 -94 -343 -86 64 349 -243 -446 -67 368 -232 -196 225 990 -267
3322 -267 -1018 854 580 -873 -568 107 -230 -200 81 197 -36 338 -566 -45 740 -111 -689 156 140 -221
3342 -221 77 -668 -69 275 -550 -360 827 506 -297 -457 287 988 20 -622 266 -156 131 -505 121 -142
3362 -142 -381 -512 -28 100 141 75 -139 -709 -245 42 -492 389 -280 -450 174 1268 144 614 -191 311
3382 311 811 959 -547 263 297 39 -737 775 963 -326 -552 198 314 -36 -154 -44 627 -184 -11
3401 -11 -506 174 75 -340 410 508 571 -1140 -633 -621 171 -641 -514 -424 -192 -466 -257 -492 -146 143 -812 -526
3423e26k5Q43j229O44J7p21J018r20K099q68o03K93L61m66Q0k01k8J53m2o76Q71
3444G4N54l77j222R56J42l09r16J095L82M38j18p15M61l27J00p14O33l05k05K03
3464a70M35k04j74K26l76O16j08r56o9J298k94m25r8k82Q54n45M46o8n17N04o45
3485e52K89J97j094J553r84K79J54L80o7J01j397O03J062n19n2N5J367j082L2
3504C25k87P94J30j610P02r3N39j360Q17K26k01j68K98Rl47J035p14p8O36j032
3524c79l50K54Q48k35j28j113J712J45j066j91J043n2j085j14J072k8k96N6m89
3543c96K54j46n37J872l63p14M0o5Q56l85p52l74J575n91j000m66J927j26j242
3562f33l9P62k51K47j2K92k17k42m57k57R71o76l65N72O15j25l44P91K24m91O7
$$ plain form
3423 -526 -551 292 -937 -293 -276 -997 21 -899 1200 332 -271 22 383 -83 -3 -204 -232 -79 -121 -797 74
3444 74 628 251 -971 -15 127 -182 -1098 -3 379 817 699 -16 445 118 218 -496 137 -168 -373 -170
3464 -170 265 61 -113 113 -263 353 245 -711 -780 518 224 -201 -299 -581 273 -272 174 106 -411 93 -552
3485 -552 -263 -66 -1160 393 -591 -312 -158 222 155 256 -1141 -538 524 5 -47 8 1375 293 325
3504 325 38 832 962 -648 54 -39 500 -860 -43 183 -18 -186 112 121 -226 809 95 17 653 -379
3524 -379 -729 -475 373 138 10 -1103 609 754 -312 -503 540 488 -597 -711 361 333 37 93 -396
3543 -396 -142 -288 -825 1047 684 -30 10 -55 801 416 -336 -710 865 274 -726 -1192 735 609 -633
3562 -633 -672 90 -161 86 74 366 149 -93 -550 -807 164 -512 -877 -305 310 185 -159 632 856 365 432
3583D32k69j83O24q97L3J435j04j932R47N2k82N2k7J158j146J02J55L26J12q58
3603b70J83O18K68j090r21Q37k16K42J77q2O67p76k04j39R51k43k40l65N15N50
3623D62j025Q34j25L60o41K33j7N37j044J30J035R0j444O03l00N82m22J5L54Q91
3643A108j666M3K30l17Q75o51Q57J40m41n74N83k92m38N20m77N26P50k55m83J38
3663A76P36p93K00l36M41o92P4M22K47j163K99J08J03K01o9j75n68R12K35p4n13
3684b29O54l70O10j159Q66k67R21q95N22j383O92R49o53j63o0L80n68l06j12k66
3704h37R97m67l42q9P91r28O25O32q7j6L29m06K24m32q07O61j52N17l05K42J1
3725A61m80l37M93o9n05O68m45N77J1P2j052J108r2k21q3m48R94k77m97j40R99
$$ plain form
3583 432 163 -20 604 -293 -260 1175 1071 -861 86 138 -144 -92 -119 1039 -107 -5 150 476 588 -270
3603 -270 -87 531 799 -291 -1212 -375 -591 -349 -172 -254 413 -363 -567 -706 245 2 -238 -603 -88 462
3623 462 -563 271 146 506 -135 98 81 618 -426 -296 739 829 -615 -12 -312 270 -152 -137 217 1108
3643 1108 -558 -515 -285 -602 273 -378 479 619 178 -396 187 -105 -543 -23 -500 26 776 521 38 176
3663 176 912 119 319 -17 424 -268 -194 228 475 -688 -389 -281 -178 23 -46 -221 -789 123 358 284 -229
3684 -229 425 55 665 -494 372 105 1026 131 653 -730 -38 911 258 95 35 415 -153 -459 -571 -837
3704 -837 160 -307 -649 -738 53 -875 -250 382 295 279 608 202 426 -6 -813 -152 -304 213 -92 150 161
3725 161 -319 -656 -163 -232 -737 -69 -514 63 74 146 -906 202 110 -111 -194 -642 352 75 -422 -562 437
3746D37p79N36n78R64k18l43r4N6O06j125N03M21k51p93P29n14M87m06O20k60
3766bj11L21q48J108k02k60j87J48l36J009o97J57r57M89M25q51R70Q03r57M28
3786D50k26j69J40j88o14O05m15L27o9L97l8l0j34k95Rm68O03J24q2m73P86j68
3808G2j86J65l70K06M89o94M21J68j160J157j55M17J09p3j022j45O48m34J00m6
3828c33P96p59M84l59K54n79k2K28n76P77n44l94J194r99R04K89q65K40M86o93
3848d71J076r10Q19q01k43N37N47l29p02O74J95n18K94m22N42n76O2L60N42l8
3868F38p85J5K63K12p72O51l78J25l79J175j320P46m01m47R20L22j034N57P47
3887H55r65O31J6p72O12m21k5O4m92L14J62K44O85j032P07o40j77P38j124N32
$$ plain form
3746 437 -342 194 -384 580 362 19 -75 -19 587 -538 -35 386 135 -658 71 -443 44 -362 258 -2
3766 -2 -113 208 -640 468 266 6 -181 -33 -369 640 -57 100 -857 -368 57 -794 176 979 22 450
3786 450 224 55 195 7 -607 -2 -417 -90 -159 238 200 170 36 -259 -250 -718 -115 9 -73 -546 240 72
3808 72 -114 51 -319 -113 376 -318 103 271 -889 268 113 530 639 566 -456 -601 47 -387 -287 -333
3828 -333 463 -296 188 -171 83 -496 -518 -290 -866 -89 -633 -1027 167 -832 72 361 -504 -264 222 -471
3848 -471 605 -305 514 -287 -530 7 554 225 -477 197 392 -126 168 -254 288 -288 -226 134 676 638
3868 638 -147 -132 131 343 -429 222 -156 -31 -410 765 -555 191 -210 -657 263 585 -449 108 855
3887 855 -110 521 537 -235 377 -44 -69 -5 -497 -183 -21 223 908 -124 583 -57 -234 504 -620 -88
3907h8Q67o49O8l39k28M03P30j378M65n56J09Q84p45M89n19P16p27J59L78M63
3927E02k39q77J124l84N2n37R24P88k003L65N87k23r0k37N07k63n10J43O45m67
3947a93n27J35J385m49j93n67N71N09j250J452o01K11N64j016j70N67l53l20l8
3966b83J047l58j049K71K19N67p40q94N06nJ54l1R58n14J27O21m04K38o26p40
3986i36M76PJ220q98j19J37nk74J20M84o82P34j72m25L06L53n9P1K47p46j04m48
4008g13J009k29o60J063N87j153Q2o09Q03k52l26K99O60o84k78j64J384l38l53
4027A28j20L45L21l44p30K39J44Rj100J085L29j481M79Q07q6Q4j73J71m21N90
4047B76J24j914K111l08o79mN4O49j86j552K196m52j188O03J22M44j142p0O46
$$ plain form
3907 -88 779 130 198 -141 -369 34 764 -614 -149 -705 -596 288 -457 32 -487 229 -498 -339 39 502
3927 502 263 -614 510 126 178 -359 565 1353 -650 -285 302 79 -11 -248 259 -4 -514 -371 274 -193
3947 -193 -720 -585 800 351 158 -409 162 671 -579 873 272 483 1047 31 -139 428 75 -245 -283
3966 -283 764 406 -643 -372 -153 414 -326 -1220 -714 -719 -565 -596 362 -152 -25 596 192 430 -196 -936
3986 -936 -460 -453 767 -131 -250 -113 -118 -392 -272 212 -470 264 92 -333 -27 326 267 338 585 -161 -265 -713
4008 -713 296 67 -593 470 1057 -96 -14 -623 180 -72 -398 -99 561 -123 -401 -565 819 481 128
4027 128 8 353 674 330 -400 -161 -17 -8 -1108 -23 306 -1175 -696 111 25 109 -64 107 -314 276
4047 276 400 -1514 597 289 -390 -394 -340 309 123 -1429 767 315 -873 -270 -148 296 -846 -916 -270
4066b70O76pm90M47P8l46L52r29N57P89p55r13N70O47m13l20N49N46r60K00l11
4087c03L09M66l46L12l06j78o77J091M90p69l5j23o7K22o76N99O55L2m99o79Q77
4108C95Lk75k03l99Q67o88M60m79j26J098r23N03j105P26K55j9k86J95M13p87
4128c75K21J666k333P18J96q79L82O41N36j284N33K94p40M75N66r74k4R91n4j2
4148E44j109J189j91N86j574J023k06p20N58K34n07q11R78j62P42j091P98k1P50
4167A010m69j243J432j94q27J57j04J412j490p31J333p43J84J53k70J082N1n39
4185B04r14R65l55Q58p64O38L9p88Q17n84k49m77J263o73l01O17K91j84k91m01
4205b89R39r12k93J383j710J195O10j436j59Q48m0k7k48k89P39o95j4J68J06o06
$$ plain form
4066 -270 406 399 -91 356 434 88 440 -489 68 857 102 -811 -241 406 -7 -327 222 768 -192 8 -303
4087 -303 6 472 126 438 132 -46 -723 368 858 89 54 -69 -136 86 -590 9 664 696 197 -482 395
4108 395 398 123 -80 -479 388 -300 160 -319 -445 653 -270 233 -872 -146 109 90 -196 -1 412 -375
4128 -375 -154 1512 -821 -103 93 -786 -404 237 773 -511 22 316 -424 51 617 -357 -381 610 556 544
4148 544 -565 624 433 1019 -555 468 262 -458 100 334 -173 -984 -6 -168 574 -517 281 260 1010
4167 1010 541 -702 730 536 -291 -134 -238 1174 -316 -1047 286 -457 -273 -120 -390 692 743 204
4185 204 -710 255 -100 758 -6 632 671 -117 700 116 -133 -610 653 -20 -321 296 587 403 112 -289
4205 -289 650 -262 -555 828 -882 313 923 -513 -672 176 136 109 -139 -428 311 -384 -398 -230 -124 -730
4225g30R30m06m00P28j02M66l29l28l35J402p95j156O93L21M13m09J53k41R84
4244H59r88L51o68J2k92K33j64N39Q9P12o61J9j74M76r16L63K09n22O64L6o16
4265d39L90j28Q23o71l10Q23K11j44j044K66L75j090O95k19R15k1n71p33J144
4284B72j206O53L51N51j020K05O96j268R47M28r07R38j73m02J08j39K33O66j431
4303d98j24J002l35k42k35N42j278M80J128p81J53K52q5J61n46O01K44j4k78q0
4323F7r3k10J57J74j13L6M4O3j66o29O55l84J64k26P4j33O82K91q02L87l92N14
4345A60n02Q66j374R17m52J393o51p50j02M94o67o1N45P77j079mJ10N4M1K54l54
4366c85L01l76L44n3K49O70j119k90N95O39j85k58K82kp64K4r47J561o06P80k68
$$ plain form
4225 -730 200 -206 -606 122 20 486 157 -171 -506 896 101 -1055 -362 -41 372 -37 116 -125 859
4244 859 -129 222 -446 -434 -726 -493 -657 -118 -29 683 22 41 -133 343 -573 -210 -1 -523 141 177 -439
4265 -439 -49 -177 646 -25 -335 488 699 555 -489 -223 152 -938 -243 -462 453 432 -139 -872 272
4284 272 -934 -281 70 621 -399 -194 502 -766 181 609 -298 640 467 65 173 34 267 933 -498
4303 -498 -622 380 45 -197 -432 110 -1168 -688 440 -341 -188 64 -21 140 -406 195 439 425 147 67
4323 67 -26 -236 -79 95 -18 18 62 125 -41 -670 -15 -399 -235 -461 -387 -520 162 453 -349 38 -354 160
4345 160 -342 524 -850 67 -385 1008 357 -393 -495 -1 -668 -729 -184 593 -486 -490 -380 -326 -285 -31 -385
4366 -385 -84 -460 -116 -169 80 750 -369 -659 -64 575 390 132 414 412 -352 -328 -1275 286 -320 460 192
4387A92K80n72NJ08J64n54P30j31j9n5k1j60N12m25l57J426j321M93n09O21l31
4408G6M52q57L01O9N1m36J86L03m64L76j206J504J75p37n12M91P04q89P6m66Q40
4429C7j16J04n28O19M6J5k54l08P55l78p3O13k44p68j74M77M85q8q13J77L88j55
4451a83P67k17N7n94N17j27j582J509p86Q54q4q32J117k73k68O14j080R42r50
4470e99K82M76m64M07N40j660O90J66J86J62m40nn8P98j348J291p02k85J44O68
4490B49m31O36j230P35L89n27m38O12K91n15L82L72o21J18j026N45Q36ro60q3
4510c75L02L35q44K72P38q76L11M31J54p15O95r00Q97j63np0J31l06k55K63m21
4531d01L77M43o72lQ39o84M1k4n61O63l58Q12k68j03j77P4N10l21K02m85J70M9
$$ plain form
4387 192 472 -100 -95 13 177 -377 353 222 203 148 127 -33 479 54 -303 1123 -198 295 -214 407 76
4408 76 528 -329 -28 41 92 -344 -158 145 -319 57 -1149 355 530 -207 -719 -228 476 -413 -337 -803 37
4429 37 -79 25 -503 116 162 177 -77 -385 370 -8 -81 532 288 -480 -654 -177 308 220 -593 -416 -28 -183
4451 -183 584 367 424 -170 347 220 -1362 147 -639 215 131 -701 416 143 -125 489 -591 351 -599
4470 -599 -317 159 -305 102 642 -1018 -328 -162 24 186 -254 -259 -317 481 -867 424 -278 -563 -419 249
4490 249 -182 454 -776 -41 348 -179 -617 -5 286 -229 153 525 -96 22 -1004 -459 377 368 -292 -375
4510 -375 -73 262 -582 -310 428 -448 -137 294 448 -267 428 -472 425 262 257 187 318 12 -243 20 -401
4531 -401 -24 419 -253 -256 583 -101 -60 -84 -645 18 -340 472 204 101 -76 -2 508 187 389 -96 74 123
4553A23j212K98M98P93m17Q5l54o43O76o93J192r23O12r5l3J46K62l38m15O49
4573B11L74l12r1k44j89M13k29k29K38o2J73K68n31O89q51N42l23J22k24N05Q0
4594C30j85o12N39J2N41p42J35m3J40m38Q10l62M3p12R95J78q61Q03m17m95L55
4615A4J04O69j80o15k07N25k59M63Q4o57R53o88j80p0n70J740j432l62O19N21
4635D72m11K93j59j1N16p86j65L85Q59r40j92P19K11j091R77o94q51J094l9o09
4655d22R34n40M30l2n29K72q04J94k00R67o70L24L78l59n74M9N85l69M58J98k44
4676D6J54n23K67P90J03q13p72L74k44J614j135k5O53oj451R63l83p5K21o44N54
4697c32k14M17j99P04n72P35l21j30k43o9q53N39N44n71J069n18P30q77L83L51
$$ plain form
4553 123 -1089 -791 -293 500 83 168 -186 -829 -153 -846 346 -577 35 -60 -93 53 315 -23 -438 211
4573 211 585 273 182 -62 -251 162 -67 -296 -58 -120 53 321 -210 479 -372 170 -153 -31 -255 250 330
4594 330 145 -467 72 84 625 -117 18 -25 115 -323 487 125 168 -544 451 629 -232 571 154 -341 14
4615 14 118 787 607 -8 -215 310 51 514 598 -59 894 206 26 -44 -614 1126 -306 -668 -49 472
4635 472 61 354 195 184 700 -86 -251 134 993 53 -139 580 791 -300 677 -17 -868 226 187 -422
4655 -422 512 -28 402 370 -159 113 -691 -497 -697 270 -400 -76 302 -57 -631 -582 3 -366 92 290 46
4676 46 200 -323 -56 734 837 24 -748 -374 -618 996 -139 -164 489 483 -968 -5 -388 -463 -242 -886 -332
4697 -332 -546 -129 -328 376 -196 539 218 88 -155 -224 -1077 -538 6 -565 504 -14 716 -161 222 573
4717E73j039Q18r33R04L85j088Q69j11k65p43J359j590J167j166J004N1K75K68
4735G38j81r87O69N76m26n26N9p52Q61L69j5l33l02P8Kn31J60P33j58L05n00N14
4757C53o98P48r53K63O87o64M03q25K85n4K45m74L49O40J71J59j713K38J362o41
4777a19l74J017l10R6m35N69m83m5k6r2K81O75j47r57K84n44J4J059m38j32L25
4798B18o53L52J99q1n77P60K11j268O57n11N04N17m93p11R21q67N22L81l18k36
4818d73J28J032k42k33l37J620j524j66N67q51Q68j225J569p28J94p66N90n82
4836e59j01J05L99r2N8K72K58n34J73L0j85N17p34O69M71j271k38L35M91L91N50
4857A005j308L1O11j326J553l30Q0p79l04N22k24P02j64J27l57J017o21L83q91
$$ plain form
4717 573 -466 352 -581 323 708 -380 489 378 113 -630 729 -861 306 -860 144 195 470 738
4735 738 557 -430 239 815 389 -137 -78 -830 31 400 385 52 -250 -172 -170 -701 -541 192 34 339 -161 353
4757 353 -345 403 -550 -287 400 -264 139 -686 -401 -455 -210 -684 -335 305 476 635 -1078 -840 522 -119
4777 -119 -493 524 214 310 -125 444 -39 -84 -110 -202 79 754 607 -350 -66 -610 -596 463 25 -107 218
4798 218 -435 -83 116 35 -542 218 429 -839 -182 -693 -189 328 -165 -876 45 -822 -300 81 -237 -473
4818 -473 -345 687 445 212 -125 1495 -29 -195 372 -479 389 -836 733 5 199 -567 23 -559
4836 -559 -660 -555 -156 -248 -190 82 340 -194 -21 9 -176 341 -393 276 747 -524 -762 -427 64 455 1005
4857 1005 -303 -272 339 -987 566 236 316 -463 -767 -245 -469 233 69 196 -161 856 235 618 -273
4876b73J0j95O30O01r34N58j336N62K39k18J2N1J264p53l4L11p26J043k52p55
4896a95j032J441N37p70K09k14L43n35l88P64k23r93J383q11M02n67J045M01p46
4915E1K48N47p47N65j081Q3k02J107r6j78j51m88P41n39l77K94o21QR95l40P16
4936E35j34q30M06L41j047K95K81M42l71k4m97Q24r5n56J127j321Q91m30NN57
4956C99q39j16R28j082J182r69Q30j150P10N8p94O38j17N53o70j51J084p6K18
4975F36j40l93K49K05l64L75J98q22O85l05q04N42k06O01p08L66n38L56K49r29
4995g47Q29r22J091l22o9J083m04n86j81O36qQ6p86L35K98P07j811K12N94P14
5015G49q07P13p30R7K19j96N9km98K24J090q81L9n80J98k34M86o2Q3O58j051K32
$$ plain form
4876 -273 -263 -458 172 773 -161 397 -939 -377 -138 -356 -344 -293 971 218 184 495 -231 812 560 -195
4896 -195 -1227 214 751 -19 190 -24 319 -216 -604 160 -63 -1056 327 -484 -82 -649 396 797 51
4915 51 299 846 99 664 -417 -334 -536 571 475 297 146 -342 399 -140 -517 -223 -844 -836 159 -181 535
4936 535 401 -429 -23 318 -729 -434 -153 289 -82 -106 -603 221 126 -430 697 -624 267 -163 -158 399
4956 399 -440 -556 372 -710 472 -497 333 -817 -107 -49 -843 -205 -322 231 -439 -590 494 418 636
4975 636 496 103 352 557 193 568 766 -56 629 324 -480 62 -144 457 -251 115 -423 -67 182 -747
4995 -747 82 -840 251 -71 -140 943 539 -47 -228 408 400 486 -300 35 333 1040 -771 -559 35 749
5015 749 -58 655 -75 22 241 45 104 102 -396 -172 918 37 76 -504 -306 -540 -54 -116 -33 625 -426 -194
5037a94L15K47L49j034R61p73l52O50%J68j87N45m30m41m86l05J2J213j85j8O61
5058G16q47O23r19l55R13j243P97n8N70m30N68M83m09j15L17j3q07O11j285J479
5078E96k77N1o39K75O98r47J5J10L22k8J99k33l71J77R2k09k16K13J603k525Q74
5099b20O7J93r0q96M71R76m10K91j99J04r71O5Q47L72o92pn59K68K08j58J035
5120F95m34r49O73M58n09n87P11K09k42L02l43J71m79N12j17m50K17J88m37J183
5140G72j07n23K61q38K6K41m6K5k47Q21o3o76L72K23J31m42j99L51J71O1K26j245
5162g05J439q63j56L87N9j27m4k68J496j289Q72q27M3k85m36O92K28m97j0N29
5182B38oM1p2o44O63o50L61m08N73K37j59M10o54j51o97J417j464N81O74N98o47
$$ plain form
5037 -194 121 368 717 -317 644 -129 -481 169 169 337 150 695 265 -176 -662 -967 -955 258 73 55 716
5058 716 -131 492 -427 -782 131 -1112 -315 -373 197 -233 335 818 409 294 611 598 -209 402 -883 596
5078 596 319 370 -269 6 704 -243 -228 -118 204 176 375 142 -229 -52 40 -169 -385 -172 1431 -1094 -220
5099 -220 -153 40 -50 -946 -475 501 91 382 183 287 -684 -619 228 600 -92 -99 -658 -390 -182 -340 695
5120 695 261 -688 -15 443 -66 -653 58 267 25 327 -16 155 -324 188 71 -379 -162 26 -411 772
5140 772 665 142 403 -435 -409 -168 -214 -189 -436 385 322 -354 18 241 372 -70 -269 82 253 314 540 -705
5162 -705 734 -129 -285 102 161 34 -10 -278 1218 -71 801 -26 17 -268 -704 -12 216 -281 -291 238
5182 238 232 273 201 -443 220 -430 -69 -477 96 333 174 584 -70 -221 -918 499 -965 -384 290 888 241
5203B41m0M77r73P48q96J35P85l9k64m70K69L11k88j65j8J50P56p35K80p63Q91
5224C92j62k66O11q29N27o7L90o19M63p43M94q70K32Q47p83R93j078L22J65L77
5244C96m93On87R02k80l88KQ50n16N92r63J209r03nj84J566j266m95J145j068
5264d80M58k73K63l26K80m6k31l2o0N33K96j87n58J7O52J44q59n9Q10J67m84M8
5286G3L5R31n46j52j404R21L5J132q12l72j46R11l65q3km86Q72n76M26p4l68k12
5308b62j09J08R11m87K98m53p1L14m02Q80p71l18o16P87oO1K15J74j323J043K17
5329A90L87j252M38L79Q87q49l94K4M8O66l78j32L19j15q19J76Pk2j07J243j012
5350c16M76K0P5m78N41o01l84R10P38j377N15l86qO71j008o9J094o81r68N68J011
$$ plain form
5203 241 201 678 -295 453 -443 -308 477 438 174 -296 -27 284 -4 -169 -187 -37 719 -16 264 -499 392
5224 392 230 -36 575 -254 273 206 596 -23 440 -303 191 -679 -447 400 -383 610 -468 -146 19 396
5244 396 -97 -91 -678 224 -56 -444 -442 408 -108 484 -479 730 -173 -178 -362 1204 -62 -557 588 -480
5264 -480 -22 -295 -32 -358 -78 -124 -355 -387 -447 86 382 195 -363 -346 306 450 -409 -468 342 509 25 73
5286 73 108 1039 493 341 -1063 -142 -107 1025 213 -159 -305 606 241 158 156 -330 542 -34 392 318 -50 -262
5308 -262 -371 -263 648 161 459 6 -65 249 -153 727 -44 -362 -978 -191 -197 -136 79 253 -1070 -27 190
5329 190 577 -675 -237 142 1029 180 -214 -190 -142 524 146 14 333 218 -601 -425 -418 -440 -547 696 -316
5350 -316 160 180 255 -223 318 -283 -667 243 981 -396 119 -267 -275 396 -612 -681 413 -268 -1236 -668 343
5371C43q91L27PM89L09j88j04J81m02K01l82q43J074p21q94J448k37P64P48o32
5391E97L13j304R12n56k34L31k93P31p53K75k36M8M2q51P35O05m39m25P40Q5r96
5412f73P24m35K61N74j259L35O29o63M07n02l30R37j31Q8K48K8P2n07K43l02j01
5433c57Q6j34P64q6L72n26p15J381j133N71J66K90k85r46J146m59n29J074q67
5452a87j71N0J180o17n08O54j54l73j16L96L32p72L91J42n07O02p35k49N32M82
5472C72m36N28m01P19j498P68j46J01j7j36%K39l70j91P74o4J43P14j179l95L54
5493a21k80N60k30N3K79k65o8P51p36L20P1j078O61M5M50j03K30m88K09j87j70
5514i7O13n86l85j02Q75p18Q53l79j36j35o16M24j45J67M17J20j77M03l13J73
$$ plain form
5371 343 -548 -221 -214 275 584 396 292 473 71 272 -110 -953 121 -600 -1494 -46 -283 481 1229 597
5391 597 910 -394 518 -38 -272 59 -234 497 -256 19 -217 -169 -127 -978 -243 362 -77 -502 238 323 -673
5412 -673 51 -384 -123 451 -808 -473 156 -507 -100 -602 -932 5 -126 -38 210 238 310 -197 46 -256 -357
5433 -357 -271 -405 359 273 645 119 -596 785 -348 223 389 679 394 -552 594 135 -394 680 -187
5452 -187 -358 -308 872 255 -253 401 247 -126 -242 154 486 -286 105 247 -260 342 -393 -642 -110 372
5472 372 -64 464 63 782 -716 52 -94 7 -10 -146 -146 93 -277 -468 306 242 385 1099 -80 -475 -121
5493 -121 -401 159 -71 -18 261 -4 -72 679 -57 263 334 -744 -83 -38 412 309 539 51 260 73 -97
5514 -97 516 -70 -455 -557 318 -400 453 74 -62 -197 -813 -389 -534 -367 50 170 -7 396 83 256
5534B56l51K82k56J88j14l75j83K89k85M76J38K39l30J22M99m57j4p32K10l45
5554g43o5O89J259q93l90M24m08r7J65j76q9P05k30j62K07L10n76j69J116r67
5574i0k79J24P56k45K51M72j396M21K40m56O9Q4M55j181Q87P81j014m46J64M85
5594H2J31n18R56l00J9o09Q20j055K23J022j047k53M14K35l41R13r51J049j40
5613F50j326R13l31J33M94m67K31r29M64M86M81j332L70Q67p71j75L2R5M43j79
5633A49P7p43Q2P51L05p91l2M82r73P91JK98M0p16J37P24o64N92o38m13P06K15
5655C80K6m24k33N12o56J295j294j47R51j10N0Q8m78k63Q48n10q36J021M13m03
5675B30m06P05n92J42o56Q57o23J06N25r7r61M74J323j349P19o52L56j22L29k26
$$ plain form
5534 256 -95 187 -69 119 5 -370 -553 -264 -549 -73 65 304 -26 96 595 138 124 -608 -398 -743
5554 -743 -808 -119 1140 247 -143 281 -127 -224 -59 -235 -324 381 151 -11 196 506 -70 -239 877 -90
5574 -90 -369 -245 511 266 517 989 -407 14 254 -202 -133 -49 406 -775 112 893 -121 -567 -403 82
5594 82 213 -305 651 351 370 -239 581 -474 -251 771 -276 -529 -115 120 -221 692 -259 790 650
5613 650 -676 237 -94 39 533 66 297 -632 -168 318 799 -533 -163 704 -67 -242 -210 -115 328 149
5633 149 226 -517 -435 316 621 -170 -202 280 -693 98 99 397 437 -279 -142 582 -82 510 -128 -541 165 380
5655 380 406 -18 -251 261 -395 900 -394 -541 410 300 350 438 -40 -303 545 35 -801 220 633 230
5675 230 -176 529 -63 79 -577 280 -343 -237 288 191 -770 -296 1027 -322 397 -255 101 -21 308 82
5695H2k39Q72j227N85l6K15L67p21R34n09j38K13j205J025J05J4m68k06N79p68
5715e26J39J141r92L34O37j001O59o72Q04n10k04k4L71J90j093J245j79k34N62
5734F47l87k6K79k44l27q3n91M49J63P45q22k21O90o39J506j729P33L27l23p83
5754f36O47l34K60O7n51Q90n96J11R3L50p61r5r4J299o99j297Q27N81R2j115J054
5775I3k17O35j047j22R78j424J475nL60j207P12K8O50o60o33O51o61P05p34P13
5795B90j78l84N68k67n01M62q3M52o05m45R57J92l07p32J48j59R83p38L14N37
5815E04q00M06O6p45R96l23j34l96J257p33q9j05j37r83J410K71m92J105q89N1
5835B40k00M86o0n20K10j12k86P34q82R69r64O08l94M44k72k91M37Q8n51o04J041
$$ plain form
5695 82 -157 715 -512 73 37 252 619 -102 832 323 185 398 -807 218 323 337 -131 -337 242 -526
5715 -526 -387 754 -238 96 733 -268 391 -281 523 13 -191 -215 156 346 -747 498 319 85 647
5734 647 260 234 513 269 -58 -141 -732 -283 -120 625 -197 -418 272 -367 1139 -590 143 470 147 -636
5754 -636 11 -323 -63 4 -547 343 -253 -142 -49 301 -460 -555 -649 650 -49 -1346 -519 62 154 -961 93
5775 93 -124 511 -536 -658 320 -1104 371 366 726 -481 231 259 909 249 -384 267 -394 311 -423 290
5795 290 112 -272 296 29 -472 -10 -93 359 -246 -691 266 458 151 -581 -433 -592 391 -347 -33 504
5815 504 -296 110 176 -569 427 104 -30 -426 831 98 9 -96 -233 -1216 194 465 -27 1078 189 240
5835 240 40 526 466 -54 156 44 -242 492 -390 579 -385 223 -171 273 1 -290 147 235 -316 -920 121
5856A21j18O15j155P45J90n00L4K50m00Q06q98K57J6n52K0Q46j016R90M44q9o74
5877f8M93o65M70o65k3J57M02j217J452j70k87J31J30n56O58J6o21M10n34N47
5897F0K91K16o65L38J68n07o81J131l77K55o96M28j56J078j040l78L36K60j5O24
5917F70n92k42m78R68o76L32L39l18n24O81l9J23l14RK09N63n40M11j32j115J008
5938C43n89O14p6m38O4n61P78m7J93M1l12j8m53P64j90N81l64m32L75K44q97P39
5960C59J75o36K47o37J91k42R78n78j00M97j240J587n20M33p86L70L41j72k15
5979E2P01j279M33r96J412J12n02M84OK07J6j060P31J57j189R65k47Jk78j93K05
6000b62J242o94l88K86m2m90j4J13J35k01j25M46j355J899j229M97P66r42P28
$$ plain form
5856 121 3 618 -537 208 398 -102 -68 182 -218 588 -310 -53 -37 -589 -569 277 -739 251 695 606 -68
5877 -68 425 -240 230 -435 -458 -301 101 -1116 336 166 -121 10 140 -416 242 258 -363 47 -487 60
5897 60 351 567 -98 240 408 -99 -780 351 -26 229 -467 -39 -195 883 -157 -535 -199 61 46 670
5917 670 78 -164 -642 326 -350 -18 321 3 -521 160 121 244 -70 -61 148 711 171 582 450 -665 343
5938 343 -246 368 292 -146 -82 -643 135 88 281 322 10 -8 -461 303 113 694 330 -102 273 517 -380 359
5960 359 534 -102 145 -492 -301 -543 435 -143 -243 254 -986 601 81 514 -272 98 439 267 52
5979 52 753 -526 -93 -1089 323 435 -67 417 423 630 646 -414 317 474 -715 250 3 4 -274 -467 -262
6000 -262 980 286 -102 184 142 -348 -362 -249 -114 -315 -440 6 -1349 550 -679 -182 584 -358 370
6019C70n11M67o73O23n06o6j73Q4l39l01R46N56l63l09m64N23j110J780K84q76
6039e8J033r65L11j45k49q51R59M72l47L66j23p35O67p35M77l41O65J14r64P69
6059C20q7k60j96K2L36l79J44l43l77R76lL91o61L8M03j129J172r07P78j56j11
6080b9L25o36R64p10p5K62J70m17n94O94l3N65k5l05n77O33r5J73j84l88k30l4
6102e46K95M61O99j232j23M64o6m25O53o81L06p1r2n15O75O60o06o26J118p31
6122c83n83J613k03n95J15K92M24j517J483p09L53l44J015k58n85O22m91J55m71
6141f7p32J62J074j247J057o54M67P74j622J2Q53K33r08J724j068n2k46R6l20
6160d64j02l7N76K54j291J212n62J370j645J300mK38j202L58L09O9l03L31j96
$$ plain form
6019 370 -141 326 -347 276 -230 -296 -469 -385 -724 -1025 -79 477 114 -195 -659 -136 -1246 534 818 -58
6039 -58 975 10 321 176 -73 -924 35 507 160 526 403 -332 335 -400 77 -264 401 515 -449 320
6059 320 233 -27 -223 -201 135 -244 -100 -443 -820 156 153 544 -117 -79 324 -805 367 -540 238 82 -29
6080 -29 296 -340 624 -86 -161 101 271 -146 -740 -46 -79 486 461 156 -421 212 117 290 106 -282 -512 -546
6102 -546 -251 210 909 -323 -446 18 -48 -473 180 -501 -195 -266 -358 -873 -198 462 -144 -770 348 -383
6122 -383 -966 647 444 -151 -36 256 680 -837 646 -63 290 -54 961 703 118 740 249 404 -67
6141 -67 -799 -637 437 -810 247 -407 60 834 -788 -776 77 310 -598 1126 58 6 -240 -144 -464
6160 -464 -566 -603 -27 227 -1064 148 -414 956 -689 611 607 845 -357 1 310 379 76 407 211
6179B11l54l12R27L67%j634J57J061L9o0j005L47M85N82j77j90r13j8M82l5O50
6200F10m34p91J184l00j53m41M8o21M19n3N04j69j16P88l17O86m31k17q28L45
6220b87K69J2J93k01O16j067N28P8o07K11K25K63l61M17j32k89l0P01j014j01
6240e76P22m66Q51j072N68l7o3M38o50K7M76l62o1N8l56P07p36R97n08L73n05
6261a75k10P63o38J53N78Nr00N45K07j48o66L01J42R07j277K49R2j170J124K56
6281A38p27R74p53R4l52M36P13m05Q33j151M43p54M67L01L84p30M2O38j307N36
6301a80j55Q2N81k00Q00q64l94O92k36Q3K03J10j163K05O39k43p5o89N66R02k04
6322D60p75n6M78M87j532O69N39p80P51L91j54k68p54O9L65l44M31l64O46l23
$$ plain form
6179 211 -143 -455 472 839 839 -795 -638 423 462 402 -603 -256 229 811 634 444 -469 -487 -5 -40 610
6200 610 176 -615 569 269 116 -325 -277 -898 -479 -532 -28 -197 -313 475 158 844 413 196 -632 -287
6220 -287 -18 -6 187 -14 602 -465 63 141 -466 -255 -30 233 -128 289 157 -132 -162 539 -475 -576
6240 -576 146 -320 531 -541 27 -10 -73 365 -285 -258 218 -144 -205 -147 -503 204 -532 465 -43 330 -175
6261 -175 -385 378 -260 -107 471 476 -424 121 328 180 -486 -185 -43 864 -413 -164 -72 -1242 -118 138
6281 138 -589 385 -368 -274 -626 -190 523 118 951 -200 243 -511 -44 257 641 -89 -47 591 -716 -180
6301 -180 -335 -253 328 128 928 64 -330 362 126 209 412 522 -641 -436 203 -40 -115 -804 -238 664 460
6322 460 -315 -371 107 594 -938 -269 270 -510 241 632 478 210 -544 -475 -110 -454 -23 -387 259 -64
6342f4k66N14j103J246j106P28M8j17J81J89n58M05j38N85o82q5j43J196l79p73
6362c22M13J01m57q58J216K11j325J029r7L43J12M81l82p14j18r1J54O20k90n85
6382e59L15M07n81j50J051r0n74O40q84k01N34N45k54j76j5L86o57M45k92K55
6402A45p4o98P34K51k77j46k61J03J166j157M63l52N54k64N86l84n20l30M55M9
6422D3J6J74l02L24p02L40m97j23k78R57j03R59j116P21n65Q56k82n32K67o97
6442e40J14n98J210p47J172J40j181J067O79j270k65J38K8k90O69r24L68N65L01
6461F36j31r46Q62n37K20L19n68k50M59n67J058o40L24l3q11J466o17K22k92p59
6481e85K14R5q75R39P53k11p19O4J146j117Q23m87K82l33l33R05k27R8m09p14
$$ plain form
6342 -64 -330 184 -919 327 -779 -51 -3 -120 61 250 -308 97 -41 544 -138 -223 -366 830 451 -322
6362 -322 91 192 -265 -1123 93 304 -1021 8 -89 254 366 847 465 -249 -367 -458 -304 316 26 -559
6382 -559 -244 163 -418 -568 483 393 -181 459 -425 -626 -92 453 199 23 8 394 -263 182 -110 145
6402 145 71 -627 107 358 81 -65 -326 -223 943 -214 249 -103 451 187 773 389 -131 -461 -6 43
6422 43 59 233 -69 255 -447 -107 -604 -727 -1005 -48 -151 808 -308 413 -152 704 422 -110 157 -540
6442 -540 -426 -1024 186 -561 611 751 -430 637 1316 46 -219 -81 -53 -343 326 -598 -230 335 636
6461 636 505 -441 421 -116 104 423 -145 -395 64 -503 555 -85 239 206 -605 861 244 466 174 -585
6481 -585 -371 -276 -1151 -212 541 330 -389 -325 821 -296 527 40 322 -11 -344 561 334 432 23 -691
6501f91M43M06mJ56L03j045N17K3o77k41J187j86j97q53J918j605P95l86Q34m71
6521B26k21R4J42q55J263j49l27k80k59K37m9K83P2L27k04l82k2l94O00l39k03
6542d40J180r01L22j285J873j306J248p96L25j7j00j43m30N63J83K04n22J06o0
6561DP03o57R43j093N28%j047J226r14J84J261r23p94P95m26M40j279J739p02
6580a2L3l50K01l19J069k07q95J086O66j656Q92l01m06K60l12O62p98R25r22j06
6600d90Q6Q2J140q44K72o22J63M35j78j061K71l36J362j053L85O04n18J18L02
6619A18J03j17r1L7r22P30l07J31j54J116j53k54j44m1m20L82L5o2p14J150p52
6640c29q6R30n33J20l07K44l47P82p93P21R1q88J255r95M07l92L47J27l88n79
$$ plain form
6501 -691 -248 158 154 310 613 -432 85 108 -569 -810 377 191 -6 -859 1059 -546 249 -137 697 226
6521 226 5 99 241 -614 649 500 173 -107 -366 -129 -178 105 177 504 300 -82 -104 -498 102 -237 -440
6542 -440 740 -161 161 -1124 749 -557 691 -105 220 203 103 -40 -470 93 276 480 -42 64 4
6561 4 707 50 993 -100 428 428 -619 607 -307 -123 1138 215 -579 216 -210 230 -1049 690 -12
6580 -12 21 -329 -128 -447 622 415 -480 606 1272 -384 508 207 -199 61 -251 411 -387 538 -384 -490
6600 -490 -404 -322 818 -26 246 -376 -213 222 44 -1017 -746 -1082 280 -773 -388 216 -302 -184 118
6619 118 221 104 13 50 -872 -142 -449 -318 -472 644 491 237 93 52 -368 14 49 -13 -727 423 -329
6640 -329 -415 515 -18 102 -205 39 -308 474 -319 402 493 -395 860 -135 272 -120 227 354 -34 -613
6660f13M40M21k55n43O53m5L19o75J91K98J46k31q05P49L16j0j112L11Q97L40
6680G92j032N66q45K88k44J047k53J20k54m6M73o87q53O88N78n05l4J33l29R5
6700c02L75O1K71J42j659N55J175l10j87k23p1N19l91N98m05L08m97j76J42m3
6720a18k11L26Q22o49K55p77M41l11k54J128o58M28p59P95n18k16M82k78K73K20
6740D21K33r25J27j1m56J26l6J33J029m87O8j30L00m24o86R10o59O49r93Q82L84
6761D55P5p54K43m44J092q4p94K64m76J103p78n3O98o07L75k43R8m02P77q24M02
6782A23l15j4L52J56p65Q58M2l61J10n71n06J759r1j702Q77m6j2m59K72O39o42
6803b96N28l56q6o7K18K32N73o07j93M52M0r34R17p19LN97j177J294l05M93n05
$$ plain form
6660 -613 -173 248 -7 -550 103 58 377 -298 -107 191 337 106 -699 50 366 356 -756 -445 452 792
6680 792 -240 326 -519 -231 -475 572 319 439 185 139 612 -75 -928 -240 338 -167 -201 -68 -397 -302
6700 -302 73 134 405 547 -1112 -557 618 308 121 -102 -173 346 -45 553 148 456 -41 -217 -75 -118
6720 -118 -329 -3 819 170 425 -352 89 -222 -476 652 -6 422 -337 458 -60 -276 206 -72 201 421
6740 421 654 -271 -144 -155 -611 -485 -521 -388 641 154 222 92 392 -32 -718 192 -467 182 -811 71 455
6761 455 530 -224 19 -425 667 583 -211 53 -423 680 -98 -151 547 -60 315 72 170 -232 545 -279 123
6782 123 -192 -206 146 302 -463 395 437 76 186 -385 -891 868 777 -925 -48 -94 -106 -565 -293 346 -296
6803 -296 232 -124 -210 -277 -59 173 746 139 -54 398 438 -496 421 -298 -295 302 -875 419 114 607 102
6824A02n62O62n92J10R35J1k27r04m4R7m22J162j156Q01k86L72M37n27k35M39
6844A73q06M45j18M32k62j252K162j499Q76J28l11m24R51r89R70o38l68R98j122
6863f54J14O18J00m85L97k00l79O53j81P80j346P07r49O28P57q39J28N10N0M57
6883H66o83k11K0j269J353m75rL22M30N2k81K79j94P08q40N2k11q4P08M9k98j03
6905A81k42l38O10R7J1j04K4o47O15k09p15P36m14L42R72l81j155J589j015n90
6925f33J006j445J321J19K0m45M75J02r20L20N03p01p39J088M85q94L79l7k16
6944b12L78L07r37R39m18j237J325k6N40p79j18l56J108j240M22l50M05N38k67
6963B2j67P87j47Ln97K34j53K83p34Q82L80j130J67N97o16K48l78j5K15j57L63
$$ plain form
6824 102 -460 202 -390 -280 655 666 439 -465 -509 -412 -834 328 -828 -27 -313 59 496 -31 -266 173
6844 173 -633 -188 -306 126 -136 -1388 774 -725 151 279 -32 -456 495 -494 476 -162 -530 468 -654
6863 -654 -540 78 178 -307 90 -110 -489 164 -17 763 -583 124 -825 -197 560 -279 -151 359 409 866
6883 866 183 -28 -8 -1277 76 -399 -408 -86 344 396 115 394 200 908 68 120 -91 -175 533 582 284 181
6905 181 -61 -399 211 308 319 215 239 -408 207 -2 -717 19 -395 -53 919 538 -617 972 -43 -633
6925 -633 373 -1072 249 368 388 -57 418 520 -400 -80 423 -278 -1017 71 556 -338 41 4 -212
6944 -212 166 473 -464 475 57 -1180 145 119 659 -120 -238 -594 514 -726 -304 -654 -249 289 22
6963 22 -145 642 495 498 -99 135 -18 265 -469 413 793 -337 -170 427 -189 59 -319 -334 -119 -276 87
6984H7n39J460j093k23K13O85q29n7q2M7P22q45J14M07K29K9P8r98M32K04L92
7005D33p52m8J122o15K44j85j15P15r72K30k7j45k05k83M54L89l84l78M26j8O82
7026E68n50j66o25J004r3N52o69J27K09m4J14j584J319J11j58m67P9j81M33j95
7046b16M95N23j352L87L04m52J19m63J166j094M38N16m52J24J91k05K10m64J6
7065b09M41j04n47O04j29n92M35K65l59k57K38J270j977P91N00M68q60l61M05
7084B2m27O75N44k32p84J80j60L8O51r0l60M07j86j60n69P21k38j23M14L05P38
7105A366j253M84q23Q85m81K39M69r74j27J44J04m06O08k63L11P2K55J84o92K5
7125A27j16K36r13Q86J83n52j55M85l93L33k53O86L73j60o07l41P54k84n93m11
$$ plain form
6984 87 -452 1008 -85 -308 -95 590 -239 -296 -378 -331 391 -454 -340 67 296 325 403 -595 -163 41 433
7005 433 -319 -367 755 140 384 199 84 799 -173 57 30 -115 -320 -603 -149 240 -144 -522 -96 -114 568
7026 568 18 -148 -773 231 138 690 21 148 357 313 427 -1157 162 273 115 -352 -273 -454 -21 -216
7046 -216 279 802 -550 -163 141 -311 -192 -655 511 -583 -145 371 -81 43 234 29 239 -225 -209
7065 -209 232 128 -419 185 56 -536 -101 164 -195 -452 -214 1056 -921 -130 370 838 -22 -383 22
7084 22 -405 270 814 582 -202 -22 -182 -144 507 417 57 464 278 118 -451 270 32 -91 323 628 1366
7105 1366 113 597 -226 659 178 417 886 -88 -215 -71 33 -373 235 -28 283 355 610 794 102 127
7125 127 11 247 -666 220 403 -149 -304 181 -212 121 -132 554 927 767 160 -181 573 289 -304 -715
7145g15O74ln62J092p6k02p18J227k58o24k62O48m90N87P57o7l73p18N85l06l6
7166A60o01L82L68o60O67J28j97l86O38O2m46J08J68l40p0J89n45N51q02K31J09
7187b86k82L58j3P09j55K41l18L05m70M13n85R31m84m75O2j59J48j15N60l51l95
7208c61M64o5l9L66P15j349P0J264o82j34N84p26K15L54j7n67m17J024j060n79
7228i40Q75N72l21l58l6j95m8J56J27L74m57m1K23M48m09K85L41m37J56r44o6
7249f95M42k34K05M60rn01k94N28M18n06L39R2j53j12K02n91L3N92m04n67J108
7270C53k69J40q4k51Q94o86O7l70r3N03J58j707J338N55o55k84J128p26m7K54
7290B18n32rj0P79p5j93j134K08J578j41q67k12q49J298m30J75O2K20L80m95K73
$$ plain form
7145 -715 -41 -44 -606 486 410 208 -510 717 459 -165 -427 221 -269 318 1075 1008 635 -83 502 196 160
7166 160 -441 -59 309 -351 316 444 247 -139 499 561 115 223 391 51 -19 170 -375 176 -626 -395 -286
7187 -286 -568 -210 -223 486 331 572 254 559 89 502 -83 848 364 -111 -49 -208 -60 -175 385 34 -361
7208 -361 103 38 -1 365 1080 -269 -199 1065 383 249 833 107 322 676 659 92 -325 699 -361 -940
7228 -940 -65 507 186 -172 -208 -403 -451 -295 -168 206 -251 -292 -69 379 -30 255 596 159 315 -629 -695
7249 -695 -253 -487 -282 178 169 -332 -626 -98 320 -186 153 245 92 -20 182 -409 -376 216 -188 -755 353
7270 353 84 224 140 -111 783 97 164 -206 -299 204 362 -1345 -7 548 -107 -391 737 11 -36 218
7290 218 -314 -323 -333 446 371 178 -956 -748 830 689 -178 -390 -1239 59 -371 -196 -134 86 466 -29 244
7311B44k44L30n66m25P53o98L79k14O82l47j5j47J69M62J76q11K80N4J86k96k2
7332g0J29N12j098L14M67o48k27M85q01J364m18j45p3J60K14J22m48J63k3p8J63
7353F4M71j131K49N31q4K27p37J7P18j116Q29J80l06O59l34L35m40k55J31K74
7373B82l94j77M58k54P96p94J17m9P31l86P20j620L25L7k4n9K18r64J017l76k96
7394f92M90P59j64k32k28n42J797p30n25L67q58R4M85K7j09n21Q2Q74o71j36O55
7415B22n40N28l76N81l85m0L73r77j27J31J563r55K9K50j31O51o31j062L73P57
7435B34j2m06l80J189m71q27J122j84J75m32J72Q4j066K15M91qK8J191j682j28
7455f95P48L55q5j25q99R88n32K17N46r27QN08J08n13k36m07P57o9N97l67N50
$$ plain form
7311 244 0 330 -236 -661 92 -606 -227 -441 241 -106 -121 -268 -99 363 539 -272 8 62 248 -48 -70
7332 -70 59 571 -527 -213 254 -394 -621 -136 -937 427 9 -136 -209 -49 165 287 -161 2 -21 -99 64
7353 64 535 -596 -347 184 100 327 -410 -393 325 -791 38 218 -88 571 237 572 132 -123 8 282
7373 282 -112 -289 169 -85 711 -83 34 -15 716 330 1050 -570 -245 -208 -232 -291 -73 -1037 -20 -396 -692
7394 -692 -202 557 393 161 -67 -609 1188 458 -67 300 -558 -464 21 48 -61 -582 -500 374 -297 -433 222
7415 222 -318 210 -166 415 30 -10 363 -614 -741 -610 953 -2 27 277 146 797 166 -896 -523 234
7435 234 222 -184 -564 625 154 -673 449 265 440 8 180 264 -802 -587 -96 -104 -76 1115 -567 -695
7455 -695 53 408 323 198 -701 287 -245 -28 518 -409 -401 107 215 -298 -534 -941 -184 -253 344 -23 527
7476E27m48j43J49L27J71k52l93M3j50M06k92L64j033J19o3O36K16k42n23R77
7496C96l71M63j181N17J99O22p67N3P2QN29j80p64j55j69L88K49k2J22Q0o18J83
7518c46J40m96J306j460J44J47K69M10p6l83K92J49m23K41l36N2K61K43r8p68
7538g32N18N52n15J159m44k00k63p56M27N76j51k59p0j05K10N26j84j005R21K60
7558D65Q9q44N11O37o24J48k34j035J126K73n30L04j6j38J73N82r56J1o3J98j99
7579a22K99q0j4p18L95L8qO89o82l9M34R1qM7j47J98l10l74k98L72P6J90R25q35
7603A19M21P6l67l67RO7o52P78P33q20%q17M25j07K15J16J70Q7o5p17P82M60r37
7626c91j85Q11r33P92m75L52M57k37j05r54R3J079m95M80j09m81Q44r58Q53n53
$$ plain form
7476 527 79 -64 85 412 583 331 -62 -19 -169 237 -55 309 -724 -605 -668 -32 184 -58 -581 396
7496 396 25 488 -693 -176 23 645 -122 -69 3 11 540 360 -404 -559 -728 -340 -91 -113 9 89 -529 -346
7518 -346 -206 -702 604 -856 -712 -565 -296 114 38 -345 -53 96 -327 -86 -422 -370 -109 134 36 -732
7538 -732 -214 338 -177 982 538 338 75 -681 -254 322 171 -88 -158 -263 -53 473 289 -716 205 465
7558 465 554 -290 221 858 234 382 148 -887 239 512 -18 286 270 132 305 887 -69 -58 -121 77 -122
7579 -122 177 97 83 -635 -240 -202 -210 479 -203 -242 192 283 275 322 175 373 63 -311 -609 -237 -161 29 954 119
7603 119 540 616 249 -118 -109 -42 -694 84 817 -3 -3 -820 -395 -502 -287 -171 -1 86 21 -696 86 546 -391
7626 -391 -576 235 -698 94 -381 -29 428 191 86 -868 -775 304 -191 289 180 -301 543 -415 438 -115
7646a15K85n72P96Qj370J326q99Q19p17N29M4K42n1m35k63k94j37J449j260M01
7666b14K80J04n02L54n48N65o62k36J061n30L59P7k42L21K82p36N49l06L72o67
7686c19N13r0K13N82q33J0o25O30N06m56m71NK53j73R44n61l99j44J135j178M20
7707c8M45o54M26k4k53o76J089l87j96N85j33r28J517Q4j069O80j029Q03J99k50
7727A91O19j747Q70O43p21r36Q21K9m20N25M77m64k17R10j042P14o86k7N44k69
7747a86J36N9j87K32j53M07j74j96j67P12o41M58m10r7j13L20M73o89N95l38l88
7768c47M93n65O16r66N27O40j103K81J486pj410O58p83l53O98o21J247n61N41
7787D71o16R10r29KN10j92m06J042K13p97k71L96O3n33p48J86N46l64l2R27N5
$$ plain form
7646 -115 170 -402 394 402 -968 358 -541 278 -439 90 134 376 325 -110 -373 -667 -804 645 -615 -214
7666 -214 66 170 -332 22 -526 39 -623 -859 202 -328 31 108 -134 187 469 -267 282 -24 348 -319
7686 -319 194 104 317 899 66 76 -549 81 587 131 -340 -335 -82 -255 689 128 -271 -415 720 -458 -38
7707 -38 407 -247 179 155 -98 -774 315 -72 -268 317 184 -744 773 857 -212 468 -561 242 441 191
7727 191 810 -937 -67 576 -145 -1081 -260 -231 -651 -126 351 -113 -330 580 -462 252 -434 -461 83 -186
7747 -186 -50 9 -178 54 -99 308 134 -62 -229 483 -158 300 -110 -207 -320 0 473 -216 379 41 -347
7768 -347 146 -419 197 -769 -242 398 -705 -424 1062 1055 -355 303 -480 -833 -135 -756 491 -70 471
7787 471 -145 765 -164 -162 348 156 -250 792 1005 208 -63 333 396 -137 -885 -699 -153 -517 -549 378 433
7808D33J35k59n43N44l83o51N15pj035J971k44k58n28J201j293Q74m00M03k71
7827B04L64j207N84J17r3o01J249j182rQ4J12o96R87o3kj35N20J28p10K26l53
7848d76N5R40j471R65r53P18M56K18L67r57k21N37L56p49M18j354J887n70O29
7867G95m87L66j033L49O0n6K2k06K80R3n98Q90p45L93p89O99r7L49L90k01p31
7888b57o15n6O0J020q0n20k28J570r65M16k98n6J31O9L17j72K53r96o00Q93m4
7909a58M41j178J121r21J222q74l23J682o75k91o60l6O44j048M96N30l20J267
7927I19m63k92J83k96m12J32Q26k50o02M11K14n96N15p2J41l39p55O48L9j08R74
7948H17q36K34r43J54J201j633N14L70j40K23L68P5K51j87n05M17K6l79k24K57
$$ plain form
7808 433 568 309 -234 310 -73 -724 -209 -216 -1251 720 476 218 -310 891 -402 472 72 475 204
7827 204 568 -639 -55 62 -31 -632 617 -565 -574 -490 -378 -1074 -87 -150 -152 -287 233 361 -349 -123 -476
7848 -476 -421 519 -952 13 -940 -222 234 452 819 -138 -359 178 534 -215 203 -1151 736 166 795
7867 795 308 674 -359 -10 50 -6 16 -190 90 183 -415 475 -270 123 -666 33 -64 285 675 474 -257
7888 -257 -872 -928 -868 152 72 -448 -676 894 -71 345 47 -9 122 191 508 336 589 -407 -1007 -114 -158
7909 -158 283 -895 226 -695 527 -347 -670 1012 337 46 -614 -650 -6 -1054 -558 -28 -348 919
7927 919 456 164 347 51 -361 -229 597 347 -255 156 370 -226 289 217 358 19 -736 -88 -49 -157 817
7948 817 -19 215 -728 -574 627 -1006 -492 -122 -262 -39 329 404 655 468 -37 380 406 27 -197 60
7968F0K12k58J90p86P65l28N1l4r50P58p7L23K39n18k84M07J68J77J51k34K46
7989B78m20l04kQ76n28j34P84q00P2J562j397K32P4q50M36m40N26O07l06p45M76
8010cO3K15n78P20R2l49m13K37l26M88J80j15J86r11N89k20L30j35K48j37l48
8031a87R79n90P20j156N41r28N94j54N21k79l82j8M1J409q01n10L46k93j03L35
8051H5J24N9L8o03L47p7K45M04n84O87k24J95j866J179m50L65n27J284r91R38
8071F28j563J391r5k21M66o48m13J130o67j41Q6P86m34k11L54o88N20Q58j811
8090f73J84Q52m9k26k15M6j2O7J43K46n97j25M00M54m10R2o08j70M07m10k0J65
8112d59L68J27l15m36O10Q0K2O22o08L11k81R39o28O86p37J36Q6o26J007j333
$$ plain form
7968 60 272 14 204 -582 183 -145 -94 -128 -1078 -320 -397 -74 165 -353 -637 -230 -62 115 266 32 278
7989 278 -142 -446 -448 428 -100 -234 550 -250 -178 1384 -13 219 293 -557 -121 -561 -35 572 266 -479 -3
8010 -3 60 275 -303 417 509 160 -253 -16 -342 146 326 211 397 -514 75 -145 185 50 298 161 -187
8031 -187 792 202 922 -234 307 -621 -27 -181 340 61 -321 -339 -298 1111 310 -200 146 -147 -250 85
8051 85 209 268 306 -297 50 -27 218 622 38 725 501 696 -1170 9 -441 -76 -603 681 -310 628
8071 628 -935 456 361 140 606 -42 -455 675 8 -133 -47 739 305 94 448 -240 280 1138 -673
8090 -673 -489 363 314 88 -127 -81 -93 -26 117 363 -234 -359 41 495 85 177 -431 -601 -194 -604 -624 -459
8112 -459 -91 36 -279 -715 -105 -25 -3 619 11 322 41 980 352 1038 301 437 523 -103 904 -429
8132d29k93J025r74Q75r85Q47K1p5k50K59k72k58M62r82M72P56k88L03j51l37
8152b74K33M17r75Q16m09p0O39J79l73L49Q9q42Oj23N04k44J40k39K11qO20r40
8174b94L5K56n18N63J91q25N14M10j89P9l15K59O63n94k81P7j03
$$ plain form
8132 -429 -722 303 -671 204 -781 66 87 12 -238 21 -251 -509 -47 -1029 -557 199 -89 214 63 -274
8152 -274 -41 376 -599 217 -192 -262 377 556 183 532 621 -221 -215 -338 166 -78 62 -177 34 26 646 -294
8174 -294 -259 -3 -521 42 233 -592 -78 332 143 222 -93 166 829 235 -46 31 -72
8191g2
$$ Imaginary data points
##PAGE= N=2
##DATA TABLE= (X++(I..I)), XYDATA
0@%%%%%%%%%%%O3j27J28j28J28j29J91k54K60l22L83m40N07n76O62p41Q47r66
29e14J095j234J385j550J736j942K164k406K671k970L295l642M032m467M946n477
45b878O074o746P509q391R412j0609J2044j3801J6011j8887K2794k8438L7378
58B1472n3746R3297l73298l75907P57210L26968m90798l81820N39716M31068m11824
69H2338m89337L75099N05268k78825n53532J94990N26630j06718n12199P1013
79a85273N02282J0481m71103l4793M61165J08606m26985j45970L85018J72755
89C76183l72636k22678L14392K34265l05100k89209K37018K92936k04732l11645
99b51206J47810L05960j14004l01380Q2239K95145n1873k86229K4459K70808r458
$$ plain form
0 0 0 0 0 0 0 0 0 0 0 0 0 63 -64 64 -64 64 -65 126 -128 132 -190 193 -247 260 -316 346 -395 452 -514
29 -514 581 -653 732 -818 918 -1024 1140 -1266 1405 -1565 1730 -1912 2120 -2347 2599 -2878
45 -2878 3196 -3550 3959 -4432 4980 -5629 6415 -7386 8625 -10262 12532 -15906 21472
58 21472 -32274 61023 -312275 -688182 69028 395996 -94802 -476622 63094 494162 82338
69 82338 -406999 -31900 473368 194543 -358989 -163999 362631 255913 -256286 -185273
79 -185273 317009 327490 -143613 -178406 282759 391365 -35620 -181590 203428 376183
89 376183 3547 -219131 95261 329526 24426 -264783 -27765 265171 60439 -251206
99 -251206 -103396 202564 88560 -212820 -130581 164564 112691 -173538 -149079 121729 112271
110A12271k65877j4149K48628J7349k56503m8884K41406N7163k36800p8487K31159
121G276R6249k10216r6841K20974J32567j93276j34702J91987J60026j72549j73006
132a71511J46680J75370j44235j96798J19101K03602r7866k06825Q5385K30812
142A43715m6081k12323M8347K38209j1910k31282n022K35535K8359k42631o2504
153a17588K26459P4707k35582j09505K26270J41975k14085j68850K05063K15388
163B44252j61438k25928J45539K59344j02267k70104O3645K77238k9265k87725
173h6709k5096K62686M9339k61462r0081K33699J15197k18288j40932J97015J70348
184B05716j63695j82274J38996J96767j08126k05521P4150K02728n5896k19994
$$ plain form
110 112271 -153606 -167755 80873 98222 -158281 -207165 34241 91404 -145396 -223883 7276
121 7276 103525 -106691 -203532 17442 150009 -43267 -177969 14018 174044 1495 -171511
132 -171511 -24831 150539 6304 -190494 -71393 132209 34343 -172482 -87097 143715
142 143715 97634 -114689 -66342 171867 159957 -71325 -76347 159188 187547 -55084 -117588
153 -117588 108871 183578 -52004 -161509 64761 206736 -7349 -176199 28864 244252
163 244252 82814 -143114 2425 261769 159502 -110602 -46957 230281 201016 -86709
173 -86709 -111805 150881 200220 -61242 -151323 82376 197573 -20715 -161647 35368 205716
184 205716 42021 -140253 -1257 195510 87384 -118137 -43987 158741 102845 -117149
194a17149R452J97797Q406k03617m9443J78478P0139j59619q7047J46874J13228
205A07499j10645j15355R6013J27095o4337j25174M2137J16447k8196j14543Q970
216f0089J02663M656r0898j1866Q4701K6095o4775j8061O4678K3921n1439k2044
228a2458N1650K0859m7471k6512L6890J9413m3860k9602L3079K1999l7402l1731
240d5146K7057K7060k2813k7844J9054K4960j8180k1499J2655J9725j7274k2384
252d4629R316J2986k1756k0951J4076J6801k5050k5739K1087L0572j6799l2282
264h2368K0614M5480m010m0233O877N3076J1046m9838j6813M6964K5829m3357
276b6733l4567L7023M1248k9453m1414K7769N5173j0047m5121J3431N6885M464
$$ plain form
194 -117149 -107697 90100 98506 -105111 -154554 23924 94063 -65556 -152603 -5729 107499
205 107499 -3146 -118501 -22488 104607 40270 -84904 -42767 73680 45484 -69059 -60089
216 -60089 42574 47230 -43668 -55534 29167 55262 -9513 -27574 37104 61025 9586 -12458
228 -12458 39192 60051 12580 -13932 22958 42371 -1489 -31091 1988 23987 -13415 -45146
240 -45146 -18089 8971 -13842 -41686 -22632 2328 -15852 -37351 -24696 -4971 -22245 -44629
252 -44629 -35313 -22327 -44083 -65034 -50958 -34157 -59207 -84946 -63859 -33287 -50086 -82368
264 -82368 -61754 -16274 -20284 -60517 -53640 -564 10482 -39356 -56169 -9205 16624 -26733
276 -26733 -61300 -24277 16971 -12482 -53896 -26127 29046 18999 -26122 -12691 44194 48658
288D8658m8226n132N0533J6273n1070k4986M4728L0541m4659m1131L4481M7216
300E7226k6015n2595J9592O0553l823n9746m584O2410K2764n6933l4727M8387
312C2509M4495l9680n7346K4053N8714j3832o6024j620O2628J5774n6069k8185
324b4583N2102L7968l9535m3045L1833M8104k1752n1045J1843M7600o178n0967
336g655n826M2664P417m5673j6824L9960J9692l7401k5510L4660L1067k8193l3803
349b5425K4060L7231j9734m2638R124M0644o473m6294n591L8527R754l7517j5452
362c9784L2783K2185k4906k2149K4619K6240j4199k2905J1574K4666q611k0404
374a0891N206J7114n776j7557K897J3721m612j3410M681J3059m351j3568O557
$$ plain form
288 48658 432 -4700 45833 62106 11036 -13950 30778 61319 16660 -24471 10010 57226
300 57226 31211 -21384 -1792 58761 54938 -4808 -9392 53018 75782 18849 -15878 32509
312 32509 77004 37324 -20022 4031 62745 48913 -17111 -18731 43897 59671 3602 -24583
324 -24583 27519 65487 25952 -17093 14740 62844 41092 -9953 1890 49490 43312 -7655
336 -7655 -13481 29183 36600 -9073 -25897 14063 33755 -3646 -29156 5504 36571 8378 -25425
349 -25425 -1365 35866 16132 -26506 -17382 23262 16789 -29505 -35096 3431 13185 -24332 -39784
362 -39784 -7001 15184 -9722 -31871 -7252 18988 4789 -18116 -6542 18124 9513 -10891
374 -10891 -5685 11429 5653 -11904 -9007 4714 102 -13308 -8627 4432 81 -13487 -6930
387f930J4954k159j6805J000J5521l168j5729k10R735l770j4152j388J0145m515
401a7471j2309L276J1951p783j4702Q480K0083q401k2933P247K7437l947l2733
414d1805o61L6247O709l9745j3906M1403K4382l7667k9228L7127M2204k4927m0911
427d0778K6147N1352j2917m6858Q243N4038J259m9857p637N0340J5115m6038k1079
440a8670M5616K3928m0396k9861L8511L5096l2998l9789K9796M2167k5501m5701
452a7802J7533M7319j2590n2238J306M8968J589m9293j2541M4415J4706m2475
464a1103k1026L5721K4283k9300k6653K5539K6457k0473k5666J7804K5582j6795
476D370k4076J1647K3763j2188k3029J1452K2620j2255k3314J4582K6456j0510
$$ plain form
387 -6930 8024 5865 -10940 -9940 5581 2413 -13316 -13526 -3791 -7561 -21713 -23101 -12956 -17471
401 -17471 -29780 -26504 -14553 -22336 -37038 -28558 -8475 -16876 -39809 -32562 -5125 -9072 -41805
414 -41805 -42466 -6219 490 -39255 -53161 -11758 12624 -25043 -54271 -17144 25060 133 -40778
427 -40778 -14631 36721 23804 -23054 -14811 39227 40486 -9371 -17008 33332 48447 2409 -18670
440 -18670 26946 50874 10478 -19383 19128 54224 21226 -18563 11233 53400 27899 -17802
452 -17802 -269 47050 34460 -17778 -16472 32496 34085 -15208 -27749 16666 31372 -11103
464 -11103 -32129 3592 27875 -1425 -28078 -2539 23918 3445 -22221 -4417 21165 4370
476 4370 -19706 -8059 15704 3516 -19513 -8061 14559 2304 -21010 -6428 20028 9518
488I518k8878J2369L0116o562k9443L609L1834j083l3874k709L1018N469l0166
501h782r648L1143R801k7773j1772L0057J3689k8140j3925K8982J6106k8918j8766
514a7946K9822K2670l1936k7020L0936L3098k9858l8684K6472M3145j9977m8955
526b8233J5429N2764q773n3733K056N4684N415n5244j3005N2978J7950n2791k4675
539c5178M7574K9474m7279l8190M1778M0411l8691m6105L1768M9435k8863n3769
551d7635K1916N7336j6407o3115Q645O0784K3o3867j1456O1867J5793n9235k6739
564f2090N3790L4175m7931l8772M2452M3583l3832m4743L0066M8300k3134m5736
576d3872J7437M7998r333m4553P628M4511l482m1100J768M4005J857m3179k597
$$ plain form
488 9518 -19360 -6991 23125 16563 -12880 -9271 22563 21480 -12394 -15103 15915 21384 -8782
501 -8782 -18430 12713 22514 -5259 -17031 13026 26715 -1425 -15350 13632 29738 820 -17946
514 -17946 11876 34546 2610 -24410 6526 39624 9766 -28918 -2446 40699 20722 -28233
526 -28233 -12804 39960 31187 -22546 -20490 34194 39609 -15635 -28640 24338 42288 -10503 -35178
539 -35178 12396 41870 -5409 -43599 -1821 38590 -101 -46206 -14438 34997 6134 -47635
551 -47635 -25719 31617 15210 -47905 -39260 21524 21547 -42320 -53776 8091 23884 -35351 -62090
564 -62090 -8300 25875 -22056 -60828 -18376 25207 -8625 -53368 -23302 24998 1864 -43872
576 -43872 -26435 21563 12230 -32323 -24695 19816 16334 -24766 -22998 21007 22864 -20315 -22912
589b2912M4415Q608m2706j1453M3493J5945m1844j9581M0097K3083l6680l0405
601b9940L3289L1568l1727l4813K6955L5792k5083l8114K1174L9490j8015m0394
613b9818J4140M2964j3314m2937Q314M5106o314m7536J909M8586L594n0789q897
626c4992N2506J5393m9634k0703M9539K8656m3742l4052M1129L9098l4371m5059
638c6232L1675M7403k4674n0338J9559N4349j3183n2689Q120N4979k017n3038
650a6086m207N3284R019n2740j5719N2435K0859n1191k7256M7973L5077m6341
662E107m0527L9167M6544l3282n3483K5499N5144j7993n7776Q963N6583j757n6019
675b3830n760N2886J4336n0567j9358M5275K3267m1531k8935L6153K9560l3081
$$ plain form
589 -22912 21503 30111 -12595 -24048 19445 35390 -6454 -26035 14062 37145 465 -29940
601 -29940 3349 34917 3190 -31623 -4668 31124 6041 -32073 -10899 28591 10576 -29818
613 -29818 -15678 27286 13972 -28965 -20651 24455 18141 -29395 -27486 21100 24694 -26095 -34992
626 -34992 17514 32907 -16727 -37430 12109 40765 -2977 -37029 4100 43198 8827 -36232
638 -36232 -4557 42846 18172 -32166 -12607 41742 28559 -24130 -16010 38969 36952 -16086
650 -16086 -20293 32991 42010 -10730 -26449 25986 46845 -4346 -31602 16371 51448 5107
662 5107 -35420 3747 50291 17009 -36474 -10975 44169 26176 -31600 -22637 33946 32189 -23830
675 -23830 -29590 23296 37632 -12935 -32293 12982 36249 -5282 -34217 1936 31496 -1585
687a585l3475K8257L3497k3798l4729K0094L7140j6693l7397J2598L6868q139
699A2638l7744N85L7647J204l7112n714L2105J0215l2988j1010K9236J4754k6795
712a2979j5853K4039J6733k0569j7775J7950J7059j6738j7337J5614J7372j4008
724f492j8075J5724J9755j4169j9184J3995K2944j0603k3906Q572K6697m686k7772
737a7200L674K8313J293k6997l642K6420Q167k5235j0586K4725J2107k1882j5551
750a6394K0778J5981j7868j7270J6444J7839j5022j8852J3616K0091j2305k2337
762a5299Q920K4322p573k6940L137K9015j326k7780l895K6474Q670k5721j2091
775b0087K4476J4354j9963j7762J6827J9134j2123j9973P386K1528m801k0540
$$ plain form
687 -1585 -35060 -6803 26694 2896 -31833 -11739 25401 8708 -28689 -16091 20777 12638
699 12638 -25106 -24521 13126 14330 -22782 -28496 3609 13824 -19164 -30174 -938 13816 -12979
712 -12979 -28832 -4793 11940 -8629 -26404 -8454 8605 -8133 -25470 -9856 7516 -6492
724 -6492 -24567 -8843 10912 -3257 -22441 -8446 14498 3895 -20011 -11439 15258 10572 -17200
737 -17200 -13526 14787 16080 -10917 -14559 11861 20028 -5207 -15793 8932 21039 -843 -16394
750 -16394 4384 20365 2497 -14773 1671 19510 4488 -14364 -748 19343 7038 -15299
762 -15299 -6379 17943 10370 -16570 -13433 15582 14256 -13524 -17419 9055 17725 -7996 -20087
775 -20087 4389 18743 -1220 -18982 -2155 16979 4856 -15117 -7731 13797 8996 -11544
787a1544K837J9817N04j7623j207J5904L795j2412n585J2309P334j1114r334J1696
801E377R351q987j0686O502J0005l831j1533J836J1272Q90j0632m162Q956N172
815I530o596p759L514Q947k506p601j317O723L897o452n704K688P352k274p733
830e291m84O745K778n875m817O513N463m623n102K851O386l177o105J313P910
845D485k325p541J236P860j72q449q5R382Q90r376k899R823M525j0068o882R899
861C03Q440r140j0710P013J1319m680j2656L540J2952k029j2667P09J1218J297
875D909j1394j007R200L022r925k924J1061K051r195l669J1520L586j1056m616
889h437J1333O561j1769p533J0768J0510j0554j2317J1349J2828q928j4094P631
$$ plain form
787 -11544 -8707 11110 11614 -6009 -7216 8688 12483 71 -5514 6795 14129 3015 -6319 5377
801 5377 14728 5741 -4945 1557 11562 7731 -3802 -1966 9306 10196 -436 -4598 4358 9530
815 9530 2934 -4825 -1311 7636 5130 -2471 -3788 2935 6832 380 -5324 -2636 4716 2442 -5291
830 -5291 -5775 970 3748 -2127 -6944 -431 5032 409 -4693 -1842 4544 1367 -4738 -3425 4485
845 4485 2160 -5381 -4145 3715 3543 -4906 -4991 4391 5281 -4095 -6994 2829 7354 -2714 -9596 303
861 303 8743 -397 -11107 -4094 7225 2545 -10111 -6571 6381 4352 -8315 -7606 3612 4909
875 4909 -6485 -7492 1708 4730 -5195 -8119 2942 4993 -4202 -7871 3649 7235 -3821 -8437
889 -8437 2896 9457 -2312 -9845 923 11433 879 -11438 -89 12739 3811 -10283 -2652
902b652J5218n842j6362K037J5685j635j5678j94J5877J177j7133j372J6330L407
916H863j6817m527J7171M938j6937q266J7560J0191j8234j2087J5934J6942j5774
929a043j9799J5079K1309j0439k3173Q533K4870m675k5190J621K4071L524k4481
942i793m390K3886P138k0493r999K0787J1701j9189j2944J8232J5013j6543j6568
955a3162J5616J9188j4481k0758J3852J9853r808k2926O814K4664n348k3968N93
968i871K4710J342k4611n715K4523P687k2575j0586K1028J2074j8862j4129J6817
981A832J6150j5775j7730J4424J7257j2333j8508J0286J9593q881k1280Q659K0907
994A4601n695k2643L947K3175j588k2688k933K3926N093k2516r113K3471R588
$$ plain form
902 -2652 12566 6724 -9638 -7601 8084 6449 -9229 -9423 6454 7631 -9502 -10874 5456 8863
916 8863 -7954 -12481 4690 9628 -7309 -15575 1985 12176 -6058 -18145 -2211 14731 -1043
929 -1043 -20842 -5763 15546 5107 -18066 -9533 15337 10662 -14528 -12907 11164 14688 -9793
942 -9793 -14183 9703 16841 -3652 -13651 7136 18837 -352 -13296 4936 19949 3406 -13162
955 -13162 2454 21642 7161 -13597 255 20108 10300 -12626 -5812 18852 13504 -10464 -9871
968 -9871 14839 16181 -8430 -14145 10378 18065 -4510 -15096 5932 18006 -856 -14985 1832
981 1832 17982 2207 -15523 -1099 16158 3825 -14683 -4397 15196 6315 -14965 -6306 14601
994 14601 8906 -13737 -9790 13385 11797 -10891 -13824 10102 15195 -7321 -16434 7037 16625
1007A6625k0785j2848J9387J4634j7479j6710J5713J7542j2686j8794J0691J9406
1019A4696q894j9483P667K0378o716k0356M585K0344j753k1681j690K2549L167
1032A2813k2408m878K1083Q408k0796j1568J9834J4581j7279j7573J4927J8113
1044A5257j0935j9723R116K0295o963j9312K306J9505j141j8914L94J7145P46
1057G776j6003l117J6302M997j6686m901J4620N975j3357q157J3074R372j2516
1070b621j0585J0338J3336j0586j2085P503J4238o278j2985K872J4087j685j3794
1083h245P51J2140J656j1968j5J0541J628j0095j938J0295L531j0864l056J0308
1097D669L744r748m190Q549P164r562q717J0304Q168q511q873P638R263n453j0522
$$ plain form
1007 16625 -4160 -17008 2379 17013 -466 -17176 -1463 16079 3393 -15401 -4710 14696
1019 14696 5802 -13681 -6014 14364 7648 -12708 -8123 12221 10468 -11213 -12903 9646 12813
1032 12813 -9595 -14473 6610 15018 -5778 -17346 2488 17069 -210 -17783 -2856 15257
1044 15257 4322 -15401 -6285 14010 7047 -12265 -9959 9546 8405 -10509 -10115 7030 7776
1057 7776 -8227 -11344 4958 9955 -6731 -11632 2988 8963 -4394 -12551 523 9895 -2621
1070 -2621 -13206 -2868 10468 -118 -12203 -4700 9538 3260 -9725 -6853 7234 5549 -8245
1083 -8245 -7494 4646 6302 -5666 -5681 4860 6488 -3607 -5545 4750 8281 -2583 -5639 4669
1097 4669 8413 -1335 -5525 3024 10188 626 -8091 2213 10381 1870 -7003 635 9898 4445 -6077
1112f077L147J1728l019j0914J101J0138l27r537j157Q963J939q439k339Q140
1126C347K364q090l283P910M049q257m918Q105M997o730p103O671P039m555q485
1141f939L444J0030l316r571J445R688K89r397k103Q232L367n933n505N887M656
1156D274m342l641K230M652j283n451K313M305j389n195K197L105l94l781R41
1171a459L656m82l685m07L664L88k152k083K659J427j823j042K23J499k36j451
1187a304r48J187Q31J30j234j861K470J503N62m181J12K908N10k908m62K496J371
1204A182q21l360J391L590j637l510P77L056O87l925m51L432Q68k831p75K308
1220a9J086k578j286K747J058k362j090K431K106k629k494K527K941k585k744
$$ plain form
1112 -6077 -2930 8798 5779 -5135 -4034 6104 5777 -3760 -4917 4046 5985 -2454 -4793 3347
1126 3347 5711 -2379 -5662 2248 6297 -1960 -6878 1227 6224 -506 -7609 -938 6101 1546 -6939
1141 -6939 -3495 6535 3219 -6352 -4907 4781 5070 -4327 -6430 1802 5169 -764 -6269 -382 4274
1156 4274 -68 -3709 -1479 3173 1890 -3561 -1248 3057 1668 -3527 -1330 1775 1381 -2400 -1459
1171 -1459 2197 1715 -1970 -2377 1287 1675 -477 -2560 99 1526 -297 -1339 -1116 383 147 -1304
1187 -1304 -2252 -1065 -234 -104 -1338 -3199 -729 774 1336 -2845 -2733 175 685 -2223 -2685 -189 1182
1204 1182 361 -2999 -1608 1982 345 -3165 -2388 668 1355 -2570 -3021 411 1279 -1552 -2327 -19
1220 -19 1067 -1511 -2797 -50 1008 -1354 -2444 -13 2093 -536 -3030 -503 2438 -147 -2891
1235b891J408L831p30l664n05L473J775m040j487K940J218j418j617J568J539
1250A400m25j457k97K107j263j15m07K46m1Q33R57j028j109M50K344k17k128J20
1268c0J365N29k439n32K605P2j956p06K300p17r04l49J385O69k310l34K987n91
1286A044j818j447L466J300l770j916K717M026l450m181L474M964j823o114J234
1301b294N766L2n437j489N607J254m082k775M358L377m338l870L592M028k327
1316A402m591K556L536k149k997J637L665k039m102K244L568j601m207J367N128
1331C417o73n849M1N281N60m150k367M250J663l261k585L836K678l030k306J982
1347e13K985k406j751J506J868j916j664K452J638l745j472L703J797l405l375
$$ plain form
1235 -2891 -1483 2348 1618 -2046 -2551 922 2697 -1343 -2830 110 1328 -90 -1707 -139 1400
1250 1400 975 -482 -779 1328 65 -50 -457 -211 -252 581 1538 510 -599 -149 2195 1978 -150 -30
1268 -30 1335 1864 -575 -1107 1498 1570 -386 -1092 1208 491 -413 -762 623 1292 -1018 -1352 1635 1044
1286 1044 -774 -2221 1245 2545 -1225 -3141 -424 3602 152 -4029 -555 4409 2586 -3528 -2294
1301 -2294 3472 3504 -1933 -3422 2185 3439 -643 -3418 940 4317 -21 -3891 -299 3729 1402
1316 1402 -3189 -633 2903 754 -2243 -606 3059 1020 -3082 -838 2730 1129 -3078 -1711 3417
1331 3417 2744 -3105 -3064 2217 2777 -1373 -3740 510 2173 -1088 -3673 163 2841 -189 -2495 -513
1347 -513 2472 66 -1685 -179 1689 -227 -1891 561 2199 -1546 -3018 685 2482 -923 -4298
1362d298L663M099l346m141K812L990j277n340J462N374m71o029Q92N615k71o348
1378c614l53O103N74n595o69N012J572n602j161O280R95n428k020N628L704o110
1394f84n036N785N317n049n956L919Q595l496j0159M101P560j127r476R55R665
1409D914M9p979k716P872M049q701k878O469N159o464o068P140N640p018n353
1424e885N937O211n176p809M441R262m287r063L686R405k990r520J772R456n33
1439D907q939j576Q499L634r798k900Q976L877q742m722Q341M592o975n908O820
1454H6O808p311n375N268P280m834q117N484P368m072r654K481J2161l029j0910
1469f366J261J0948J260j1900k164J1436L158j0686m357J0289M900r088p044Q302
$$ plain form
1362 -4298 -635 3464 118 -4023 -1211 2779 1502 -3838 -2376 2998 2527 -3502 -2610 3005 2734 -3614
1378 -3614 -3967 2136 2710 -2885 -3554 1458 3030 -2572 -3733 2547 3542 -1886 -3906 1722 5426 -684
1394 -684 -5720 65 5382 333 -5623 -1704 6891 3395 -6764 -2663 4897 3770 -5706 -4751 4914
1409 4914 4963 -3016 -5732 2140 6189 -2512 -5390 1079 6238 -226 -6294 846 6486 -532 -5885
1424 -5885 52 6263 1087 -6722 -2281 6981 2694 -6369 -2683 6722 3732 -5788 -4016 5440 4907
1439 4907 -4032 -5608 2891 6525 -3273 -6173 2803 6680 -2062 -6784 1557 6149 -826 -6734 86
1454 86 6894 -417 -5792 -524 6756 1922 -6195 -711 6657 2585 -7069 -4588 7573 4544 -6366
1469 -6366 -5105 5843 7103 -4797 -6961 4475 7633 -3053 -7410 2879 7779 -1309 -8353 -51
1483e1Q042p361q589O682R733p932q713O389Q949m527r961M138J1050l622j2169
1498g942L131J2145j238j2483r61J2483K443j2721m246J2653N799j0589p436R977
1512A015P969q893r851Q496J0203p520j0084O418R617m554j1396M923J1006l123
1526D226j1319J701J1683p34j1526r69J3172P50j1259m575J2946M902j1368o885
1540i255J0512Q281r491r941Q379J0484o518j0999N641J1934m604j2226L219J2243
1554G659k072j2808J589J1316O65j1604j144J1599K556j1835l569J2129L650j1002
1568b871n172J1423N675j0605p159R304Q941q163j0211P398J0699n636j1563M331
1582c609J2692l175j3751K313J1962L15j2058r75J1108L584j2153m161J1493N428
$$ plain form
1483 -51 7991 630 -7959 -1277 8456 524 -8189 -1800 7149 2622 -7339 -3201 7849 4227 -7942
1498 -7942 -4811 7334 6096 -6387 -7348 5135 7578 -5143 -9389 3264 9063 -1526 -8962 1015
1512 1015 8984 91 -9760 -1264 8939 1419 -8665 -2247 7370 2816 -8580 -3657 7349 4226
1526 4226 -7093 -5392 6291 5557 -5969 -6938 6234 6984 -4275 -8850 4096 8998 -2370 -9255
1540 -9255 1257 9538 47 -9894 -1515 8969 2451 -8548 -2907 9027 4423 -7803 -4584 7659
1554 7659 5587 -7221 -5632 5684 6349 -5255 -6399 5200 7756 -4079 -7648 4481 8131 -2871
1568 -2871 -8043 3380 9055 -1550 -8709 595 9536 1373 -8838 -1440 9259 3623 -7940 -3609
1582 -3609 9083 5908 -7843 -5530 6432 6747 -5311 -6286 4822 8406 -3747 -7908 3585 9013
1596I013j0708n364R620O309r797p233Q561P911p526r025O518J0882n629j1998
1610h466M000J2793k600j2199R31J1878K19j2176j661J2420K441j1539m812J1848
1624C077N608j0396o081Q575P347q688p378P917P111n292q985M739J0150n243
1638B461j0406L708J1103k136j0176q78J2374n6j0902k498J1551L578j1182m339
$$ plain form
1596 9013 -1695 -7059 2561 8870 -927 -8160 401 8312 786 -8239 -1721 9161 3532 -8466
1610 -8466 -4466 8327 5727 -6472 -5541 6337 6556 -5620 -7281 5139 7580 -3959 -8771 3077
1624 3077 8685 -1711 -7792 783 8130 -558 -7936 -19 7092 1800 -7185 -2446 7704 2461
1638 2461 -7945 -4237 6866 4730 -5446 -6324 6050 5994 -4908 -7406 4145 7723 -3459 -7798
$$ [...]
8191A57
##END NTUPLES=NMR FID
##END=
