##TITLE=1H_AT-38b
 Py-d5+CCl4, 108 sc, 
 13.3.2019
##JCAMPDX= 6.0         $$ Bruker NMR JCAMP-DX V2.0
##DATA TYPE= NMR FID
##DATA CLASS= NTUPLES
##ORIGIN= UXNMR, Bruker Analytische Messtechnik GmbH
##OWNER= root
$$ XWIN-NMR		Version 3.5
$$ Wed Mar 13 14:10:22 2019 Russian Standard Time (UT+4h)  she@DPX200
##.OBSERVE FREQUENCY= 200.1314
##.OBSERVE NUCLEUS= ^1H
##.DELAY= (6, 6)
##.ACQUISITION MODE= SIMULTANEOUS
##.ACQUISITION SCHEME= undefined
##.AVERAGES= 108
##.DIGITISER RES= 18
##SPECTROMETER/DATA SYSTEM= spect
##.PULSE SEQUENCE= zg30
##.SOLVENT NAME= Pyr
##.SHIFT REFERENCE= (INTERNAL, Pyr, 0, 15.7039)
##AUDIT TRAIL= $$ (NUMBER, WHEN, WHO, WHERE, WHAT)
$$ ##TITLE= Audit trail, XWIN-NMR		Version 3.5
$$ ##JCAMPDX= 5.01
$$ ##ORIGIN= Bruker BioSpin GmbH
$$ ##OWNER= she
$$ F:/spectra/data/she/nmr/H-F/1/audita.txt
$$ ##AUDIT TRAIL=  $$ (NUMBER, WHEN, WHO, WHERE, WHAT)
(   1,<2019-03-13 14:09:08.01 +0400>,<she>,<DPX200>,
      <continue with go, POWCHK disabled, PULCHK disabled
       configuration hash MD5:
       00 E9 B6 7A A2 85 ED C7 34 08 36 98 17 FE 4E 26
       data hash MD5: 16K
       B7 50 66 84 DE E9 D9 25 A3 50 6D EF 3F 67 A3 47>)
$$ ##END=
$$ 
$$ hash MD5
$$ B8 6F 57 93 CF EF 95 F1 87 F9 40 AC 30 29 00 B0
##$RELAX= 
##$RELAX= 
##$RELAX= 
##$RELAX= 
##$RELAX= 
##$RELAX= 
$$ Bruker specific parameters
$$ --------------------------
##$DU= <F:/spectra>
##$EXPNO= 1
##$NAME= <H-F>
##$PROCNO= 1
##$TYPE= <nmr>
##$USER= <she>
##$AMP= (0..31)
100 100 100 100 100 100 100 100 100 100 100 100 100 100 100 100 100 100 
100 100 100 100 100 100 100 100 100 100 100 100 100 100 
##$AQSEQ= 0
##$AQ_mod= 1
##$AUNM= <au_zg>
##$AUTOPOS= <>
##$BF1= 200.13
##$BF2= 200.13
##$BF3= 200.13
##$BF4= 200.13
##$BF5= 200.13
##$BF6= 200.13
##$BF7= 200.13
##$BF8= 200.13
##$BYTORDA= 1
##$CFDGTYP= 0
##$CFRGTYP= 5
##$CHEMSTR= <none>
##$CNST= (0..31)
1 1 145 1 1 1 1 1 1 1 1 1 1 1 1 1 1 1 1 1 1 1 1 1 1 1 1 1 1 1 1 1 
##$CPDPRG= <>
##$CPDPRG1= <>
##$CPDPRG2= <>
##$CPDPRG3= <>
##$CPDPRG4= <mlev>
##$CPDPRG5= <mlev>
##$CPDPRG6= <mlev>
##$CPDPRG7= <mlev>
##$CPDPRG8= <mlev>
##$CPDPRGB= <>
##$CPDPRGT= <>
##$D= (0..31)
0 1.2 0 0 0 0 0 0 0 0 0 0.03 0 0 0 0 0 0 0 0 0 0 0 0 0 0 0 0 0 0 0 0 
##$DATE= 1552471265
##$DBL= (0..7)
120 120 120 120 120 120 120 120 
##$DBP= (0..7)
150 150 150 150 150 150 150 150 
##$DBP07= 0
##$DBPNAM0= <>
##$DBPNAM1= <>
##$DBPNAM2= <>
##$DBPNAM3= <>
##$DBPNAM4= <>
##$DBPNAM5= <>
##$DBPNAM6= <>
##$DBPNAM7= <>
##$DBPOAL= (0..7)
0.5 0.5 0.5 0.5 0.5 0.5 0.5 0.5 
##$DBPOFFS= (0..7)
0 0 0 0 0 0 0 0 
##$DE= 6
##$DECBNUC= <off>
##$DECIM= 24
##$DECNUC= <off>
##$DECSTAT= 4
##$DIGMOD= 1
##$DIGTYP= 9
##$DL= (0..7)
0 120 120 120 120 120 120 120 
##$DP= (0..7)
150 150 150 150 150 150 150 150 
##$DP07= 0
##$DPNAME0= <>
##$DPNAME1= <>
##$DPNAME2= <>
##$DPNAME3= <>
##$DPNAME4= <>
##$DPNAME5= <>
##$DPNAME6= <>
##$DPNAME7= <>
##$DPOAL= (0..7)
0.5 0.5 0.5 0.5 0.5 0.5 0.5 0.5 
##$DPOFFS= (0..7)
0 0 0 0 0 0 0 0 
##$DQDMODE= 0
##$DR= 18
##$DS= 0
##$DSLIST= <SSSSSSSSSSSSSSS>
$$ [...]
##$SUBNAM2= <"">
##$SUBNAM3= <"">
##$SUBNAM4= <"">
##$SUBNAM5= <"">
##$SUBNAM6= <"">
##$SUBNAM7= <"">
##$SUBNAM8= <"">
##$SUBNAM9= <"">
##$SW= 26.0245685251456
##$SWIBOX= (0..15)
0 0 2 0 0 0 0 0 0 0 0 0 0 0 0 0 
##$SW_h= 5208.33333333333
##$TD= 16384
##$TD0= 1
##$TE= 0
##$TE2= 300
##$TE3= 300
##$TEG= 300
##$TL= (0..7)
0 120 120 120 120 120 120 120 
##$TP= (0..7)
150 150 150 150 150 150 150 150 
##$TP07= 0
##$TPNAME0= <>
##$TPNAME1= <>
##$TPNAME2= <>
##$TPNAME3= <>
##$TPNAME4= <>
##$TPNAME5= <>
##$TPNAME6= <>
##$TPNAME7= <>
##$TPOAL= (0..7)
0.5 0.5 0.5 0.5 0.5 0.5 0.5 0.5 
##$TPOFFS= (0..7)
0 0 0 0 0 0 0 0 
##$TUNHIN= 0
##$TUNHOUT= 0
##$TUNXOUT= 0
##$USERA1= <user>
##$USERA2= <user>
##$USERA3= <user>
##$USERA4= <user>
##$USERA5= <user>
##$V9= 5
##$VALIST= <valist>
##$VCLIST= <CCCCCCCCCCCCCCC>
##$VD= 0
##$VDLIST= <DDDDDDDDDDDDDDD>
##$VPLIST= <PPPPPPPPPPPPPPP>
##$VTLIST= <TTTTTTTTTTTTTTT>
##$WBST= 1024
##$WBSW= 4
##$XGAIN= (0..3)
0 0 0 0 
##$XL= 0
##$YL= 0
##$YMAX_a= 1003116
##$YMIN_a= -1329892
##$ZGOPTNS= <>
##$ZL1= 120
##$ZL2= 120
##$ZL3= 120
##$ZL4= 120
##$ABSF1= 10
##$ABSF2= 0
##$ABSG= 5
##$ABSL= 3
##$ALPHA= 0
##$AQORDER= 0
##$ASSFAC= 0
##$ASSFACI= 0
##$ASSFACX= 0
##$ASSWID= 0
##$AUNMP= <proc_1d>
##$AZFE= 0.1
##$AZFW= 0.1
##$BCFW= 1
##$BC_mod= 2
##$BYTORDP= 1
##$COROFFS= 0
##$CY= 11.3945322036743
##$DATMOD= 1
##$DC= 2
##$DFILT= <>
##$DTYPP= 0
##$F1P= 18.9103706918063
##$F2P= -1.10871071338519
##$FCOR= 0.5
##$FTSIZE= 0
##$FT_mod= 4
##$GAMMA= 1
##$GB= 0.15
##$INTBC= 1
##$INTSCL= 1
##$ISEN= 128
##$LB= 0.24
##$LEV0= 0
##$LPBIN= 0
##$MAXI= 10000
##$MC2= 0
##$MEAN= 0
##$ME_mod= 0
##$MI= 1.114404
##$NCOEF= 0
##$NC_proc= 0
##$NLEV= 6
##$NOISF1= 3.799351
##$NOISF2= 2.8
##$NSP= 1
##$NTH_PI= 0
##$NZP= 0
##$OFFSET= 15.70392
##$PC= 1
##$PHC0= -8873.269
##$PHC1= 34.80026
##$PH_mod= 1
##$PKNL= yes
##$PPARMOD= 0
##$PSCAL= 0
##$PSIGN= 0
##$REVERSE= no
##$SF= 200.130013532006
##$SI= 16384
##$SIGF1= 3
##$SIGF2= 2
##$SINO= 400
##$SIOLD= 16384
##$SREGLST= <1H.CDCl3>
##$SSB= 0
##$STSI= 0
##$STSR= 0
##$SW_p= 3612.71676300578
##$SYMM= 0
##$S_DEV= 0
##$TDeff= 0
##$TDoff= 0
##$TI= <>
##$TILT= no
##$TM1= 0
##$TM2= 0
##$TOPLEV= 0
##$USERP1= <user>
##$USERP2= <user>
##$USERP3= <user>
##$USERP4= <user>
##$USERP5= <user>
##$WDW= 1
##$XDIM= 8192
##$YMAX_p= 0
##$YMIN_p= 0
$$ End of Bruker specific parameters
$$ ---------------------------------
##NTUPLES= NMR FID
##VAR_NAME=  TIME,          FID/REAL,        FID/IMAG
##SYMBOL=    X,             R,               I
##VAR_TYPE=  INDEPENDENT,   DEPENDENT,       DEPENDENT
##VAR_FORM=  AFFN,          ASDF,            ASDF
##VAR_DIM=   8192,          8192,            8192
##UNITS=     SECONDS,       ARBITRARY UNITS, ARBITRARY UNITS
##FACTOR=    0.000192,      1,               1
##FIRST=     0,             0,               0
##LAST=      1.572672,      0,               0
##MIN=       0,             -1329892,        0
##MAX=       1.572672,      1003116,         0
$$ Real data points
##PAGE= N=1
##DATA TABLE= (X++(R..R)), XYDATA
0@%%%%%%%%%j4J22k16K16k18L26m32M40n48O56p64R38j060J210j421J641j883
26a007K176k483K814l194L603m051M540n086N691o343P062p859Q722r671J0728
41E642j1876J3132j4538J6106j7856J9822k2046K4591k7535L0965l5042L9998
53B1363m6146N4026o4564P9440j02223J41988k31511Q32555l16901j341312O95247
64b78038J011468J18013j064038n75980M16151R01939J11197o55902n86089L11814
74b89465N91740M3878n39734k47372K75331L75582P646j88497j28569L2010N0028
85a7422L4735L832j6354p6519l1416Q9918J50830K633j48104j16386N5380J26788
97E7915N6793n6557r0828m2307M8312Q8449K5218j18419j52108K4662K11128J27773
$$ plain form
0 0 0 0 0 0 0 0 0 0 0 -14 108 -108 108 -110 216 -216 224 -324 332 -432 506 -554 656 -765 876 -1007
26 -1007 1169 -1314 1500 -1694 1909 -2142 2398 -2688 3003 -3340 3722 -4137 4585 -5086 5642
41 5642 -6234 6898 -7640 8466 -9390 10432 -11614 12977 -14558 16407 -18635 21363
53 21363 -24783 29243 -35321 44119 -58104 83884 -147627 684928 368027 -973285 -278038
64 -278038 733430 851443 -212595 -788575 -372424 529515 640712 -15190 -601279 -289465
74 -289465 302275 346153 -193581 -440953 -165622 209960 217606 29109 -99460 -67450 -17422
85 -17422 17313 21145 4791 -71728 -103144 -13226 137604 140237 -7867 -124253 -68873 57915
97 57915 114708 58151 -32677 -74984 -26672 61777 86995 -31424 -183532 -158870 52258 180031
109A80031j46036k19366K0275K31803J30472j43567k22212J0724K64834J79285
119B86243j62667k76880K3362K68524O5685k35767j58219J40489J70216o2720
129E8266j55491J4474J62747N1557j61593j29861J34340K00165r6840k98470m3918
140b64624L03550J97943j88776k76096M8156L14988J61869k20305l36038j0506
150b69839L42445K17379k29383l45996N1757L75467J72036k39854l05707J0111
160b21584K71445J81215j09396k45830n6861K29264K29134q3692k94198j12958
170b13461J86159J85334o5110j83172m2597J29331J22607j7862j13315q0331K0980
181g1437O1601K4283k6481k5305J939K1177M3424M2060j8258q9171o6653M4514
$$ plain form
109 180031 33995 -185371 -165096 66707 197179 53612 -168600 -157876 106958 286243
119 286243 123576 -153304 -129942 138582 204267 -31500 -189719 -49230 120986 58266
129 58266 -97225 -82751 79996 131553 -30040 -159901 -25561 174604 77764 -220706 -264624
140 -264624 38926 236869 48093 -228003 -179847 135141 297010 76705 -259333 -269839
150 -269839 72606 289985 60602 -285394 -233637 141830 313866 74012 -231695 -221584
160 -221584 49861 231076 121680 -124150 -181011 48253 277387 193695 -100503 -213461
170 -213461 -27302 158032 92922 -90250 -132847 -3516 119091 101229 -12086 -92417 -71437
181 -71437 -9836 14447 -12034 -37339 -35400 -14223 29201 71261 53003 -36168 -102821 -58307
193e8307J09550K5417j16093j04737R0358K02306K7725k03328j40716J22572J92006
204A46753k0571j96224r4308J25314J73670k045j83485j30764R7330J92165K012
215A09847j93902q9580J69562J93554m0378j84515o8678J14941J19953m5069j55788
226g0053p0031J21235J62457k4200j84785o4111J52674J28575j06628j87239m76
237a42582J72045R6261r9526j46767J7766J64679P4342j40759j60952N8478J90620
248H3605L5475j60172j02213J04521J42984j9053j41298o5258R7142J25509j5136
259H6106j25474l6908J06838P9939o2800j02318L533P2602K2426m1254k9103J8944
271g469L1736M024j8890l535J6012k244k9598r397L0855J9183l7384m4207K0328
$$ plain form
193 -58307 51243 76660 -39433 -144170 -53812 148494 176219 -27109 -167825 -45253 146753
204 146753 126182 -70042 -164350 -39036 134634 132589 -50896 -181660 -84330 107835 109847
215 109847 -84055 -173635 -4073 189481 149103 -35412 -104090 10851 130804 85735 -70053
226 -70053 -140084 -18849 143608 119408 -65377 -129488 23186 151761 45133 -142106 -142582
237 -142582 29463 125724 26198 -120569 -102803 61876 136218 -4541 -165493 -107015 83605
248 83605 119080 -41092 -143305 -38784 104200 85147 -56151 -121409 -24267 101242 86106
259 86106 -39368 -76276 30562 110501 47701 -54617 -51084 21518 43944 2690 -26413 -7469
271 -7469 24267 28291 9401 5866 21878 19634 -9964 -19361 11494 30677 -6707 -50914 -30586
284c0586O1678J1548n8634n2839L2792Q3167K3461q4251p9454M6429J11684J6203
296H1198j10849q9172N5640J30956L2493j04910j09194L8841J55327O7767j37348
307A0749j69702M4265K03477O2009j77678j54100Q8216K05228M9513j53461j47009
318a38493M8452J84717P4127j49492j76103N6927K16018O5683j68521j41776P3666
329e4795J52477J8341j17415q7738L6177R8778L2388p2369q0177J0464O8539K2416
341B7086m6117l4987K1223L5386O121q581J193n40j5542j2973J6246L0780m331
354A4964m3639j3864N2291N1600k1227o3740j6082N1397M7444k4022o8273k6342
366e9493N5039O5836j8256q8216k6510Q1538O9549m5562q6649M379Q3184L7545
$$ plain form
284 -30586 31092 42640 -15994 -68833 -36041 47126 70587 -13664 -93118 -46689 64995 81198
296 81198 -29651 -118823 -63183 67773 100266 -4644 -113838 -74997 80330 148097 10749
307 10749 -158953 -114688 88789 150798 -26880 -180980 -92764 112464 161977 8516 -138493
318 -138493 -90041 94676 168803 19311 -156792 -99865 116153 181836 13315 -128461 -54795
329 -54795 97682 116023 -1392 -89130 -52953 45825 78213 5844 -74333 -63869 4670 27086
341 27086 -19031 -54018 -32795 2591 8712 131 1324 784 -14758 -27731 -11485 19295 14964
354 14964 -28675 -42539 9752 61352 40125 -23615 -39697 11700 59144 35122 -33151 -59493
366 -59493 -4454 61382 43126 -45090 -71600 9938 79487 33925 -52724 -48345 34839 72384
378G2384n3739o7004R732P0589L0537n5331o5638K7706Q5729J4108q5232n2918
390f9077O3124P7970l0177r7611k9688P2516P3379l0713j00332k4533R9372R0763
402I4993n3966j23408j2706J16521P5303o8541j12524j771J07945P6658m9722
413D8782j13093k0003J12387R0479o2780j21220q863J06379O2585o0704q9707
424e5758o068P1603N1005k6632o4406j7651M9660M7875j5306m6411j1363K1716
436a736J4007m585n934p273j1083k825J9423K8169k640m3183k7696L0695N4364
449C9703o987p1913l9378N1958P2868o012p3585m0586N3212Q0892N665q7083o3241
462h4487N4189J02414j813j06359n2065P4679R3742j7349r1475l9173O1940P8213
$$ plain form
378 72384 18645 -48359 -38627 31962 62499 7168 -58470 -30764 54965 69073 -16159 -69077
390 -69077 -5953 72017 41840 -55771 -85459 -12943 60436 29723 -70609 -95142 4230 94993
402 94993 41027 -82381 -95087 21434 96737 28196 -84328 -86099 21846 98504 48782
413 48782 -64311 -84314 28073 118552 55772 -65448 -74311 32068 94653 33949 -55758
424 -55758 -61826 9777 60782 34150 -30256 -47907 1753 49628 34322 -12089 -23452 -1736
436 -1736 12271 7686 1752 -5521 -16604 -19429 -6 28163 25523 -17660 -45356 -14661 39703
449 39703 32716 -39197 -78575 -26617 46251 40239 -33346 -73932 -20720 60172 65837 -21246 -84487
462 -84487 -30298 72116 70303 -36056 -88121 -13442 80300 62951 -28524 -67697 -5757 72456
474G2456k991q3555n4329N4676Q8669j1265j00530m0891P6669O9570l6823p9284
486d7628j0062O5741M6561k9281o3101q113N7400L9510m2628o7011J0630P1527
498B3545K2322n5784m0809L6337N6720n675n6749l0124L5397M5229j3910n7044
510d0545j3949N1210M3635k3046m4350O114M3095J7528k7543l5617K154L3454
522A2140J2810k3241j9221J8551K9514q326k5143J687K3533q12k7221r802K2184
535F653J9251j3722l0478o528L1511K5896k7458m9126j718N3883L0664l8326m8995
548d8493J2927O0627K4465m6087n5624M549O2718L4861m5386n9629J7824P8341
560D1093K8711n9228o4997J4128O4411K1922n1629n8428J4249P8543M2542n0182
$$ plain form
474 72456 69465 -14090 -68419 -13743 74926 63661 -36869 -77760 -1091 68479 31656 -47628
486 -47628 -57690 8051 54612 25331 -37770 -45883 11517 51027 8399 -58612 -47982 23545
498 23545 45867 -9917 -50726 -14389 42331 36656 -20093 -50217 -14820 30409 16499 -40545
510 -40545 -54494 -3284 40351 17305 -27045 -20931 22164 39692 12149 -23468 -21314 12140
522 12140 24950 1709 -17512 1039 30553 22227 -2916 -1229 22304 21492 -5729 -15531 6653
535 6653 25904 12182 -18296 -24824 6687 32583 5125 -44001 -45719 8164 38828 502 -48493
548 -48493 -35566 25061 49526 3439 -52185 -47636 15082 49943 4557 -55072 -37248 41093
560 41093 69804 10576 -54421 -40293 24118 46040 -5589 -64017 -49768 28775 71317 21135
572B1135o8173J7307P8268K0836o7856n8790K6151O5996J5749m3983m1316J8387
584a6289N2741J3269m9346m2367K4439M8115o081m3716j1099L3543J8326k3053
596a518k3598J0266K3938j833k5004r102K7290K4950k1970l9463O725M2434J5699
609B8814m0931l2738K6593M9643P207m4837l0638K9983N2857o589o0209k2835
621d3680M8089L9288k6773m9381R21M1069K2524k6114l2427P072M1021J9079l2401
634H287l4293J8999L9129m782m4120j7892L3824L3505j2511l3598o722K6466K2213
647B8505j5440l7731j4452K4345K8906r449l4029m921L8621L1958j8166m0533
659b2386j0643K8458K8852j4856m1052r856M5148M1456j8532n0973j0538M5710
$$ plain form
572 21135 -47038 -29731 48537 69373 1517 -57273 -31122 34874 50623 6640 -34676 -16289
584 -16289 36452 49721 375 -41992 -17553 30562 24481 -19235 -30334 3209 21535 -1518
596 -1518 -25116 -14850 9088 7255 -17749 -26851 439 25389 3419 -36044 -29319 13115 28814
609 28814 -12117 -44855 -18262 31381 38588 -6249 -36887 -6904 45953 39364 -20845 -43680
621 -43680 4409 43697 16924 -32457 -31536 9533 32057 5943 -26484 -19412 21609 40688 8287
634 8287 -26006 -7007 32122 27340 -16780 -34672 -848 32657 20146 -13452 -20174 6292 28505
647 28505 13065 -24666 -39118 -14773 14133 4684 -29345 -34266 4355 36313 18147 -22386
659 -22386 -33029 -4571 24281 9425 -31627 -41483 3665 45121 26589 -24384 -34922 10788
671A0788L1723k8184m3879J604M8047L1235k8643m6920J85M4437J4848m3586l3544
684d1889K7113M3886m259l2609l743K6509J1180k5460l0243R250L3539L727l7145
697b0144j3899M6493M3231l3288o4715J91O0148K5983n0864n3184K1222P0909
709C2083K6436n9217o2046K6595P6695Q346o9417m2848M5697O8577k063n9387
721a0549l2962L0275M3905l215m6172k5486L3520M6272K18l2837j3678J6780J6566
734B2637p424k3053j1958P300J8414J4444n895j6920j746J5113Q303k0610k5781
747b7176K199K4328J1897j0771j1271P371J3861J506j8021j2452P057J6514k833
760B209j6059N149K6033L231k8289j8129J8230K0796j3631k7286M768L8389K6343
$$ plain form
671 10788 42511 14327 -29552 -27948 20099 51334 22691 -24229 -24044 20393 35241 -8345 -41889
684 -41889 -14776 29110 24851 -7758 -11501 15008 26188 728 -29515 -20265 13274 17001 -20144
697 -20144 -34043 12450 55681 22393 -42322 -42131 18017 44000 -6864 -60048 -38826 32083
709 32083 58519 -698 -62744 -36149 40546 48892 -20525 -63373 -17676 50901 48838 -10549
721 -10549 -43511 -13236 30669 27454 -18718 -44204 -10684 35588 35806 2969 -10709 6071 22637
734 22637 15213 -7840 -19798 -12498 5916 20360 14465 -2455 -4201 10912 19215 -1395 -27176
747 -27176 -24977 -649 11248 477 -10794 -3423 10438 11944 -6077 -18529 -11472 5042 2209
760 2209 -13850 -8701 17332 20563 -7726 -25855 -7625 13171 -460 -27746 -22978 15411 41754
773D1754k5164l6634Q528M2234j477n0924k6689L7034M5937p978l9283q239L4664
786A3763K8375k5367n0235k995M8555K0108l7240k8788L3808M2379j5925m7929
798b1491r558L2830K2133k3342l2505O639M3740J7375l3474l5876J2861L2361
810A1693j953l3829r275K9849L0502m004k6182q010J5800J1642j8161k3484J457
823b3955K3203J4593m388p513J812O541K129q734j1686o780Q579J3283M814j0157
837A741m789J2796J1329j2055k2313n943J6233J4048k892j4931M35J7677J0269
850B1605j7405k8418J11K6310Q930k4810j2271L0129L0719j5067l6491r950K4307
863b301J9155j7828l3368K705M3470K7361k5514l6538P158L6519O762l7905k5939
$$ plain form
773 41754 16590 -20044 -11516 30718 29241 -21683 -48372 -11338 34599 26621 -12662 -20901 13763
786 13763 42138 16771 -33464 -36459 12096 32204 -5036 -33824 -16 42363 26438 -21491
798 -21491 -31049 1781 23914 572 -31933 -25294 18446 35821 2347 -33529 -20668 11693
810 11693 9740 -24089 -33364 -3515 26987 22983 -3199 -11209 4591 16233 -1928 -25412 -23955
823 -23955 -752 13841 9453 1940 3752 10293 12422 3688 -7998 -14778 -6199 7084 11898 1741
837 1741 -3048 9748 21077 9022 -13291 -19234 -3001 11047 8155 -6776 -6341 11336 21605
850 21605 4200 -24218 -24107 2203 11133 -13677 -25948 4181 34900 19833 -16658 -26608 -2301
863 -2301 16854 -974 -34342 -31637 11833 39194 13680 -22858 -15700 20819 27581 -10324 -36263
876c6263K1568L7499O725k9796j9064K1059K8773j1496l8366r396K9291K3643
888B4177j2265k0582N887K0178K154j9991k0341L543K0827P177j5866q142J8414
901E170K2495r218k9159q892J4356Q626j1554j3349P798K1480J1874j0679j5709
914f761J653J0261r18j7092q641J2265J9986N31j2254m021R065Q503q565j7436
928a3424k485J6878J2979o700q353L791J2482j746j3308j2237J95J1508P006k485
942D101n513K587J4294M469j7950j9586M257J4292J978j3471m561J4502J8881
955A8280q31j9110j4956P735J9374k808k5939j1167K6864L0742r341l5924o610
968b3691K7047J8827k0076k7079K678L0469J8723j7478k7401L841K5936M742k5573
$$ plain form
876 -36263 -14695 22804 29529 -267 -19331 1728 30501 19005 -19361 -28757 534 24177
888 24177 11912 -8670 -2783 17395 19549 -442 -20783 -17240 3587 10764 -5102 -13244 5170
901 5170 27665 18447 -10712 -19604 -5248 3378 -8176 -21525 -13727 7753 19627 8948 -6761
914 -6761 -5108 5153 4235 -12857 -21498 -9233 10753 11284 -970 -4991 4074 12577 4012 -13424
928 -13424 -15909 969 13948 7248 -1105 2686 15168 13422 114 -12123 -11928 -420 6586 4101
942 4101 -1412 1175 15469 19938 1988 -17598 -13341 951 2929 -10542 -15103 -601 18280
955 18280 17449 -1661 -16617 -8882 10492 7684 -18255 -29422 -2558 28184 18843 -17081 -23691
968 -23691 3356 22183 2107 -24972 -22294 8175 26898 9420 -17981 -14140 11796 16538 -9035
981i035j6615J5539K4091J085j4691m043J1527J1947j2444j8538K036J5904J185
994G948j4572j279J8955J2877j4983j8108K94J4001K539j4619j3462R660J9259
1007H510M382j6292j3469Q641J4528k353j7074n599J7178J5558k199j5532m336
1020h057R567R059m072j6544m953J2081J8527j104j4237p851J0427J1759m830
1033I772k2617j0526J3715K1310q00j9958n589K1995J7103j3163k5621l689K2216
1046D148J2616j1662j5455K708K0858J0020j6641k2864N241K2695L601k3527j1642
1059a9904J8100J8763q294j9047n057J0754R575p440j2009p22J4610J1022o517
1072C834p814K419P038j293j0078m045O855Q048j825l867M561R103j254j1066
$$ plain form
981 -9035 -25650 -10111 13980 15065 374 -3669 7858 19805 7361 -11177 -9141 6763 7948
994 7948 -6624 -7903 11052 23929 8946 -9162 -8868 5133 7672 -6947 -20409 -10749 8510
1007 8510 12892 -3400 -16869 -8228 6300 3947 -13127 -18726 -1548 14010 11811 -3721 -8057
1020 -8057 1510 10569 6497 -10047 -15000 -2919 15608 14504 267 -7584 2843 14602 9772
1033 9772 -12845 -23371 -9656 11654 10854 -9104 -14693 7302 24405 11242 -14379 -18068 4148
1046 4148 16764 5102 -10353 -7645 13213 23233 6592 -16272 -11031 11664 15265 -8262 -19904
1059 -19904 -1804 16959 8665 -10382 -15439 -4685 4890 -2550 -14559 -15281 -671 10351 3834
1072 3834 -3980 -1561 5477 4184 -5894 -9939 -3084 4964 3139 -728 3833 12936 11682 616
1086F16p143P157P378n829j0401l05J0964P480l797j3543k534R078J1656j903
1100H874j7313p339J6849J7422q434k2605k645J8546J1656j1861j7572J562J5642
1113B782J2859q540j9198l299J8419J2773j5205k2347O016K4602R680j8170j5815
1126a5443Q491J9258L601j5614j3768N067J8458L437j5794j0390Q064J2778P12
1139H857j2536o039P506J0037j969q990k860P952L994o131n345M514N428j366
1153C052m164M75O980J345l918n792J171K358J526o984n544L906Q188K689j1665
1168f377m471R054P305n239j0197j611J0536P192n935r409J844J4480P062r832
1182D402j2636M483J4910N417j2394j2722N042J4891M778j6104j5268N128J9645
$$ plain form
1086 616 -6527 630 8008 2179 -8222 -8527 2437 9917 6120 -7423 -9957 -879 10777 8874
1100 8874 -8439 -15778 1071 18493 10059 -12546 -15191 3355 15011 3150 -14422 -12860 2782
1113 2782 15641 7101 -12097 -15396 3023 15796 591 -21756 -15740 8862 18542 372 -15443
1126 -15443 -6952 12306 15907 293 -13475 -8408 10050 13487 -2307 -12697 -4633 8145 8857
1139 8857 -3679 -9718 -2212 7825 5856 -3134 -5994 1958 5952 -179 -5524 -1010 4418 3052
1153 3052 -1112 -637 6343 7688 3770 -2022 -851 1507 3033 -3951 -9495 -5589 2599 5288 -6377
1168 -6377 -10848 -1794 5511 272 -9925 -11536 -1000 6192 257 -9152 -7308 7172 14234 4402
1182 4402 -8234 -3751 11159 16576 4182 -8540 -3498 11393 16171 67 -15201 -10073 9572
1195I572L213j8611j2818J2145J7042J816j7817j0982Q377J6159L37j2502r497
1208a3566Q202J8135J330j4237j1996J4359J3294n813j5264m512J1464P622o096
1221B922r625l210R281Q551m459j1353j747J0650O313p388r615L836Q266J221
1235C643o820j709O240N174k971n324J873Q564j109q477l816P855N720n526r447
1250f130m34Q382Q254n453j3366k258J6775R203j4236j6055M255K0077L550j7117
1264d553j1135R155J5758J332j3025r603P262J3267J662j6857q213J1079J3822
1277I951k992j7257k819J4752R659n760j0765j799J0741Q718n137j2375k887R781
1291A811Q380m875j1899q18R559R253n969j1490l125Q195J0444m321j3812k950
$$ plain form
1195 9572 12785 -5826 -18644 -6499 10543 12359 -5458 -16440 -8063 8096 8433 -4069 -13566
1208 -13566 -5364 12771 14101 -136 -12132 2227 15521 9708 -5556 -10068 1396 9018 2922
1221 2922 -6703 -9913 -632 7919 3460 -7893 -9640 1010 7323 -65 -9680 -5844 2422 3643
1235 3643 -3177 -4886 1354 6528 3557 -1767 106 8670 7561 -916 -4732 3123 8843 3317 -6130
1250 -6130 -6564 1818 10072 4619 -8747 -11005 5770 14973 737 -15318 -11063 9014 12564 -4553
1264 -4553 -15688 -6533 9225 10557 -2468 -12071 -4809 8458 10120 -6737 -14950 -3871 9951
1277 9951 6959 -10298 -13117 1635 11294 5534 -5231 -7030 3711 12429 7292 -5083 -7970 1811
1291 1811 10191 5316 -6583 -7401 2158 11411 5442 -6048 -9173 -978 9466 5145 -8667 -11617
1305a1617J0876Q644m249j0362J90P178P305m354p400l49Q182N560p043q641K108
1320c972J0386l73j0351k719Q448N608p267n818L762O676k170r533k504Q282N945
1335D400m883r701L049J4610M735j2716j0469Q298J5513J39j7640q813J3352J9258
1349A9132m998k2840o829K0558J4436j2077k1186O90J8122R066j0807j6326J190
1362a1869J4259Q331r979j3789J260J6635O332j0336q773N457Q266o64o368l904
1376e142L046L698l36J662k194j523K271K374j55o449l260L823N538j143n563
1391c353j288O263N204l532r380j455Q009P267m934r035K998R876K492r491o049
1406f408M366O689j624p892J12Q401M213o226p632N556O095n835r029q5J1898
$$ plain form
1305 -11617 -741 7903 3654 -6708 -6518 660 7965 3611 -3789 -4138 4044 9604 2561 -6080 -3972
1320 -3972 6414 6041 -4310 -7029 1419 7027 -240 -6058 -2296 4380 2210 -7323 -9827 -1545 4400
1335 4400 -483 -10184 -7135 7475 12210 -506 -10975 -2677 12836 12975 -4665 -13478 -126 19132
1349 19132 14134 -8706 -15535 5023 19459 7382 -13804 -13114 5008 14074 3267 -13059 -11869
1362 -11869 2390 10721 742 -13047 -11787 4848 11180 844 -7929 -2472 5794 5130 -1238 -5142
1376 -5142 -2096 1602 1266 2928 734 -789 1482 3856 3701 -2748 -6008 -2185 3353 2210 -3353
1391 -3353 -4641 1622 6826 3294 -6086 -7541 468 7735 2801 -6234 -3236 6640 9132 -359 -6408
1406 -6408 -2042 4647 3023 -4869 -4757 3644 7857 1631 -6001 -445 5650 -185 -9214 -9299 2599
1421B599L476o673o981M617J1344M74j3563j0391J1986J4797n770j7024N03J9149
1435H543R185j5005j6366L898J8208M839j4903j3956J0334J9633J352j8921j1265
1448a4424J0539J4355m315j4722k625J1710Q743o26j0166l233M369M112l811o873
1462f967K880L801K521K43J903q72l305l659O24K510o14l614r63P063K570p14
1478C407l452j976K27l64m2L12K10J367J338Q26K641p06l041o368J695N784J983
1495C841o379k112J0508O438n188j2189k413P534O527r355q038L706J4398M175
1509A1453j0503q061O083P191l023j1226l258R882J0869k410j1418j713J1991
1522E857N658j2162j3951O463J5597P51j2464l127J1494P661p167j2685m571J0400
$$ plain form
1421 2599 6075 -598 -7579 -2962 8382 8856 -4707 -15098 -3112 11685 5915 -11109 -10606 8543
1435 8543 17728 2723 -13643 -9745 8463 13302 -1601 -15557 -5223 14410 15762 -3159 -14424
1448 -14424 -3885 10470 6155 -8567 -11192 518 9261 8635 -1531 -4764 -395 3717 -94 -6967
1462 -6967 -4087 -286 2235 2478 4381 3509 204 -3455 -2831 -321 -935 -4549 -5512 1551 4121 3407
1478 3407 -45 -2021 -1794 -2158 -2200 -1888 -1678 -311 1027 1853 4494 3788 747 -5621 -3926 1858 3841
1495 3841 -2538 -4650 5858 12296 7108 -5081 -7494 40 6567 -2788 -10826 -7120 7278 11453
1509 11453 950 -7111 -1028 6163 3140 -8086 -11344 -1462 9407 6997 -4421 -6134 5857
1522 5857 11515 -647 -14598 -8135 7462 8213 -4251 -7378 4116 11777 4610 -8075 -12646 -2246
1536b246R323m797j0370L603J3551N993j1896j1619J420R022J913p078m966N403
1550b744P451J980m454k927q40N6r21k110J424J292J820K948L353j703l293l165
1566a833p78K858J291j195j628J027O532L614n654q626k453N266j475m67j702
1581e223K747L646K578l00k561m982l493J579M446K30k692J849O619O069k268
1596H244p086m138M066M538l517q209K488R480P645q528j0414J555P342R36j1357
1611f955p991Q588J3419q7r307o729J0471O168q044j0486J362J1512O804n285
1625C440m446L916O872Q2r630q173L778P677j799n888J252R246K334r334o548
1640g221K242L449q09n104P27O311N786k218l807M23L194k356n788J04L646O538
$$ plain form
1536 -2246 7077 2280 -8090 -4487 9064 15057 3161 -8458 -7038 1984 3897 -3181 -8147 -2744
1550 -2744 4707 6687 2233 -694 -1534 -1478 -2399 -4509 -3085 -1793 27 2975 6328 4625 1332 -1833
1566 -1833 -2611 247 1538 343 -1285 -258 6274 9888 4234 -4392 -6845 -1579 -3054 -3521 -5223
1581 -5223 -2476 1170 3748 3448 887 -4095 -7588 -6009 -1563 -1333 -4025 -2176 4443 10512 8244
1596 8244 1158 -2980 1086 5624 2107 -6102 -3614 5866 13511 4983 -5431 -3876 3466 4402 -6955
1611 -6955 -14946 -6358 7061 6974 -2333 -9062 1409 7577 -467 -10953 -9591 1921 8725 3440
1625 3440 -1006 2910 9782 9864 234 -7939 -4161 3516 1717 -4171 -2919 6327 8661 -673 -7221
1640 -7221 -4979 -1530 -2339 -7443 -6716 -405 5381 3163 -644 -221 2973 617 -5171 -5067 -1421 5117
1656E117J150l605r09L087J230m178q208n75M722L608r28p85K082L67K70j126
1672A319m284k913j49L083M010j79k594K700N505L91q992p095K748Q318J514n018
1688a636k053K984R074M60r342p590L554P825j637p003k52J1904M737p105p848
1703c928k11P732J113p525p118O036J0480K238q558m261L232L940l548p144l116
1718a0638O112N658J892k267j499M846j78l789l113J296R67J198M70M598K196
1733G749k989l436k412J803O15m804j595K90M219M459j898n665j425M113j33l277
1749d386k854J352O780L527O5l376L2L234q5l737k590l96M281M688k62n463l10
1766E00K793K453n237q433m58O138M123k406n003L107L741J844o065l408J28N266
$$ plain form
1656 5117 6267 2662 1753 4840 6070 1892 -6316 -6891 -2169 1439 511 -274 1808 2175 2445 1319
1672 1319 -2965 -5878 -6027 -2944 1066 887 -1707 993 6498 6889 -2103 -9198 -6450 1868 3382 -1636
1688 -1636 -3689 -705 8369 8829 -513 -8103 -4549 3276 1639 -5364 -5616 6288 11025 3920 -3928
1703 -3928 -4139 3593 4706 -2819 -9937 -3901 6579 8817 259 -4002 -770 3170 -378 -7522 -10638
1718 -10638 -4526 1132 3024 757 -742 4104 3926 137 -2976 -1680 -713 485 955 5553 7749
1733 7749 4760 1324 -1088 715 1330 -3474 -5069 -4779 -560 3899 2001 -3664 -5089 -976 -1109 -4386
1749 -4386 -7240 -5888 892 4419 4484 1108 1140 4374 4289 552 -2038 -2434 1847 6535 6273 810 500
1766 500 3293 5746 509 -7924 -8382 -2244 1879 -527 -5530 -2423 1318 3162 -2903 -6311 -6183 -917
1782i17K998j315k37J139N114J910o133n098L305L585l096k996J441M059J776
1797E535l587l023j435j76J105l138m49R05N569J412l359j371J527J270q40l153
1813c208R80K415K705k612N05K065K765l713m107j734L469L645m190o04M67M807
1829C655K132m110o659J79M392N687n826o407K826R001L223o140n728q99N075
1844D01L055l816n833l39Q377N276m678n910j781N570K847l766n323J515O765
1859B360K285k134k424J219J132Q45k795l190L094J060R71k392K9M55J771l728
1875a442m080O51L231J145k553m41L050L059p89m299j097M510M86r31n02p18N086
1892D366K76q56l730l10K546J615l606n555L302N533j172m021j160J626K975j937
$$ plain form
1782 -917 2081 766 529 1668 6782 8692 2559 -2539 766 4351 1255 -1741 -300 3759 5535
1797 5535 1948 -1075 -2510 -2686 -1581 -4719 -5168 -4263 1306 2718 -641 -2012 -485 785 -55 -3208
1813 -3208 -2228 187 2892 280 785 2850 5615 1902 -2205 -3939 -470 3175 -1015 -1619 -1152 3655
1829 3655 5787 1677 -4982 -4803 -411 5276 -550 -6957 -4131 4870 8093 1953 -3775 -4674 401
1844 401 3456 -360 -6193 -6532 1845 7121 2443 -3467 -5248 322 3169 -597 -5920 -4405 2360
1859 2360 4645 2511 87 1306 2438 3283 488 -2702 392 1452 2423 31 60 515 2286 -1442
1875 -1442 -5522 -4871 -1640 -495 -3048 -3489 -439 2620 1831 -2468 -3565 945 1431 500 -2 -720 4366
1892 4366 4642 3786 56 -254 2292 3907 301 -5254 -1952 3581 2409 -1612 -2772 -1146 1829 -108
1908a08n084K45L189K999j233k516K3L703J787l463j782J851K878J602k619k058
1924e86K279L527j170n533l384M880K800r12o966J137K795L653r88n212r10J156
1940c434M470L19l590k211K091P249k84l812k415J828K587M16j283l407K450J186
1956B160k94j481k243J340K424j215j922m17J632K506m306K82K707O93j177k713
1972b024q55L465J782k690k768K340K814r2k600j996J317K066R92m451l01M084
1988A083K825k173o578K096N562J980n292n130O001L620j059n377k063N270L791
2003D556k130n312j338M103N041l445n672n69M963L100l267m681J571M349J760
2018C029l014k351P80M248L70j816q35j24Q43J447j613j797j11J427J688m94k450
$$ plain form
1908 -108 -5192 -4947 -1758 1241 8 -2508 -2485 1218 3005 -458 -2240 -389 2489 4091 1472 -586
1924 -586 1693 5220 4050 -1483 -4867 13 2813 1901 -5065 -3928 -1133 2520 1532 -3680 -4590 -3434
1940 -3434 1036 1355 -2235 -4446 -2355 4894 4610 798 -1617 211 2798 3214 1931 -1476 974 2160
1956 2160 1866 385 -1858 -518 1906 691 -1231 -1648 -16 2490 -1816 -1534 1173 1866 689 -2024
1972 -2024 -2879 586 2368 -322 -3090 -750 2064 1972 -628 -2624 -1307 759 1751 -2700 -3001 1083
1988 1083 3908 1735 -4843 -2747 2815 4795 -497 -5627 374 3994 2935 -2442 -4505 765 4556
2003 4556 2426 -2886 -4224 -121 4920 1475 -4197 -4766 197 3297 30 -4651 -3080 1269 3029
2018 3029 15 -2336 -1556 2692 3062 1246 411 287 1130 2577 964 -833 -944 483 2171 1677 -773
2035g73k190J343K135J446n459j522L528K314O26k154l817K899N032j293k658
2050e43q67K732K450j686l577K093K874k314l658K576K020k64k369k768K766K689
2066B154j576l092k509M106K492j656m319o89N785K565m551j653J780N364j231
2081B970m166j414M306L691l206n069M73O044Q88n690k716K526M106J622m957
2096e92m219K998M843p21n100k951N164K824j442k135o60K800j68J200j877O33
2112E97k99p83o13J153M47k66j381N31O02N17k772J258K128n54l7k237J124K112
2130A527M82l610J48J112J069Nk489J08L555l48l029j090K917J280m62l002Q43
2147i84K529N46n91j727P30R15k001j031q39K268K286k649j982R50M130Q43n333
$$ plain form
2035 -773 -2963 -1620 515 1961 -3498 -5020 -1492 822 1448 -706 -4523 -1624 3408 2115 -543
2050 -543 -1410 1322 3772 2086 -1491 602 3476 1162 -2496 80 2100 1836 -533 -3301 -535 2154
2066 2154 578 -2514 -5023 -917 1575 -81 -4400 -5089 696 3261 -1290 -2943 -1163 4201 2970
2081 2970 -1196 -2610 1696 5387 2181 -2888 -2415 3629 4517 -1173 -3889 -1363 2743 4365 -592
2096 -592 -4811 -1813 3030 2309 -2791 -5742 -578 2246 804 -1331 -1991 809 641 1841 -36 597
2112 597 298 -485 -1098 55 502 236 -1145 -614 -12 505 -2267 -1009 1119 565 528 -1709 -585 1527
2130 1527 2009 -1601 -1453 -341 728 733 -1756 -1648 1907 1559 -1470 -2560 357 1637 1175 -1827 -984
2147 -984 1545 2091 1500 -227 503 1418 -583 -1614 -2453 -185 2101 -548 -2530 -1580 2550 3393 -1940
2164a940j925K726N473k949l853j693N138L864l488m853L63M999J370n187j749
2179c704L140M449j200n143q89L743K380j659l113k0K907L298l296k621J274L377
2195B923j578m166K16K770J023k56j884J489M88j64j810N5O84J306k728R04R08
2212A80J897K73k008j968O03K757j707n31o28J738k46R70l74N36j034j705p64
2229b011K597L59m41k326L068J257k48k815k849J637L273j023l637J971K964K13
2245A989j31k906J041N83R4k178j807L901L658k387l491L29M990N75p776k501
2261f017N392L974m73n387j797O551J366j319o776lM821L074j603m576J407L874
2277B508J936l291m359J141K433O30m079R38K527K974k086j812M31o68l08K4L15
$$ plain form
2164 -1940 -3865 -1139 4334 1385 -2468 -4161 977 4841 1353 -3500 -3137 1862 3232 -1955 -3704
2179 -3704 -564 3885 2685 -2458 -3347 396 2776 1117 -1996 -2016 891 4189 893 -1728 -454 2923
2195 2923 1345 -2821 -2605 165 1188 932 -952 537 1025 861 -949 -894 -210 1096 -1632 -728 180
2212 180 2077 2350 342 -1626 -1023 1734 27 -504 -1132 606 360 1330 956 1492 458 -1247 -2011
2229 -2011 586 945 504 -1822 1246 2503 2255 -560 -3409 -1772 1501 478 -3159 -1188 1776 1989
2245 1989 1858 -1048 -7 576 670 -1508 -3315 586 4244 1857 -1634 -1305 3685 4260 -3516 -6017
2261 -6017 -625 3349 2876 -2511 -4308 2243 3609 2290 -4486 -4489 332 3406 1803 -2773 -1366 2508
2277 2508 4444 1153 -3206 -2065 368 998 -3081 -2143 384 3358 1272 -540 -109 -777 -1085 -1061 -746
2294g46R71R78j149r60K146O96o15m003M21K768J440l168m79K262K289N18k472
2311H97l342R00J888M23j975k77J340J387P3j76l53k240j820K701M71P34r04p74
2329a047J426L035p75m035j716J595L521j042k123K18L478J374j181l867J34J628
2345F23N91l815j519L982L422m48m035J878O15J78k795l382L766J999O99q58k290
2362a389K721J839n7n669k304L180K186j177l58P63L056l47k562j036L17J288
2378D51j981j597K084L294p7j665q81J731k016l95k327P23J833L219j701q92J341
2395A144J933j879m164l91J418K890j143o98J284Q68J249o64k159k346J371K49
2411a038J562j183N02Q83J549j61k126j805q15J500P61M52j467L39J867K844r74
$$ plain form
2294 -746 225 1203 54 -906 1240 1936 1321 -2682 -2261 507 1947 -1221 -1700 562 2851 3369 897
2311 897 -2445 -1545 343 766 -1209 -1486 -146 1241 1314 1138 785 -1455 -3275 -574 -103 631 -273 -1047
2329 -1047 379 3414 2639 -1396 -3112 -1517 2004 962 -1161 -943 2535 3909 2728 -1139 -1005 623
2345 623 1214 -2601 -4120 -138 3284 2836 -1199 679 1294 1472 -1323 -4705 -939 1060 1759 901 -1389
2362 -1389 1332 3171 3114 -2555 -4859 -1679 507 -670 -1028 -265 2791 2444 -118 -1154 -837 451
2378 451 -1530 -3127 -1043 2251 2174 509 -372 1359 -657 -1052 -3379 -2656 -823 2396 695 -197 1144
2395 1144 3077 1198 -2966 -3357 -1939 951 -192 -890 394 1262 2511 1847 -312 -2658 -1287 -1038
2411 -1038 524 -659 -157 726 2275 2114 -12 -1817 -2632 -1132 -371 81 -1386 -1047 820 3664 2690
2428B690m599k358K649K290j33k008N16K722J906j632j881q46n3l56q35j49J804
2445b73K262j625o82O92O9l68j026l242J936M358L64k465j212K755J673j671l079
2462a534o67J764K344j604k247K853J380R67k523j471k361L031p14J72j176J047
2478g39K151K158j495k929lN76J26j750L68J399J034Q45P02k932r4m25j295J890
2496d13o04N85Q24m98O86O16O7j686j399n3J239N60j305J62J789J203J087k358
2514E02p58j481K116l99L00j360k74L130K046j526m205j184J588K035M81k203
2530a192K87J430K004q22k024j362j82K031N1k316J094J831J88j037R5M78n93
2547c9l95k044N41K258K245k818Q31o61J336j224j320j243R10K787j749n93J652
$$ plain form
2428 2690 -1909 -4267 -1618 672 539 -1469 -953 1769 3675 2043 162 -684 -737 -1093 -1928 -2077 -273
2445 -273 1989 364 -318 374 443 75 -951 -4193 -2257 2101 2465 0 -1212 1543 3216 1545 -1534
2462 -1534 -2201 -437 1907 303 -1944 909 2289 3256 733 -738 -3099 -68 -782 -610 -1786 -739
2478 -739 1412 3570 2075 -854 -857 -281 -155 -1905 -1537 -138 896 1741 2443 -489 -583 -1008 -2303 -413
2496 -413 -1017 -432 392 -106 580 1196 1263 -423 -1822 -1875 -636 -76 -1381 -1219 570 1773 2860 502
2514 502 -256 -1737 379 -20 280 -1080 -1354 1776 3822 2296 -1909 -3093 -1505 530 1011 -1192
2530 -1192 -905 525 2529 1707 -317 -1679 -1861 170 221 -2095 -1001 830 1018 -19 76 554 -39
2547 -39 -434 -2478 -1937 321 2566 -252 579 -82 1254 30 -1290 -2533 -1623 1164 -585 -1178 474
2564D74N14J558k112l151K41K558m65j76j408J216K909q77j713K38l74O10o79
2581f37m62n59J157J572R33j609m95q88J009K96n58m62J002j46K2J153p88p23
2599a83j476p29L021L0j041L37J09j258R82J644r60j015k298J932K358L78k705
2616h74k37J862K719k305k582j298J655L444m89k189k041J057M104r87l300o17
2632b078L89K042n34r59l08J634J587p90j057L33k80R07k506J538J684j108l85
2649A09m87K547j176p77j116j420J130K149m30j678N18K287nj958k269L313j477
2666g40R39l83n52J275M59L42r71j229k11j51P11N53q18J76K83J654m84p46q56
2685g49O83n36K048j569o45r80L180J880l132l09n84J384r52j32q62Q55L43k15
$$ plain form
2564 474 988 2546 434 -2717 -2476 82 -383 -559 -1967 -751 2158 1281 -432 -194 -568 42 -637
2581 -637 -1099 -1658 -501 1071 2004 395 -100 -988 21 317 -241 -703 299 153 175 1328 540 -183
2599 -183 -1659 -2388 633 663 -378 -41 68 -1190 -208 1436 476 -539 -2837 -905 1453 1831 -874
2616 -874 -1111 751 3470 1165 -1417 -2715 -1060 2384 1895 -294 -2335 -1278 2826 1839 -1461 -2078
2632 -2078 -1689 353 -181 -1140 -1448 186 1773 983 -74 259 -21 886 -1620 -82 1602 494 109
2649 109 -378 2169 993 216 -900 -2320 -1190 959 529 -1149 -631 1656 1651 -307 -2576 737 -740
2666 -740 199 -184 -736 539 998 1340 369 -860 -1071 -1222 -511 42 -776 -600 -317 1337 853 107 -749
2685 -749 -66 -602 1446 -123 -768 -1748 1432 3312 180 -129 -713 671 -281 -413 -1275 -420 -77 -292
2703b92j163J449P5k58k470J900O46R97j277r27J234K384J094l156k144Q09L743
2720B644o40j719k512K221J435l61j800k23O30J113m69j672l81J467m14K58k26
2737f49K31m2j221L12J100L81O49j341N33K117p01k16j999J069K215k30k381j135
2755a308Q74J183P43l464R55J22J004j405P36o53N44J566O7j336j226J761O75
2772H38r67k2p10J180P64j45N58j125n80p88L018j021o50k333J289K148R77l077
2790f46j263J784J074p39j717K33P86o44L6l11J231P74n59p55R0J831l41M8j985
2809a073N3K364J710l453r26K57L154l57l119n49K285Q52p63j532N84N82J438
2826A507j295j814J324N37P34k330J252O51J189k143K67j289L405o78k347k23
$$ plain form
2703 -292 -1455 -6 69 -189 -2659 -759 -113 884 -393 -1320 -86 2298 3392 236 -1908 -1099 2644
2720 2644 2004 285 -2227 -6 1429 1068 -732 -955 -325 788 319 -1353 -1734 -267 -681 -423 -649
2737 -649 -418 -460 -1681 -1369 -269 112 761 -580 -47 2070 1369 1153 -846 223 2438 2208 -173 -1308
2755 -1308 -434 749 1492 -1972 -1017 -895 109 -1296 -560 -1213 -669 897 964 -372 -1598 163 838
2772 838 -129 -151 -861 319 1083 938 1496 371 -209 -997 2021 1000 350 -1983 -694 1454 2431 -646
2790 -646 -1909 -125 949 210 -1507 -1274 -488 -1132 -1096 -1407 -176 598 39 -716 -626 1205 864 912 -1073
2809 -1073 -1020 1344 3054 -399 -1325 -1068 2086 1729 -1390 -1939 346 1198 435 -1097 -513 69 1507
2826 1507 212 -1602 -278 259 993 -1337 -85 566 1755 -388 -121 -1410 1995 1317 -1030 -1253
2842a253J329l00K03q21M21J922j347K08m74M45K44J228k906O13O03J243j207
2859A51p78J57R37l01j199p94j70J533l66P54P99n38m78r47J268K045q85j574
2877c86q85K958J112j969j366k91K144P44q44l062Q33M43K390k258k816J559K221
2894E27M88k080j601K137P45k65p91m2M3J473j833L38J366K388k555o34k74L577
2912C007j566j652r9J674N87m06k058j265J400J202j288k887K481P29J217k378
2928a302p86K611O95j918j023J223Q07J473j18l380J675K254q53k907O70J682
2944H03L62j139j204J411J128p78j304m42J309Q81j219j681M33K002r31o80l25
2961a374m7J614l75n26k01R31j61r10K89K761j592j407lJ152J915r60j800r92
$$ plain form
2842 -1253 76 -224 -21 -842 -421 1501 154 362 -112 333 577 1805 -1101 -488 115 1358 151
2859 151 -627 -470 467 166 -1033 -1827 -1997 -464 -830 -76 723 185 -293 -1240 28 2073 1188 -386
2877 -386 -1271 1687 2799 830 -536 -827 1317 2061 1217 -1845 -1012 -569 1821 -437 -3253 -1694 527
2894 527 1015 -1065 -2666 -529 216 -49 -840 -882 -839 634 -1199 -861 505 2893 338 -296 -570 3007
2912 3007 1441 -211 -310 1364 1951 1545 -513 -1778 -378 824 -464 -3351 -870 -141 1076 -1302
2928 -1302 -2088 523 1218 -700 -1723 -500 307 1780 1662 -1718 -43 2211 1358 -1549 -879 803
2944 803 1165 26 -1178 233 1361 583 -721 -1163 146 1027 -192 -1873 -1440 562 -369 -1049 -1374
2961 -1374 -1421 193 -182 -708 -909 22 -139 -1049 -760 2001 409 -998 -1001 151 2066 1106 -694 -1686
2979a686K294J926j455l635J512J508R74j600k020J980J833o70j746O94J103p49
2995B63m57j511J633J642j206j512n2L032L79k492k194K331R18n48j294M8K206
3012A186J446j190j268p04P83R67j215j429J011J745j311l15j729J358M78M66
3028B79j383j526J836J238m30j168J77J535m41j385L62J726k08m48q74J430K270
3045B990k386j263J99nJ460k574j26J885J185K8j220l41K41O4q88P39l56k49J78
3064d39J311J08N38m56k506LK696j306J566k282M61Q39J164m7l159M79J926n08
3082C88j576n81J807J192j536O01j503R46L28o02o61k74J429J54l81j75K195j19
3100A632k120j788P30K379r57K00m62N52K519o53k817q58J791J424j908j030J272
$$ plain form
2979 -1686 608 2534 1079 -2556 -1044 464 1438 -162 -2182 -202 1631 961 -785 -91 1012 263
2995 263 -194 -1705 -72 1570 364 -1148 -1200 1832 2211 -281 -2475 -144 774 226 -1068 -1020 1186
3012 1186 2632 1442 174 -530 253 1220 5 -1424 -413 1332 21 -294 -2023 -665 -187 279
3028 279 -1104 -2630 -794 444 14 -1154 -977 558 117 -1268 -906 820 612 164 -710 720 2990
3045 2990 604 -659 -460 -465 995 -1579 -1705 180 1365 1393 173 -168 73 137 -751 -12 -368 -617 -439
3064 -439 872 980 1518 1062 -1444 -1441 1255 -51 1515 -767 -306 533 1697 1650 -1509 -1030 896 388
3082 388 -1188 -1769 38 1230 -306 295 -1208 -262 66 -536 -1197 -1471 -42 112 -269 -444 1751 1632
3100 1632 -488 -2276 -1546 833 -124 76 -386 166 2685 2032 -785 -1643 148 1572 -336 -1366 -94
3117i4J417L95j157j042j49M98N78k119L30Q65J622q6j580J367j711N37K5q45
3135a149n07J414r5k29J299l03N92j277r02K281K99k361j23O32J923k43l44j50
3153G57j891J471r4j071N6O40o93J650j099J314j527j221J082J388j435Q54j553
3170a372J293J313K1k91k074M69N92P80j597j135J563J759j017j42k96L98l53
3187h9j120m17J210l28K127j450r19K311m02p27j197j015J476J739j492K50P01
3204F58Q11j49k61j233k156K099o3q70J731N73o8l77p83O52o05k99k342J551N31
3223f00J427P45j058J90K32r19j185P1P02q67J100l77J762m16r01o07J142m26
3241A5n03j7j019J159P91J418j469m87k99Q82j343n23N13L20p48J483l72L53L52
$$ plain form
3117 -94 1323 1718 561 -481 -630 -132 446 -1673 -1343 -478 1144 1058 -522 845 -866 -329 -304 -1149
3135 -1149 -1656 -242 -337 -566 733 430 1022 -255 -1157 1124 1423 -938 -1061 -429 1494 1251 907 757
3153 757 -1134 337 243 -828 -772 -132 -825 825 -274 1040 -487 -1708 -626 762 -673 181 -1372
3170 -1372 -79 1234 1255 964 -1110 -641 -49 731 -866 -2001 -438 1321 304 162 -134 264 -89
3187 -89 -1209 -1626 -416 -744 1383 -67 -986 1325 923 196 -1001 -2016 -540 1199 -293 -43 658
3204 658 1469 1320 1059 -174 -2330 -231 -294 -1164 567 1140 1072 695 -88 564 -41 -340 -2682 -1131 -600
3223 -600 827 1572 514 704 936 17 -1168 -1097 -395 -1262 -162 -539 1223 807 -94 -701 441 15
3241 15 -488 -505 -1524 -365 426 1844 375 -112 -411 471 -872 -1395 -882 -562 -1310 173 -199 154 506
3260E06m67p62Q42q76J264j042R26J054P16k005j389m77J074M07j64K25L19K05
3278C56J224k50j100n11O2q10L29k31P17K82j39k34N34q60J552o50r42J156O8
3297E53Q96n44r93J729j163k01k041J858p41j52J292m65N93j12p96m8J809j521
3315d7K5j068p78K490N80o82K80M1L68q78o90n55j74Q95L73n43J286M5j074r30
3335a036J052l95k39j008J63Q97J958j03j711l1J026K88j602Q36K62j087M43p00
3353i87J315L52q08LJ61K39Q87p61j952Q65N28K992k580q90P64K79k85k80j340
3372a498N86N93Q07j7j055P42o22k14j75j25J349J130j099J09J238j708L77q10
3390c92p45J039P97o04m2N6J91k98k88j54O64j217L17l45J379J043j330n8M13
$$ plain form
3260 506 39 -723 119 -757 507 -535 391 1445 2161 156 -1233 -1710 -636 -229 -393 -168 151 356
3278 356 1580 1330 230 -281 -219 -1029 -700 -931 -214 68 -71 -305 229 -631 921 271 -671 485 553
3297 553 1449 905 -88 1641 478 277 -1764 94 -647 -799 493 28 621 509 -287 -335 1474 -47
3315 -47 -22 -1090 -1868 622 1202 520 800 841 1209 331 -359 -914 -1088 -193 180 -363 923 968 -106 -1036
3335 -1036 16 -379 -618 -1626 -1463 -566 1392 1289 -422 -453 573 861 -741 95 357 -730 -287 -987
3353 -987 328 680 -128 -125 36 275 1162 401 -1551 -686 -158 2834 254 -636 128 407 122 -158 -1498
3372 -1498 -912 -319 488 471 -584 158 -464 -678 -853 -978 371 1501 402 511 1749 41 418 -392
3390 -392 -1137 -98 699 95 53 109 300 2 -286 -440 224 -993 -676 -1021 358 1401 71 13 426
3409D26L23m56K2r13r79J601K06P04k06l94N42K76j53j1j050j706J218J855L54
3428A659j827R0m66M58J86n17k48M73O26L81m01j07p06J197j305O0j584J529J025
3447E23M1j60L73O96j027l28j039Q71O59K51j55j230Q74J660k091L29o24n4N48
3466A17n07j289P39M25Q5L63j723J017J094j221J84J098j85j25j259J855P22J394
3484B784j706j963L35J927j158L18l36l98J690j356r7j012R42K90j029l86K28
3501i27J266j130m69o88L154n91o77j699Q44K88J024r30N07p5O45L26n14o73N7
3520b62J128J32m25n53j34j051M44R42p57J53K8r02J602M92n86j340Q77J518r46
3539C60n86m75P20k57K91l38n18J654j142P2l62R00M88j242j076O01J338J631
$$ plain form
3409 426 749 293 315 -598 -1577 24 230 934 728 334 876 1152 999 988 -62 -1768 -550 1305 1659
3428 1659 -168 -78 -544 -86 100 -417 -665 -192 434 815 414 307 -399 798 -507 -447 -2031 -502 523
3447 523 564 404 777 1473 446 118 -921 -50 609 860 705 -525 349 2009 -82 247 -377 -431 117
3466 117 -390 -1679 -940 -515 -430 -67 -1790 -773 321 -900 -716 382 197 72 -1187 668 1390 2784
3484 2784 1078 -885 -550 1377 219 537 201 -197 1493 137 40 -972 -30 260 -769 -1155 -927
3501 -927 339 -791 -1260 -1948 1206 615 -62 -1761 -917 -629 395 -535 -28 -103 542 868 354 -319 -262
3520 -262 866 998 573 20 -114 -1165 -721 221 -536 -383 -355 -1257 345 837 251 -1089 -212 1306 360
3539 360 -226 -701 19 -238 53 -285 -803 851 -291 -219 -581 319 807 -435 -1511 -910 428 2059
3557B059j150j646P2J386L3j042M54K6M17q37j271J199J019j356R75k107J942
3574A73K05p04q19M21J653j316j004M37k85J821L75O6j200l84J659j500O02j431
3592a231J464P73j584k26m37J463j342R69N59J47l42j013O30q4m20J412j606J49
3610g19J829j564l83J550m40O87j147L03p04Q64j4n46p71J231J119j043j951N02
3628a197Q64P63Q89j954j338K574m68L54k372J383k57J265j179P15M52m82p46
3645g34K35J157o5p83O04j259O86J434j050r17l45J843n2p72q38L49J978j295
3663A76o96j278K335m79q93l80O21N58J197q72j65p6J736m92j918j69N90j04L99
3682I0l79M66JN55k87o36M24O20q37O69o37M19q58q34P45J115r31M49M44O2o82
$$ plain form
3557 2059 909 -737 -665 721 754 -288 166 192 609 -228 -1499 -300 719 -637 338 -1769 173
3574 173 378 -326 -1145 -724 929 -387 -1391 -954 -1239 582 957 1023 -177 -561 1098 -402 200 -1231
3592 -1231 233 1006 -578 -804 -1241 222 -1120 -151 408 555 213 -800 -170 -254 -674 738 -868 -719
3610 -719 1110 -454 -837 713 273 960 -187 116 -588 276 262 -284 -1055 176 1295 252 -1699 -1197
3628 -1197 -333 430 1319 -635 -1973 601 133 487 -1885 -502 -759 506 -673 42 494 12 -734
3645 -734 -499 658 593 -190 414 -845 -159 1275 225 -692 -1037 806 754 -18 -856 -507 1471 176
3663 176 -520 -1798 537 58 -835 -1215 -594 -36 1161 289 124 48 1784 1292 -626 -795 -205 -309 90
3682 90 -289 177 178 733 446 -190 234 854 17 686 49 468 -390 -1224 -479 636 -295 154 598 660 -22
3703b2o4J18j185N51J148n66k64J523j718m10K25Q51j154J601j566P7Q40J207
3721A192q13j502p9J211J132j022J61n53j57J75j945J137M78L93O95j877J896
3738E22Lj15r15l36J457o4Q78k517R01J135j93j011k16J6Q67J71k321Q32Q84J11
3758H9n47m58J259j186J621Q77k702M78J343o57L36m36k85J430j518Q9k013K124
3776a56M11p54m11N02K10L5K575j938K59o62l15J039j323K10K34l55o65K146j675
3795f33o1r33J97J437o8l80o68J342R8l17o74M20J131k06l22o06Q4O08r5j692
3815a338N47J910K25j609N9r78J164m70J8K3L72O59r89J71j431J895M55j424R0
3834f51P56L81r15p18R99l60J340r18j38o58K96J507j074j419J196J369j079l24
$$ plain form
3703 -22 -86 32 -1153 -602 546 -20 -284 1239 -479 -889 -664 187 -967 634 -932 -855 -15 1192
3721 1192 379 -1123 -1202 9 1141 119 280 -273 -430 -255 -2200 -1063 -585 -192 503 -1374 522
3738 522 525 410 -505 -841 616 552 1430 -1087 -186 949 756 -255 -471 -455 412 583 -1738 -906 -22 89
3758 89 -458 -916 343 -843 778 1655 -1047 -569 774 117 453 17 -268 1162 -356 -267 -2280 -156
3776 -156 255 -499 -910 -408 -198 -163 2412 474 733 71 -244 795 -528 -318 -84 -439 -1104 1042 -633
3795 -633 -694 -1627 -1430 7 -61 -441 -1109 233 331 14 -660 -240 891 685 363 -243 -159 449 354 -1338
3815 -1338 -791 1119 1344 -265 -206 -1184 -20 -490 -472 -449 -77 582 -407 -236 -1667 228 683 -741 -651
3834 -651 105 486 -429 -1147 -148 -508 832 -86 -224 -882 -586 921 -153 -1572 -376 993 -86 -410
3852d10O13pj012M39N62J18j82p07Q48k52J3K1o95J022K55l04p18j423J588N50
3872C19K72j723Q47J428m98l14O33o23j105P32k67J0J308n55r23P05j441R86m5
3891b54p32m41J61J975K10o58m51N81k13j27r21L93N6Q71n32O42K6P56j330j973
3911a961Q75M6N69J9K30K32K31mK16m85J28O21j400l14J19J126J330k481J339
3930D36J88j71j072j92K15J352j74j108K82p1P92K91n86j234Q97Q58J52q95l80
3949d20q50O37N84K041k374L08q70j20N14m6k85Q14o14j63J626j257P06p92J076
3968E15k23J35r36J012j01l95k89N58j89j518J467k48J231p31m35j09J011r67
3986b12l09J65l48Q08k10l64O92J125j690q27K025o82n99J23o57K597q22L53q96
$$ plain form
3852 -410 203 196 -816 -377 185 303 121 -586 262 10 23 44 -651 371 626 322 -396 -1819 -231 319
3872 319 591 -1132 -285 1143 645 331 964 341 -764 -32 -299 -289 1019 464 -459 246 -1195 -209 -254
3891 -254 -986 -1427 -1266 709 919 261 -190 391 178 51 -870 -477 -421 450 -82 560 586 1342 12 -1961
3911 -1961 -1086 -1040 -471 -452 -222 10 241 237 453 -32 96 717 -683 -997 -878 248 1578 -903 436
3930 436 624 453 -619 -811 -596 756 582 -526 -244 -315 477 768 182 -1052 -155 703 855 -40 -420
3949 -420 -1270 -633 -49 1992 -382 -74 -944 -1064 -550 -596 -881 -67 -681 -844 782 -475 231 -561 515
3968 515 292 427 -509 503 402 7 -282 276 87 -1431 36 -212 1019 288 -147 -256 755 -212
3986 -212 -521 -356 -704 104 -106 -470 222 1347 -343 -1170 855 173 -426 -303 -960 1637 815 1168 272
4005B72M18n83K73L6q06J94l62L05J339m10o36j331O79K336j897L59j63Q0L8Q82
4025A023p44o83P42m67K31n61K78Q8m64p1J123n39q75J08L39M6M52o40R2j89N17
4046a94N72L73L61n85p1j041j281K004n46J104r93Q27P16j467K53m60l75J045
4064B42M37P59r89p53M90q10J647n73m4M40j001m79J243N24j347j74P92j80l85
4083a61k09Q23l52J173q48O42j772m16R46J101j496J68n30M17K88J037l89P3j22
4102C73q56L32N13L05o25o36P19m13R15r36O16j038K177j889J27L17J94J088j186
4121I7L74M8j69m93R05r37m47j53J743O09k4j228r23N88j066P65J066j086L79
4140D8J77P9n70O73J18M21j442k01L61k45N86L05q22L67M0J036k13q09j300J002
$$ plain form
4005 272 690 107 380 416 -390 -196 -558 -253 1086 676 40 -1291 -612 1724 -173 186 23 103 141 1023
4025 1023 279 -404 338 -129 102 -459 -181 -93 -557 -628 495 -44 -919 -811 -472 -426 26 -614 -522 -711 -194
4046 -194 378 751 1112 527 456 -585 -1866 138 -408 696 -297 530 1246 -221 32 -428 -803 242
4064 242 679 1438 449 -304 186 -624 1023 450 406 846 -155 -634 609 1133 -214 -388 404 224 -161
4083 -161 -370 453 101 1274 426 1068 -704 -1120 -174 927 -569 -401 -931 -514 -226 811 422 495 373
4102 373 -483 -151 362 667 42 -594 125 -288 627 -309 307 -731 1446 -443 -316 1 195 1283 97
4121 97 471 519 350 -143 762 -175 -622 -775 968 1577 1553 325 -598 -10 -1076 -311 755 -331 48
4140 48 225 304 -266 407 525 946 -496 -697 -336 -581 5 310 -512 -145 -105 931 718 -91 -1391 -389
4160c89J172o83O04n81R7k98%j163j98L55J300j544K349j025j269K000j162M41
4178FJ72l56l00L66k31J179r23L92j310J047J387j239o70K92o85N63J53m48R42
4197C37j2j239J403q41J49L36r51J54J222k95q30Q15O80j158N74q39O31pk65o40
4217g76J091M64J53j002N57J521k592J143J25k53P69j142n4j097J957j892J752
4234G24o21q87J703j927J125M44j265L14P8J25m67M4R86N65j082q98J610r29O32
4253B74L36k94l4Q13m31j146n59J684k27m51j441R42J084j151j51P69n83M37o75
4272h04k29R31J011j211P17P93j587J358j000J21j028J609j67j242J036m25r69
4289a086K68K80M38P26r79N52K83n69k01K99j093J253K81n31O5q17J034j208J312
$$ plain form
4160 -389 783 100 704 123 220 -78 -78 -1241 -1439 -1084 216 -1328 1021 -4 -1273 727 -435 6
4178 6 178 -178 -478 -112 -343 836 -87 305 -1005 42 1429 190 -480 -188 -873 -310 -157 -605 337
4197 337 325 -914 489 -352 -203 133 -818 -664 558 263 -567 248 928 -230 344 -495 136 129 -136 -776
4217 -776 315 779 932 -70 487 2008 -584 559 684 431 1200 58 4 -1093 864 -1028 724
4234 724 103 -784 919 -1008 117 561 -704 -390 -312 -187 -654 -610 376 941 -141 -1039 571 -358 274
4253 274 610 316 282 1095 664 -482 -1041 643 416 -35 -1476 -534 550 -601 -752 17 -566 -129 -804
4272 -804 -1033 -102 909 -302 415 1208 -379 979 -21 100 -928 681 514 -728 308 -117 -1086
4289 -1086 -818 -538 -100 626 -353 199 482 -87 -288 11 -1082 171 452 -79 -14 -831 203 -1005 307
4308C07q54l26R21M99j098P20o10O58j8j083M09N79K3j19m34Q5J43J047l82r11
4328d44O42Q03j219J52q02J364l22l6j6R9r25M03m92J023K75m98k91J00P1P35
4348F22n47r61K74O7Q00j48p29J204o4J98n41l51m23R30N0n41q01J183q7j175
4368a040R87o5j65R2k88m16J568l89M10j315N77j09J090j071k33P42k50j235J301
4387A91P46j100p3q92Q90Q48k79r41j41Q69k94M67k19K25O71l44r65m85K98O91
4407A63J23j145J174n08L29Q55j172M10K88p78r11J633n16L67m79oJ25k65o25
4426i38NN10J279j784R29n2n43J241o87nQ13o70R0L56l65N42l60l27j25o44J234
4447D99J73n67n80P74N50m71r47k42J005j48o15P13j112J948j069K21n92M36K02
$$ plain form
4308 307 -547 -873 48 547 -551 169 -441 217 199 -884 -475 104 127 8 -426 -341 -198 849 467 -444
4328 -444 198 1001 -218 -66 -868 496 174 138 122 221 -704 -301 -793 230 505 7 -284 -184 -113 622
4348 622 75 -886 -612 -545 255 107 -622 582 518 716 175 -176 -599 331 381 -160 -961 222 135 -1040
4368 -1040 -53 -118 -283 -191 -479 -895 673 284 694 -621 -44 -153 937 -134 -367 375 125 -1110 191
4387 191 937 -163 -236 -1128 -238 610 331 -610 -751 118 -176 291 72 297 968 624 -341 -826 -528 163
4407 163 286 -859 315 -193 136 991 -181 229 517 -261 -1172 461 -55 312 -167 -173 -48 -313 -938
4426 -938 -933 -423 856 -928 1 -51 -594 647 -40 -45 768 98 188 544 179 721 361 34 -91 -735 499
4447 499 672 105 -475 299 849 378 -569 -811 194 46 -569 144 -968 980 -89 132 -460 -24 178
4466A78Q35n50n85N64m26k84P18j021Q10j6q88R46n86l57R78m01R7J059j409N4
4486b84j40j38M81P86j615O05Q63p98O15r42L87M1r0N16j56J350j507n91N09j78
4506b86j301J517o70K028k315N42p61N52K98R21lm91k58J45j10J029j009j33M17
4525A12L97n30k00N74q41R19k135J267J028p70J55q05m85J370k08J880k364J904
4543A268n78j192Q94k38m36N68J2J220j179j092J192j079J462p57l0M70q88j7
4561d00M3L11J277M76M64j776J13j023Q33J02N2K54N14n93j886K568j843n44K238
4580A180j904J044o13N22M1k27j283J486p34O71P6m96j053J728q80q8K22l33P10
4599F9p0J307r60l86O91M94j260P55O4n90J207j035j281J500j62O1j69o64L5n12
$$ plain form
4466 178 1013 463 -122 442 16 -268 450 -571 239 223 -665 281 -305 -662 316 -85 12 1071 -338 -284
4486 -284 -424 -562 -81 705 -910 -305 558 -240 375 -567 -180 -139 -229 287 131 1481 -26 -617 -108 -286
4506 -286 -1587 -70 -740 1288 -1027 -485 -1246 -694 -396 525 522 31 -227 -82 -192 837 -172 -305 112
4525 112 509 -21 -221 353 -488 431 -1704 -437 591 -179 -24 -829 -1314 56 -152 1728 -636 1268
4543 1268 690 -502 392 154 -282 286 298 1518 339 -753 439 -640 822 65 35 505 -383 -400
4561 -400 -357 -46 1231 1707 2171 395 508 -515 318 420 472 726 1240 647 -1239 1329 -514 -1058 1180
4580 1180 -724 320 -293 229 270 43 -1240 246 -488 183 259 -237 -1290 438 -442 -530 -308 -641 69
4599 69 -1 1306 346 -40 651 1145 -115 640 704 114 1321 286 -995 505 343 404 235 -429 -394 -906
4619i06J319j61P01l46j147M03J2L63n40O92o60O80J24j014n89J024L21k0l84
4638a28l39K53M09J088j111K50k98J74qj333R38k81K43l39l46M82K76j23J074
4657H81m18q72O10j752K084j28k00m81N0Q2J570o27K33k289L19O30k2J007o90
4676a3M43J61J45j675J288o34P45r6o05J522r41q85P37n4p02P19o4R30j624o78
4696a281M95P49O71r89R18j027PN19J220j964N55L74L34o10n3k63n65Q84J76l35
4716a85L33mj64N83j164m23P70K44J27M45j437J373J98m99o42N20k33%O31L65
4736H38j445O61K98o57P62P5j357J188k62M3n68m24O12R84j658N36j1M68L37j78
4756B42p83Q79j515Q45J03l93J149n41l21P59k03j137J82j22K89N05J117k032
$$ plain form
4619 -906 413 252 953 607 -540 -137 -125 238 -302 390 -270 410 534 -480 -1069 -45 276 256 -128
4638 -128 -467 -214 195 1283 172 422 124 298 290 -1043 -105 -386 -143 -482 -828 -346 -70 -193 881
4657 881 463 -409 201 -1551 533 405 205 -276 -226 -144 1426 799 1032 -1257 -938 -308 -330 677 -13
4676 -13 430 591 736 -939 349 -285 460 364 -241 1281 340 -545 192 138 -564 155 91 1021 -603 -1281
4696 -1281 -786 -37 634 -355 563 -464 -457 62 1282 -682 -127 247 581 -29 -82 -345 -910 -26 150 -185
4716 -185 148 144 -20 563 -601 -1024 -254 -10 117 562 -875 498 696 197 -445 75 -158 -158 473 838
4736 838 -607 54 352 -305 457 532 -825 363 101 144 -424 -848 -236 748 -910 -374 -385 83 420 242
4756 242 -541 338 -1177 -332 -229 -622 527 -14 -335 424 221 -916 -734 -856 -567 -62 1055 -977
4774i77R37p4n93O90J86l81Q78%n00m21J13qR73n31q33K41K3K95O29r86l82P35
4796A4P6m13P87o91k05J172j472P51L60K75n31o18Q89j410J897m87j001J387j286
4815e06j072K672j774R92J269j857j02J022j280K093j687M75m46j049L26O86K69
4832C1J074j056j66K56J42K70p04M40o1n54K16N75M84n76m92P7o55J284k59j062
4852g36j39M80O11R18j693p1O06P11j497J224m88j310J184K35M84n60L5j104P4
4871a036Q51l77J083j371L63M55L1M09J134j437j55M90N67k09j210O04k56n8j62
4890b84J236j455J21p22J198n6N42n68J077o03l85J076j519O39L92r23J67L15
4908B48J28j05M30j265O14r83J11J832m70P77j332J099o16r95J472l58n29q66
$$ plain form
4774 -977 -40 -114 -707 -17 169 -212 666 666 166 -255 -142 -150 823 292 -541 -300 -277 18 647 -339 -721 14
4796 14 90 -323 464 -227 -432 740 -732 19 379 654 123 -495 394 -1016 881 394 -607 780 -506
4815 -506 -1578 1094 -680 312 1581 -276 -378 644 -636 1457 -230 245 -201 -1250 -924 -238 31
4832 31 1105 49 -117 139 281 551 -153 287 226 -328 -112 463 947 371 -121 -44 -699 585 326 -736
4852 -736 -875 -395 216 1134 -559 -630 -24 687 -810 414 -74 -1384 -200 35 519 -41 -6 -1110 -1036
4871 -1036 -185 -562 521 -850 -487 -32 -1 408 1542 105 -50 440 1007 798 -412 192 -64 -122 -284
4890 -284 952 -503 -382 -1104 94 38 580 12 1089 486 101 1177 -342 297 689 -234 -67 248
4908 248 376 271 701 -564 50 -933 -822 1010 540 1317 -15 1084 468 -527 945 587 58 -808
4926h08N9J700Pm37n90J27r01J618p13p97M16q47J102R17m82j197P35j63J95J232
4946A173o79j389P04k02o15J153N70l0q66j57K76q36L77K20q7P94r58O4K113j624
4966AL54r63J60J044m48l5q53J537j639J414j335O23K58j50L42j138J226n47R43
4985G94j75j38p48j093J471n27M58j20m35O23N4P43j74j337J762j940P44O49j961
5004a350K106j45l73r06J284P1j456K10k51J336o80N88p07R59m30P06q38N27p70
5023a19k46K25l05J546l74q25M98k59l20k83M66K12P6j103J104m32q3M18J08j34
5043A70K00j602K095n94m52J181r22P08r07j23J2j4j74R6K53O07j569R82M19J28
5063D94l17Q82j271M79j0k43M23p82Q2J84o06J940r78k36j36N81l4p70J78Q86
$$ plain form
4926 -808 -749 951 958 521 -69 58 -843 775 62 -735 -319 -1166 -64 853 371 -826 -91 -254 -59 1173
4946 1173 494 -895 -191 -393 -1008 145 715 685 -181 -338 -62 -898 -521 -301 -388 406 -552 -488 1625 1
4966 1 355 -608 -448 596 148 113 -740 797 -842 572 -763 -140 118 -32 310 -828 398 -149 794
4985 794 619 481 -267 -1360 111 -416 42 -78 -513 110 164 907 733 -604 1158 -782 -38 611 -1350
5004 -1350 756 611 238 -668 616 687 -769 -559 -810 526 -154 434 -273 686 256 962 124 651 -119
5023 -119 -365 -140 -445 1101 727 -98 400 141 -179 -462 4 216 292 -811 293 -139 -222 196 304 170
5043 170 370 -1232 863 269 -183 998 76 784 -123 -246 -234 -248 -422 -326 -73 534 -1035 -53 366 494
5063 494 177 1059 -212 267 257 14 437 -345 -263 -79 -685 1255 277 41 -95 486 452 -318 -140 746
5083G46q78P29k80k97O50k47j021Q27R3q37K540k594M07k49P64k89p46L75Q68
5102E61j664J862j005N69k6l94j535J914K42j092J202n64l84P14j76L96m2j35
5120D43J524k524M95K35K38k91R2o5l08J42n5p76Q85p79Q90K50j323J180M74m31
5140B96m0o46RP53J05l34j69L13p00p48J416n72L74O11p78O35j023Q14q33P4K99
5161a44J19m85n73J121O04K82p20o68K00J26p47Q22L67Q68o82j138M90P10j044
5180d92K44k35P02o86Q70p74lQ42j82L06p54k31O13j232J159j60L31o34k04m90
5200a010R69J18j648J020K92k20R33m5r95K9K72O69n0O80j437J319k19r56k45
5219e24J038m52p19k69L47M05m46j86J036o15N92l82M59L96l88n90k64O12L49
$$ plain form
5083 746 -132 597 317 20 670 423 -598 229 322 -515 2025 -569 -162 -411 353 64 -682 -307 561
5102 561 -1103 759 -246 323 297 -97 -1632 282 524 -568 634 70 -314 400 224 620 578 443
5120 443 1967 -557 -62 173 411 120 212 147 -161 -19 -74 -850 35 -744 146 396 -927 253 727 296
5140 296 256 -390 -381 372 477 143 -26 287 -413 -1161 255 -317 57 668 -110 525 -498 316 -517 -443 -144
5161 -144 -25 -510 -1083 38 642 924 204 -464 -264 -138 -885 -63 304 1172 490 -648 -158 552 -492
5180 -492 -248 -483 219 -467 403 -371 -374 468 286 592 -162 -393 220 -1012 147 -13 318 -316 -520 -1010
5200 -1010 -41 77 -1571 -551 -259 -479 454 409 -586 -557 -285 384 334 1014 -423 896 677 -279 -524
5219 -524 514 62 -657 -926 -579 -174 -620 -806 230 -385 207 -175 284 680 292 -298 -562 50 399
5238C99j02o72J92R5O04n48q99M3P56r73q9J804p81P48J039j270l70O05m02N42
5258G21l63q97J49J64R14j15m30j824R62R09O23l16r33L64j004K046j80J8l56
5277D52n88Q99l22j043Ln27P25J312o23Q77k278J236N19j067J323r78J55Q18m51
5296D42p59N35n63l81Q93l68P79p17K20q14Q02Q7M91j23j197J088P97r69J298
5315A541j326j5o11J480l76K86j146l09RR86p49q46R05k61o81J669Q36r36o62
5334b06m72j78J268M45j132K08N86o80N47k09l10m08O21o45K98J7l03O3N30J034
5354A074o33O84l45k24n82n28K76J9J6J424j375n88L62J275r82J07k76q53J442
5373B93N80m9m38K08M07o56j38K68p04K05j95M21J96r15M2R6J693j305K7N47r90
$$ plain form
5238 399 297 -375 -183 -88 516 -32 -931 -888 -132 -1105 -1194 610 -171 577 1616 346 -24 581 179 721
5258 721 358 -539 -390 -226 688 573 143 -1681 -719 190 813 497 -436 -72 -1076 970 790 808 452
5277 452 -136 763 441 -602 -599 -1126 -401 911 288 1165 -1113 123 642 -425 898 -80 75 893 442
5296 442 -317 218 -345 -726 167 -201 578 -139 81 -733 69 156 647 524 -673 415 1212 243 1541
5315 1541 215 200 -411 1069 693 979 -167 -476 -467 519 -230 -1076 -171 -432 -1113 556 1392 456 -206
5334 -206 -678 -856 412 857 -275 -67 519 -161 386 177 -133 -541 80 -565 -267 -250 -553 -490 40 1074
5354 1074 441 1125 780 556 -26 -554 -278 -259 -243 1181 -194 -782 -420 855 -127 -20 -296 -1149 293
5373 293 873 824 386 594 1001 345 207 475 -229 -24 -219 202 398 -517 -475 -379 1314 9 36 583 -407
5394d07P94q15J031p37M10j63J81J016j421j263J893j865L01Q53J256j297M00
5411A67N71q02k06O91L31o61J189j712Lk90J256r99O63j308Q72R8r2m06J69l02
5431g68J317L80j107R7J63Q26J68l46r02O15K30k197J803Pj100J466l22n62J50
5450h2j8J8N12j656K096o44J63L54p22k37R24j302P39j19l45o09J36J025m92r32
5470a191P73m27R72n68R14j746K223n83k02o86N68m72L54J61k1Q39j790P59p62
5489h85R24m95j36Q18Q13j763N06n1l17N85J687j931l69Q86M49n76J87N07o33
5508B06p62M14N32p7j303J727Q2j337L56n34R21N25j154N0J244k84r62l99P33
5527b2n13K45p00Q44P52O07q12m06j0q8K35Q27j398K92M82N11q94j52J139l18
$$ plain form
5394 -407 387 -428 603 -134 276 113 294 1310 -111 -1374 519 -1346 -1045 -192 1064 -233 167
5411 167 738 -64 -270 421 752 91 1280 -432 -429 -719 537 -462 201 -1107 -235 -137 -229 -635 -466 -768
5431 -768 549 929 -178 -81 82 908 1076 730 -172 443 673 -1524 279 286 -814 652 330 -232 -82
5450 -82 -100 -82 430 -1226 870 226 389 743 21 -216 708 -594 145 26 -319 -928 -792 233 -259 -1191
5470 -1191 -418 -845 127 -441 473 -1273 950 367 165 -521 47 -425 -71 90 69 908 -882 -123 -885
5489 -885 39 -456 -592 226 1039 -724 -218 -269 -586 -1 1686 -245 -614 272 721 145 332 839 206
5508 206 -556 -142 390 313 -990 737 819 -518 -162 -696 225 750 -404 -354 890 606 -356 -755 -22
5527 -22 -535 -290 -990 -146 606 1213 401 -5 -15 -103 132 959 -439 -147 335 846 -48 -200 939 621
5547F21j045r38J303j18o92M58J19O63M73m13k61P22j371K03L46M0l4P20p82L22
5567C36K04l67j17L45n85J37M68o97O71N00q60J036j740P91n06l94O54O72r59
5586d11J583j650K42J004o97K98j591J297l80R80K41p14p66N62m92J071o52o31
5604g06L25m02J212n59j280J785j057J325r18J053O12j561R55k250P87N70p70
5621h79J809n36n36J80k73R6o7O75o67k32K22j77J071l24j86k82n69R98L31r56
5641c02k53K6n30J677o46K87J073j365J222j380N19m61l72k5K21N07J884j937
5659A45l3r09M14K37J210j054R8m02R10J37j083J42q69J426m14J433k367J106
5677A27j111L51L04J2M80j13R48q62O12l83l46L65m68l78N73k84P06n95K02K90
$$ plain form
5547 621 -424 -1362 -59 -177 -869 -411 -292 371 844 431 170 892 -479 -276 70 110 76 796 14 336
5567 336 540 173 56 401 -184 -47 421 -276 395 895 35 1071 -669 122 -384 -778 -124 548 -411
5586 -411 1172 -478 -236 768 71 369 -1222 75 -305 675 916 202 -564 -2 -494 577 -75 -706
5604 -706 -381 -783 429 -130 -1410 375 -682 643 -275 778 1390 -171 784 -1466 -679 -109 -879
5621 -879 930 394 -142 38 -235 -139 -206 469 -198 -430 -208 -385 686 362 176 -106 -675 323 654 -302
5641 -302 -555 -529 -1059 618 -28 259 1332 -33 1189 -191 328 -133 -505 -530 -309 198 2082 145
5659 145 112 -797 -383 -146 1064 10 108 -294 616 753 -330 -188 -1057 369 -45 1388 -979 127
5677 127 -984 -633 -329 -317 163 50 998 136 748 365 19 384 -84 -462 111 -173 533 -62 140 430
5697D30M06M23l93p30M32j169J9N33O48j311l67J935n55l60J32Q99L9K39k257
5716a007k3P55J91R86j965M62P85M70j99j18Q11q13j62k98M17J7K5q81R74m33
5736fl57J16M19O85j32n31m15Q41m41K73q07R51j173l79L07J30J079r0j936J998
5756E32L32j054j26Q66p10J255j004j363L62J81j9L74R9l21M44j61J84K271j356
5775G86r33m01J070j25k69o23R55j101J082P94k326J002L78L05j038J26J103k473
5793a688J600J995j289r90J379l30j128n35j59J373J35L2N51o59q21J16N25o58
5811e51P84q71k1J210p76J44P16j24k18j037J065r59n48J0R32j044Q62N42j79
5830f3J09N83q60P10Q29j627J520j409J95p51R60N54r18J224q48J23l67q63k59
$$ plain form
5697 430 836 1259 866 136 568 -601 -582 -49 599 -712 -1079 856 301 -59 73 972 1011 1250 -1007
5716 -1007 -1030 -275 -84 902 -1063 -601 184 654 455 337 1148 335 173 -125 292 309 334 -547 427 -6
5736 -6 -363 -247 172 857 725 194 -221 620 179 452 -355 596 -577 -956 -649 -519 560 470 -1466 532
5756 532 864 -190 -316 550 -160 1095 91 -1272 -910 -729 -748 -374 -275 -596 -152 -313 -129 2142 786
5775 786 -147 -548 522 397 128 -495 460 -641 441 1235 -1091 -89 289 594 -444 -318 785 -1688
5793 -1688 -88 1907 618 -372 1007 677 -451 -986 -1145 228 363 395 946 287 -534 -418 107 -551
5811 -551 233 -638 -659 551 -225 -81 635 511 293 -744 321 -638 -1186 -1176 -244 -1288 -426 116 -63
5830 -63 46 629 -231 479 1308 -319 1201 -208 -13 -764 196 750 -168 1056 208 331 -36 -899 -1158
5849a158J631q60K00J469j430J475r42o40P54O06k76j381R09r40N78M39o25L9
5867a52L02j13r9m02L6K94M02o15M06J58n08R82p08M56K73j243M89M36N38k121
5887a189J240r31J533N90k096Q78J29j7J06J23j050K86J320p55k74L4K45m22N93
5906C43N4p39p92N40M82L49P66p42K72n84J24J328j499o0P12j058J033l74M11
5925E66o85n99j02M92N2J17J62j78M81n25Q88p95J71j62N30K6m38j51k39J21N9
5946b09P29j026J149j049l78Q96o80J181M6K47j46j99o12r7R7L37K69J97n27n48
5966c23k29N78M65J82k05n73N9J153j469P27r35K011j777P76M0L32p87N42m89
5985G8O01j613J052k29M47j125k23J140q24P52L23M42k42m6q32L2K27O66m01K25
$$ plain form
5849 -1158 473 -387 -187 1282 -148 1327 385 -255 499 1105 829 -552 357 -583 -5 434 -191 -152
5867 -152 150 37 -62 -464 -428 -134 268 -347 59 217 -291 691 -17 439 712 -531 -42 394 932 -1189
5887 -1189 51 -880 653 1243 -853 25 154 137 243 366 -684 -398 922 167 -107 -73 172 -250 343
5906 343 397 -342 -1134 -594 -112 237 1003 261 533 -51 73 1401 -98 -158 554 -504 529 155 566
5925 566 -119 -718 -820 -328 -276 -159 3 -175 306 -219 669 -126 45 -117 413 439 1 -150 -389 -268 -209
5946 -209 520 -506 643 -406 -784 112 -568 613 659 906 760 561 -51 -148 -51 286 555 752 225 -323
5966 -323 -552 26 491 673 468 -105 -46 1107 -362 365 -570 1441 -336 440 480 812 25 567 78
5985 78 679 -934 118 -111 336 -789 -1012 128 -696 56 379 821 579 533 -299 -267 -40 626 225 450
6005D50o74K53j22p49P42n54n33Q78Q84j23L4p79N22L63j93k81J16p65N95L21
6025C85m71R02M9j721R28n99N62j47o71R47l83O59J25o13L80l92o99M60O55k50
6045A06q21K60J52K61K67q99mJ000j01q76J98J048j246J150l16p67P84p10M07
6064a07Q48q33L42J93Q0L28o97o19j5k87r7k15K90j98J392R1j271J971p71j337
6084i12R43L46Q27j255k13O76o70Q63n48m00J97q85J312J57L74o01n18J3L65o18
6104e47J273j026l83M37L15Q31o67n10O63r11J038o83p15L05o95J511j09L79P9
6123E85j050P94K07o26P37q21Q15n87l41L16M27O9l2r53j22O1P81J511q06r62
6143Cl64R63Qq57J27L45Q03j201L00J65N24p17j078J048K57k11o65l45K60J963
$$ plain form
6005 450 -224 29 -93 -842 -100 -654 -1187 -309 575 452 486 -293 229 592 399 118 234 -531 64 385
6025 385 -86 816 865 -856 72 -527 35 -112 -783 164 -219 440 565 -48 332 -60 -759 -299 356 106
6045 106 -715 -455 -303 -42 225 -674 -678 322 221 -655 -457 591 -655 495 179 -588 196 -514 -107
6064 -107 741 -92 250 443 523 851 154 -465 -480 -767 -864 -1079 -789 -987 405 496 -775 1196 425 -912
6084 -912 31 377 1204 -51 -264 412 -258 605 57 -343 -146 -1031 281 438 812 211 -307 -294 71 -547
6104 -547 726 -300 -683 -246 69 900 233 -277 386 -525 513 -170 -885 -580 -1275 236 127 506 585
6123 585 -465 329 536 -90 647 -174 641 54 -287 29 456 525 493 -460 -582 -521 260 1771 965 3
6143 3 -361 602 610 -247 -120 225 1028 -173 127 292 816 99 -979 69 326 115 -550 -895 -635 1328
6163A328j316K18j043Q83o99P41r82R57O40m50K53q91M7q21J118n12J538j408
6181c99J275n25p80L74o30N75K86L69r15n21R93n54J024m33o21N64k74j52m73
6200h17n1L07J715m17j089m25O72O51L40J46p18O24q33j53P3N87j069l71N07j27
6220d48l46J96K13M02J71n76R69j346R85N64q31L19j890K145r18L78q32n82J363
6239f4l44pK24J14n74R28l5o35J309j011l93K85N25j310K9M99O15JL61r23k11
6260f17j62m95J542k01LO03j070jJ78L19o72O60K90M21j145L38k25J32Q21j280
6280e61O57r92M33P07n46J65o13J057j094J219r0n94O99k05j077R61o6j48N8Q10
6300G80K52k185R68j90R34k17R07j606P57K8J51j289M42P09K09o77m94L33J29
$$ plain form
6163 1328 12 230 -813 70 -629 112 -870 87 727 277 530 -361 -314 -1135 -17 -529 1009 -399
6181 -399 876 351 -429 -55 -685 -110 176 545 -370 -891 102 -452 572 139 -482 82 -192 -344 -817
6200 -817 -868 -561 1154 737 -352 -777 -105 546 886 1032 314 938 105 -48 25 612 -457 -828 -321 -448
6220 -448 -794 -598 -385 17 188 -388 581 -765 220 784 -47 272 -1618 527 -391 -13 -845 -1427 -64
6239 -64 -408 -415 -191 -77 -651 277 242 -393 916 -95 -488 -203 322 -988 -959 -460 155 156 517 -406 -617
6260 -617 -779 -1274 268 67 70 673 -397 -398 -220 99 -573 87 377 798 -347 -9 -234 -102 719 -561
6280 -561 96 -896 -463 244 -302 -137 -750 307 -787 432 342 -252 447 242 -835 126 60 -88 -30 780
6300 780 1032 -1153 -185 -375 559 342 1249 -357 400 428 579 -710 -268 441 650 -27 -521 -188 -59
6319e9M38m19J06N88p93R72q57J099k140M54l71R22P38j109K59n31k03Q27R78
6338H99j061J61l89J577k019J174L41l77q67J363j110N39j020P18N38J60p58O77
6356E46j171J236l90k58q72J384O53j296K30j80R81j143k75jO83m07Jk47M13j075
6376a188R97M17j064N13M93q50J144j510J181j76L1n1l89M59m48o38J538j54j269
6395i64J116J93K12J13j14j00j897J621M20j214P52K26p57J930k015K74J246M71
6413A513r50K48m27R9j443O83o53J042m16p18J590P18j397j111J168n90L78J56
6431a10l0k16O30r40L36N67r82M85J039j075O76o98N40p99M4M09K8o31K67j115
6451a575J663m49K84p55J041l96J0qN64kj364J415k38K01R34j040K94j199o66
$$ plain form
6319 -59 379 -40 66 654 -139 833 -24 1075 -1065 -611 -982 -60 678 -431 -172 -703 -906 -79 899
6338 899 -162 -1 -390 1187 -832 342 683 306 -561 802 -308 231 -789 -71 467 627 -131 546
6356 546 -625 611 221 -37 -909 475 1128 -168 62 -118 863 -280 -555 -556 127 -280 -279 -526 -113 -1188
6376 -1188 -191 226 -838 -325 168 -682 462 -1048 133 -43 -12 -63 -452 7 -441 -1079 459 305 -964
6395 -964 152 345 557 670 556 456 -1441 180 600 -614 138 364 -393 1537 -478 -204 1042 1513
6413 1513 563 811 384 483 -960 -277 -930 112 -304 -1022 568 1286 -111 -1222 -54 -644 -266 -110
6431 -110 -140 -356 274 -666 -330 237 -745 -260 779 -296 380 -318 222 -577 -533 -124 -96 -727 -460 -1575
6451 -1575 88 -361 -77 -832 209 -187 -177 -185 379 377 -987 428 190 391 1325 285 579 -620 -1286
6470a286J029N65M6J58l31p05L31P97J4o61n33K65P40l40J30k74M16j194J476
6489F43o83J66j65O6j276Q81R43l44l73j44j88Q34r36J54j79R04K65j005N57l39
6509b19L89r24M95K9j387J686R99j210L15P00l55m31q85O81O98j200Q85L18m44
6528A40p59k76R93K12q86j9k23J302o67K9J072j091R47M04j261n08R32j437J159
6547F3q84J29O33l24P21j468P52N48p16N49N9J361j163J343k231j75J156n83N18
6566B88l59R54r40k97O54J44j552J834r38K42n42P43j13O1q7o01M83j342J303
6585f5j88l23J110l04M4J71P35j392n57N11n72J496n45p81P3M77O23m82L43P84
6605A158j162M86m81J116n46o76k72J371j14o17M42j111q19P21J311o81K62n18
$$ plain form
6470 -1286 -257 308 354 512 181 -524 -193 604 618 -43 -576 -311 429 89 219 -55 361 -833 643
6489 643 -40 126 -39 27 -1249 -368 575 231 -142 -286 -474 360 -576 -422 -601 303 568 -437 120 -219
6509 -219 170 -754 -259 -230 -1617 69 1068 -142 173 873 518 87 -798 -117 581 -619 266 584 140
6528 140 -619 -895 98 310 -576 -595 -818 484 -183 -154 918 -173 774 1178 -83 -591 341 -1096 63
6547 63 -821 -692 -59 -383 338 -1130 -378 170 -546 3 62 1423 260 1603 -628 -803 353 -230 288
6566 288 -71 883 -57 -354 300 444 -1108 726 -212 30 -512 231 118 179 92 -509 -26 -1368 -65
6585 -65 -253 -576 534 230 274 445 1180 -212 -769 -258 -830 666 121 -660 -587 -110 513 31 374 1158
6605 1158 -4 482 1 1117 571 -105 -377 994 880 263 705 -406 -1225 -504 807 126 388 -130
6623a30n50M15Q46J06J284r38j604J667j757J41J210j560m32J84L71J923j543
6640c67J385j186n11M58Q66l22N68j544K56K02L4k69n7M59j38K16l97L12r9k04
6660c38O3P27k61j000k25J83P19j95j76J073K25j549l0O44p88O96p70K36O12O23
6680D69j04j121j38J608j312J362o31l72O6m89L23P94o97J394q47j134M46L78
6698el06L82j033J766o90N25k165R96J102j559K63O11R55j495Q15J044j406r37
6716a137J629o97P43q26J219j549K76M86N8J359j224o0j73l43M09k06j07l6k66
6735d45o44R22L30k36P92j273J376q51Q4n9j27J297r00p98j98N78j068J95J275
6754B50l87J387m08m09n8p43O62j460M60O78n20R67k02p60P3l12J214o97R20j617
$$ plain form
6623 -130 -680 -265 581 687 1971 1033 -571 1096 -661 -520 690 -870 -1302 -1118 -747 1176 -367
6640 -367 1018 -168 -679 -221 645 323 891 -653 -397 -195 -161 -430 -487 -28 -166 50 -347 -35 -134 -338
6660 -338 -275 452 191 -809 -1034 -851 -132 -327 -503 570 795 -754 -784 -140 -928 -232 -1002 -766 -154 469
6680 469 365 -756 -894 714 -598 764 133 -239 -173 -662 -339 455 -242 1152 305 -829 -383 -5
6698 -5 -311 71 -962 804 114 639 -1526 -530 572 -987 -724 -113 842 -653 162 1206 -200 -1137
6716 -1137 492 -205 538 -288 931 -618 -342 144 202 1561 337 277 104 -239 170 -36 -143 -179 -445
6735 -445 -1089 -167 163 -73 719 -554 822 -29 55 -4 -131 1166 266 -532 -730 -152 -1220 -1025 250
6754 250 -137 1250 842 433 375 -368 294 -1166 -706 -28 -548 419 217 -543 -470 -782 432 -265 655 -962
6774i62m01N40J001M26k143J485j36O59p14O28k76r2K55L1N74j491O69n96J184
6793F41j96j94p85N38n93O23k5p35P20K48L01q80K95m43K77J63N69p5K0k76P73
6814I66k362K392j378k02J151K9p48N90O9r16n46N48N79L30m61p39J28M77q84
6833i77M62P17o21R17j418P00P79m0j169O77R40j887J378o97M42q18Q78k5q47
6852f09p7M08L61k66j077J697m80R80j290L18o64N21n36q2K55j10R00J01k21j410
6872a281J126l13J128j173M54m99K84M83n17k68Q81o87O16M82r73n68P42O25m09
6891A33L80l31k67j180J502k00j32N93q54J70O18o20k69n15J134k26q6O18N3J92
6911G13l78n93J155j394N35k97j49k57J308j30J09l3J92n58Q46j875J193j170
$$ plain form
6774 -962 -1363 -823 178 604 -1539 -54 -190 469 -245 383 107 15 270 301 875 -616 53 -543 641
6793 641 445 251 -534 4 -589 34 9 -726 -6 242 543 -337 -42 -485 -208 -45 524 449 469 193 966
6814 966 -1396 996 -382 -584 567 596 -152 438 507 -409 -955 -407 172 502 41 -698 -570 -93 -977
6833 -977 -515 202 -419 498 -920 -220 559 519 -650 27 967 -920 458 -239 203 -615 263 238 -609
6852 -609 -686 -278 83 -183 -1260 437 -43 937 -353 -35 -699 -178 -714 -796 -541 -651 249 350 129 -1281
6872 -1281 -155 -468 660 -513 -59 -558 -274 209 -308 -576 305 -382 234 716 -257 -825 -83 542 133
6891 133 513 182 -85 -1265 237 37 -95 498 -356 -186 432 -188 -457 -972 162 -64 -150 468 521 713
6911 713 335 -258 897 -497 38 -259 -408 -665 643 513 622 589 781 223 1069 -806 387 -783
6929g83N35N40j264L36M49J27k86n9R11N10k389P95J297j382n76J088J234p65
6947C18n30j54J325j669J71J44j17P08n37l73M56J72q60J342J30J64L44P3k331
6966a224J993N8p67m24q99K412r85q25k6M73K57j599K263j677J575j76p9j080
6984g30N43J231j057L41n15o17J396p21R33M7M94j486m9k0O42p2j308J650m56
7003B46j180O03O28J89j470M47k28P32R42j220O2k76M17n98J92J035n26r5K61
7022A61m33K90N95q72J38l34L63O3K54k9j170O60k30N15J95k70M53j005K82P09
7042C35J4k46J30Q69q44J196j306P01k049L03Q42L77r46r5m5P74M16Q96o06j48
7062E68Kj03n17L96J25qj091O71j03o0Q90j181J62o11J782l21J58o05l40K77N75
$$ plain form
6929 -783 -248 292 -972 -636 -187 -60 -346 -405 506 1016 -1373 -578 719 -663 -1239 -151 1083 318
6947 318 -212 -366 959 -710 -539 -395 -512 196 -341 -714 -258 -86 -946 396 526 690 1034 1107 -1224
6966 -1224 769 827 60 -364 -1263 1149 164 -661 -687 -214 43 -1556 707 -970 605 429 350 -730
6984 -730 -187 1044 -13 328 -187 -804 592 -129 804 851 1345 -141 -190 -210 432 360 -948 702 246
7003 246 -934 -331 297 486 -984 -537 -765 -33 909 -311 -249 -525 -108 -706 -514 521 -5 -100 161
7022 161 -272 18 613 -259 -121 -455 -92 -29 225 196 -974 -314 -544 -29 166 -104 349 -656 -374 335
7042 335 349 103 233 1102 258 1454 148 849 -1200 -897 -55 322 -624 -719 -764 10 426 1322 716 568
7062 568 570 467 -50 346 471 463 -628 43 -60 -120 770 -411 -249 -860 922 601 759 154 -186 91 666
7083F66m52k18n28J414j539L10N30K19J55m62q10k5J642j383M58K33k3j864K403
7102G26m81j23m16O09J94q6j077R11J478j459L07o19j53r99J536q08J329n1r1
7121G27N25j350Q65q62R7q34J208l85M2o21J134N02j295J049j242J79M03R81k044
7140i21P56j54K36o48J219M5j88N3m35P91j086n56J22R78o1Q8j167J383j63J65
7160D57K98k69m3O46j456j49l34M70o7n89K27N18O08M92j382Q27l00l8L35m18
7180a67L68m75K97k49P02j22l95k80J081m78j037P14J37l18n06P07J00L54K93
7199G26j156O46J82n59R97j732J411j130N00K81j366J221n48J277j371m58J043
7216c6P75j187J554j138J84J264j346j9o83j56J008k04j097L62N17O78l13j68
$$ plain form
7083 666 214 -4 -532 882 -657 -347 183 402 557 95 -715 -740 902 -481 -23 210 187 -1677 726
7102 726 245 122 -294 315 509 423 -654 257 1735 276 583 -36 -189 -1188 348 -460 869 818 727
7121 727 1252 -98 767 -95 2 -832 376 -9 33 -588 546 1048 -247 802 -440 -261 142 1123 -921
7140 -921 -165 -319 -83 -731 488 533 345 398 -37 754 -332 -888 -766 212 151 239 -928 455 292 457
7160 457 755 486 443 1089 -367 -516 -850 -380 -447 -1036 -809 -291 317 809 -573 254 -46 -84 251 -167
7180 -167 201 -274 23 -226 476 354 -41 -321 760 282 -755 -41 96 -222 -728 -21 79 433 726
7199 726 -430 216 398 -161 836 -896 515 -615 -115 166 -1200 21 -527 750 -621 -1079 -36
7216 -36 739 -448 1106 -32 152 1416 70 51 -632 -788 220 16 -1081 -719 -202 476 163 -5
7234eK41J49L32M35n89j137N58J040j070m82L09P0O39l77o41J705j231J3M5j042
7254a038k9J295J16m83l54J001j531O41J006l37l58l9nL28K63p62J161j113J292
7273A054k451O87J270O91j247k60Q13j405K270m51r02j025J020k20j26J169q42
7290D5j538O01O26j30J06m79R2j17J44M60O11k222K137mk52p94M45K89N11l99
7310A32n89p11J185R86j276q04J057Q38j014J8M41j233j9J201J7P72j760J116
7328C57K57p00q12Q50Q43p65p50K14R47o13j236J066R66p91J105p77L77n04m23
7347c89K61n02O08M12m83M22j08n03k4J190n53K78j136M82J527j741j9J471j373
7366a80L21n80N62o80L82k42L14k18J316k52n80m64L40P75q19K77J37O04l42j075
$$ plain form
7234 -5 236 385 717 1152 563 -574 -16 1024 -46 -528 -219 -149 490 113 -528 1177 -54 -41 4 -1038
7254 -1038 -1067 228 344 -139 -493 508 -1023 -382 624 287 -71 -110 -115 213 476 -286 875 -238 1054
7273 1054 -1397 -710 560 1251 4 -256 557 -848 1422 971 69 -956 64 -156 -282 887 45
7290 45 -1493 -892 -266 -396 -290 -769 -677 -794 -650 -190 421 -1801 336 332 80 -714 -269 20 531 132
7310 132 -457 -1168 17 1003 -273 -1077 -20 818 -196 -178 263 -970 -989 212 229 1001 -759 357
7328 357 614 -86 -898 -48 795 30 -720 -506 441 -172 -1408 -342 624 -167 938 161 538 34 -389
7347 -389 -128 -630 -22 390 -93 329 221 -282 -306 884 331 609 -527 -45 1482 -259 -278 1193 -180
7366 -180 141 -439 123 -557 -175 -417 -103 -321 995 743 163 -301 39 814 -5 272 409 1013 671 -404
7386d04M61L93m9p88L45L66j79q5o30J073j262J359j5j11L92o31j96K42M91k644
7406a872J342Q98o98L9Q66J76j131l13L46n18O05J335r07j9J55n23m51O89M49
7425D68j219o1J632j734O63J74J11k24J87p46Q18L82L68j053N93o03L8K38K69
7444C01L2q68J94R52p69K21O92o54k30N94k31q31J212q32l71Q65R21j319L09K75
7464D63j41J82o22M25r72N07O07k2k72k38j499J072J12l0J071M2n64m79K53K34
7484A29m59j11O22n24p43R24k32Q16o35q6P64l49l52R59j042J300j282O28O96
7503A023J29M19j672m34J79K40J0P74j70l77j98P8k08K16R28j537P23L4M97p40
7523h6N92j19l10P05o98J496j562pJ17J3r05J50L22R01q41m60P95o10J18L19J51
$$ plain form
7386 -404 57 450 401 -387 -42 324 145 60 -570 503 -759 600 585 474 866 235 39 281 772 -1872
7406 -1872 -530 368 -330 -291 575 751 -380 -693 -347 -865 -260 1075 168 149 304 -219 -670 19 468
7425 468 -751 -812 820 -914 -251 -77 34 -190 -3 -749 69 451 819 -234 359 -244 -206 32 301
7444 301 333 -535 -341 611 -158 63 755 101 -129 465 234 -597 615 -217 -588 277 1198 -121 188 463
7464 463 322 504 -118 307 -665 -158 449 427 155 -83 -1582 -510 -398 -428 643 685 121 -358 -105 129
7484 129 -330 -441 181 -343 -1086 -162 -394 422 -213 -299 465 116 -236 723 -319 981 -301 327 1023
7503 1023 1152 1571 -101 -535 -356 -116 -106 668 498 121 -77 1 -207 9 937 -600 123 157 654 -86
7523 -86 506 387 77 782 84 1580 18 11 128 141 -764 -614 -292 609 -232 -692 103 -507 -389 -70 81
7544H1K56L02j489j62J922K81k526J437j053J190J76n80M62j86j92l35R88j178
7562f06J408K46j494k36N92j249R44K77J68l45k38R33j141M38N43m39l23Q13p17
7581d26L57P19p38L45j424J020o32Q11R70q47m63l85K49J361k136N73L77Q81j54
7600D58K9j380O38J154m2p73j61J878j540o30O20N7j003j24R42p21J107l55R39
7619A093l49j485J66l4J31Q60j102M64j44J253k93o45O27o65M86q19J008m2r39
7638d29o42M3Q65q13Q12J034j96J23j001j25M88r78J226o81j87J05R01P4r99J16
7658b64R0N80j111m10J364p98J397p51J35p15p08P50n80P98m8M85P16r38p88J209
7678D13l94M29q23j2l12J628j420J253m55n21k13q60jQ87M40k62j15m2R92o20
$$ plain form
7544 81 337 639 -850 -1012 910 1191 -1335 102 -951 239 415 -165 297 111 -81 -416 572 -606
7562 -606 802 1048 -446 -682 -90 -1339 -395 -118 50 -295 -533 400 -741 -303 240 -199 -522 291 -426
7581 -426 -69 650 -88 257 -1167 -147 -779 32 1002 155 -308 -693 -444 917 -1219 -646 -269 612 458
7600 458 487 -893 -255 899 857 84 -77 1801 261 -369 251 308 -695 -819 123 -598 509 154 1093
7619 1093 744 -741 -575 -609 -478 382 -720 -256 -400 853 560 -85 542 -123 363 -456 552 510 -429
7638 -429 -1071 -1028 -163 -976 -164 870 674 797 -204 -329 159 -819 407 -274 -461 -356 545 619 -380 -264
7658 -264 -174 406 -705 -1115 249 -549 848 97 232 -483 -1191 -441 -1021 -223 -271 214 930 -8 -796 413
7678 413 19 448 -375 -387 -699 929 -491 762 307 -214 -427 -1287 -1288 -401 39 -223 -338 -380 612 -8
7698hQ90j186J315p51K47n65L04l40M52p12J284j856K44O26K69q36J042J07j101
7717e75K26L46J38j69M86n14k2K42k252J917M75j189J121k79p31K22J114n49O65
7736F72j244L54N44j40j937K256k68q27J113m76k92R7m16n02J667j468J035N37
7754G05k88q22J040r18M3O6J198k69n75M97q79l35J032q69J014j488M79J027k130
7773a472Q01L73L78m61L65l58Q80m11K25%p05J19L85l05J238j091k14M61j68j256
7793a216J130O25n1l41M50p21L20j01m43Q08k97q7R7j077J463L94j260J26n00
7812f81L45O7J191n74m15M39q10O14O56o30m97L91K45r86j10J309j112J050K75
7831G67j489O34L29p08M07K23J30J89o23J81J364k219J390m69j441K697k220Q98
$$ plain form
7698 -8 882 -304 1011 260 507 -58 246 -94 358 -354 930 -926 -682 -56 213 -623 419 526 -575
7717 -575 -349 -3 135 -34 452 -62 -84 158 -2094 -177 298 -891 230 -49 -780 -558 556 7 672
7736 672 -572 -218 326 186 -1751 505 237 -590 523 47 -245 -148 -564 -1066 601 -867 168 705
7754 705 417 -405 635 -283 -240 -174 1024 755 180 677 -202 -537 495 -374 640 -848 -369 658 -1472
7773 -1472 -671 -298 80 -381 -16 -374 506 95 320 320 -385 -266 119 -186 1052 -39 -253 208 40 -1216
7793 -1216 -86 539 488 147 597 -124 196 95 -348 460 163 76 173 -904 559 953 -307 -181 -681
7812 -681 -336 -269 922 348 -67 372 -438 176 832 202 -295 96 341 -645 -755 554 -558 492 767
7831 767 -722 -88 241 -467 -60 163 293 482 -141 40 1404 -815 575 106 -1335 1362 -858 40
7849D0O4o21k61J148L7j354J034PKl05K75l29k38M84J23j44l65j50J574n46Q30
7870A305r82m33P42l5N6l31O37j20j685J502k38N48j693J258q70P83j184J306
7888E66L78j257J145j094O34l54J41J59q17P56pk58j443K392l57k78O15r74K25
7907A72k25j04N1J42M89m27M37j514M39K80L79m52n65M34N59p7l10M81n0K41L3
7928D13j20J43n34m76k98R28l41L8l19j32k95J366j601N96l69Q08O50j174n00
7947a217J367q29j20R43L57O81r83k12n02L09j17j251J406K17Q4O40l62j215J458
7966F54j354l06J149k63Q57p91N50j553R12P92j21q87P32q02P19m46J176r53m19
7985c54K27N46J143j670J149o15l77l80P09q29M55R41k030R76p51m92J245q59
$$ plain form
7849 40 104 -517 -778 370 407 -947 87 94 96 -209 66 -263 -501 -17 106 -38 -403 -553 1021 475 1305
7870 1305 323 -110 632 597 653 322 959 839 -846 656 418 966 -727 531 -339 444 -740 566
7888 566 944 -313 832 -262 372 18 159 318 -499 257 250 -8 -1451 941 584 306 921 -53 172
7907 172 -53 -157 -106 36 525 98 535 -979 -540 -260 119 -333 -898 -464 95 18 -292 189 139 380 413
7928 413 293 436 -98 -574 -872 56 -285 -247 -566 -698 -993 373 -1228 -632 -1001 -193 457 -717 -1217
7947 -1217 150 -679 -799 144 501 1182 199 -13 -515 -206 -323 -1574 -168 49 133 773 411 -804 654
7966 654 -700 -1006 143 -120 737 -54 496 -1057 -145 647 526 -361 371 -431 288 -158 1018 65 -354
7985 -354 -127 419 1562 -108 1041 426 49 -331 378 -451 4 945 -1085 -109 -860 -1352 -107 -966
8003i66O94M49J61K71j083n7P1J411j248K75k63j69K38m40j34R4O59L45K78q67
8023b81M29k04p9O83k59O1R37j907J203m47O19q98p58Q01o88K31q42J268m57J52
8043d36k53K11J170q73P56o24p53J027k99j06M07lm43k63n68J549j814O43P59
8062H7k08r64J80J117p09q7J008L67L22j067q33J874j51o18j47N36j168k57R14
8081A96O99j733O99j034J832j287J614q42n96k20R52n36P71m99O55r16PL90P70
8100I22j720l6q02K077o85j15N63q3n87P50o96Q75N55j476L96M31l73j122J641
8119E15p49L28r10J247j073O38R33r00N52m62l53K02L13N9J30P9K02q7j87M99
8139I76j692k92J449J31M40j348N41M49jj58P77k193J834j054j9K96N34N09r90
$$ plain form
8003 -966 -272 177 338 609 -474 -531 -460 951 -297 -22 -285 -454 -216 -656 -790 -696 -37 308 586 -281
8023 -281 148 -56 -135 548 289 350 1287 -620 583 136 755 -143 -901 -100 -788 -557 -1399 -131 -588 -436
8043 -436 -689 -478 692 -181 575 -49 -802 225 -74 -180 227 224 -219 -482 -1050 499 -1315 -672 87
8062 87 -121 -1085 -905 212 -497 -584 424 791 1113 46 -787 1087 936 318 171 707 -461 -718 196
8081 196 895 -838 -139 -1173 659 -628 986 144 -452 -672 280 -256 515 16 671 -245 -238 152 922
8100 922 -798 -834 -1636 441 -244 -359 204 121 -466 284 -412 463 1018 -458 -62 369 -4 -1126 515
8119 515 -234 94 -816 431 -642 -4 929 29 581 119 -234 -32 281 340 470 549 751 664 477 976
8139 976 -716 -1008 441 572 1012 -336 205 654 653 495 1272 -921 913 -141 -160 136 670 1179 189
8158A89k89K0r57Q23J160j284k15J349o37q90J350j00J62J86k90l46K50k80o00
8177c99L17M46Q1j728J498l25K1l80o06J454N85j276J713j252
$$ plain form
8158 189 -100 -80 -1037 -214 946 -338 -553 796 159 -731 619 519 681 867 577 231 481 201 -399
8177 -399 -82 364 445 -1283 215 -110 -89 -469 -1075 379 964 -312 1401 149
8191A49
$$ Imaginary data points
##PAGE= N=2
##DATA TABLE= (X++(I..I)), XYDATA
0@%%%%%%%%%%%On3J55k16K16k16K26l17M15m38N06o10O84p91R16j031J182j346
29g12J511j704J918k149K408k682K987l326L684m093M545n026N566o167O828p563
45c975Q379r320J0390j1604J3023j4686J6693j9153K2243k6281L1796l9825N2647
58C0327p6427J35033n38212q80613J151262J181746j66641j152204l94765O63579
68d6915P58293j91796p88154l64667N50693O32184j15825o29237k00085L66099
78b9410L21369j35471k71416o6744J33472J09688J6422m0268m9251n9339k25J00682
90B9509J06685n0196j68506q3226R5534J25000J2174p5537m7031M0607R9731O9081
102A53825m3160j57207j31045N1526J88443O7989j58202j48766J07603K35283
$$ plain form
0 0 0 0 0 0 0 0 0 0 0 0 0 6 -47 108 -108 108 -108 118 -199 216 -222 284 -326 358 -433 483 -548 634 -712
29 -712 799 -905 1013 -1136 1272 -1410 1577 -1749 1935 -2158 2387 -2639 2927 -3240 3588 -3975
45 -3975 4404 -4916 5474 -6130 6893 -7793 8900 -10253 11990 -14291 17505 -22320 30327
58 30327 -46100 88933 -449279 -1329892 -178630 1003116 836475 -315729 -710494 -46915
68 -46915 711378 519582 -268572 -633239 -82546 549638 433813 -195424 -395509 -29410
78 -29410 291959 156488 -114928 -181672 -48200 61488 77910 37642 -11609 -70948 -71173 29509
90 29509 136194 85998 -82508 -165734 -70200 54800 66974 -8563 -55594 -14987 84744 153825
102 153825 110665 -46542 -177587 -126061 62382 130371 -27831 -176597 -68994 166289
112A66289K8445k42069k26662N8478K59470J22563j71889j84320J37739L03681
122B51725J8627k89351j59343J54013J45760j00387j47842O0024J83617L4923
132A51766j58297r4438J38037J50641j34854k62737L1618L09750J19678k59740
142h576k48695J23564L09605O3014k76823k53217J16605L59995J17245l07855
152e138l01519J40151L74139O3976l25461k56846J26425L02553Q9664k00590k26224
163b18870L7478K67064J68426j54682k70963j6514K48225J54626j33733k00960
173a19903O120J67609R6568p0176j24152l8685O5219P2795j11n4086l3805R927
185b2680K6913K8232J1249l2768o7871j9220P6175R2371j9618j26194p4328J02425
$$ plain form
112 166289 194734 -47335 -273997 -215519 43951 166514 -5375 -189695 -51956 251725
122 251725 270352 -18999 -178342 -24329 121431 21044 -126798 -66774 116843 151766
132 151766 -6531 -100969 37068 187709 52855 -209882 -178264 131486 251164 -8576
142 -8576 -257271 -133707 175898 238912 -37911 -291128 -174523 185472 302717 -5138
152 -5138 -306657 -166506 207633 271609 -53852 -310698 -184273 118280 207944 7354 -218870
163 -218870 -181392 85672 254098 99416 -171547 -188061 60164 214790 81057 -119903
173 -119903 -113783 53826 150394 80218 -43934 -82619 -17400 55395 55284 1198 -32607 -22680
185 -22680 4233 32465 43714 10946 -56925 -76145 30 92401 72783 -53411 -127739 -25314
197b5314J51285l8426k09559p9306J78768J88294o4086j96641l5323J66209J39726
208A75627p3396j94645p6256J42371J62057n8096k09891n3856J87496J48804j00892
219D9323j87458l513J71259J09982p6709j45242j5978J42706J14847p9630j78710
230i9123j7240J78995J03722j31189j63645N2206J84314M5294j46296j31052N7848
241f6166J57250K8303j60749j23597J05305J85210r232j79639p0192J32261J21574
252A20328p1360j55676k9304J20752J03467n1529j19300m773J26348O7013q8716
263A7250r8840K8383Q6612J1179n4611k6291L2147L4691p361k8010q958J5316
275A507K100j5743N913M1239K1237l5171l3892K3240M0025j7759p1407l4837N0788
$$ plain form
197 -25314 125971 87545 -122014 -201320 -22552 165742 101656 -94985 -130308 35901 175627
208 175627 102231 -92414 -168670 -26299 135758 77662 -132229 -186085 1411 150215 49323
219 49323 -138135 -141648 29611 139593 62884 -82358 -98336 44370 159217 79587 -99123
230 -99123 -116363 62632 166354 35165 -128480 -76274 108040 153334 7038 -124014 -66166
241 -66166 91084 119387 -41362 -164959 -59654 125556 116324 -63315 -133507 -1246 120328
252 120328 48968 -106708 -136012 -15260 88207 36678 -82622 -87395 38953 105966 17250
263 17250 -81590 -53207 33405 44584 -10027 -36318 -4171 30520 23159 -4851 -13809 1507
275 1507 3607 -12136 -6223 35016 56253 21082 -12810 10430 50455 32696 -38711 -73548 -22760
288b2760P9858K666q0368m6342O7246R4048k4891j24010o1815Q7478J14564j0903
300G4771j20915p0189Q1989J40326J1149j53137j24301R7168J95228L616k02752
311f7047j17473J35112J85169k1424j88444j02347J11752J81109J6517j75181
321d2257j29795J07310K06519L459j99804j08620J28272J57884k1661j37796n6743
332i3232Q3095J03801J817q9515o1144L9113P4368J221o7358m0571K9110L5981
344A6686m885j9298L31M666p890o140J3883J7758j6941m1646l951N1119L5860
357C9552l7463n7588O887O3976L8013l7467n8490J688O4346M5379m2058q4854
369e8079p853Q4678M9494o5690p9313K9955R2130J9135o7863n3546L3993O8857
$$ plain form
288 -22760 57098 59764 -20604 -66946 300 94348 69457 -54553 -116368 -28890 85674 74771
300 74771 -46144 -116333 -34344 105982 117131 -36006 -160307 -63139 132089 135705 -67047
311 -67047 -184520 -49408 135761 114337 -74107 -176454 -64702 116407 132924 -42257
321 -42257 -172052 -64742 141777 145236 -54568 -163188 -34916 122968 101307 -36489 -93232
332 -93232 -10137 93664 95481 5966 -55178 -16065 58303 59524 -7834 -48405 -19295 16686
344 16686 11801 -7497 -7166 -2500 -10390 -16530 -2647 15111 -1830 -43476 -47427 3692 39552
357 39552 2089 -55499 -48612 15364 53377 15910 -42580 -40892 23454 68833 26775 -58079
369 -58079 -65932 18746 68240 2550 -76763 -46808 45322 64457 -3406 -56952 -22959 45898
381D5898Q528o4987n2325M4307P9842m226q6588k9924P9858P0526m8549q9016
393d6656k962Q5074M9463n9684r7086q59J02036N9021q0311j10436K3998J28405
405E0003M7127r8531r9068L3011J11459M1035q6181j01185J9640J20614O0584
416I8508q7895j07235L1294J22124L8158q4325q1703K5883Q2436K8848n2984o2407
428d9298L731N9608L7097k8865m7391J247L7718J7021j1955j3470m931o761N07
441e742J4571J5229j0851l5815q029M2997M5227j9650o9775j9784O1537N3305
453F3220l5889q0712j9138O8178O4120k2708q7253l3805P6740Q5811l0432j10815
465f2683k8140R3771P4709m9037r6824r442Q0994O6941l1206q4324k2108P4595
$$ plain form
381 45898 54426 -10561 -62886 -18579 61263 57037 -29551 -59475 20383 90909 42360 -46656
393 -46656 -49618 35456 84919 25235 -71851 -72710 29326 88347 8036 -102400 -78402 50003
405 50003 97130 -1401 -100469 -67458 44001 85036 -1145 -102330 -82690 37924 98508
416 98508 10613 -96622 -65328 56796 94954 10629 -71074 -45191 37245 66093 13109 -49298
428 -49298 -45567 14041 51138 22273 -25118 -23871 13847 30868 18913 5443 512 -6249 -5742
441 -5742 8829 24058 13207 -22608 -30637 12360 57587 37937 -31838 -51622 9915 63220
453 63220 27331 -53381 -72519 -4341 59779 37071 -50182 -83987 -7247 78564 48132 -62683
465 -62683 -90823 2948 77657 28620 -68204 -77646 3348 70289 39083 -45241 -67349 7246
477G246P6578l2458r7662j5120R2100N6301o0267q1613J1796P1801K8859m9210
489H351n6081J4100O4104K9495n0826n8297K6480O7575k58o8104l6275N0167N3956
502D4387j6846n2527r764M8606L6812k8265o0556j0045N0078K7124m0125m2371
514e3492J8202N2307J4806l4453k7128J6588L2406O99l1856j9253K1569K5950
526A6345r206k4877Q679K5995m10k4560n001K4377J5242j8902k2474P299L4571
539B7078J6616l2285m0972R894M9536J3179n1093m1612K8749N9203P111n3993
551h589m2634K5939N8251J1437o0095n0089L1298P5032J0802o7849m4353M3615
563a7235O9308K190o5370n1001K8784O5943J1995o9117n4728M2607Q4034N847
$$ plain form
477 7246 83824 51366 -46296 -61416 30684 86985 26718 -54895 -43099 28702 57561 8351
489 8351 -47730 -33630 30474 59969 9143 -49154 -22674 44901 44643 -23461 -59736 -9569 44387
502 44387 27541 -24986 -34750 13856 50668 22403 -38153 -48198 1880 29004 -11121 -53492
514 -53492 -35290 17017 31823 -2630 -29758 -13170 19236 19935 -11921 -31174 -9605 16345
526 16345 7139 -17738 -9059 16936 16526 -8034 -13035 11342 26584 7682 -14792 -7493 27078
539 27078 43694 11409 -29563 -19669 29867 43046 -8047 -49659 -20910 38293 45404 -8589
551 -8589 -51223 -25284 32967 44404 -15691 -65780 -34482 40550 51352 -16497 -60850 -17235
563 -17235 52073 54263 -11107 -62108 -33324 32619 44614 -24503 -79231 -36624 47410 53257
575E3257p1124m0032M6717O2159q774o0468l2487L4552N1251K626m8513k6933
587c7769M1140M9050j3819n0074o854L5341J2066k9983k0512J5384K5571l009
599A6532k4484n013K6061J3299k8138l3972J3245M0888M672m3449k0887L4383
611f863M2581j2059n1637k1242L8194M5021j6052n3836k294O0282L5217l9191
623A8121m9397P920L8533P289l7724k7451K0085M3309J0476l0811k3827K3567
635I0L7487j5671m7351r685M1696K7442k0251l1067O365L1736J7849k1230l5382
648a7972k197K9351K1579k0486l4706K819L6759J7883k8780l7808M166L7949K0579
661B9136k4292l6135L048M3242K4445l6040n1538K631N1250K2727l5494l7323
$$ plain form
575 53257 -17867 -57899 -11182 50977 42203 -18265 -50752 -16200 35051 37677 -10836 -37769
587 -37769 3371 52421 38602 -11472 -18326 17015 29081 -902 -21414 -6030 19541 16532
599 16532 -7952 -12965 13096 26395 -1743 -35715 -22470 18418 23090 -20359 -41246 -6863
611 -6863 35718 23659 -27978 -49220 -11026 33995 17943 -35893 -38187 22095 57312 18121
623 18121 -31276 -23356 15177 22466 -15258 -42709 -22624 20685 31161 350 -23477 90
635 90 37577 21906 -25445 -35130 6566 34008 13757 -17310 -10945 20791 38640 17410 -17972
648 -17972 -20169 9182 30761 10275 -24431 -21612 15147 33030 4250 -33558 -29392 8557 29136
661 29136 4844 -31291 -28243 14999 39444 3404 -48134 -45503 5747 28474 -7020 -44343
673d4343J9748N1698J6126l7150m0193J4243M5338P192m6664k5243L5927M2483
685C9162j5806l7996M65K9252P217k7932k0475J7770L2244j925l5307j0175M2721
698A9215K8520m3091n5316J7762O7529J3889n5961l8328L6952O3280k280p1270
710a9099n0441M0537P0421q408p2483k4278O5808N9333k1666o7678j7756M1376
722d334L8511k0057m8189j2187M2803L9429j4216l9313p596K6124J6013j2454
734D534k0838j037J4973K0029M204j1811j7295K282J6733M494j8326j6803J3643
747e218K5791O472j8691j3837N416R036n587j8134p960J4262J8862k241j2971
760d800O400J9156l964l0607j3174K1762J6673j4566k3809R252L8942J0750l3371
$$ plain form
673 -44343 -24595 27103 43229 6079 -34114 -19871 25467 32659 -14005 -39248 -3321 39162
685 39162 23356 -14640 -14175 15077 22294 -5638 -26113 -8343 23901 21976 -13331 -23506 19215
698 19215 47735 4644 -50672 -32910 34619 48508 -7453 -45781 -8829 54451 52171 -19099
710 -19099 -69540 -29003 41418 33010 -39473 -63751 2057 61390 39724 -27954 -45710 -4334
722 -4334 34177 14120 -34069 -46256 -3453 35976 21760 -17553 -25149 975 16988 4534
734 4534 -16304 -17341 -2368 17661 21865 10054 -7241 -4959 11774 16268 -2058 -18861 -5218
747 -5218 20573 27045 8354 -5483 -67 8969 3382 -14752 -22712 -8450 10412 8171 -4800
760 -4800 1600 20756 16792 -13815 -26989 -5227 11446 -3120 -26929 -17677 21265 32015 -1356
773a356l2661J7011M0981o414m4562j1510M6942L6224k1847m5654n037L7706J8834
786B8657l1908l8196J4932N5037J5043m4111k6220L5460L2790k8937m7785R37
798c4301M3958J9854k4355k6323J7708L8245M776m3440l0596J9534L3175p511
810A0724l5174l517L5970K2511j6986k9612l284K0380J0313j8105j7678J0689
822a3769K5251Q195j5140j3454K416O078q16p562o268N061J4304J3239j743j1265
836D527p904P732M575j4229j6492L850K2886J6507r324j2107L367J2915J836k1919
850c780k1068O723K8320O348k4214p640K9060K1468k3445l8054M7L3029J3385
863B0179k2850k5495J2227L9918J1174l7933l5549J5866L7192n61l6212j4684
$$ plain form
773 -1356 -34017 -17006 23975 17561 -27001 -38511 8431 44655 22808 -22846 -27883 9823 28657
786 28657 -3251 -41447 -26515 28522 43565 -546 -26766 8694 41484 12547 -35238 -34301
798 -34301 9657 29511 5156 -21167 -3459 34786 39562 -3878 -34474 -14940 18235 10724
810 10724 -24450 -27967 8003 30514 13528 -16084 -19368 1012 11325 -6780 -24458 -13769
822 -13769 11482 19677 4537 -8917 -6501 -423 -1239 -8801 -15069 -10008 4296 17535 15792 4527
836 4527 -3377 4355 8930 -5299 -21791 -17941 4945 21452 12128 21 3388 16303 18139 -3780
850 -3780 -24848 -18125 10195 16543 -7671 -15311 13749 35217 11772 -26282 -26235 6794 20179
863 20179 -2671 -28166 -15939 23979 35153 -2780 -38329 -22463 14729 14168 -22044 -36728
875c6728L5429L6055q844l6135j4723K3052K1902j7217l5264K196L8941K2571
887C1235j9562k1363Q992J8835k829k2501j6049J2450K1839M129j7795n215J8763
900A0929J6167j6377k6251j111K2161Q856j4603r927R229J7556M0j7826j5135
913a6292M732J3674Oj3404k284J8316J4323o899j6960p239Q173N604r855j3044
927b1149P076J9975J1256r463j1303L054J0123m019j6254n609Q015J3906M905
940A0513n545o146L610R591J897j7672j3267J0990J8638J208j5427l088J3187
953H489R865j0054k2869n342J5281J7219l430k1168l741L0047J9623k1276l9341
966b6697OL0923J3737k3258k1172J4002L2090J0215k4748k6958Q860K5077j551
$$ plain form
875 -36728 -1299 34756 25912 -10223 -24946 -1894 20008 2791 -32473 -30277 8664 31235
887 31235 11673 -9690 -698 18137 15308 -7193 -23242 -10792 11047 15176 -2619 -7834 10929
900 10929 27096 10719 -15532 -16643 5518 14374 -229 -10156 -927 16629 16669 -1157 -16292
913 -16292 -11560 2114 2120 -11284 -13568 4748 19071 12172 -4788 -12027 -3854 1750 -8105 -21149
927 -21149 -14073 5902 17158 7695 -3608 -554 9569 5550 -10704 -16313 -8298 5608 10513
940 10513 4968 -1178 2432 12023 13920 -3752 -17019 -6029 12609 13817 -1610 -4698 8489
953 8489 18354 8300 -14569 -19911 -4630 12589 9159 -12009 -15750 14297 33920 12644 -26697
966 -26697 -26691 4232 17969 -5289 -26461 -12459 19631 29846 5098 -21860 -13000 12077 10526
979A0526k8640j0358K1088K5170p134j9552j653J4287O941j4986j2679P295J8632
992H937R17j3865n72J8036N975j9116j6688Q768J7399J150j2531n592J1993J5343
1006B0154j848k0599j3910R743J1945n067j6537J200J8663J2231q171j6122r91
1019i309R949N684q468j3428K40J6774J4188m468j6771k638J3214R499p969k0036
1033a3539j366J7240J5835q283k0863n015K0309J2466j9545k0777O739K5480Q051
1046A6732j5161j5589P817J9150L481j8278j8200J1397K4538J917k2669o140K1206
1059A0201J5398j3821k0673j648J5736M796r047j3116K818J3552M688r529j1344
1072a1989L693Q609L40q209l669R611O156m556n312K769N367r19q286k549J0676
$$ plain form
979 10526 -18114 -28472 -7384 17786 10652 -8900 -10553 3734 10675 -4311 -16990 -9695 8937
992 8937 9854 -4011 -4583 13453 19428 312 -16376 -7608 9791 10941 -1590 -7182 4811 20154
1006 20154 18306 -2293 -16203 -6460 5485 418 -16119 -14919 3744 15975 7804 -8318 -9309
1019 -9309 640 6324 -2144 -15572 -15332 1442 15630 11162 -5609 -8247 4967 14466 6497 -13539
1033 -13539 -14905 2335 18170 9887 -10976 -15991 4318 16784 -2761 -23538 -16799 8681 16732
1046 16732 1571 -14018 -6201 12949 16430 -1848 -20048 -8651 15887 17804 -4865 -11005 10201
1059 10201 25599 11778 -8895 -10543 5193 9989 942 -12174 -9356 4196 8884 -645 -11989
1072 -11989 -8296 313 653 -7556 -11225 -1614 4542 -14 -5326 -2557 2810 1891 -6395 -8944 1732
1087A732R744m866q971J395J1174P92j0922j0584q00J3784P466n521j3369j141
1101a0087J8735J1405j3542k1158J380K0371P340j5248j4253O990J9165O616j4072
1114C642j7346K009J9541Q091j7069j8802J0154K5203R50k2822j2824J1843J8974
1127A1544j098j9283p576J2366J8727j303j6879q839J1440J2363m733j6105l574
1140a2950J2462Q393m562p577k70Q748K450o602p800L698M696k015m102M077N574
1155D220Q43m910k331M194L836J551o666j474L500N334p90j0563k806P877P366
1170I181q361r828J325J1276K702r512r411K496J2412L384j2546r480P983J4918
1184F539K247j3979q067J1168J5635Q79j6861r150R936J8685j697k1237q639J5385
$$ plain form
1087 1732 11476 6610 -2361 -966 10208 11000 78 -10506 -11306 2478 9944 4423 -8946 -10087
1101 -10087 8648 20053 6511 -14647 -13267 7104 14444 -804 -15057 -8067 11098 17714 3642
1114 3642 -13704 -11695 7846 15937 -1132 -19934 -9780 15423 16373 -6449 -19273 -7430 11544
1127 11544 10446 -8837 -16413 -4047 14680 13377 -3502 -12341 -901 11462 6729 -9376 -12950
1140 -12950 -488 7905 3343 -4234 -4504 4244 6694 92 -7708 -4010 686 -1329 -5431 -1354 4220
1155 4220 5063 153 -2178 2016 5852 7403 737 -737 2763 8097 7307 -3256 -6062 1815 9181
1170 9181 820 -9008 -7683 3593 6295 -3217 -12628 -10132 2280 5664 -6882 -16362 -8379 6539
1184 6539 8786 -5193 -13260 -2092 13543 14422 -2439 -11589 -1653 17032 15335 -5902 -14541 844
1198H44J6348n952j9147n126J2503J2099l430j5440q490J1252J3417j263j8855
1211a1240m018J5353J3977q546j4231J207J3635P734r362j1154J655R280M448
1224H738o715r580J473J1097M376r858q761N448Q364j425q890k573N719L104k483
1239a966l936L343O583r41p106K19P046M424n936q440K467J0407L961q854r715
1254h444K581J3789N876j3032j4965R619J9144m16j9760q962J3695J3704n637
1267G192j4776n874J2356J2695l316j4742m826J2182J1876p309j7007k97J3135
1280A289P515q957j1233J819J3360M768o579j0949R72J2664N549q237r758L9J2253
$$ plain form
1198 844 17192 11240 -7907 -13033 -530 11569 8139 -7301 -15791 -4539 8878 7615 -11240
1211 -11240 -15258 95 14072 5526 -8705 -7498 6137 13871 4509 -6645 -4990 4290 8738
1224 8738 2023 -7557 -6084 5013 9389 -469 -9230 -3782 4582 3157 -5733 -8306 -2587 517 -1966
1239 -1966 -5902 -2559 4024 3083 -4023 -3804 3242 7666 1730 -6710 -4243 6164 10125 1271 -8444
1254 -8444 -5863 7926 13802 770 -14195 -4576 14568 14152 -5608 -14570 -875 12829 7192
1267 7192 -7584 -13458 -1102 11593 8277 -6465 -11291 891 12767 5458 -11549 -11846 1289
1280 1289 8804 -153 -11386 -9567 3793 8561 1982 -8967 -7995 4669 10218 1981 -7777 -7738 4515
$$ [...]
8191d03
##END NTUPLES=NMR FID
##END=
