##TITLE=1H_AT-38a
 CD3CN+CCl4, 108 sc, 
 6.3.2019
##JCAMPDX= 6.0         $$ Bruker NMR JCAMP-DX V2.0
##DATA TYPE= NMR FID
##DATA CLASS= NTUPLES
##ORIGIN= UXNMR, Bruker Analytische Messtechnik GmbH
##OWNER= root
$$ XWIN-NMR		Version 3.5
$$ Wed Mar  6 14:05:52 2019 Russian Standard Time (UT+4h)  she@DPX200
##.OBSERVE FREQUENCY= 200.1315
##.OBSERVE NUCLEUS= ^1H
##.DELAY= (6, 6)
##.ACQUISITION MODE= SIMULTANEOUS
##.ACQUISITION SCHEME= undefined
##.AVERAGES= 108
##.DIGITISER RES= 18
##SPECTROMETER/DATA SYSTEM= spect
##.PULSE SEQUENCE= zg30
##.SOLVENT NAME= THF
##.SHIFT REFERENCE= (INTERNAL, THF, 0, 15.7039)
##AUDIT TRAIL= $$ (NUMBER, WHEN, WHO, WHERE, WHAT)
$$ ##TITLE= Audit trail, XWIN-NMR		Version 3.5
$$ ##JCAMPDX= 5.01
$$ ##ORIGIN= Bruker BioSpin GmbH
$$ ##OWNER= she
$$ F:/spectra/data/she/nmr/H-F/1/audita.txt
$$ ##AUDIT TRAIL=  $$ (NUMBER, WHEN, WHO, WHERE, WHAT)
(   1,<2019-03-06 14:03:05.95 +0400>,<she>,<DPX200>,
      <continue with go, POWCHK disabled, PULCHK disabled
       configuration hash MD5:
       00 E9 B6 7A A2 85 ED C7 34 08 36 98 17 FE 4E 26
       data hash MD5: 16K
       85 88 DA FA A5 C7 39 81 74 EF 8A 96 D5 AB 14 D6>)
$$ ##END=
$$ 
$$ hash MD5
$$ A0 E4 53 C6 65 4E 27 9F 98 CD 6B 3F F6 71 3A 40
##$RELAX= 
##$RELAX= 
##$RELAX= 
##$RELAX= 
##$RELAX= 
##$RELAX= 
$$ Bruker specific parameters
$$ --------------------------
##$DU= <F:/spectra>
##$EXPNO= 1
##$NAME= <H-F>
##$PROCNO= 1
##$TYPE= <nmr>
##$USER= <she>
##$AMP= (0..31)
100 100 100 100 100 100 100 100 100 100 100 100 100 100 100 100 100 100 
100 100 100 100 100 100 100 100 100 100 100 100 100 100 
##$AQSEQ= 0
##$AQ_mod= 1
##$AUNM= <au_zg>
##$AUTOPOS= <>
##$BF1= 200.13
##$BF2= 200.13
##$BF3= 200.13
##$BF4= 200.13
##$BF5= 200.13
##$BF6= 200.13
##$BF7= 200.13
##$BF8= 200.13
##$BYTORDA= 1
##$CFDGTYP= 0
##$CFRGTYP= 5
##$CHEMSTR= <none>
##$CNST= (0..31)
1 1 145 1 1 1 1 1 1 1 1 1 1 1 1 1 1 1 1 1 1 1 1 1 1 1 1 1 1 1 1 1 
##$CPDPRG= <>
##$CPDPRG1= <>
##$CPDPRG2= <>
##$CPDPRG3= <>
##$CPDPRG4= <mlev>
##$CPDPRG5= <mlev>
##$CPDPRG6= <mlev>
##$CPDPRG7= <mlev>
##$CPDPRG8= <mlev>
##$CPDPRGB= <>
##$CPDPRGT= <>
##$D= (0..31)
0 1.2 0 0 0 0 0 0 0 0 0 0.03 0 0 0 0 0 0 0 0 0 0 0 0 0 0 0 0 0 0 0 0 
##$DATE= 1551866224
##$DBL= (0..7)
120 120 120 120 120 120 120 120 
##$DBP= (0..7)
150 150 150 150 150 150 150 150 
##$DBP07= 0
##$DBPNAM0= <>
##$DBPNAM1= <>
##$DBPNAM2= <>
##$DBPNAM3= <>
##$DBPNAM4= <>
##$DBPNAM5= <>
##$DBPNAM6= <>
##$DBPNAM7= <>
##$DBPOAL= (0..7)
0.5 0.5 0.5 0.5 0.5 0.5 0.5 0.5 
##$DBPOFFS= (0..7)
0 0 0 0 0 0 0 0 
##$DE= 6
##$DECBNUC= <off>
##$DECIM= 24
##$DECNUC= <off>
##$DECSTAT= 4
##$DIGMOD= 1
##$DIGTYP= 9
##$DL= (0..7)
0 120 120 120 120 120 120 120 
##$DP= (0..7)
150 150 150 150 150 150 150 150 
##$DP07= 0
##$DPNAME0= <>
##$DPNAME1= <>
##$DPNAME2= <>
##$DPNAME3= <>
##$DPNAME4= <>
##$DPNAME5= <>
##$DPNAME6= <>
##$DPNAME7= <>
##$DPOAL= (0..7)
0.5 0.5 0.5 0.5 0.5 0.5 0.5 0.5 
##$DPOFFS= (0..7)
0 0 0 0 0 0 0 0 
##$DQDMODE= 0
##$DR= 18
##$DS= 0
##$DSLIST= <SSSSSSSSSSSSSSS>
##$DSPFIRM= 0
$$ [...]
##$SUBNAM2= <"">
##$SUBNAM3= <"">
##$SUBNAM4= <"">
##$SUBNAM5= <"">
##$SUBNAM6= <"">
##$SUBNAM7= <"">
##$SUBNAM8= <"">
##$SUBNAM9= <"">
##$SW= 24.9337058887773
##$SWIBOX= (0..15)
0 0 2 0 0 0 0 0 0 0 0 0 0 0 0 0 
##$SW_h= 4990.01996007984
##$TD= 16384
##$TD0= 1
##$TE= 0
##$TE2= 300
##$TE3= 300
##$TEG= 300
##$TL= (0..7)
0 120 120 120 120 120 120 120 
##$TP= (0..7)
150 150 150 150 150 150 150 150 
##$TP07= 0
##$TPNAME0= <>
##$TPNAME1= <>
##$TPNAME2= <>
##$TPNAME3= <>
##$TPNAME4= <>
##$TPNAME5= <>
##$TPNAME6= <>
##$TPNAME7= <>
##$TPOAL= (0..7)
0.5 0.5 0.5 0.5 0.5 0.5 0.5 0.5 
##$TPOFFS= (0..7)
0 0 0 0 0 0 0 0 
##$TUNHIN= 0
##$TUNHOUT= 0
##$TUNXOUT= 0
##$USERA1= <user>
##$USERA2= <user>
##$USERA3= <user>
##$USERA4= <user>
##$USERA5= <user>
##$V9= 5
##$VALIST= <valist>
##$VCLIST= <CCCCCCCCCCCCCCC>
##$VD= 0
##$VDLIST= <DDDDDDDDDDDDDDD>
##$VPLIST= <PPPPPPPPPPPPPPP>
##$VTLIST= <TTTTTTTTTTTTTTT>
##$WBST= 1024
##$WBSW= 4
##$XGAIN= (0..3)
0 0 0 0 
##$XL= 0
##$YL= 0
##$YMAX_a= 1339181
##$YMIN_a= -1532638
##$ZGOPTNS= <>
##$ZL1= 120
##$ZL2= 120
##$ZL3= 120
##$ZL4= 120
##$ABSF1= 10
##$ABSF2= 0
##$ABSG= 5
##$ABSL= 3
##$ALPHA= 0
##$AQORDER= 0
##$ASSFAC= 0
##$ASSFACI= 0
##$ASSFACX= 0
##$ASSWID= 0
##$AUNMP= <proc_1d>
##$AZFE= 0.1
##$AZFW= 0.1
##$BCFW= 1
##$BC_mod= 2
##$BYTORDP= 1
##$COROFFS= 0
##$CY= 11.3945322036743
##$DATMOD= 1
##$DC= 2
##$DFILT= <>
##$DTYPP= 0
##$F1P= 18.9103706918063
##$F2P= -1.10871071338519
##$FCOR= 0.5
##$FTSIZE= 0
##$FT_mod= 4
##$GAMMA= 1
##$GB= 0.15
##$INTBC= 1
##$INTSCL= 1
##$ISEN= 128
##$LB= 0.24
##$LEV0= 0
##$LPBIN= 0
##$MAXI= 10000
##$MC2= 0
##$MEAN= 0
##$ME_mod= 0
##$MI= 1.114404
##$NCOEF= 0
##$NC_proc= 0
##$NLEV= 6
##$NOISF1= 3.799351
##$NOISF2= 2.8
##$NSP= 1
##$NTH_PI= 0
##$NZP= 0
##$OFFSET= 15.70392
##$PC= 1
##$PHC0= -8853.209
##$PHC1= 1.20014
##$PH_mod= 1
##$PKNL= yes
##$PPARMOD= 0
##$PSCAL= 0
##$PSIGN= 0
##$REVERSE= no
##$SF= 200.130013532006
##$SI= 16384
##$SIGF1= 3
##$SIGF2= 2
##$SINO= 400
##$SIOLD= 16384
##$SREGLST= <1H.CDCl3>
##$SSB= 0
##$STSI= 0
##$STSR= 0
##$SW_p= 3612.71676300578
##$SYMM= 0
##$S_DEV= 0
##$TDeff= 0
##$TDoff= 0
##$TI= <>
##$TILT= no
##$TM1= 0
##$TM2= 0
##$TOPLEV= 0
##$USERP1= <user>
##$USERP2= <user>
##$USERP3= <user>
##$USERP4= <user>
##$USERP5= <user>
##$WDW= 1
##$XDIM= 8192
##$YMAX_p= 0
##$YMIN_p= 0
$$ End of Bruker specific parameters
$$ ---------------------------------
##NTUPLES= NMR FID
##VAR_NAME=  TIME,          FID/REAL,        FID/IMAG
##SYMBOL=    X,             R,               I
##VAR_TYPE=  INDEPENDENT,   DEPENDENT,       DEPENDENT
##VAR_FORM=  AFFN,          ASDF,            ASDF
##VAR_DIM=   8192,          8192,            8192
##UNITS=     SECONDS,       ARBITRARY UNITS, ARBITRARY UNITS
##FACTOR=    0.0002004,     1,               1
##FIRST=     0,             0,               0
##LAST=      1.6414764,     0,               0
##MIN=       0,             -1532638,        0
##MAX=       1.6414764,     1339181,         0
$$ Real data points
##PAGE= N=1
##DATA TABLE= (X++(R..R)), XYDATA
0@%%%%%%%%Q2j86K12k16K16k81L70m13N14o21P29q86J001j144J352j572J830k120
26a133K418k741L114l533L986m484N035n643O308p035P834q707R670j0721J1876
41F244j3162J4574j6127J7862j9804K1973k4434K7252l0499L4284l8772M4210
53B3601n0951N9557p1006Q7077j11457J53326k44897Q24387p28181j084214J752166
64F09408P29773j321666j073973J166035R11846q64047j051819O48550R19770
73F73877l03511q19474J83248O46884K2208n41890j33407L10800K16386j75723
83G9398k30747j6166K00636P9541j70229j67043J57767K33174m9181k26309l264
94a12423J86736P3128j20566r2533O4444J27758q497j71502j02922J43632J63293
$$ y = [0, 0, 0, 0, 0, 0, 0, 0, 0, 82, -104, 108, -108, 108, -173, 197, -216, 298, -323, 406, -480, 521, -623, 729, -843, 987, -1133, 1285, -1456, 1658, -1875, 2111, -2373, 2662, -2981, 3327, -3708, 4126, -4581, 5089, -5632, 6244, -6918, 7656, -8471, 9391, -10413, 11560, -12874, 14378, -16121, 18163, -20609, 23601, -27350, 32207, -38799, 48278, -63179, 90147, -154750, 669637, -58544, -1142758, 609408, 1339181, 17515, -1056458, 109577, 1021423, 157376, -894443, -245893, 673877, 370366, -449108, -265860, 381024, 403232, -138658, -272065, 38735, 255121, 79398, -151349, -167515, 33121, 112662, -57567, -224610, -66843, 166331, 117150, -109159, -112423, 74313, 147441, 26875, -65658, -1214, 126544, 118047, -53455, -156377, -12745, 150548]
105A50548j06815j92093R1747K24312o8491k53570M6401K84533N979k68812k7022
116a13283K25309j9689k44612J9912K24771m4878j99747Q2525J68308j37447j54894
127a93725K04126J86068k08755j73680K27305J69256k66191k02604K70603K44884
137B57287k49317k75363K16618K87586j87775k95801J70727L34127j01257l24820
147a67988M2464K89491l780k71231m3621K49956R8487k25311j62989J63493J81443
158A50414j18372j86644R9501J96925o6910k05945J0698J77878K9587j31139n0037
169i4044R5755O2828p0279r2912K9936J16355L8578r8897p6790P6886J06817o1724
181C2509j43399M3195J99234j288k38818n5520K52176R4189k67200j20855K91391
$$ y = [150548, 43733, -148360, -56613, 167699, 99208, -154362, -107961, 176572, 182551, -86261, -113283, 112026, 92337, -152275, -132363, 92408, 47530, -152217, -69692, 98616, -38831, -193725, 10401, 196469, -12286, -185966, 41339, 210595, -55596, -258200, 12403, 257287, 7970, -267393, -50775, 236811, 49036, -246765, -76038, 258089, 156832, -167988, -125524, 163967, 160187, -111044, -154665, 95291, 193778, -31533, -194522, -31029, 150414, 32042, -154602, -55101, 141824, 74914, -131031, -120333, 57545, 87132, -44007, -94044, 1711, 64539, -5740, -98652, -68716, 47639, 86217, -12680, -89470, -12584, 94233, 32509, -110890, -67695, 131539, 130251, -108567, -164087, 88089, 182278, -84922, -205777, 85614]
192H5614J68018k92804k20464K63213K53301k27425k72752J94237K96068j63025
202H3981l35813J02246L44614l8345l29115r7L16773L8228l04244q2021K74442
213G0649J28398k27579j54738J84366J65958j58579j87766J33945K09432r0040
223G4046k03738P1149J91010o7548j82075O8951J77879o0302j67673M5264J37677
234H4640n4648j28828N7785J27493m9749j23923L9774J07816m1607j00318M9961
245c1604R7615m9321q8557L9161N4274m8291k8128O0400J1129o6788R364O4616
257B3870l0846p2764N6026J00188n0974j17821M8542J28524m5573j51093L7902
268g4019J77588j5576j96639j2511K00641L3682j96805m9601K02792Q2315j90177
$$ y = [85614, 253632, -39172, -259636, 3577, 256878, 29453, -243299, -49062, 247006, 83981, -251832, -149586, 195028, 156683, -172432, -172529, 144244, 182472, -121772, -203793, 70649, 199047, -28532, -183270, 1096, 167054, 8475, -179291, -45346, 164086, 74046, -129692, -58543, 132467, 64919, -117156, -48205, 129674, 69372, -98301, -53037, 84640, 29992, -98836, -41051, 86442, 36693, -87230, -47456, 60360, 18753, -81565, -31604, 66011, 16690, -71867, -32706, 21568, -26723, -54851, 5549, 16678, -50110, -40746, 23870, -6976, -79740, -23714, 76474, 25500, -92321, -43779, 84745, 39172, -111921, -74019, 103569, 87993, -108646, -121157, 79484, 113166, -83639, -133240, 69552, 151867, -38310]
279c8310j14911J63622J43185j39356j63587J16497J85333r3691k11729O3318
289h9629K24854l2099k21579J4048K23426O321k19641l3850K08448O0871j88422
300d7252q1100J65733R3643j52699j09007J34656J25714j09664j24321Q7485J18286
311A01474o7368j10525M3956J01212j8116q5740j1352O3638K8041m7793m1999
322d4572L4020N5392j5573o0892r840N8887L3472m9761n1486M0351P0586k8238
334C2346r4785J2400J12515O940j22356k2338J28271L9884j28957o1191J27774
345C0503Q4432j13608j08531R8955J26429q5860j43689P0413J61354n3641j70112
356a03355L5563J72070j8455j70127L680J64148J4530j54623l3582J41851M6530
$$ y = [-38310, -153221, 10401, 153586, 14230, -149357, -32860, 152473, 58782, -152947, -89629, 135225, 103126, -118453, -104405, 119021, 125342, -94299, -128149, 80299, 141170, -47252, -128352, 37381, 131024, -21675, -130682, 3974, 129688, 20024, -104297, -16812, 101474, 34106, -76419, -32463, 68749, 50633, -35107, -46459, 17179, 45220, -2573, -44572, -10552, 44840, 29267, -31625, -41465, 17422, 50894, 1133, -50353, -10002, 60584, 32346, -62439, -50039, 62476, 69416, -52940, -75278, 52993, 92877, -36080, -97271, 30503, 114935, 1327, -107204, -8249, 118180, 32320, -111369, -40956, 120398, 66757, -103355, -67792, 104278, 85823, -84304, -80624, 83524, 98054, -56569, -90151, 51700, 98230]
367I8230j28742n7600J18761O5684j08305p3593R9114P3607q8659p2858P9734
378E373O7599o9229o5641N6197O2060m5210n5817L1204N2371k1811n0260J1914
390b1250M6523q814l8853M244K8924p552j7141J1034J440j3773J3864K3135k7568
403e787l2132L4825M3684m1894n5210M0871O9190l6669q7818K7681J06205j5031
415D7915j20403K208J37614J3587j46164k5634J49716M1254j49508n5647J40588
426C5526P0089j32387q4828J19484J01147j08372j11022R5886J24198q4140j29831
437a04250P3954J34518o3089j38324M9490J33901l7179j34780K1158J30657l868
448F2188j24142j1346J24732K7491j15692m2401J10519N5142j03702o3482R0726
$$ y = [98230, -30512, -88112, 30649, 96333, -11972, -85565, 13549, 87156, -1503, -74361, 5373, 72972, 3743, -61898, -5701, 56359, 11149, -44668, -13464, 38907, 17096, -33164, -21250, 25273, 16459, -22394, -18150, 10774, 3222, -13919, -2885, -1445, -15218, -1354, 21781, -5787, -37919, -3094, 40590, -1304, -56514, -15643, 53547, 16878, -70940, -43259, 62946, 47915, -72488, -70280, 67334, 80921, -65243, -90877, 58839, 100093, -49415, -105062, 35526, 105615, -26772, -111600, 7884, 109031, 659, -110363, -14477, 109721, 25581, -104250, -30296, 104222, 41133, -97191, -47701, 86200, 49021, -85759, -64601, 66056, 62188, -61954, -73300, 51432, 78923, -36769, -79170, 31349, 86491, -17211, -80693, 10033]
459A0033O3190p5285o8651N7258O9091l9715o5463K3672O2688p487n3929k520
471b7118M7049J0451l8766j5893K3930J2534j2403j3835j264O158J7663k422k8824
484b2740J827M1496P588m6509j1756N0954J9416n1996k8224M8019L7795m8551
496b681m8647M1588O3675l8372o8655L8268P8388l1700q2042K7587Q4492k0059
508D1842q3475J0930P7945m834p9331q129P3814J7322o7810k3760O3492L0582
520D8588o1608k9691N5157L1512m9843k8619L8489K1261l2667k1304K3373J7331
532A1979j3696j3439P009R079n28m500L464K343k009N401n75j3657n451K4991
546A0411Q224l2787j2831M0136J2955m7306j6599N4614K5666n1951l3951M8551
$$ y = [10033, 73223, -2062, -70713, -13455, 55636, 15921, -49542, -25870, 36818, 29331, -24598, -27118, 19931, 30382, -8384, -24277, -347, 12187, -216, -14051, -15315, -9157, 8506, 6084, -22740, -20913, 20583, 28171, -18338, -30094, 20860, 40276, -11720, -39944, 8075, 45870, -2681, -51328, -9740, 53935, 15563, -53092, -14824, 63564, 31864, -50178, -22591, 61901, 41842, -41633, -30703, 47242, 42408, -36923, -45052, 28762, 46084, -21726, -45486, 18006, 48588, -13020, -42711, 12446, 43958, -5885, -34504, 3985, 25246, -7421, -28725, -5352, 11979, -1717, -15156, -8147, 932, 404, -4096, -632, 1711, -298, 5103, 4528, -9129, -14580, 10411, 18635, -14152, -26983, 13153, 26108, -21198, -37797, 16817, 42483, -9468, -43419, 5132]
558E132M1673m4121n2710L9773O6179l1400p9314K0204Q4827j3354q9157P735
570d4533R6248M010r6799j5134R2396K7170q5728l5979Q7104M6159q6744o0787
582g2617Q2848O8273p8293p1158Q0467P3998q1229q0840P6135Q3951o8047q3578
594g0090O4285Q3387o1440r0491M9990R3070l9246r3607L3812R0239l4503r3337
606f7931L0166Q9557k2657p8438J9554O6714k6070n8852K2011N5282j4588m4523
618b9775J1931L5056j8482l3369K1388L6593j8581l3657J9277K9856k6801k9872
630c6436L3122L5637k8540l1161K4815K4484k3164k6456K3852L1661j3708l5623
642b1517M270L1749m434l4484Q371M6465j266m9457q089M7020R764m4345q736
$$ y = [5132, 46805, 2684, -50026, -10253, 55926, 24526, -54788, -34584, 50243, 36889, -52268, -44533, 51715, 55725, -41074, -56208, 36188, 63358, -22370, -58349, 28755, 74914, -11830, -72617, 10231, 78504, 211, -70947, 9520, 83518, 2289, -78551, -2416, 81535, 13488, -70090, -5805, 77582, 16142, -74349, -24359, 68711, 29465, -64142, -30330, 59909, 25406, -67931, -37765, 51792, 29135, -49303, -29749, 36965, 10895, -47957, -25946, 29336, 14748, -29775, -17844, 17212, -1270, -34639, -13251, 23342, 4761, -28896, -9619, 20237, -6564, -36436, -3314, 32323, 3783, -27378, -2563, 21921, -1243, -27699, -3847, 27814, 14106, -21517, -17247, 14502, 10068, -24416, -16045, 30420, 29154, -20303, -28392, 18628, 28392, -15953, -24689]
655b4689N1580J5760n3883l1680M7174L8647m3209m0786M9563M8891n1593o2130
667e6355M7938O6995l9711n9488L9709N8661m4823o5792L2296O2212k0506n4283
679c3147J8841M7295k0700n0923J5530N0632n690m0775Q824K7222j6480k8231
691b7602J2814K2562o368o731L114r939o491J2811Q913j4521J471K9204k579m1044
705b4386q332M1575J5867l9784j5137M7205J9221n8774l3823N7692M6196m9424
717a904l9680N2082L6138n5289m5320N1396M8393l2907m2878K5328L2368k6117
729A610l8566K0881M4650n015l6965o01L1335p054l1062O502L8865K887l0315
742b848j2176J7814N655j7475o029K6002J9104k5341k8130J5332K6587j7512j7213
$$ y = [-24689, 26891, 42651, -11232, -42912, 4262, 42909, -300, -41086, 8477, 57368, 5775, -56355, -8417, 58578, 18867, -40621, -912, 57749, 12926, -52866, -20570, 41642, 21136, -33147, -14306, 32989, 12289, -38634, -23104, 27528, 21838, -18937, -10113, 17109, 629, -27602, -14788, 7774, 1406, -5325, -2211, -12150, -18641, -5830, 3083, -11438, -9967, 19237, 16658, -24386, -32718, 8857, 24724, -15060, -30197, 17008, 36229, -22545, -56368, 1324, 47520, -1904, -41584, 10498, 46636, -8653, -53973, -2577, 45816, 12909, -29969, -4641, 27727, 1610, -36956, -16075, 28575, 23560, -13405, -14006, 17329, 10275, -20787, -14285, 24580, 27467, -2848, -15024, 2790, 8445, -9030, -15059, 10943, 30047, 4706, -23424, -8092, 18495, 983, -16230]
755a6230K6892K4696l2233k9944K2569K1189k4515j2001L4155J7382l8494k7071
767c3605L2049K6247l0142k3228M3594L2729n4752m7736M8298N1094m7121m4688
779d7261N5218N0298o1970o2948N2302O7934m0832n9376M1696O0187m3402p3365
791f1519L4240P6730k2749o7303K6617O4215l2903p1132K7524P1411j6623n5779
803b7271J6295M5434k2503m9602J6099N2596j879m0701r93K9245m759l4248M649
816a7638L5558P442k5575p213R878l684r598P008J1151K264k161q108j0568m34
830a1678J0599J693m67Q286K78j5086q292P849M429l790Q754J0472j0777j8926
844a6656N76J4072J369j0982J1083J7428j1325l0147N835K7631o673j9087J9810
$$ y = [-16230, 10662, 35358, 3125, -26819, -4250, 16939, -7576, -19577, 14578, 31960, -6534, -33605, -1556, 24691, -5451, -28679, 14915, 47644, -7108, -54844, -6546, 44548, -2573, -47261, 7957, 58255, -3715, -66663, -14361, 53573, 12741, -46635, -4939, 55248, 11846, -61519, -27279, 49451, 26702, -40601, -13984, 50231, 17328, -53804, -26280, 45131, 28508, -27271, -10976, 34458, 11955, -37647, -21548, 31048, 29169, -11532, -12525, 16720, 11961, -22287, -17638, 17920, 25362, -213, -7426, 2452, -1232, -10830, -3822, 7329, 9593, 7432, -676, -11244, -11678, -1079, 614, 147, 8433, 8711, -6375, -14667, -6818, -2389, -6179, 2575, 13047, 2270, -16656, -16080, -2008, -639, -11621, -538, 16890, 5565, -24582, -18747, 8884, 2211, -16876, 2934]
857B934K3037k9330l0950K6628K7311k4883j4887L5234J4505m1312k3164L5775
869H98K3313k9503j2629L4343J3403m0080k2785L5040K2309k8057p649L0825J771
882B1199l9609m042L4535J115k4330J2807K3515k0350k8852J5273K6620j3279
894D602j5352J9353J4761k3958k4581J7823K5366j3810j6568J8138J6425k8348
906f149k2504K3885K2441j6739j2472J9616R189k6307j6833K0087K2085p609k0107
919a1417N197J9339p540k9355P38L9182J0448l4559j4709L2020J0378l5263j4941
932c0482L9905K6985l2469l2830K2781K9986k3735l2937L0805M2467k7753m6460
944c3737K1567L9643k3327l3490K8284L8249k8447l7717J8286L3882j6114l0805
$$ y = [2934, 25971, -3359, -34309, -7681, 19630, -5253, -20140, 15094, 29599, -11713, -34877, 898, 24211, -5292, -17921, 16422, 29825, -10255, -33040, 2000, 24309, -3748, -11397, 19428, 21199, -18410, -22452, 12083, 13198, -11132, 1675, 25190, 4840, -24012, -8739, 17881, 4602, -10750, 8603, 23364, -594, -25175, -7352, 18014, 4204, -12364, 5774, 22199, -6149, -28653, -4768, 17673, 934, -11538, 8078, 17267, -9040, -25873, -5786, 16299, 8690, -11417, -6220, 13119, 5579, -23776, -23038, 16144, 26592, -7967, -22676, 9344, 19722, -15541, -30482, 9423, 36408, 3939, -28891, -6110, 23876, 141, -32796, -1991, 40476, 12723, -33737, -12170, 27473, 4146, -29344, -1060, 37189, 8742, -28975, -10689, 23193, 7079, -23726]
956b3726J9355L6029j7367l9886Q839L6905n606l2301J0703L4122r033l7757K778
969a6945L0809k12k1939N001J9209m708k2570o65J9583L975j3731j954J7675l593
983I935k4521J91K6016J452k2850L666K3665j0323k9514O448L0985k521k3357
996a0728J496K2307l520k6782j125K7660R613k6616p126K4986J907k8012j878
1009a7818K8988O629k3741o675K0060O52j7280m233J8925J0388j2769j4751P398
1022d227J3077p102j3136R279J8030p659j5247O99J1662n69p701J291Q622K331
1036I350o591r301K861J1025j26q714L802O881m765q828K735N028J200J406l384
1051B579j624J480n6p526K93J2098M774j4138n082J2570M401j4939n714J7182
$$ y = [-23726, -4371, 31658, 14291, -25595, -16756, 20149, 14543, -17758, -7055, 27067, 18034, -19723, -16945, 13864, 13652, -8287, -3286, 15923, 11215, -11355, -12020, 7563, 11538, -2193, -4147, 13528, 9935, -14586, -14395, 11621, 13073, -9777, -6111, 17554, 7231, -22283, -15835, 15150, 12629, -10728, -9232, 13075, 9555, -17227, -18352, 9308, 18921, -7695, -14821, 10165, 12072, -15940, -17818, 11170, 17799, -5942, -12617, 7443, 8095, -9185, -13418, 5507, 15895, 3126, -11625, -4227, 8850, 1748, -11388, -2109, 15921, 8262, -6985, -6286, 5376, 4807, -2894, -1603, 7019, 9350, 2759, -6542, -3681, 7344, 7218, -1496, 2306, 9187, 4422, -4406, -1671, 3357, 4557, 5963, 2579, 955, 2435, 2379, -5147, -4854, 7244, 12018, -2120, -7202, 5368, 9769, -5170, -10884, 6298]
1065F298J1701j7366j8328J4397K0102j3210k5144J7436K9642j6747l4701J4939
1077a0981L3022j1330l2550J1432L2409r426l1434L908K8208J58k7428L54K9414
1090A5756L01k9796m902L0857L994k8602j053K7095P72k8514k841K7113M653k5163
1104a0330p678K2995Q654k2624j3894K2227J8046j9662j9461K0178J8227k0873
1116d195j9798K0186J7482j7791j6012J7084J1934j6816j2803J7304J5057j7543
1128e911j6330J9034J8360k1707k0799K4638K4303k8041k6869K9509K7865l0312
1140f260k7991K8877L1519k5129l2290K1209L4025j6561l6953J5286L7581j1321
1152A1992l8949R327L9155p851l9128P373L9372o675l4831L776L3379Q25l2289
$$ y = [6298, 17999, 633, -17695, -3298, 16804, 3594, -21550, -4114, 25528, 8781, -25920, -10981, 22041, 10711, -21839, -10407, 22002, 12576, -18858, -14950, 13258, 13416, -14012, -13658, 15756, 16057, -13739, -18641, 12216, 16210, -12392, -13445, 13650, 14422, -14092, -16933, 10180, 14833, -10330, -18008, 4987, 13641, -8983, -22877, -650, 17396, -2266, -21727, -1549, 16678, -4195, -23993, -3807, 13675, -4116, -20128, -3044, 8890, -7926, -20729, -3425, 11632, -5911, -22241, -3207, 15153, -6554, -27353, -2715, 21588, -6453, -33322, -3813, 24052, -6260, -34251, -5374, 26145, 1016, -31274, -10065, 23960, 7399, -29554, -14268, 23313, 11992, -26957, -17630, 21525, 13674, -25454, -18081, 21291, 14616, -20215, -16439, 16940, 17765, -14524]
1165a4524l014L2161O568k9224j1664K8654J5402k7820j8570K7445J9830k4408
1177H36j9174K0459J9361j4981j9047J1122J7163m623k0782L233J9402N31j9860
1190f360p99J8433N46j9105O05J6874K56j5734M42J3301k36j0693k117J1038P73
1205G224r117l222Q612L546p992m583R785K578q090j084Q377k414p549M761N845
1220F677o620l497Q046P98r154K43Q242O63p524l131P398L438o904l022O512N709
1236G874q779m461R032J679r806K392R815m267j0329P472R670r857q253J1005
1250C187Q770j0941q227J0668P611j0830q258J0386Q724q260j0635P659J1875
1263A1729j0295j1684J2591J1981j5598j0601J6595R208j9017p462J8748O969
$$ y = [-14524, -17538, 14623, 21191, -8033, -19697, 8957, 24359, -3461, -22031, 5414, 25244, 836, -18338, 2121, 21482, 6501, -12546, -1424, 15739, 11116, -9666, -6433, 12969, 13500, -6360, -7159, 11274, 11820, -7285, -6680, 10194, 10450, -5284, -4842, 8459, 8223, -2470, -4587, 6451, 7224, -1893, -5115, 3497, 7043, -949, -5532, 4253, 6831, -1259, -2343, 6034, 3620, -3929, 832, 6677, 57, -3440, 4606, 5404, -3750, -3507, 4735, 5398, -2126, -5257, 2141, 5579, -1325, -4347, 2165, 7874, -905, -5366, 3666, 5345, -4461, -2069, 7746, 3479, -6850, 622, 10292, 435, -7818, 3187, 11957, 1016, -7211, 3457, 11068, 238, -8020, 2366, 11090, 2830, -7805, -146, 11729, 1434, -10250, 2341, 14322, -1276, -11877, 4718, 13926, -5091, -12553, 6195, 13164]
1275A3164j5786j1857J4347J3268j2034j6074J1013K0031q925k2812N882K1752
1287A1969l109k1632K452K0295J966j9778o433J8271Q278j4404j2305J5050J5313
1300A5933j5841j8554J5151K1839j3961k2829J5966K2217j8372k1519J6186K4037
1312B0253j3011k4260R447K8133j1343l0613J0373L4165q280l4347N943L4452
1324B0912q552l3596Q659L5572q310l1150N634K6609o345k5786R043K3686o651
1337I725k2959M836K1615n788k3917J0018K5281j1479k3327R140K1529j0839j9902
1350a6067J1662J8617r221j6493O394J0678l638q508M541P520j336o697l519O008
1364e9J709l657J343M293j486n857K86K226K471M12j409n51M311k85j0818RJ2986
$$ y = [13164, -2622, -14479, -132, 13136, 1102, -14972, -3959, 16072, 7147, -15665, -9783, 11969, 8860, -12772, -10320, 9975, 11941, -7837, -14270, 4001, 12279, -2125, -14430, 620, 15933, 92, -18462, -3311, 18528, 4567, -18262, -2296, 19921, 1549, -19970, -3784, 20253, 7242, -17018, -7571, 20562, 9219, -21394, -11021, 23144, 14864, -19483, -13540, 20912, 12360, -21236, -12577, 22995, 14685, -16465, -10831, 15778, 9433, -16353, -7310, 16376, 9725, -13234, -8398, 13217, 7429, -16488, -6470, 18811, 7332, -15995, -6855, 14674, 3835, -16067, -4405, 14212, 4991, -11502, -5108, 5570, 1932, -6576, -2035, 5485, 4149, -2548, -6067, -59, 1650, -2007, -664, 3629, 2143, -3714, -3428, -1202, 1269, 1681, 272, -279, 4032, 3747, -7071, -7062, 5924]
1381E924M186j5581j667J5993J95k0812q78K3770K893j9997m476J7886K182j7929
1395h311n254K0248R424j8875q474J5574O329k0154j611K2590J770j7460l558
1408g762J4587m798j0851O129J1688l917o816R98p7m434L798O923l254n053M091
1423A252L979j0585r453J3833J5790j1951j7663J2832J9360j9881k3522K2469
1435c540K7482j8039k6436J6256K2269j9146k3162K0018K7066j5110k4684R159
1447g867K0345r691k1122J2353K5136r491k2663N633J6335o958j6087J2279J7227
1460A5429o198j6356N48R453Q28o410J5Q679N481r751j0227M410J1042p2r550
1475b679N820Q907p408j3033K820J2584J848q643R36J0362n594j6099R94K0299
$$ y = [5924, 10110, -5471, -7138, 8855, 9050, -11762, -12640, 11130, 14023, -5974, -10450, 7436, 9618, -8311, -13565, 6683, 16107, -2768, -11242, 4332, 10661, -9493, -11104, 11486, 13256, -4204, -7762, 6825, 2027, -8824, -2695, 8993, 5076, -1740, -742, -819, -5253, -1455, 5468, 2214, -2839, 1252, 5231, -5354, -14807, -974, 14816, 2865, -14798, -1966, 17394, -2487, -26009, -3540, 23942, 5903, -20533, -4277, 17992, -1154, -24316, -4298, 22768, 7658, -17026, -7867, 12478, 2787, -18335, -5982, 19154, 9663, -13000, -7367, 8968, 2010, -14077, -1798, 15429, 9231, -7125, -6577, 2876, 3704, -2706, -2691, 5988, 11469, 1718, -8509, -4099, 6943, 6871, -2679, 3141, 12048, 4640, -8393, -5573, 7011, 8859, 216, 1152, 11514, 5920, -10179, -9185, 11114]
1489A1114J694j8216K539J9366j0335k5062Q762K9422m931k5197M759K2722r004
1502G633k7913O119L0211L70k6027j940K3765k837k6707K409K9267L553k7571
1515i668n66J9273l999k0831N761K3520j597j9271r82J3458l241j4517L171J9513
1529A0024L281j7287p872J1908L454j2548J366J4337M450j3828p180N261M273
1542c61j755M8L380K805k056j0145k737P601N755l947j879O055J084j2600l208
1557a1960P101Q968l111m748K650M246q212j1865Q789J7607l385j4768K887J0111
1571D310p267j3843P127J7582j441j2292p32M143j30p299L639P614M695o002o208
1586f104r64K378j49J576M924K352l992l121m836L39P343K424k826K338M571q233
$$ y = [11114, 12808, -5408, -2869, 16497, 6162, -18900, -10138, 19284, 14353, -10844, -6085, 16637, 7633, -20280, -14161, 16050, 16420, -9607, -11547, 12218, 9381, -17326, -14917, 14350, 17903, -9668, -10234, 9039, 5040, -15791, -10030, 13490, 11893, -7378, -8360, 5098, 1857, -12660, -9489, 10024, 13305, -3982, -11854, 54, 3508, -9040, -7674, 6663, 11113, -2715, -9895, -4634, -361, -2116, -2068, 1312, 4117, 2061, -8084, -10821, -3220, 2535, -1412, -3291, 2764, 3848, -8752, -11960, -4859, 4109, 998, -3750, -1100, 3146, -5066, -16931, -8142, 9465, 6080, -8688, -5801, 4310, -2957, -16800, -9673, 7909, 6468, -5824, -6556, -2413, -2543, -9842, -6203, 1411, 6106, 104, -6104, -7068, -4690, -4839, -3263, 1661, 4013, 21, -3100, -7936, -7597, -254, 2170, -656, 1682, 6253, -1980]
1602a980j3031R318J3951m986r828R002R139j1920j5893J0799J8826l338j5268
1615e209K801J5171q340j9917N017K6328j713k0845K803J6432p278k0143J0729
1628d164K1460o626j7830O120J2839j0732j5653J1662K0640l981k1902J152J9617
1641A2602l941k2255M115K8100K184k7865n828J9678N380j7057n333J8990J1035
1654A9805j5853j7773Q245J6586m438j4302P644J7927r611k0927L225J8627j616
1667G539j3497N270J3834p473j7211K132J6925N83j4404L505J5745l529k4225
1680a4806M30K5859L005k1550j440K2716k842k6052N28K3757O153j7762o869J6418
1694G545L625j9847m550J7389J1564j5576r801J2933N303j5267o180J6501R450
$$ y = [-1980, -15011, -5693, 8258, 3272, -6556, 2446, 11585, -335, -16228, -5429, 13397, 10059, -5209, -2408, 12763, 4423, -15494, -10477, 15851, 14138, -6707, -3904, 12528, 5250, -14893, -4164, 17296, 10670, -7160, -1040, 11799, 1067, -14586, -2924, 17716, 13735, -8167, -7015, 12602, 8661, -13594, -9479, 18621, 20805, -7060, -12888, 6790, 12170, -4887, -10220, 8770, 19805, 3952, -13821, -5576, 11010, 6572, -7730, -86, 17841, 8230, -12697, -9472, 9155, 7539, -5958, -688, 13146, 5673, -11538, -9406, 7519, 8102, -6302, -2797, 12948, 9419, -14806, -14376, 11483, 14488, -7062, -8502, 14214, 11372, -14680, -14152, 9605, 15758, -2004, -8873, 7545, 11170, -8677, -13227, 4162, 15726, 150, -9651, 3282, 8585, -6682, -12862, 3639, 13089]
1707A3089j2647q680J0388L319r891n161J1883R278p008j4034O498R349n299r625
1721h541O444J4086m250j5411J600J1998j134j0347K916J2417J15j3521n903J1331
1735A800Q525r900o936J1494Q989j2635j3250J0332J1614n576p382L016Q741l952
1749D880r855m90R254N060o298n365M897L356o399l397P719M485m692k008J771
1764B918j264m056K246L191K210k346l865J679L266m891o160P841R870o065j2871
1779h297L676J1988l729j2317K560J5760L42j6423o382J2822J0329j2146j1830
1792a3647J2956J3446j2183j7431R887J5689n488j2497M775J0206l985j0810J110
1805g972J0679j37q773J761Q064m260j1243N416J2670m848j2222O589J1976p234
$$ y = [13089, 442, -8238, 2150, 5469, -4422, -9583, 2300, 11578, 4570, -9464, -2966, 6383, 1084, -8541, -2097, 11989, 7739, -7672, -6072, 5926, 4792, -5555, -2639, 9778, 9893, -3628, -9531, 1800, 10325, 425, -6511, 4983, 13972, 1337, -11913, -1581, 10033, 4457, -2925, 91, 8832, 4880, -4975, -5465, 3789, 8849, 2551, -2814, 2083, 5439, -960, -4357, 3362, 7847, 3155, 1147, 2918, 1654, -2402, -156, 3035, 5245, 2899, -966, 713, 3979, -912, -7072, 769, 10639, 4574, -8297, -4621, 7367, 3638, -8679, -6119, 9641, 9983, -6440, -12822, 0, 10329, -1817, -13647, -691, 12755, 572, -16859, -6972, 8717, 3229, -9268, -4493, 5713, 1728, -9082, -7972, 2707, 2570, -6203, -4442, 3622, -638, -11881, -6465, 6205, 1357, -10865, -4276, 7700, 466]
1819D66j6868O921J7853l409j7445J177J7311J633j8381p413K0913J0742j8341
1832d841j3401J5216J4413j3557j3823J2259J3655p390j2695L365J1978l674p430
1845e925K582P679j767q368K827O930n101q196R654R194r961j1809J2179J0249
1859A0167j0279j2878J1469J5207q901j8323N767J8619j452j9779j838K2649K637
1872A3065k3364l718K1599N889j8115o774J6193P190j3697p826J0784P940p518
1885A648p670P599N851o906n501O581N075n797m220O785K361p667j314P844J258
1900E927o709j859N233K116l884m978L358O446o50q742j358R107L364j0636l576
1915f841R262M516n239q380K155J2210k185j2266j286J3302L928j3966m386J2268
$$ y = [466, -16402, -9481, 8372, 4963, -12482, -11305, 6006, 7639, -10742, -18155, 2758, 13500, -4841, -18242, -3026, 11387, -2170, -15993, -3734, 9921, 2531, -10164, -6799, 5179, 1505, -5925, -3343, 4336, 2569, -5799, -2972, 3958, -1143, -9339, 315, 9509, -452, -12261, -82, 10167, -112, -12990, -1521, 13686, 4785, -13538, -7771, 10848, 9396, -10383, -12221, 10428, 13065, -10299, -14017, 7582, 13471, -4644, -11418, 4775, 11965, -1732, -9558, 1226, 9166, 1648, -6022, 1577, 7428, 522, -4979, 1602, 6677, 880, -3340, 3445, 5806, -1861, -3175, 4669, 5927, -782, -2641, 2592, 4708, 824, -4154, -796, 5650, 5000, -3742, -5100, 4007, 7371, -3265, -6841, 2421, 6937, 1698, -6682, -4527, 7683, 5498, -6768, -8054, 5248, 9176, -4790, -9176, 3092]
1929C092M540r619n356O256N263k788m181j506M749K551j928l577j756O153J461
1944C354m816k948K959M902L2o665k138P190K158n699j688L977Q42m71o25j788
1960a424l010N815N285q244q083J0304J0328r205j3358Q875J5258m419j9479K848
1974h509K1017o03k0640l043J9763N229j7560p004J5878N603j2422k397R416j183
1988C545n738K744M661n675m550P334N764q469r029R624J1329j0360j1933O292
2002d461J7161n986j9229K909J9205R83j5870n077J5035O974j1155j1097P269
2015c339J4013k695j5746o83J5099L405j5227n098J2945O501r624p045P314P149
2029F969q021m436O335L538o294k822P910J763j0748j935J5938N77j6781j686
$$ y = [3092, 7632, -1987, -7343, -1087, 4176, 1388, -2793, -4299, 450, 3001, 1073, -2504, -4260, 1893, 3354, -1462, -4410, -1451, 3451, 3483, -3182, -5320, 1870, 4028, -1671, -3359, 618, 1460, 989, 364, -1424, -4434, 1381, 6666, -1578, -9661, 643, 10971, 1766, -11592, -2717, 12541, 8122, -11357, -8509, 12508, 11905, -8735, -11778, 7985, 13214, -4346, -11350, 4528, 10131, -2291, -4688, 4728, 3545, -2193, 551, 5212, -463, -5013, 2321, 8085, -384, -9413, 211, 11540, 1180, -10753, -4461, 12700, 6714, -12515, -9606, 9599, 10582, -5288, -10365, 4670, 11644, 489, -10608, -3339, 10674, 7979, -7767, -8450, 6649, 10054, -5173, -10271, 2674, 9175, -449, -7494, -180, 6969, -1052, -5488, 847, 4385, -1909, -4731, 3179, 4942, -5806, -7741, 8197, 8774, -8007, -9693]
2043i693J9147K376k1764j065K1035M790k1513p574J8986J1273j8555j1808J6668
2056B303J4616j5507j5918J2067J3860p400j2275N225R766l596p408J431M401
2069A565k00p21j464j057J300J239j160k318O31M457M57m245k315J411L540J84
2085A304l251J72J204o1J046k090k080J219Q627k893j2719L729J2333j690j5679
2100a0829J822J6592K778j8778m139J5031P969j4789p092J2144J0930j1581j2811
2113a2753P849J1458l223q011K579O489k847m022m82Q90K939K691j890k910j488
2128b731K963J743j589k463J471M142k36n293l217M900O985k444q245l41P462
2143C107L952j1003p711J2619J3842r583j9542P423K1122o727k3519N779K5590
$$ y = [-9693, 9454, 11830, -9934, -10999, 10036, 14826, -6687, -14261, 4725, 15998, -2557, -14365, 2303, 16919, 1412, -14506, -2439, 11421, 4021, -8254, -3029, 6737, 3141, -4267, -2836, 1565, 1365, 644, -820, -1877, -577, 662, -498, -2816, -2185, 2272, 2729, -1516, -3831, -2420, 1120, 1304, -1947, -1775, -571, -632, 414, -1676, -3756, -2537, 6090, 3197, -9522, -5793, 6540, 4850, -10829, -9007, 7585, 10363, -8415, -12554, 2477, 10446, -4343, -11435, 709, 11639, 58, -12753, -4904, 6554, 3331, -4680, -2101, 4388, 1541, -2481, -2963, -2073, 866, 3557, 1667, -1243, -2731, 232, 1975, 386, -2077, -606, 3536, 3300, -1993, -5210, -310, 6675, 4231, -4014, -4355, 3107, 7059, -3944, -11655, 964, 14806, 5223, -14319, -6896, 14226, 7499, -16020, -10241, 15349]
2156A5349P4k6660m499K3953M932k0515m495J9399P446j8414q760J3771P451j2771
2170c739k043J4088j527j4743J671J4645m066j4869O457J8491m855k1278R23J9089
2184H244J933j6914j960J5951O207j7987j1333J5539J3794r164j1727N234J1883
2197I700m432j3637J5J3413O979j0150q630O043Q141p795q644R132R667o686q446
2212e330M454L409m442l603J0145L595r710m362R783Q82j1758k328J7693N602
2226A4030j8406r785J8702O964j7882p891J9754J2815k1315j3095J4140J2045
2238A0076j1181j0983J1863J2679j0012j4692M896J2432k143q000L782P120l316
2251B521r965J841O780j794j325K845K634m626m091J212K777L661k265j040K258
$$ y = [15349, 15423, -11237, -15736, 8217, 13149, -7366, -11861, 7538, 14984, -3430, -12190, 1581, 9032, -3739, -5782, 8306, 6779, -7964, -6293, 8352, 4286, -10583, -4126, 14365, 9510, -11768, -10845, 8244, 10177, -6737, -8697, 7254, 13461, -4526, -15859, -320, 13474, 4310, -7417, -2183, 9700, 5268, -8369, -8354, 5059, 12038, 1888, -6742, -699, 7442, -353, -8997, 135, 9802, 3116, -5330, -876, 2533, -1909, -5512, 4633, 8228, -1482, -5844, 3939, 4821, -6937, -9265, 8428, 14030, -4376, -14161, 4541, 11505, -6377, -14268, 5486, 18301, -3014, -16109, -1969, 10076, -1105, -12088, -225, 12454, 2442, -12250, -7354, 5078, 2935, -5065, -1283, 5837, 2521, -7444, -5603, 1177, -617, -1942, 903, 3537, -1089, -5180, -3968, -1191, 2470, 205, -835, 1423]
2266A423L88p316k169Q170O773o324o596M831P454q260j0043P099J5767o64j7689
2281g156j900J5572J345j7413j259J8437P454j8118j0206J1349R998r437p906
2294i240J0361R454n654j3505J043J0484J479n881L88N997j350q033n72N405O2
2309D38j028L457K549o109m820J834O373N65n022R35O348k029j0105m621J4521
2324C286P858j1080q164R575P811j0312j2083R890J4919l234j5238k72J3759K66
2338F981j6033m56J6807N173j3369q362Q759M038p504p27R521J486q556k441N470
2353G87j128l505K239J0035r44j3506j280J1333N07j1333J052J6417J546j8189
2367e969n360J2898P563j1357n586J1153P614r171j3124O157J1638j454q758K099
$$ y = [1423, 1811, -5505, -7674, 496, 7269, 945, -5651, -820, 6634, -1626, -11669, -4570, 11197, 10533, -7156, -9056, 6516, 7861, -9552, -10811, 7626, 15080, -3038, -13244, -1895, 8103, -1334, -9240, 1121, 10575, 4921, -8584, -7541, 2943, 4422, -1459, -1071, 4926, 3576, -4457, -5029, 376, 438, -590, 2867, 5416, -693, -5513, -3679, 2694, 3259, -1763, -828, 5520, 3491, -6614, -11235, 3286, 11144, 64, -8100, 1475, 9286, -1026, -13109, -3219, 11700, 8466, -6772, -7044, 6715, 6981, -9052, -9508, 7299, 12472, -897, -9259, -500, 3538, -3966, -4693, 4828, 6314, -2242, -4683, 787, -341, -3846, -1607, 8428, 7484, -6022, -7302, 4031, 4538, -6795, -5743, 10674, 12220, -5969, -11329, 1569, 9132, -2225, -7811, 3342, 10956, 1785, -11339, -5182, 6456, 5002, -3756, -1657]
2381a657Q717l703j0994K284R755n49m301J094K570k320o754J900O341K265m763
2396a15j459N319k494r229K62J4019J953j0671l799R661K346j1678k646J2241
2410C710O882r673j0304Q088Q750q535r155R676J2899q032j3566N657Q537n495
2424e61o503O421Q964m812q664k89O416J787m801J056M775R5o125j864K685K690
2440A270j523Q3L045j06m774q78M64K410K312j755O00LO2n994J278O353Q38l694
2458fj598M955j412p224Q69P317J855m075l669J194M074k780n036M149R278l485
2474D406q062j79M622J105m398J562L987L43l256l300k54M245J133j869J373J377
2490B835r20m907k12M021l58K0K455r03l331k560L801J874k362j048L021L586
$$ y = [-1657, 7060, 3357, -7637, -5353, 4402, 3853, -448, 646, 3216, 896, -5858, -3958, 2383, 4648, -115, -1574, 3745, 1251, -7978, -7716, 6303, 8256, -2415, -6214, 3447, 5793, -5885, -8531, 3710, 10592, 919, -9385, -1297, 7453, -1082, -10237, -561, 12338, 4306, -9260, -3603, 4934, -561, -7064, -643, 8321, 3509, -5155, -5444, 972, 2759, -2042, -986, 3789, 3884, -2241, -4105, -1420, 1270, -253, -170, 2875, 2769, -2005, -2883, -2419, -9, 2303, 548, 1148, 1151, 1213, -4781, -3503, 2850, 3688, -6, -1604, 3351, 1939, -5285, -4416, 2901, 4756, 681, -2988, -1794, 2280, -500, -5536, -1387, 7891, 4406, -3656, -3835, 787, 1892, -2506, -944, 3043, 3386, 130, -3170, -3424, 821, 1954, 85, 1458, 2835, 1915, -2992, -3204, 817, 459, 479, 2934, 2031, -1300, -3860, -59, 1815, -547, -1595, 1426, 5012]
2506E012n245p752L199J0012j507r706K642Q738k373j1308K468J0244N32p781
2520b825j961O032K215n987n228R091M088p298l112N410K019o084j308R182K04
2535D438p932j869Q688j782n803m94O798M178p387n066N565N358n077o293O952
2550B74P040n129q556K292Q842r87o902L27O936O05o897l957P016M210m929m520
2566d335P099K311o778l863P466L750o268j737M754K919n962n092N962N520l958
2581A788m612J520O788m604p800M800Q175k731q205M090O812m297o188K296N707
2596C539R4o032J329L515m98m167L13M894R25n233o07M832j141l897J560J875
2612A301K209k646p20k89K823l74k070q96L290J836m590k328M680J914l397k770
$$ y = [5012, -233, -7985, -4786, 5226, 3719, -5987, -3345, 5393, 3020, -8288, -5820, 4424, 4956, -2825, -4786, 1246, 3461, -2526, -7754, 1337, 5425, -1873, -4985, 425, 2444, -3640, -4948, 4234, 4438, -3494, -5363, 3325, 1543, -4260, -4754, 2044, 6222, -1165, -6231, -666, 4692, -385, -6678, 274, 7314, 2185, -6371, -4079, 4763, 3776, -3126, -2799, 4137, 4742, -2155, -6112, 904, 5114, 185, -4335, 2764, 5075, -1703, -5566, 1900, 5650, -618, -2355, 2399, 5318, -644, -5736, 226, 5746, 1788, -2824, -1304, 5484, 880, -6920, -2120, 6055, 3324, -4881, -791, 6021, 1724, -4464, -2168, 3539, 3633, -2399, -1070, 2445, 1947, -2220, -1907, 2987, 3912, -1321, -1928, 2904, 1763, -2134, -574, 1301, 3510, 864, 144, -145, 2678, 2304, 234, -662, 2628, 4464, -126, -2454, 2226, 4140, 743, -2027]
2628b027M600K131m308k459K278M199j733k620J085L120k441o076M959O005m686
2643B027n436M622N358o223n274M821P185n075o923L509P443j764q687Q87Q695
2658E165j221p030j617O406K200o357l158O600K694m632k972L028L175l806k525
2673d050J604M720k126m692J659N202k629o201K636P763k871p058N64R087j542
2688B066p477j100R043K158j0286l454J1602M179j0777n413J0976O062j2673m273
2702i367J1021O049j0590n270R650N046q724m777P485O673r179n172P091P732
2716G668q962p591R447Q314j0452o816R627O560q015n900O584N379n404n441L861
2731a141O192p38q655J850N942J54n622m91O136P80o394p76M499O51l645l289
$$ y = [-2027, 2573, 4704, 396, -2063, 215, 4414, 2681, 61, 1146, 4266, 1825, -4251, 708, 6713, 2027, -3409, 1213, 6571, 348, -4926, -105, 7080, 2005, -4918, -1409, 6034, 4270, -4417, -3530, 5165, 3944, -3086, -4703, 1703, 3903, -2454, -5612, 988, 3682, -950, -3922, -894, 2281, -1525, -4050, -2446, 2274, 148, -4544, -2885, 2317, -312, -6513, -3877, 3886, 1015, -6043, -5479, 3608, 2066, -5411, -6511, 2532, 4690, -5596, -9050, 2552, 6731, -4046, -9459, 1517, 7579, -5094, -9367, 1654, 7703, -2887, -8157, 1493, 6539, -2185, -6962, 523, 7196, -1983, -7155, -64, 7668, -1294, -8885, 562, 8876, -1576, -8392, 1235, 7795, -220, -6120, 464, 5843, 439, -5002, -1141, 5051, 4313, -4342, -2492, 3450, 3604, -2018, -2509, 3627, 4407, -1987, -2763, 1736, 2387, -1258, -4547]
2747d547M764L609l962m097M919M755m753p852N634R359o819r574N734J1392o014
2762B548j1209M571J1756m355j1135L126J0546j410j0534Q35J1634j649j0265
2775e541J109Q935J67r524J027Q561j854q080J535P385j584n853M3N630J262n552
2791b334k004N254K619m575l307M311L518k199m516R80L923o1l061j715M742K225
2807C800m753m252M483M868m004n243M040O944n181o232M772M823l175o243N364
2822A1N694n138o825N305P077l954p500L778Q128n073r028M288J0625m079q795
2837e486L082P139j255q573K246P235O27n185j845L402K112n276p17M956J240
2852C702l711j945L719L36l206m05N268N10k884k509K054K858l071l743K655O566
$$ y = [-4547, 217, 3826, -136, -4233, 686, 5441, 688, -7164, -1530, 7829, 1010, -8564, -2830, 8562, 2548, -8661, -4090, 7666, 3311, -7824, -4698, 5848, 4438, -6096, -5261, 6373, 4724, -5541, -4432, 4503, 4670, -4854, -3827, 4734, 2880, -5200, -3665, 3720, 2136, -3717, -3674, 1956, 3218, -2334, -4338, 916, 3535, -1040, -4347, -36, 3482, 1283, -3233, -2253, 1670, 1609, -1452, -3167, 1575, 3800, -953, -5205, -722, 4146, 142, -5101, -1061, 5883, 702, -5530, -758, 4065, 890, -5353, 11, 5705, 567, -6258, -953, 6124, 2170, -5330, -1552, 6576, 1503, -7525, -3237, 7388, 3309, -5486, -2404, 4735, 3480, -5093, -2847, 4388, 5015, -170, -2015, 1387, 3499, -1777, -2494, 2462, 3702, -9, -1954, 1765, 2101, -1105, -1510, 3758, 4268, 1384, -1125, 929, 3787, 716, -3027, -372, 6194]
2868F194j165q570M27Q529p62q054J523P635J42p900k124P843K557o792j833P696
2884E346K759j0036k922Q629L465r448j495R411K608j2164j426R434L036r620
2898b423m254J1544K409r822n087Q813O830p123p045O890N966q282o417P972O248
2913F219m269o374L557M469l057n332K510O117K2o064j090L883J138n103L51N208
2929B185J749n238k891M386J905l722k253M441M695n584n156K870N561k136n502
2944d690M262O199l500p303K238N895j312n427K880M619k872n741J091N693q5
2959A947l924J935L158j601p452L008O765k239n235K634N496l154o228J117N370
2974A597J926m839j45L227j388j766j079J460L748p98k566M86q71Q35j069K129
$$ y = [6194, 5029, -3541, -3114, 5415, 4653, -3401, -1878, 5757, 5899, -2001, -4125, 3718, 6275, -517, -2350, 5346, 8105, -1931, -4853, 3776, 7241, -2207, -3702, 5709, 8317, -3847, -5273, 4161, 7197, -2423, -6677, 4867, 7276, -2546, -7633, 1180, 8010, 887, -6158, 732, 6698, -1584, -8001, -29, 6219, 1950, -4424, -867, 3602, 545, -4787, -2277, 3840, 3862, -2202, -3292, 591, 1729, -3374, -3023, 2185, 3934, -1304, -4195, 191, 2096, -1626, -3879, 562, 5257, -327, -5483, -2613, 2948, 812, -4690, -428, 5771, 2271, -5032, -2794, 3101, 1789, -3638, -758, 3861, 989, -4752, -3661, 2032, 1947, -1977, -42, 3116, 1515, -5937, -2929, 3836, 1597, -3638, -1004, 4492, 1338, -4890, -3773, 1597, 3523, -1316, -1461, 1766, 378, -1388, -2467, -1007, 2741, 1943, -623, -137, -1008, -173, -1242, 887]
2990H87J180j184j22j756r2R47J53Q3P11L407l756l263J789L258l109q88L309
3007A554M193o528m371L123N177j176m754J635N236p01q387r61P384K381n486
3022a681k3L693j69m282j145M109J261j523m9K32j5j999m4K757J622p27j538l54
3040A25K59j332k297M318L306j965m282k5M158j371m119J708M645K701p486l078
3056d735L619N358n026k468O079L537o283n824N404K208j385j683K743K370l791
3071A23n925M848L823k942j656L410L391o114m346L447N372l557k518L228M377
3086D961o412m228K939N189Q33l769k63K135n40m721l1M622K279k473j809J639
3102C51K57l694N27M051J76q85k960R06J413k371j253L715L490l281m136J333
$$ y = [887, 2067, 883, 761, -995, -1087, -140, 13, 96, 807, 4214, 458, -2805, -1016, 2242, -867, -1755, 1554, 5747, -781, -5152, -2029, 3148, 1972, -2782, -1147, 4089, 3388, -4999, -5960, 1424, 3805, -1681, -1704, 1989, 1820, -2462, -3607, 502, 1763, 240, 191, 423, 408, -1591, -1635, 1122, 2744, 2017, 479, 125, 384, -948, -3245, 1073, 4379, 2414, -1868, -1893, 2265, 894, -3225, -1517, 3128, 5829, -1657, -4735, -1116, 4242, -784, -3252, 2827, 6364, 81, -5743, -339, 1869, 484, -1199, 1544, 3914, 123, -5802, -954, 2869, -73, -1729, 1681, 5072, -1042, -5388, -1941, 3431, -126, -2644, 584, 4961, -1451, -5679, -2740, 2449, 3282, -487, -750, 1385, 845, -3876, -3907, 715, 2994, 521, -1288, 351, 608, -3086, -2559, 1492, 1668, 783, -2177, -1271, 142, -2229, -3482, 233, 3723, 442, -3694, -2361]
3118b361K459n34k678K590L469j294n215J313L155j92k622L75N337j392m850k079
3134d519M319K008m140J480L898J55o065n70L440J288j354J00J498R92l830l047
3150d347K947M044P79n289J144L607k404m644J395M699J066k232k661O28K243
3165I75j578l733M271M329j373m713q24L564n46k490Q93M442r14m722k68M084
3181A397p79l777J618M914j71n867k936O377K075o091L2P019N4o298k628M711
3197c50M639l583l538L781L543l527n330L055M122Q38n140K909K577k325m099
3212b428J682K751K55k260N38J970k021j830K96M244L74l036j613M048l96n673
3228c099Q73N661J895p057j143M998O99m954k845O716M079m942m977K740L782
$$ y = [-2361, 98, -436, -3114, -524, 2945, 1651, -3564, -2251, 904, 712, -1910, -1535, 3802, 2410, -2440, -4519, -200, 1808, -2332, -852, 3046, 3201, -2864, -3434, 6, 1294, -60, 40, 1538, 2530, -1300, -4347, -1400, 2644, 3423, -1866, -722, 2885, 481, -4163, -2768, 1931, 2997, 765, -1896, -1268, 975, -603, -4336, -65, 4264, 2891, -1822, -2646, 918, 372, -2118, -1225, 3217, 2303, -2419, -2687, 1397, 618, -3159, -1541, 3373, 3202, -2665, -5601, 776, 2851, -3240, -3208, 3811, 3865, -2433, -5061, -350, 4289, 706, -2832, 949, 4492, 965, -4365, -1310, 2812, 3650, -1490, 1419, 3996, 1671, -2428, -746, 2005, 2260, 0, 538, 2508, 487, -1343, -1047, 3197, 3571, 535, -1078, 2970, 2574, -3099, -2226, 3435, 5330, -1727, -2870, 2128, 2827, -2127, -4972, 1744, 5823, 881, -4096, -1356, 2426]
3243B426j112n144M696M207m273n307L957L991n345k362M887M633n763m390L626
3258a273M456k792n942M568O725m766p049K137Q234j036o975J378O494j03q533
3273d477l4N258K677n044j589M274R83l580l131M333M847k520m679J267M875k520
3289I40n578M259M132j004o238J817N518j483n869Q93Q239J78q697J2N411Q09
3305C339n837l53P161K387p369l227M610K810m503j908M249K787k477m121K624
3320A72L711k775k829L493K363l078l757K492K522k138j494J140M404j708m150
3335a632j065L793J309j670k524K336K814m501j912K870K924p42m952L487K429
3350B964k503l208J254L667n29l346k96M448o22m479J330M112j010m640J597M527
$$ y = [2426, 1314, -3830, 866, 5073, 800, -4507, -550, 3441, -1904, -4266, 621, 5254, -509, -4899, -1273, 3183, 391, -5551, -983, 5742, 976, -6073, -3936, 4298, 3262, -3713, -2335, 4159, 4056, -4477, -4511, 747, 3424, -1620, -3209, 1065, 2048, -1532, -4663, -330, 4517, 1997, -2682, -1415, 3460, 940, -4638, -379, 3753, 2749, -3489, -1672, 3846, 2363, -3506, -2613, 5626, 5804, -2893, -2881, 2530, 3339, -2498, -2851, 4310, 6697, -672, -3899, 711, 3521, -982, -2890, 1359, 4146, 1669, -2452, 172, 3883, 1108, -1721, 1772, 4135, 1057, -2700, -208, 2314, 176, -1318, -178, 4226, 2518, -1632, -2697, 1096, 2405, 735, -1789, 547, 3361, -1140, -3052, -182, 2742, 2000, -2952, 535, 2964, 461, -2747, -1493, 2174, 1645, -1701, -1997, 2451, 1829, -2650, -1320, 2792, 1782, -2858, -1261, 3266]
3366C266k246m356J243N450j739m935O27N828n36o223r88P172J836p264j787N090
3382D38L512n963k015N129J319l892k805N204K016m221l394N344L092n590j873
3397c699K352L939k315n588M298L943k469n912L255M890q89o058R1O350P56n225
3413b281m292O963M534q193k251O380M154p219l646N228N708o123l197L912N290
3428D967n506n094N842L972l500n725M911M619n096m643L573P271m101o243L627
3443a126N760k941n696J816O459j298n554J27M952K03m823p78M872J022m848l3
3459a886L147J725l689j038K385J428k924p83L038J476k694k231K488K888j882
3474A448m873K655L463j854m333J894M598r80m864M99N661j408m147j070M929
$$ y = [3266, 1020, -3336, -2093, 3357, 1618, -3317, -2690, 3138, 2602, -3621, -4609, 2563, 4399, -2865, -4652, 438, 3950, -2013, -4028, 1101, 2420, -1472, -4277, 927, 2943, -1278, -4672, 672, 3764, -1826, -3699, -1347, 2592, 277, -5311, -1013, 2930, 461, -5451, -2196, 2694, 1805, -4253, -4162, 2188, 2944, -2281, -6573, 390, 4924, -3269, -5520, 860, 5014, -2205, -5851, -623, 5085, -1038, -4235, -323, 4967, -539, -5633, 209, 4181, 681, -5044, -133, 4486, -610, -5253, -1680, 5591, 1490, -4753, -1126, 4634, 1693, -4003, -2187, 4272, 2974, -2580, -2453, 2499, 2702, -2121, -2899, 1973, 2995, -1853, -1886, 1261, 2986, -703, -1741, 644, 2072, -852, -1635, 1403, 2879, 185, -2046, 442, 3330, 1448, -3425, -770, 2693, 839, -3494, -1600, 2998, 2018, -2846, -2347, 3314, 1906, -2241, -3311, 1618]
3489A618m92l957q97N034J896n600r14N289K84m924n11M709K78l766k97L445J817
3506C012m031k939M695K111m488j652L244M070n288o42J359L265k339k063O93
3521i93K123j42k870M15J757K113k600j564R34K600j112j731K56K120q01k351
3537a846J549K553k094k815K334K436o59l538Q08L986K44n701J412N399q23n999
3553b754q62P000J60m739j314L855K926m910j785L433K549l962k157L627K421
3568C488m415k62J207K401j622j59K438j359r66j819J648J413q14j219n60K001
3584A401l40k939J171K349O32l309r97L526J428k798j474K094J067j251k483J247
3600f76L126j399l542P97L089j444k850K976K975l126k620K784K099k848l098
$$ y = [1618, 1126, -2831, -3728, 1306, 3202, -2398, -3312, 1977, 2261, -2663, -3174, 1535, 1813, -1953, -2250, 1195, 3012, -1019, -3958, 737, 2848, -1640, -3292, -48, 4022, -1266, -1908, -549, 2716, 377, -1686, -993, 1130, 988, -1882, -1467, 290, 2403, -197, -1761, -827, 1773, 661, -1070, -814, 1306, 505, -1846, -297, 2256, 162, -2653, -319, 2117, 1458, -2080, -1272, 2714, 2958, -2743, -1331, 4068, 3245, -2754, -3616, 3384, 3544, -1195, -2509, 1346, 4272, -638, -2423, 1010, 3559, -403, -2560, 1067, 3488, -927, -1189, 18, 2419, 797, 638, 3076, 1717, 751, -1068, 580, 1993, 1179, -40, -600, 1401, 1061, -1878, -707, 1642, 2274, -1035, -2032, 1494, 2922, 124, -1350, 744, 1811, 560, -1923, -676, 2450, 1051, -2491, -1694, 1395, -49, -2899, 77, 3052, -74, -2694, 90, 2189, -659, -3757]
3615c757L232L035k505l382K488L063j559m705L003M851k586m669O75M396r95
3630E85m250K324L151l93k633k061M398l10j805l81J231K177k571j613J935J600
3646A384q48k107Q85L077k564k868P10K860L64j979r4K296P73l415j680L016K221
3663B031j566k720K219J513k851j944K602L217j463k316J079K172k676j291J285
3678g09K855q40l477J995K599l188l180L773L286k783k911L01L927j73l508J00
3694a933L770P47l750k604K567K256j263j598J329L392q57l959J64J885P17j723
3710h60n51K378P76k780k321L633K020j899l1J089l5l826R15P54J992j143j831
3727a720M031j284l502M59M740J804l979m304N986L608o438l303M371M687k484
$$ y = [-3757, -525, 2510, 5, -3377, -889, 2174, 615, -4090, -1087, 3764, 1178, -3491, -2816, 1580, 585, -3665, -1341, 1810, 1417, -1216, -3277, 1121, 811, -994, -1375, -144, 2033, -538, -2151, -216, 1384, 536, -1571, -686, 2391, -173, -3041, -2331, 529, 893, -1086, -1180, 1116, 1889, -1526, -3206, -190, 2031, 465, -2255, -36, 1477, -1374, -3318, -716, 2501, 1038, -1278, -199, 1973, -703, -1994, -709, 2146, 1306, -2171, -176, 2423, -765, -3945, -172, 3114, 331, -2580, -2279, 1648, 1475, -2033, -1933, 1837, 2584, -1166, -3770, -1203, 1053, -210, -1808, -479, 2913, 2056, -1903, -1739, 146, 863, -860, -1411, 967, 1743, -1037, -3358, 275, 2295, 396, 365, 1454, 1419, -2407, -1492, -738, 1254, 111, -1720, 2311, 1027, -2475, -2016, 2724, 4528, 549, -3755, 2231, 5839, -599, -3902, 469, 5156, 2672]
3742B672m436K019L085k770k138R16L405N3j967k155K283j137n67j86K997r53
3758A121k493J751N32n00j635J295K835j525m052o07N218m01m244P89M699J372
3774D155o336k995N511L751m567m101L057O571m444o275K127P054j534m487K57
3789b256M874P02p938n1O686J731m849j769M832O3o225J199N342J418m147j209
3805a597K409K97k727j149M821O69l517j845K343L150l456k840N089K290l466
3820D71l558K648K855k133j812J223M550k63o890o53M678J543l059r92L570R83
3836C161l769k462J967L643j219l100K475J504j758l018J135M652k408j931J437
3851C09K102k529k490J896L051j593k201K919J289l605k438K691L929j171m846
$$ y = [2672, -1764, 255, 3340, 570, -1568, -652, 2753, 2806, 839, -1316, 967, -170, -737, -923, 2074, 1121, -1372, 379, 911, 411, -1224, 71, 2906, 1381, -2671, -3278, 1940, 1539, -2705, -1916, 2783, 4155, -2181, -5176, 335, 4086, -481, -4582, -1525, 5046, 602, -5673, -3546, 3508, 1974, -2513, -2256, 2618, 3320, -4618, -4669, 2017, 3748, -1101, -2870, 1962, 2025, -4200, -3001, 2341, 3759, -388, -1597, 812, 1109, -1618, -2767, 2054, 2723, -794, -2639, -296, 2854, -602, -3442, 1647, 3937, 471, -3087, -439, 2416, 283, -1529, -306, 4244, 3981, -2909, -3562, 1116, 2659, -400, -1392, 2178, 3161, -608, -3070, -1103, 2540, 1321, -1779, 696, 2200, 442, -2576, -1441, 3211, 803, -1128, 309, 2411, -118, -2608, -712, 2339, 746, -1455, 1464, 2753, -852, -3290, -599, 3330, 2159, -2687]
3866b687K304M217k501o355J842P453n72m659k370M585K754n006k090K729N569
3881E213k468n785j325N619N01k957n71K704K154m230j739K531J463j398N83O82
3897I77q11k004J60K905j394j631J089M666j712p258J169P248n79o231l52P737
3913C979Q39q368l333Q507M618p036k913J775O856n276o724K507P781J094p017
3928b711O17M351j475m075K31L543P68k138r04J890n29j205R34J707L11k997N49
3945a133K820j811l928J435O910j372n322j682N299K925o620k333N849N024n073
3960I88o026L082P271k599n099m71P962j563p842O94N444J729l592j150L867j71
3976B524k241j968K551J942k336n72J770m19k821P8L577j261l109J671L924j135
$$ y = [-2687, -383, 3834, 1333, -5022, -3180, 4273, 3701, -958, -3328, 1257, 4011, -995, -3085, -356, 5213, 2745, -3040, -4365, 1254, 1755, -1202, -1773, 931, 3085, -1145, -2884, -353, 1110, -288, 295, 977, 166, -1838, -1678, 1227, -167, -1798, -709, 3957, 2245, -5013, -3844, 3404, 2825, -3406, -3758, 3979, 4818, -3550, -6883, 1624, 6242, -794, -3707, -1932, 4924, -352, -7076, -4569, 3212, 4306, -2711, -2094, 2257, 782, -3293, -3062, 481, 1249, -889, -1793, 97, -432, -1637, -703, 1004, 1315, -1682, -1133, 1687, -124, -4052, -2617, 4293, 2921, -2401, -4083, 1216, 4141, -2479, -4812, 1037, 6061, 988, -5038, -1956, 5315, 2716, -2383, -2854, 5108, 3545, -4297, -3603, 1841, 3570, -22, -1172, 2695, 2524, 283, -1685, 866, 2808, 472, -100, 1670, 1251, -1570, -1492, 2085, 824, -2285, -614, 3310, 2175]
3992B175n337P84N164N01l866j675M243Q12l589m890N552N159l421n202J696M597
4008B703j442l814m41N100P75l460k888L082K835k675k085J930L242j050l466
4023a654l03L416J43j968J082P23j96j859P94P4j272P55J800l04k605o30K115
4040A11K698k794k272L514L456m252m606L087N994k073m756k56M583K286n837
4055a117k802M201M984l933m729J695M258j647l338M51L197J382k281k796J073
4070a402L309j431j737K17K033L9L21j547q77J122J317L50k996q97J833K769l301
4087h78k573K134M555q05n918l83N720K408n505l589M856M708m405o073M057N232
4103C541j92n173j225N135J225m370j902M201J036j723k072J548L14N85o82N21
$$ y = [2175, -3162, -2378, 2786, 3287, -579, -2254, 1989, 2801, -788, -5678, -126, 5033, 1612, -3590, -1894, 2703, 1261, -2553, -2994, 2106, 2881, -579, -3467, -385, 2450, -225, -2310, -380, 2862, 1812, -1654, -1957, 1459, 1602, -366, 716, 1439, 1243, -616, 178, 252, -1020, -265, 1535, 1231, -1374, -2004, 111, 2809, 15, -2257, 1257, 4713, 461, -4145, -1058, 4936, 2863, -1893, -2149, 2434, 4720, -1117, -3919, 282, 5266, 1333, -3396, -1701, 2557, 910, -2428, -1977, 1220, 2602, 321, -2475, -1402, 1907, 476, -1261, -1044, 989, 1028, 1349, -198, -1075, 47, 1364, 1714, -1282, -2179, -346, 2423, -878, -3451, -1317, 3238, 2433, -3485, -3868, 1852, 4260, -1245, -4834, 22, 4730, 325, -5748, -1691, 3541, 3349, -1824, -3049, 2086, 3311, -1059, -2961, 1240, 2276, 553, -1519, 29, 343, 928, 246, 767]
4119G67k780K227N72J404k753k1M59K251r68l169j66N673j033m474j038M780L403
4136E134o626l165N365N285o020m902L595N292n94p216M62O263j03m271k425N740
4152A814J448l639k679M111K92k117k85J320O0j87j037J529m95o33MK612j199
4169I19j897l00L071k68l691O05L828L10l987k98K576J403j816l131K161L604
4185C089j542l671R90L002J906l678k023L013K753l307m498K404M840k85n080
4200b087j318N159P43l180j891L287J436j541k680J535J923o53j119O46k52Q66
4216H74l90o65o88j06J365j15o16k877L461K653j864m532J029N507k98m968j273
4233c503M157J999l286l458K885M397j363m873J2L791K039l744k594M281J484
$$ y = [767, -2013, 214, 786, 2190, -563, -584, -125, 2126, 1158, -2011, -2177, 3496, 2463, -2011, -3049, 1731, 5134, -1492, -4657, 708, 5993, -27, -4929, -1334, 3958, 3364, -3852, -3390, 2873, 2770, -1501, -3926, 1814, 3262, -377, -3056, 1055, 1347, -770, -1055, 265, 325, 138, -899, 630, 135, -498, -494, 2118, 919, -978, -1278, 1793, 1525, -2166, -1561, 2267, 2577, -1410, -1708, 868, 2271, 455, -2676, -515, 3089, 1547, -2124, -1134, 1868, 3774, 96, -1927, 1086, 3839, 532, -3966, -1562, 3278, 2993, -2087, -3405, 1754, 2497, -683, -2574, 713, 2149, 608, -2072, -537, 1386, 733, -386, 260, 8, 874, 484, -181, -869, -975, 390, 275, -341, -3218, 243, 2896, 1032, -3500, -2471, 3036, 2738, -2230, -3503, 654, 2653, -633, -4091, -1206, 3191, 1828, -3045, -3033, 758, 2797, -947, -3541, 740, 2224]
4248B224j989j560L5L002L0l226m4J904J193j455p94J63l17K137J56r57j488P00
4266b86K960j03l715k629O280R35n275k610N711M282o029m979L920O769l287p074
4282e130J563O964O47p052j065O599N95m423k429L822K534k199l421R71L240q18
4298C98j447k55J567n92n01N17P70j341L31J459l00j419k87J128J888k504j494
4315b082J072L687j489m808K402M207n49m937j41N500o84m532j574N597K038n016
4331a309j504K879M073m321k768K081L297n48m307K066J731q97k057J352J176
4346I44j188o58J019J097j682m34J861l3j044j831N40K898n54l157J198K641j584
4363C3k328K21L505O51m007j168M047K120m783j277K068L184j040m364K235L227
$$ y = [2224, 235, -1325, -1290, 1712, 1742, -1484, -1528, 376, 1569, 114, -680, -517, -834, 1303, 1459, 502, -986, -286, 2674, 2571, -1144, -3773, 2507, 3442, -1833, -4443, 1268, 5550, -479, -5458, -1538, 5231, 1944, -5130, -3567, 3397, 4044, -3008, -4073, 2526, 3121, -1302, -3731, 91, 2625, 426, -2995, -2024, 1216, 398, -1049, -1304, 263, -329, -830, -313, 457, -884, -553, 906, 606, -813, -1100, 28, 1916, -588, -2082, -1010, 2677, 1188, -3620, -1218, 2989, 2440, -2497, -2638, 2862, 2178, -2354, -3928, 1669, 3707, -1309, -2813, 66, 4139, -182, -2950, -869, 2428, 1880, -2427, -361, 1370, 473, -1584, -232, 944, -244, -902, 117, 1214, -468, -902, 959, 926, -118, -1949, -1409, 1489, 935, -2222, -1024, 1617, 33, -2295, -2074, 1431, 2082, -1925, -3093, 954, 3074, -1709, -2986, -918, 2266, 1226, -3138, -903, 2324]
4379B324r09m581J287M624Q1m010r70K527J011l125m52K526J670l030q78K044
4395A39P92j461q3K338j090j450P28M59R68l140J642L424j764l380J21L234J295
4412B772m614j257M765J751k742l757K584M577j309n640P72M348n52l023j341
4427b666M322K052l679j222J373K739k520k362L606j033K99k379K081Q66k138
4442f61M25J675J146k622k561K934K342l702k228L495M114m855l986L347N377
4457D240l678m605K669L994q50m779O23M315M72l106j55K426J580m468j277L111
4473E12J779k693o90K808N44k506j488L402k53k519P62J871M2k879j30J917K171
4490B650k902j471K514K141l632k608L045L617k650k967J139K599L49m892J386
$$ y = [2324, 1415, -3166, -1879, 2745, 2826, -1184, -2154, 373, 1384, -1741, -2193, 333, 2003, -1027, -1905, 139, 931, -530, -613, 1725, 635, -815, -87, 372, 1340, -1800, -158, 3266, 1502, -1878, -1757, 1477, 2772, -1842, -3099, 1666, 3417, 675, -3082, -498, 4079, 2770, -2870, -2098, 2250, 1698, -1325, -2666, 1656, 3708, 29, -1193, 180, 2919, 399, -1963, 1643, 610, 909, -1470, 611, 1477, -661, -236, 1439, 2585, -37, -2598, 336, 2678, -1024, -3252, 243, 4357, -498, -4484, -1137, 4240, 562, -4043, -1374, 2620, 1770, -3009, -2386, 1929, 2401, -705, -860, 1566, 3146, -1322, -2599, 512, 2291, -402, -1092, 1716, 2260, -246, -1734, 1668, 1415, -1104, -342, 1529, 1571, -1308, -1438, 479, 2650, -252, -1723, 791, 2932, -700, -3308, -263, 3354, 704, -2263, -1124, 1475, 1824, -3068, -1682]
4505a682L736J201m178j067K887O13k787j103L733K207m856k312M430L94k473
4520a257j295L054K879l120k967K003K333k388o03Q49L677j623m335K526J795
4535A528j162r92J365R68L07l930P91K329j5j323J61K402q56k388n64K368J213
4552B202p47k033J984k22j364j720J235L271p18k512Q22J540j044k093M30K435
4568A466Q63k754k35K149j838n49q9K396L89j514l62L45l43j655K19M453k366
4585E75k004j27K131K85k967J955J364J739m567j102K099J384n06k206J670K314
4601B037k622l41n25K011N15k022j063L405j452j649M22J098J660j095j334J040
4617H5q21M9j841K747J220k060j66J024K97j703j085J796J934k462m28M79K658
$$ y = [-1682, 2054, 3255, -923, -1990, 897, 1510, -1277, -2380, 1353, 3560, -1296, -3608, 822, 1216, -1257, -2552, 502, 3381, 261, -2706, -703, 1630, -758, -1361, -512, 3165, 1542, -2793, -267, 1528, 366, -626, 739, 1707, 2014, -1916, -1125, 1204, 1189, -134, 27, 2429, 1573, -815, -1379, 989, 2202, 1455, -578, 1406, 1184, -180, -1900, -665, 2606, 1888, -624, 198, 1738, 694, -1399, -969, 1466, 2329, -425, -660, 1489, -349, -898, -987, 1409, 1798, 284, -78, 267, -76, -1731, -1512, 2941, 575, -1429, -1556, 575, 860, -2107, -152, 1212, 2951, -1616, -2718, -619, 765, 259, -1947, -277, 2037, -585, -926, -1451, 560, 1075, -947, -2010, 1395, -57, -1706, -1284, -186, 1474, 379, -955, 85, -736, -687, -2528, 219, 1439, -621, -787, 237, 534, -1169, -2254, -458, 1476, -986, -1414, -935, 1723]
4634A723r78k176R24L618k686j496Q69K306q45l011K54M656p99l227r69K104J117
4651A384l239P76L056k03k714j8N22O48M2j692L268J64k737p50J227K534j555
4668G13j248J269J138q55l373O78K582r99L74j474K735p62k419j378L162O88j353
4685e22m32J479P19j731j335L270L84j943q58J196J378k021j355J777J770j694
4701H2j521P17J400j30k357J701K210j393j498j002K741m47j217L18J539J196
4717B339l070Q0K25M01m45M88J40o04J046k11O0r0n20r24L92J257j390L68J73
4736b85K99J61j032R4K416j495k162J050J062N70j539R47P54o28j543j492L562
4753G39J484j554k138J293J194k382j126L670q8j070j379J449J501n53k933J932
$$ y = [1723, 745, -1431, -507, 3111, 425, -1071, -202, 2104, 1259, -1752, -1498, 3158, 2359, -868, -1837, 267, 1384, -1855, -1079, 1977, 1774, -940, -958, -436, 212, 254, -1438, 1830, 1994, -743, -1493, -266, 2268, 713, -535, 734, 1872, 1017, -2356, -1678, 904, -95, 279, -1195, 1540, 778, -1641, -3019, 143, 831, -522, -954, 525, 1244, -487, -1822, 1448, 1832, -111, -969, 227, 1605, -416, -1771, 6, 1776, 82, -1439, -722, 678, 548, -1809, -108, 2102, 709, -789, -1791, 950, 503, -714, -396, 1143, 2339, -731, -651, -426, -25, -470, 18, 158, -446, 600, 389, 449, 359, -161, -1085, -693, 564, -826, -458, -285, 14, 175, -857, -763, 1653, 158, -2004, -954, 108, 678, -861, 86, 840, 212, -1331, -2823, 739, 2223, 669, -1469, -176, 1018, -1364, -2490, 1180, 1092, 22, -1357, 92, 1593, 1040, -1893, 39]
4769C9J528r47j936R55K005j681k759J977K955m23l423O99K386P95k363j368L686
4786B125Q2k717j397K046J912j471k067K446J417j219k972J464J968m54j713J410
4802H60J39K47k381P41J397k18k646J502J475jm414J322L544p14k534m26K171
4819F4N24k261r51L418Q29j731k212J209J239k95k135K716R43q61k509J685J231
4836I03j266p30J850J52r82j636J675J527j887J43m91Q23J006j893L2J468J113
4853A807l172L12K811K70j807k999L307J284j773p98K137O43j35l258K589J263
4869B481k246n21J426J345l150k47R91J280m46j439J780M38%l418O29L439o55
4886A687k085j065L487m85k104r45M315j461k511O89Q45K322l339l72Q21J287
$$ y = [39, 1567, 620, -1316, -361, 1644, -37, -2796, -819, 2136, 1713, -1710, -1011, 1375, 2170, -193, -1561, 2125, 2207, -510, -1907, 139, 2051, 580, -1487, 959, 2376, 1157, -1815, -351, 1617, 1163, -550, 860, 999, 1246, -1135, -394, 1003, 785, -1861, -359, 1116, 1115, -3299, -1977, 1567, 853, -1681, -2107, 64, 588, -1673, -2624, 794, 1623, -108, -2320, -1111, 128, -167, -2302, 414, 1357, 496, -2013, -328, 903, -363, -1093, 757, 909, -73, -1709, -34, 1493, -394, -251, -742, 81, 1087, -806, -774, 694, 1807, -1365, -1053, 1758, 2028, 221, -2778, 529, 1813, 40, -758, 1379, 2022, 1887, -1371, 1218, 2481, 235, -286, 1140, 2485, -665, -912, 79, 1359, 913, -526, 1254, 1692, 1692, -1726, -1097, 2342, 1687, -398, -1463, 2024, 1539, -565, -1510, 2805, 1344, -1167, -478, 367, 2689, -650, -1022, -201, 1086]
4902A086j297j331P66J775l96k461J499K295k118n24r0K128j816j155k66L463
4918A558J84l813P18K227J09l082K54K778N90k995j107L461O47k258j778K846
4934C39R81j375j994O04K419o76j938N00K920j175j511J068J369j348k720L305
4950G68K56o86j694O0L433k140j972M04M088p85m702K629O16J432k726j730L828
4967A079K54k001j272N79K281k928J03J636J493n14k639J818Q80q07j292Q60J189
4984G19j757o69K043R47p56k242M66L326q10k894Q85L155j789j809j006M356n34
5001A631k637m31K811J642l916r75J848J752k606l4J518J77j389j110K352J621
5017B254k412j789K516J110r46k446J812J117k37k507R88K171j778j238k10K843
$$ y = [1086, -211, -1542, -776, 999, 603, -1858, -359, 1936, -182, -706, -796, 1332, -484, -1639, -1905, 1558, 1742, -2071, -1353, 874, 983, -2099, -1845, 933, 1523, -1472, -2579, 882, 1529, -729, -2507, 339, 1320, -55, -2049, -1445, 974, 298, -1640, -1140, 1780, 605, -906, 162, 1531, 183, -2537, 768, 1024, 338, -1356, -1296, 2137, -3, -1975, -1571, 2517, 1732, -2970, -341, 275, 1707, -1019, -2749, 1079, 1333, -668, -1940, -1361, 920, -2008, -1905, -269, 1224, 710, -1929, -111, 769, -38, -1330, -470, 719, -1038, -1707, 336, 1283, 527, -1715, -1249, 2077, 1267, -1627, -742, 2413, 624, -1185, -2191, 2165, 1631, -1006, -1437, 1374, 3016, -900, -1875, -27, 1725, -881, -915, 603, 780, -609, -1719, 633, 2254, -158, -1947, 569, 1679, 733, -1713, 99, 1216, 979, -1528, -540, 1631, -147, -1385, -1595, 1248]
5033A248l9k626K89K136J217l612o91K503J379k620j792L583L16j864j780K537
5049A84J387k176q45J149K511k956j242Q44K624j123l450K804K229j793k132N66
5065a419L615j971j917J107J941q75j965O80J241m20p57r21K751j303R2n49J162
5082D92p22m21K3J912n84j619l10J790J2j575J30L43K787k145j223J546R34m61
5100I09k316K48J585R15r45k085K055K30j466J98J790q68q09m48J714L55k113
5117a051J64J796k62j410J063l80m8n70q43K528J122k573r17R60K704k007j900
5134a624K114O03j407j487J62M101j633k410R40J783O67k699j88J955J336k837
5150f24k39Q95J276j399j061K356J640k468o72J171Q28j290j859J949P28l1j378
$$ y = [1248, 1209, -1417, -1128, 1008, 2225, -1387, -2078, 425, 1804, -816, -2608, 975, 1291, -573, -2353, 184, 1571, -605, -1450, -301, 2210, -746, -1988, -1144, 1480, 357, -3093, -289, 1940, 147, -1985, -1419, 2196, 225, -1692, -585, 1356, 481, -1484, -804, 437, 17, -740, -1661, 1090, -213, -121, -670, 492, -230, -651, -628, 1284, 700, -919, -1229, 561, 573, -1002, -872, -529, 2258, 113, -1110, 436, 1370, 909, -1407, -1159, 426, 1341, 396, -1689, 366, 596, -870, -672, 1118, 250, -559, -1007, 707, 1062, -1051, -887, 909, 647, -763, 300, -80, -128, -698, -1541, 987, 2109, -464, -1381, -421, 2283, 276, -1624, 490, 1093, -314, -1801, -1639, 2462, 829, -1581, -641, 1142, 1809, -890, -1078, 877, 2213, -624, -863, 32, 1308, -91, -1152, 1204, 2844, 376, -296, 875, 1703, 413, -1446, 503, 1231, 1200, -178]
5167a78K78J559r15j555J143K323j831k879J642J575j75j018r28K139k2j958j452
5184b252J626J637j760K43J398m2j581R3O49rk65L7J149r58j188j52J405J91m22
5203b01l11R46K7j144r67J993P06n47p36J02J175j138l89j040K742j236mk83R25
5222F20j08j171p50J827N13j108o20J447O00k199L04J529j555O21l78N85R01j850
5240g92K3N42O64k0q73k86K017Oj665M05J717o06j851j64J056Q20j375L06K73
5259A97k62q82K01K33Q95j285o0P82J798k866J486J021j163P0j897J787K67q38
5277e16j363J572K677j852j858Q11J571p31j410k90J728J775k273j568K121J45
5293E39K24j389Q87J259j353j007RJ179p00k72q98L260q11j319J148N7J76j207
$$ y = [-178, 100, 1659, 744, -811, 332, 2655, 824, -2055, -413, 1162, 987, -31, -959, 1180, 1158, -800, -2252, -626, 1011, -749, -506, 892, 850, -731, -638, 11, 2, -263, -226, 923, -35, -1223, -1375, 30, 221, -201, -512, 434, 461, -683, -1650, 343, 1049, 502, -234, -132, 1043, -95, -484, -1524, 1218, -18, -22, -305, 620, 512, -659, -1409, 418, 931, -177, -797, 650, 1250, -949, -645, 884, -671, -50, -428, 157, 1058, -792, -769, -227, 437, 417, -456, -742, 1275, 1281, -384, 21, 1738, 1132, -719, -883, 173, 993, -382, -76, 197, -65, -947, -746, -513, 382, -903, -963, -181, 1617, -1249, 237, 1258, 95, 165, -1732, 55, 322, -516, -1879, -307, 2370, 518, -1340, -529, 1042, 311, -1099, -1389, 339, 2114, -159, -1727, 394, 539, 763, -626, 261, 1520, 167, -840, -831, 348, -352, -624, -1522, 1738, 927, -392, 756, 813, 989, -218]
5311b18L62J94J17j400m28P53J835k342R39N81M57j568m05L83K217p05j984J669
5329D57O75j370j113N98j89K200k605R04P42M1j793J131J353j573k16K00Q03L12
5347E57j661N4J912k28o04n92J115L79n83k204L035o55j200j151J208J403O12
5364A397k398N53J485m79k77r64J448l59r57L56J508p66j585M18J786J51j144
5381A73M3M46n54k539J264K319Q86j643p91O19O14j262j380K738Q94j239j347
5398g59k1K140k723O66M23K123j797j576P31J675O51j740j16J511J88j230j198
5415a052K975k596L91q91J550L87k245j42K156Q02k377P84J712q52o82k441J890
5432f31L016m012M12J021K195k134k781K507J059l37m19K69R4k78r3j879K744
$$ y = [-218, 144, 338, 455, -945, -1373, -620, 1215, -1127, -188, 393, 850, -718, -1123, -740, 1477, 772, -1212, 457, 1132, -238, -1351, -753, -942, 1258, -1347, -443, 299, 340, -1453, -322, 1031, -542, -758, -558, 245, 557, -1104, -1050, 862, 634, 30, -562, 553, 932, 349, -1855, 1180, 525, -675, -1826, -618, 785, 1397, -1001, -448, 1037, 558, 281, -683, 765, 406, -551, -195, 1313, 547, -1038, -620, 1166, 1317, 173, 216, 662, 108, -2431, -1167, 1152, 2038, 395, -396, 223, 837, -425, -1805, 933, 1827, 588, -759, -780, 1360, -1363, -697, -274, 1849, 52, -1524, -793, 882, 1533, -207, -323, 1188, 1376, 146, -1052, 1923, -673, -282, -1173, 377, 764, -1481, -1623, 533, 1335, -1042, -258, 1454, 602, -80, -2521, -631, 2385, -1627, -1215, -194, 2001, -133, -2914, -407, 652, 315, -104, 165, 259, -19, -112, -1991, 753]
5449G53j443Q00j383K032l08j761R62O47J436j812j011J496J072j459j281K220
5465I60K01j011j003J338J645k171j356N99K710k066q12L84J468j031j051P90
5481d06J704K38j385k218K009P85r07J043K07Lk364L59J297J480m435J239K923
5498A572j82k652j80J187J342j145j950K240L44o68k373K510J588k070p08J330
5514A85K564l555j218K094J012j331q84J467J717n62l308R95K886n99k653L11
5530h79K795n56l124M57K813J28j942j083J001K201j769k524L262J558k091k191
5546a944K533L35j710k05M59J331j319j246J960P08j45j572P00K290j928j776
5562a529K22L462j217k063J628M73Q46k569o37J236R74j273n95J548J002m71j861
$$ y = [753, -690, 110, -1273, 759, 451, -1310, -348, 299, 1735, -77, -1088, 408, 1480, 21, -1260, 960, 1161, 150, -853, 485, 2130, -41, -1397, -798, 1912, -154, -966, -582, 886, -145, -1196, -406, 1298, 1536, 151, -2067, -58, 727, -180, 863, 1070, 1073, -1291, -932, 365, 1845, -2590, -1351, 1572, 1390, -1262, -1442, -255, 1087, -58, -2008, 232, 576, -92, -2465, 45, 1633, -437, -1145, 185, 2749, -806, -2024, 70, 1082, -249, -1133, 334, 2051, 1489, -1819, -824, 2062, 1463, -1190, -879, 1916, 1360, -1764, -1307, 1506, 1634, -308, -1391, -390, 1811, 42, -2482, 780, 2338, 247, -1944, 589, 924, -786, -991, -532, 799, -520, -1766, 194, 902, 757, -815, -115, 2175, 247, -1529, -1307, 2155, 938, -1125, 503, 976, 1822, -747, -1384, -148, 826, -447, -1042, 506, 1508, 1037, -824]
5579h24J566N43r36j117j27J988p69k021N45J858J16j903M44J255l36k120J019
5596h19K374j007j192k88K178k59k924O89K488Q2k629m32K098k46q33j464K801
5613F17L13j128j432K163J163k224j337J647J864k697P50J74K202k084j839K106
5629B58J399k235j152J538K806k664Q2j247K835j339j338j87K344j86k507n77
5645b170L022J117k348l62P1J966q33k140J394J509m42L88j363J908r73k059O78
5662f37J054R05j592L09K122j765j794J234J340m69k324J703K170j512j623n38
5678a417L108j040j665N74J087J639k060j413J173J814j451p80M69R94j84k456
5694a608J177J451k82q11l21N37l57j88J678n91o30j815J346M59j90p65p63K463
$$ y = [-824, 742, 1285, 349, -768, -895, 1093, 324, -1697, -1152, 706, 822, -1081, -637, 618, 282, -1838, -819, 1555, 548, -644, -932, 1246, 987, -1937, -1248, 1240, 1322, -1307, -1739, 359, 113, -720, -2184, 617, 930, -198, -1630, 533, 1696, -528, -1865, -218, 1646, -1051, -301, -127, 2075, -9, -1848, 258, 1657, -578, -1730, -192, 2614, -50, 32, -1215, 1620, 281, -1057, -1244, 1100, 914, -1593, -2170, 852, 1969, -379, -741, -670, 1296, 463, -1677, -283, 1226, 784, 1172, -191, 1717, 744, -1315, -637, 417, 1322, -270, 39, 2161, 396, -1398, -164, 1176, 707, -1617, 86, 2256, 744, -879, -1417, 1691, 651, -1014, -440, 647, 2286, 226, -1187, -14, 1800, 349, -431, 38, 1032, 848, -1608, -431, 1020, 738, -73, -394, 143, -214, -402, 1276, 685, 55, -1760, -414, 45, -145, -910, -1673, 790]
5712G90K1j561J289O90K73k010J34N17R06j015r03J445N67j624L47j14K022j541
5730B33j25Q1J99J12j451P57J029m11j104J314R46k277J12M67J713o21k040J068
5748BN26P52k842J343J896j183q99m10J697o79j047L02M63J818k699J22J342O99
5766A203j312j165J393J545j969l21J422l26l96j017J03J638K76j782r47J891
5782B36J889k678o20R66J851j178k082J043J657j289j49J05J551L25k507O41K92
5799E3O35q58J029o48m72n51J385Q3r3p26J62O40q58q36J33J834J16j305k232
5818b509K786J061p33k129K542J62j168n53p0J584p09j961L9K598k94j590m58
5835a402J721K45p09q08O89P40k10Q4J70k6o06Q47N02q32j570K293j514N77j395
$$ y = [790, 811, -750, 539, 1229, 1502, -508, -374, 143, 1049, 34, -869, 576, 1143, -481, -134, -248, 1774, 233, 108, 189, 388, 500, -951, -194, 835, 424, -680, 634, 1580, -697, -585, -118, 1595, 974, -1066, 2, 528, 1280, -1562, -219, 1677, 494, -405, -815, 882, 203, -844, -542, -79, 1739, -960, -838, 504, 1203, -109, -1274, 119, 1664, -305, -626, 796, 470, 74, -943, -840, 798, 1074, -708, -1655, 236, 2125, -553, -1173, -207, 1644, 466, -1616, -573, 1084, -205, -354, -249, 1302, 1627, -880, -239, 53, 688, -170, 859, 211, -261, -812, 573, 656, 563, -163, -1, 639, -219, -1055, -922, 912, 1028, -277, -2509, 277, 1338, 605, -1524, 1018, 1180, 12, -541, -611, 973, 264, -1697, -1658, 940, 646, -944, -1402, 319, 564, -145, -953, -264, 476, 266, 350, 520, 494, -112, 735, 1237, 405, -1165, 1128, -386, 191, -1204]
5854a204L83J054n29p03j04J868j74r01q43J282K074k136k573J775J909m49l331
5871b602J057L077q15j128m24N1M26K50j346R88R18K0k241J469P65k55l95k74
5889d59L5o10K89J768M55p81q80k53J265j189l08O95R88j346j453K355R68j267
5907B72r86q31K440l58j462r33J799J295j316q80J016J828k166p47J165J794j472
5924D58j307l48Q73J128j548p0Q19k74L92n88Q59j72o89m32Q80j04j263J533J23
5943B70p41k47J94P44j187J91N29P43K8o19k1J185L31k284n73K230j34p17o90
5962g68Q61J081j094r73J090J724j063k502P39J940n77r03o72J047Q83j232j35
5979e54R22L11l24j83k8N01j046q24J285n52m59J668J361j986j729R63K135r99
$$ y = [-1204, -821, 233, -296, -999, -1103, 765, 591, -310, -1153, 129, 2203, 67, -2506, -731, 1178, 729, -2602, -1545, 1532, 717, -411, -835, -784, -358, -108, -1454, -466, 452, 472, -1769, -300, 465, 210, -185, -459, -424, -1034, -745, 1023, 1478, 697, -183, -436, 829, -360, -668, 27, 1015, -331, -1784, 571, 1539, 272, -714, -1545, 895, 537, -925, -1858, -59, 1236, -80, -960, 56, 1884, -282, -1029, 136, 1930, 458, -849, -1197, -324, 804, -744, -814, 5, -269, 123, -465, 394, 222, -467, -899, -19, -123, -1386, 147, 270, -471, -718, -524, 220, -967, -776, -247, 496, 524, -95, -116, 1069, 1400, -884, -1457, 773, 639, -78, -768, 93, 1174, 80, -893, 197, 1921, 858, -1644, -905, 1035, 458, -445, -1117, -70, 813, -419, -554, 368, 679, 355, 172, 144, 645, -401, -1225, 60, -492, -951, 717, 2078, 92, -1637, -674, 1461, 462]
5997D62j524K62K781l97q94l119K369J728m92l183L64L369l32k542j064L079J175
6014B042k951r72J900J770j520r98l67J925l6j450O88m27K72O6N56j517Q82J05
6032c2P73q12r63M99K559j464m51j931K239J03m16j828J724K160j277k375m46
6049a938L332k16k021j342L716R1k797o24J822J540r93j957J975J414k435n98
6065a031J244K47K8j417Q72M1N54j699J330n3o88M88J282k80k111K98J845N44
6083A494j868j411J803J675j864k664J627K627r19k388J418J137R09l121o90L313
6099A078J95j232j469J022K005j612j647J003J352p09P6q23J469r8p60j17K360
6116B093k548p35J234J33o43m04J163P72k031J25N11J240o44j732J591J637j322
$$ y = [462, -1062, -800, 1981, 1584, 690, -2429, -60, 1668, 1176, -2007, -1643, 1726, 1394, -1148, -2212, 867, 2042, -909, -1881, 19, 1789, 269, -729, -1096, 829, 793, -657, 31, -396, -124, -58, 498, -1019, -137, -32, 741, -71, -1034, -535, 2024, 560, 109, -1822, 417, 520, 104, -1724, 0, 2160, 883, -1492, -1938, 1394, 1178, -843, -2185, 1531, 1622, -1175, -1799, 23, 1563, 570, -1387, 588, 2002, -433, -1031, 213, 460, 488, -929, -57, -16, 538, -1161, 169, 116, -572, -84, 1198, 918, -1193, -895, 950, 1494, -374, -1785, 18, 1693, -171, -2835, -1208, 1419, 500, -1888, -470, 667, 1576, -1545, -2235, 1078, 1273, 41, -1428, -406, 1599, -13, -1660, -657, 695, -14, 62, -761, 708, 610, -150, -267, 2093, -455, -1190, 44, 177, -466, -870, 293, 1065, -966, -841, -330, 910, 266, -1466, 125, 1762, 440]
6133D40k126J474J069m52j545q43K552J216k578q61J335K362p78k361L95K948
6149B247j549k566J029K302j289r32O00N26m51N3l47R52q05J41L63j035M6l00
6167a015J692lq68m88Q92P11j509k144K577O06Q77k293j38K793l61l659M06J451
6185d73K539j347j984O65J871K69k936j74K698J88k047k01J636N11j168r79l71
6202a303K789j264p03M70M04m50M81j36j121J43RK259j140j466J057J234M35l548
6220a850J283K146R88l739r84L103Q80k048j225N59L155j482j433j045J833N69
6236G10k002J10J573O14J02j646Q01N9l19R9r47J193p79R7L34K65L98j73K59J44
6256H92p43o79R24M9j267P24R87K034l604n88Q05J008j959p2R07Q30j4r60n55
$$ y = [440, -1686, -212, 857, 405, -1140, -1983, 569, 1785, -793, -1654, -319, 2043, 1265, -1096, -701, 2247, 698, -1868, -839, 1463, 174, -758, -158, 368, -83, -30, -377, 575, -230, -89, 274, -761, -715, -1015, 677, 674, -194, -682, 210, 921, -588, -2732, -155, 451, 1328, -965, -1103, 1690, 1329, -2330, -1924, -473, 2066, 719, -1265, -600, 1271, 1540, -1396, -1570, 1128, 1316, -731, -932, 704, 1215, 47, -932, -1303, 1486, 222, -481, -11, 393, -57, 424, 288, -833, -690, -681, 1578, 438, -1028, 29, 1263, 1698, -1850, -567, 1579, 2567, -1172, -2156, 947, 1827, -221, -1446, -887, 2268, 786, -647, -1692, 141, 710, -1292, -1182, 391, 1005, 1107, -539, 262, 321, 2, 101, -846, 347, -432, -335, -1, 264, 662, 489, 748, 892, 149, -530, 394, 443, -824, -100, 887, 2921, -683, -1271, -466, 542, -1417, -1489, -582, 248, 234, -726, -1281]
6275a281K458k58j903J1K248k58j717q81J838P02j942J345p73J453j035k57n06
6292g56P47K12n08J14m49L39M81k61J27j044J653o35L11l11r35J112L53p02m10
6311e62p51J845o92j278K70J163O66o79l37J157L83N8k295Q90J379j391j782K154
6329A98O59o66J33j093J546l35j044j70R78P8q70M12Q42j206J479l82K73k95j
6348E36R58n70n39r54J057P86J52k603R95N18Q43j297k180K829J573k807j362
6365b065J941J968k740j255R52J245J315r75j750P79J628r30j991Q42K386j469
6381a19j037K95P89N76n20R0L2p21O68p70L44k57N51J179M2r58j640J638M14l69
6401B27j424K49K004q21j200J012M56M44j915j61K835J20k857nJ303L72j07l201
$$ y = [-1281, 1177, 919, -984, -973, 1275, 1017, -700, -1581, 257, 959, -983, 362, -411, 1042, 7, -250, -756, -9, 203, -305, -191, -640, -301, 180, -81, 46, -998, 655, 20, 331, 20, -915, 197, 550, -152, -562, -1313, 532, -160, -1438, -1168, -5, 661, -18, -355, 802, 1185, 1243, -1052, -162, 1217, -174, -1956, 198, 857, 191, 324, -769, 777, 442, -602, -772, 206, 284, -586, -174, 668, -538, 941, 559, 832, 537, 536, 1494, 924, 385, -569, 488, 1274, 1426, -1177, -182, 336, 1179, -118, -2298, 531, 2104, -703, -2065, -124, 1844, -896, -2151, -1199, 46, 1361, 386, -1364, -585, 1043, 113, -1878, -1036, 1350, -119, -1156, -861, -72, 504, -16, 74, 106, -615, 53, -717, -373, -630, -79, 1100, 1142, 184, -1456, 182, 596, 227, -1197, -948, 1056, 235, -965, 47, 503, 947, -968, -1129, 1706, 1826, -1031, -1036, 267, 639, 532, -2669]
6419b669K866J257q37k001Q32J053K77j032j38K15l22N17N9K6Q00r84m27J311
6437H03j155k26J72P44l65p08O82M40j318Q8J46J325N69k152k89J943K32j658
6455g27j35R80n0K53j342M37J169j195n26J458k23P15n72J24O45r22L48j47J06
6474C96J57j341Q96K61l6R49j443Q10p62M15m38k84M65j33j7L37l27l32O15N18
6494G06j94r35q70J899O5j009o91J386k31L70j125m23K462p65j920J44J858J349
6512B076j788j295J997k08p05j066J025nr7m64l41J179K15j224P67M54q97O80
6530C03k93O90p78j174l39K032j261L3Q64J055j280j08L86M44q6k311O02J591
6548C70P46j082j650J171K479k246o14M03P48n47o82L24Q73O27k142J815j7n5
$$ y = [-2669, 197, 1454, 617, -1384, -552, 501, 778, -254, -392, -177, -499, 18, 77, 103, 903, -81, -508, 803, -352, -578, -406, 338, -27, -735, -53, 387, -931, -843, -697, 628, 1197, -955, -1244, 699, 931, -727, -862, 118, 68, 321, -1021, -584, 585, -610, -1136, 322, 99, 814, 242, 366, 1011, 89, 437, 290, 396, 553, -788, 108, 369, 333, 1282, -161, 649, -113, 302, -136, -420, 45, -88, -105, 232, -95, -427, 188, 706, 512, -423, -1293, 606, 671, -338, -1029, 357, 126, 496, -629, -1052, 1410, 645, -1275, -1131, 727, 2076, 288, -1007, 990, 782, 77, -989, 36, 31, -66, -530, -871, 308, 523, -701, 66, 520, -377, 303, 10, 700, -78, -1252, -1591, 441, -820, -787, 77, 1132, -148, -256, 130, 574, 488, -1823, -1221, 370, 1116, 34, -1616, -445, 2034, -212, -826, -423, 325, -222, -904, -580, 293, 920, -1222, 593, 576, 521]
6566E21p73N85Jl36j310J186J8J02p79N80P35K80r18j231L39J907n16r17J228
6585G02l87j058p86K593l69k975J530N52J420r71j021J514j20p67m17l85J176
6602B31j192K89J667n07j995M03J323N65M9j158m97J603j871K04J297J04j97o33
6620c15O04L94O58j166n66R33j149nR96J65L80j200p34L06J589j036m31J26O17
6639A66q1k46J06J371r31q71J084N44j666o69L26J514k98k27m44J628j448j209
6657a351k9J001J227o47n75j33J235j118o0J062k340O98m75J401j91O62r50K34
6675c49J222j677Q23m35J356M92j385n19R29K78j771N29K44J623k736j09J946
6692D61l41j61j57R30q95l04p45K064n98Q28j024p3J366j992l56J467n71Kk77
$$ y = [521, -252, 333, 334, -2, -1312, -126, -108, -6, -785, -205, 530, 810, -108, -1339, -1000, 907, 391, -526, 702, 315, -743, -1529, 1064, 695, -2280, -750, -198, 1222, 251, -770, 744, 624, -143, -560, -945, 231, -961, -672, 995, 488, -1507, -1104, 219, 784, 833, -325, -822, 781, -1090, -886, 411, 515, 318, -315, 289, 683, 1341, 175, -391, 542, -607, -612, 384, 549, 929, -271, -1005, -699, 890, -146, -577, -451, 166, 85, -161, -55, 1316, 385, -486, 598, 1142, -524, -1193, -867, 647, 349, 122, -322, 1306, -142, -1351, -1380, -379, 848, 201, -374, -507, 728, -390, -450, 612, -1728, -1030, -1505, -104, -295, 367, -583, -349, 873, -804, 19, -416, 940, 1432, 47, -472, 457, 735, -1036, -507, -263, 1360, -1376, -1485, 461, 120, -41, -198, 732, -163, -467, -1212, 852, 254, 1082, 58, -15, 1351, -641, -997, 470, -101, -99, -376]
6711c76J175L00j221p02J202N03rj119P2J948k647P70N93l12N72o58K79q2K68
6730E56p99j018J108Q83o24k81O34R10r59o8j24N65k66r40j57K057p75k028J046
6749b80P63m03l79J236O68j123k826K146K432k431m74O28O33k53j937O91R10N83
6767E84j569L50N64l01M78n5L56r0k60l40N16m41J01r4J347j078m77K6n9J362
6787I20m33j055R43M30j642J124r78J96J942j799J169J05j90j005j92J030l7j019
6805d91m7P90j52j51L8J22n50o48L91R48R43j080o16J64R04q0r57N12J88l02m76
6826e50J268P38j435l74J479K8K83j042j266Q55P16o81q1L06j17o09R07L56p1
6845G10k15q66%K077j085j896K319m42R2K89k17k62K10j161Q08Q51j417l02M05
$$ y = [-376, 799, 1099, -122, -824, 378, 881, 872, -247, -175, 1773, -874, -104, 489, 177, 749, 91, 370, 288, 556, -243, -1261, -153, 730, 106, -175, 459, 1369, 410, 342, 218, 783, 517, -423, -580, 1477, 702, -1326, -280, 483, 80, -299, 937, 1605, 482, -2344, -198, 2234, -197, -671, -43, 590, 337, -1600, -909, 1, 584, -985, -635, -71, -372, 106, 51, 407, 317, 57, -283, 233, -208, -107, -201, 1146, 68, -409, -383, -442, 920, 487, -568, 375, 805, -837, 287, -691, -495, 1447, -352, 817, 922, 732, -273, -465, 565, 528, -491, -538, 252, 100, -51, -13, 109, -441, -1089, -698, 250, 1193, 113, -503, -339, 565, 485, -472, 40, 228, -74, -550, 718, 1456, 21, -353, 1126, 1154, 1437, 395, -871, -16, 700, 19, -62, 244, 127, -482, 425, 781, 710, 495, -371, -371, 1706, 621, -1275, 1044, 602, 694, 983, 766, 504, 714, -447, 361, 1212, -205, -507, -102]
6864a02K059j909n09K21K09J6j002J580m58N4R4k17L76l48r3J7j73Q88l18q4j85
6885A16L46j3j61K82j427P43k7R8o8p65L80J074q07m2Q96j242N73N88J00q32J682
6906A494j076j452L32J872k053J607j546O10J943k484j36N26J360Lj720J30R07
6923C17m18J82N24N11K06j392N73O46j854J030m77O81o14q47P25R80K03j486J259
6942G49p28R00j250p0J74k15o3l42J108k53N61p14j86R31r85Q7K99J340j782Q11
6962C72l88Q3p23N12K73o5l01o41N02J419j119O49r27J068n55m03n09O12J7N5
6982f9O33l66M18m53j547K194m55n96j485J670P98q57M03N18j132Q32m6j317J506
7001F49o30k07N88O97j200K39P33L91j834N45k59O75J05j36p06P44P09m11j496
$$ y = [-102, 1957, 48, -461, -240, -31, -15, -1017, 563, 105, 159, 253, 36, 412, 64, -29, -12, -185, 703, 385, 301, 116, 462, 449, 288, 570, -857, -114, -141, -43, -111, -876, -496, 578, -229, -271, 625, -617, -44, 544, 644, -188, 1494, 418, -1034, -702, 1170, -883, 724, -822, -212, 1731, -753, -889, -363, 997, 1000, -720, -590, 317, -101, 81, 605, 1116, 1322, -70, 503, 1149, -705, 325, -152, 529, -85, -932, -207, 773, 976, -510, 749, 21, 921, -329, -399, -225, -440, -503, -845, 263, 10, 571, -143, -329, 602, -383, -296, 3, 1343, -439, 372, -16, 67, -656, -144, 129, 64, -237, -878, -376, 1043, -76, 573, -354, 714, 159, -244, -753, -141, -124, -69, 564, 198, 616, 163, -1384, 810, 355, -241, -1726, -56, 742, -115, 288, 806, -326, 506, 460, -857, 649, 19, -188, 400, 1097, -103, 136, 869, 1260, -574, -29, -288, 387, 492, 356, -350, 394, 1103, 692, -804]
7020h04n23K610o00r72J52P06m0j285m11J127L62q34k59J511n32l79p7N83N75
7039I10p01j598J518K0j34r35M68P31r94q34K252J65j519j14M36P68N34j897N58
7058c66J189j157K43k11J472j057q14M57L95k90K9l39n0J029P51q15o16N71m78
7077e7r28K628k151l39O43J136p34l26k26N43L9m15K12N43R4q75L01o32Q59j47
7097A68n28q1L10O34j129J42R40j04q27NK28O39j296o6R94l2q00R7J062K10r30
7118c64M36J4M51j412K25J254On56l0l78P19j00O6j200O63Q3n24J031j25r28o37
7139a306J157oP77r08n60J665r01j499J173Q53m44j475R90P12N73j942J259N67
7157F85o10l98r4M73k36L9Q1K53J113r41j658J644N3n3j084J044K43o85L04O7
$$ y = [-804, -1327, 1283, 683, -289, -137, 569, 529, -756, -1167, -40, 322, -512, -771, 740, 208, -171, -248, 335, 910, 209, -1389, 129, 149, 15, -920, -452, 279, -715, -1549, 703, 868, -651, -765, -329, 439, 973, -924, -366, 823, -334, -91, -302, 1170, 113, -701, -244, 151, -139, -110, -449, -499, 530, 1281, 466, -150, 421, -57, -985, 1643, -508, -847, -204, 932, 198, -128, -354, 189, 228, -187, 25, 568, 662, -213, 88, -544, 315, 168, -360, -441, -131, 503, -626, -484, 456, 352, -475, -470, -242, 397, -899, -965, 29, -3, -803, -706, 356, 566, -364, 72, 86, 537, -875, -650, 604, 610, 54, 24, -354, 365, 265, 331, -869, -206, -123, -647, 384, 259, -669, -1306, -149, -155, 622, -286, -846, 819, -82, -1581, -408, 445, 1, -1474, -484, 228, 801, -1141, 118, 685, 75, -323, -417, 56, -180, -141, -60, 193, 1306, 365, -1293, 351, 404, 351, -733, 311, 554, -131, 173, 240]
7177B40J80k26j006O85L95l9j22J58K50k30J77q61J802p05q65k26O63m14l58K5
7197d77O72Q70r82o93L88M45n4p63M38J338o81m57P54l74K14j665J879j086O20
7216C86m92M76L05n19q46L26L68L53k93j05M91n40l87m0Q24r62M05j135P00J571
7236H86j68j522J462m36L42n26M06K24p57m35Q06N28j327P47j032J782j078q32
7254i30N37Q04j332J30L69J153l49j433R60M75m53j078R22N82J063k593J453k14
7272F6n41P55n69m92J260j48l18J55N13k80j100M71J637m52j13j461R14l71m82
7291e56J196l7n44M93n53Q65j0k843J056J843N51j700q5J418k81j066R92r47R36
7310G28o77m29m04K085Lj593j92J907j381k85P83j71l46l57J476p70k62j278Q57
$$ y = [240, 420, 194, -812, -127, 268, 229, 107, 265, 515, 285, 462, -399, 1403, 698, -167, -393, 270, -144, -502, -477, 195, 1065, 83, -610, -222, 223, 169, -594, -156, 1182, 501, 44, 798, 424, 638, -1027, 852, -234, 386, -106, 370, 675, 156, -690, -364, 4, 357, 64, -41, 450, -90, -477, -517, 307, -655, -250, -1385, -685, 886, 718, -804, 658, 222, 564, 38, 444, 668, -89, -524, 282, 810, -517, 230, -802, 980, -98, -930, -393, 411, -921, -791, -422, 731, 382, -1051, -91, 384, -69, -1147, -225, 357, 1420, -1173, 280, 66, -475, 280, -289, -781, 479, 331, 13, 168, 681, 401, -699, -228, 1409, 957, 844, -617, 297, -74, -556, 640, 603, 59, 552, -1, 864, 854, -1989, -933, 910, 1461, -239, -324, 1094, 813, -253, 739, -208, 728, 51, -378, -782, 1303, 1306, -287, -479, 1428, 47, -238, 545, 374, 28, -329, 1147, 377, 115, -1163, -306]
7329c06J541j390r21J460N18j076j117m5J159O4L22L61J40n21m98K37P08j212
7347e76J023q91O29Q9l70M8N14o76o79N56L97M90K1r42N22n16j54k18N86O06P6
7368E35k22j046K84J752j291l0l46L17m36Q3N18M83j329LR80l65l01o77K18P50
7388a20l50M02k36M91J214j717l13J797j157n88J813j244P67j688O70K78Q8j007
7406i00O72J76J801j235p50N91K89m1j279J432p30L11j181R01M75k16q23j477
7424a984K560K77j596p1J477K58p01M7j7p16P93J69j43L1n15K79L77j200Q5J098
7444E08o30J800l274J540J093k24O3j681J050j36p15O04m7M37r62J323L01n65
7462D85j22j577J218O15j428L11k87J172l29M86o98k56O02j663J002J518r22P55
$$ y = [-306, 1235, -155, -1076, 384, 902, -174, -1291, -1336, -177, -113, 209, 570, 710, 189, -309, -72, 636, -576, 447, -444, 185, 274, -96, -48, 466, -210, -889, -333, 64, 554, 575, -367, 155, -361, -515, -733, -147, 459, 535, 313, -733, -449, 1303, 12, -18, -364, -47, -483, -400, 118, 601, -728, -725, 255, -110, -411, -1088, -870, -120, -470, -68, -304, 187, 1401, -316, -629, 1168, 11, -577, 1236, -8, 759, -929, -259, 19, 107, -900, -228, -52, 1749, 514, -236, 355, 644, 603, -676, 756, 26, 337, -844, 57, 532, 316, -507, -1984, 576, 853, -743, -814, 663, 921, 220, 267, 250, -466, 327, 496, 353, 384, -131, 148, 525, -675, -590, 508, -122, 1678, -1596, -56, 1037, 813, 876, -805, 245, 109, -606, -2, -49, 388, -574, 749, 1050, 485, 363, -1214, 4, 619, -809, -498, -785, 387, 58, 544, -154, -410, 192, -1471, -469, 1049, 127, 882]
7480H82j981J962K26j482k03J3P80O50r33J07R12o25n15J182q82p96o78J422j459
7499a418J585j068J057j42k34K71O3O11q54n9q30K332l90j764P64P75m04j074
7517g79m48K758j513K11o20N47m23P55j715Q09Q30J41r1j691J506J63o68j153
7535a381K700j155O28p46k89K84q10J227k50M59r34M62P75j564L23m36N68k32
7553c71l62j196J975O88q5q84n47J765l25j285P77n08P98k54o85J511j024M74
7571D62q59P25m07j075Q89P88q69M94J58M3J03j77k75l06R89r02K84L47N24p61
7591A75N80j694K186K2j906J028l04%K05p04L98J529j248o77K61M63q81M36J96
7610F5l85k94o2P88q31Q21j07O23l06k42J00K62J08j06n52J13J451j735O72o93
$$ y = [882, -1099, 863, 1089, -393, -596, -583, 197, 847, -86, 21, 933, 308, -207, 975, 93, -703, -1381, 41, -1418, 167, -901, 156, 14, -220, 51, 114, 725, -129, -188, -1018, 1314, 924, -840, -76, 699, 295, -779, -1227, 1531, 18, 229, -391, 156, -267, 488, -1227, -418, 412, 553, 462, -1229, 277, 440, -228, -1381, 1319, 164, 792, 46, -243, 41, -769, 458, 208, 667, -267, 195, 970, -594, -271, -707, -139, -371, -733, -1929, 46, 734, 649, -235, -782, 983, 658, -627, 150, -358, 440, 186, -499, 1012, -12, 462, -397, 328, -79, -1154, -265, 523, -346, 148, 306, 349, 452, 275, 0, -306, 683, -219, 65, 412, 936, 175, 755, -939, 1247, 1269, -637, 391, 87, 87, 292, -412, -14, 1515, 267, -410, -149, 314, -567, -131, 65, -320, -614, -676, 112, -719, 102, -5, 618, 312, 70, 170, 432, 540, 434, -118, -5, 1446, -289, 383, -310]
7630c10k03J257j703K104j204J1r35J326P39r56P2j135J266J53j081R80k45k7
7648A09l90l56N30Q03p85l45Q64j165J91m62J295jl71l07M91J34j754M94M64J515
7668I54q97l63J52M25Q65j846M01M96p93O80o4P4k74L5q12N70Q90n66O1K06p7
7689A17m77J146m28J50m30K05j112J120l99J99m74L67m56K63Q28m74L30j46l78
7708d9N13N40r19l43m4L01q59L56O64J036r33P6k75j66k36L07J434L20j164o50
7728i1M5Q68j045m8P13Q15j838j59O09M00Q43m81j362J742m28n21l73M56P5l30
7748a10o27j09N39n1o20M60P98n63J022L69j050P5J21J14M48k48j141P78M33r20
7768b82m04R91R90r34j375N99P40n43o53O60P3r6J38j92j2L65l77m67J001L38
$$ y = [-310, -513, 744, -959, 1145, -59, -48, -983, 343, 1082, 126, 198, -937, 329, 482, -599, 381, 136, 109, -281, -637, -107, 696, -89, -434, 430, -735, -544, -1006, 289, 288, -83, -390, 101, 235, -1519, -1025, -561, 954, 57, -306, -154, 271, 1136, -710, -309, 187, -606, 74, 10, 84, -190, -155, -967, -397, 493, -73, -12, 194, 117, -360, 786, 358, 508, 78, 283, -829, 291, -108, 91, -383, -16, -472, -209, 619, 145, 475, 329, -49, 464, 1004, 85, -258, -302, -1, -860, -504, 160, 1196, 263, 339, 64, -102, -338, -31, 1403, 1723, 559, -91, -46, 822, -223, -271, 442, 1257, -581, -740, -131, 269, 1112, 631, -731, 1011, 583, 62, -311, 145, 220, -110, -737, -846, -307, -358, -978, -518, 280, -283, 739, 1108, 58, 133, 254, 368, 816, 568, -573, 205, 638, -282, -686, 305, 1295, 361, -1014, -415, 325, -218, -871, -211, -138, -234, -96, -288, -300, 65, -312, -779, 222, 560]
7788E60j531N69J103k85j30m81P39j298L44R32N70j238N9j91J79j1l60n26J548
7807E52m50j4J26m7J031j763k62J143M41o44j287N34P77o12K46L73K55N3r76R3
7827d31M91J64l20m0R87j349N66k25Q52k9Q23n66j477M29P15o68M29N87j052P97
7847F83m16K48p18o52L40M1J67j313N87J944j340M35n43Q22j87j563J430p4L3
7866g6r9n24R72M35p86L21p4L96r56o31J228P95j285m72O89%l83K59o02J19J364
7887F90q42l66K37J002l18j057N29L1J00N0J616r50j353P02J314j933j32M04J043
7906G67m84q04N4R90L12j181n22N89J081m86j75k91Q34M31j522K27J112p33l19
7925a20k64N74j04n79N20K51j051k56J097j53j87M57M03l88q43j86J009k60j3
$$ y = [560, -971, -402, 701, 416, 286, -195, 544, -754, -410, 522, 1092, -146, -87, -278, -99, -110, -470, -996, 552, 102, 88, 214, 167, 1198, -565, -827, 316, 757, 113, -1174, -640, 137, -475, -229, 144, 399, 452, -524, -431, 60, 224, -96, -136, 851, -498, 68, -157, 695, 666, 1489, 923, -554, -125, 590, -78, 351, 938, -114, 683, 267, 515, -203, -855, -515, -474, -307, -1620, -1033, 911, -429, 6, -537, 285, 98, -1465, -35, -109, -76, -175, -699, 273, 708, -78, 243, 169, 565, -391, -1022, 206, 1001, -284, -756, -67, -67, -450, -191, -793, -674, 690, -152, -518, -281, 721, 403, -654, -125, -94, 6, 56, 1672, 722, -631, 71, 1385, -548, -680, -276, 767, 283, -521, -467, 523, 835, -346, -868, -279, 802, 316, 141, -150, 684, 1115, -407, -180, 932, 199, -120, -384, 190, 86, -493, 27, 278, -773, -1029, 68, -85, -272, 185, 588, 200, -643, -829, 180, -80, -93]
7944i3l74m16J672p82p31L61P01K23m57j16o24J943r56j147p4J256J30L76k277
7963a385K507l69k39k66j095M78j387J995m49O03K64j201J484j751j06J690r08
7980a35J087j313N14K93K29j496m72J727p02J532k177J225M72m49p02R19P48j549
7998b49q92J125p9k68m44M16Q44m71J20Q49q50K06o32k17j324J591Q19l81j595
8017a432J571N22j803J677l3l41n0L53K40j553J434O72k9j695N6m2J519j723J41
8036e16P72N65j152j130J809N72p95n64K67J129j036J003j846R01Q11p65J02p33
8054f06J480o6p36o33J064J18j689L7J577r15M75j331J322j356Q97J64J69N39
8072E10n91Q4J018j278j283K034m78P63j794L98J350r63n14l29J445m91N65k35
$$ y = [-93, -467, -883, 789, 7, -724, -363, 338, 561, 104, -12, -636, 1307, 351, -796, -870, 386, 516, 892, -1385, 1122, 753, 514, 248, -847, -369, -1756, 239, -210, 393, 657, -544, 940, -811, -917, 773, -135, 952, -361, 153, 446, 675, -821, -1293, 434, -268, 1264, -913, 312, 784, 335, -367, 552, 1300, -249, -1141, -16, -95, -363, -807, -391, 453, -18, 102, 951, 101, 307, -325, -542, -1866, -275, 544, 163, -1432, 139, 661, -1142, 535, 502, 161, 111, 464, 704, -849, 585, 1257, 1228, -467, -411, -453, 1066, -657, -516, 256, 821, -331, -1461, 348, 920, 125, -439, -172, 957, -79, 924, -922, -21, 790, 25, 127, -606, 874, 808, 72, -561, 503, 621, -1068, -1031, 546, -369, 106, -1225, 97, -1259, -362, -198, -29, 510, -81, 3, 1021, -257, -1540, 494, 16, 779, -1015, -617, 733, -230, -744, -1073, 372, -119, 446, 211]
8090B11m31R75J96r39j869K415P11j869j36L49K91K01j368J422l17L23J92r21
8108e64P58P9K53n29J369j502M08K88M0j001Q11J40q23Q4k8J178j40j664L45R45
8128D47J52j75j444J491j83J105k587J276j31J107j053j190J450P6L39j630Q88
8145f2P54p38Q4j25k62J566j256n02N54N38j339N90l79J38m24N63M86N26j165
8164d53n97P80J14l13Q32L74j115L55J083q41Q29j716k7J815j979Q00r27J312
8182C26l3j458J885L19q97j9j162J292O2
$$ y = [211, -220, 755, 951, 12, -1857, 558, 1269, -600, -736, -387, -96, 105, -1263, 159, -158, 165, 357, -564, 194, 273, 526, -3, 1366, -136, 272, 560, 600, -401, 410, 550, -273, -189, -217, 961, 821, -843, -498, 447, 599, 424, -1020, 471, 288, 1393, -1194, 82, -49, 1058, 5, -1185, 265, 341, 680, -950, -62, 692, -46, 38, -87, -349, 1217, -39, -541, 13, 551, -788, -198, -577, -439, -863, -300, 186, 712, -453, -1050, -270, -156, -469, 363, 737, -378, -23, 1060, 219, 1048, -668, -695, 1120, -859, -59, -986, 326, 293, -1165, 720, 1039, 142, 123, -1039, 253, 315]
8191C15
$$ Imaginary data points
##PAGE= N=2
##DATA TABLE= (X++(I..I)), XYDATA
0@%%%%%%%%%%l7J45k16K16k16K39l47M32m54N62o69P74q87J018j203J357j528
27h14J739j974K237k521K826l177L568l976M418m917N467o061O711p431Q229r113
43d789J0094j1181J2398j3779J5352j7154J9245k1714K4667k8288L2856l8823
55b1116M6964n8787P7616j12283J96658p78303q83387J937599Q14890j385656
65a65805r49654J304433R33723j011653j053349P53955R47941m64846q98557K59260
75c44552P31578m3863n88134m8943M37038K04225k42481k26669N9035K09982L2786
86A80002j96393j42415J56726J88057j13103k45467K0300K14407N4214j42243
96b5915o8391J05547J22393l4396j48436m4632J59639J30177j35338j92828Q7084
$$ y = [0, 0, 0, 0, 0, 0, 0, 0, 0, 0, 0, -37, 108, -108, 108, -108, 131, -216, 216, -238, 324, -345, 429, -458, 560, -643, 714, -814, 925, -1049, 1188, -1333, 1493, -1684, 1884, -2092, 2326, -2591, 2876, -3185, 3526, -3905, 4324, -4789, 5305, -5876, 6522, -7257, 8095, -9059, 10186, -11528, 13139, -15149, 17707, -21116, 25848, -32939, 44677, -67606, 129052, -649251, -1532638, 404961, 1219851, -165805, -1115459, 188974, 1122697, 111044, -942305, -188350, 759591, 294745, -603812, -344552, 387026, 343163, -244971, -293914, 143124, 347349, 104868, -121801, -62766, 147216, 180002, -16391, -158806, -2080, 185977, 72874, -172593, -152293, 62114, 116328, -25915, -94306, 11241, 133634, 99238, -49198, -93830, 65809, 195986, 60648, -132180, -45096]
107d5096J97968q5065k38133O5601K83754o431k69546j2034K54179J2855k30584
118g2532J7189K28806m4222k29313M3134J67248j17965j64690J71462J73070k02025
129b9838j76982K23579J78048k41209j79781K75653K22942k70856k70438K24360
139d4522K74822k05978k93160J83264L20855j35425l25387P7288L17631j2218
149A57170k72845j4846K64029O8518k44059j37211J92893J74980j41520j84332
159a37223J05342J91331q6184k04038M1268J97407J2157j56000m4661J09436N0419
170G9254q7133q0403N0884J06831K299j13536o1567Q8788R4302o4036j20027N8503
182d5841J70852k3441k23461k9171K48034P6387k58252j08155K78563J43947k94817
$$ y = [-45096, 152872, 67807, -170326, -104725, 179029, 172598, -96948, -108982, 145197, 158052, -72532, -55343, 173463, 129241, -100072, -56938, 110310, -7655, -172345, -883, 172187, -29838, -206820, 16759, 194807, -46402, -226183, 49470, 272412, 1556, -268882, -44522, 230300, 24322, -268838, -85574, 235281, 99856, -225531, -148243, 169388, 157170, -115675, -130521, 133508, 202026, -42033, -179244, 13649, 188629, 47109, -137223, -31881, 159450, 73266, -130772, -89504, 107903, 120060, -35940, -80601, 28835, 79254, -7879, -88282, -37398, 69433, 71732, -41804, -103371, -14583, 79719, 15683, -104344, -45841, 125011, 101570, -121891, -151062, 96972, 173359, -84893, -193048, 85515, 229462, -65355]
193f5355j94335K83823K44338k42665k60188K11136K82668j83864l19223J33167
203a10498L38955p0884l41100J5394L20396J8981l09826n8210K95037J08989k50576
214d3342j43436K02016J58212j72637j77588J44763J98969j12397k10790Q0429
224g5801J99264o3898j79758P3081J84377o3569j73073N1879J52405m9273j33060
235g7426N6301J26863n7234j30679M2410J17700l8653j01701M8601R9107n0476
246C4813r3602M1827P0638m1815m2672N2560J5722o8600o425O4155k1995p0522
258f5916M5451Q7470n5690j09399N1057J26055m5409j37421M2542J65374l0555
269G3559j89194j546J98155K3625k01800m0928K00365O5315j96940r7381J82014
$$ y = [-65355, -259690, 24133, 268471, 25806, -234382, -23246, 259422, 75558, -243665, -110498, 228457, 157573, -183527, -168133, 152263, 171244, -138582, -196792, 98245, 207234, -43342, -186778, 15238, 173450, 813, -176775, -32012, 166957, 54560, -156230, -75801, 123463, 59565, -120193, -47112, 137265, 73696, -99377, -47498, 104907, 55634, -77426, -21125, 105738, 48504, -82175, -39765, 77935, 39282, -62419, -13818, 85289, 34813, -58789, -16962, 53676, 11861, -30811, 21749, 37471, -31129, -37554, 26601, 4606, -65916, -20465, 67005, 11315, -98084, -47027, 79028, 33619, -103802, -61260, 104114, 73559, -115635, -117181, 80974, 104599, -97201, -138129, 62236, 127551, -69389, -166770, 15244]
280A5244J32034j49833j53319J27428J75166j08166k01354P7771K19596m8162
290H6405k25446K3007K22171l499k19701j6381K17775M9216j98186p0413J74558
301C9506Q6826j59854j03562J44974J17942j24274j25705R8938J22924p4856j13178
312i0319N7645J06781l0382r4145K811P5299J9249n5051l6080M0354M7554k5172
324A8544o0463K125O1908K3108n5188m0967M4312N9948l3998q4010K2071J02630
336F0020k711j17863j5639J24368L2211j29350n0398J29862P3851j21358r5956
347a12963J05814J19093r2276j35993Q0700J52232o3119j66003M3205J73217k7342
358G6565j71119J3700J68322L944j60115k4015J50638L8215j34207n1389J24453
$$ y = [15244, 147278, -2555, -155874, -28446, 146720, 38554, -162800, -85029, 134567, 86405, -139041, -116034, 106137, 102638, -117063, -133444, 84331, 133547, -64639, -135052, 39506, 126332, -33522, -137084, 7890, 125832, 1558, -124147, -25209, 97715, 22859, -90319, -32674, 74107, 43725, -50420, -47609, 27690, 46939, -8112, -44192, -3838, 43716, 18544, -41919, -39794, 22114, 45222, -9966, -50933, -6621, 53327, 19329, -64681, -42610, 60020, 57309, -60554, -76193, 48175, 80386, -48964, -99362, 30500, 104351, -17007, -112963, -7149, 111944, 19668, -116325, -35625, 116607, 53488, -112515, -69310, 103907, 76565, -94554, -80854, 87468, 91412, -68703, -92718, 57920, 96135, -38072, -89461, 34992]
369C4992O1480j15286o9448J03400P7516r5745p1980Q3424O9676p4286o6265O3878
381A356O2508m9895n7141L6225N3011k5399n2412J8879M8851j0514m3570P103
393a0998L1925p264k2546Q239Q014j3033N938J8456j9910k6964L2352L7437m0087
406A559m7036M0361O1823m0758p8596L0986R5358k2574j14217Q111J29522L940
418F8479j38864j8247J48489L4812j49401m9060J46408O4459j38407p8744J26501
429A6425R1507j14963j05171J00303J17346q9515j24329P9953J32754o6882j35544
440i8116N7235J37181m5114j35838K7942J30053j3540j29309k949J23051J8652
451F9248j17590l5110J15230N0968j06466n8458R8197O5550q4349o7627O6512
$$ y = [34992, 96472, -18814, -88262, 15138, 92654, -3091, -75071, 8353, 78029, 3743, -62522, 1356, 63864, 13969, -43172, -6947, 46064, 20665, -31747, -12868, 35983, 25469, -18101, -10998, 20927, 13663, -8883, -644, 7370, -5663, 275, 18731, -1179, -28143, 4209, 41646, 1559, -45477, -5116, 56707, 15949, -62647, -31661, 63697, 41123, -73094, -64983, 64539, 68479, -70385, -88632, 59857, 94669, -54732, -103792, 42616, 107075, -31332, -110076, 16425, 107932, -7031, -112202, -11899, 105447, 15932, -108397, -28444, 104310, 37428, -98116, -40881, 96300, 51186, -84652, -56710, 73343, 59803, -69506, -72455, 50596, 69248, -48342, -83452, 31778, 82746, -23720, -82178, 16019, 81569, -2780, -70407, -3895]
462c895O7546n1989o6805L1815O1730j4604n7022K088N3116P472m0132j2049L1888
475I159J5234j8788j4222K860Q337Q498p193k5356J166L5200L238m4210r224N1173
489A5872J8288n1096k3513N0460L3180m8700m4829M3876N4916m1773o7372L8501
501b2190P3691l4633p9242L1763Q6343k1194q4003J7479Q3821p728p9055k399
513c7347P5333J3177p4539k2400O6007K6460o1400k8788N8705L2435n1709l0898
525c4964M4932K6365l4750k2780K6449J8635k0622j5838O319J1364m174n831O59
538d236L584j045J581J495q162j241J9869P486l0075j0960L6011J0773m5158j4836
552c4914N1701K0285n2913k9819M9255L7632m4367m6397M4043N9048l6113p4085
$$ y = [-3895, 63651, 11662, -55143, -23328, 38402, 23798, -33224, -31136, 21980, 29452, -10680, -22729, 9159, 24393, 5605, -8617, -5757, 2580, 11078, 3885, -21471, -20305, 14895, 18133, -26077, -35301, 15872, 34160, -16936, -40449, 10011, 43191, -5509, -50338, -6462, 48454, 6681, -60691, -22190, 51501, 16868, -62374, -30611, 55732, 34538, -49465, -31986, 51835, 44107, -34948, -37347, 37986, 51163, -23376, -45776, 20231, 46691, -14709, -43497, 15208, 47643, -4066, -34964, 9968, 36333, 1583, -21197, 5252, 23887, 3265, -12573, -6254, 5110, 936, -4895, -4236, -652, -1697, -116, 1379, -6783, -8024, 11845, 19331, -10744, -21704, 14307, 25080, -20078, -34914, 16787, 37072, -15841, -45660, 3595, 41227, -3140, -49537, -5494, 53554, 17441, -56644]
564e6644K5251Q3609j7750q7535Q313R3658j931r8067j1261R6541K2205q7417
576c1028l1435Q7714M0976q8369n2815Q5377O6020q0948o8315P9434P0938q1294
588c745p7529Q1123Q3279p0906q2611O5746Q1432o0609q6023N7130R2016m4931
600C4372r2936L5720Q9747l3595r1239L2241R1253k5524q6046J9244P2376k2087
612B3526o2670K1960N9061k0488n0502J3608L8427j5399l3117K0507L4824k0254
624I483l7779J7057L1475k4876k7862L1220L1278l0672l4154K6768K7618k2549
636b993k3656K5878K9438k0724l4609R839L0383l660l2007P040L9961n469n1293
649c1872l243N0430Q882m3648n640M8019J0735n3287k4489N2885L5034m5898l8001
$$ y = [-56644, -31393, 52216, 34466, -53069, -44756, 48902, 46971, -51096, -62357, 34184, 56389, -31028, -62463, 25251, 66227, -22142, -74957, 10420, 76440, -4508, -72823, 6611, 77549, -3745, -81274, -151, 83128, 12222, -70389, -4643, 76789, 16180, -69843, -12713, 79303, 34372, -58564, -22844, 66903, 33308, -57931, -25690, 65563, 40039, -46007, -26763, 45613, 23526, -39144, -17184, 41877, 21389, -29113, -15505, 22922, 7523, -25594, -5087, 29737, 9483, -28296, -11239, 20236, -4640, -32502, -1282, 29996, -676, -34830, -8062, 19556, -2993, -26649, -771, 28667, 7943, -26666, -16827, 13556, 9896, -22111, -15071, 24890, 19421, -31872, -35115, 15315, 24197, -19451, -25091, 22928, 33663, -19624, -44113, 8772, 43806, -2092, -40093]
662d0093M3517M4789n2479n5982N0761O7981m0784o2745L9778N9110m1933o0827
674d8907M0031O4771k5751n9514J8591M7229k0977m8802J9488N1606j0319m4931
686a7485P227L2690j2415k7240J6564K7593j0695j7838K457n190p834J1880J0455
699A0169j4637l456K1058l489l6307j797M3969J3770l8327j7576M1570J5539n4055
712b3569k6847N7155M1074n3781m3485N0725L6477n4843l7676N5986M9192m2603
724G805m6308K7872L5634k5259l4829K4237M2884j4054m4625J174L2471j343k8028
737b2369R137L5996m90l7323p895K3642R071j6787m416K1699J1350k6718k5463
750c0566J9425K7609j2149j9283K2771J9250k9598k8650K7028K7305k1081j5225
$$ y = [-40093, 3424, 48213, -4266, -60248, -9487, 58494, 17710, -45035, -5257, 53853, 11920, -48907, -8876, 55895, 30144, -29370, -10779, 36450, 15473, -33329, -13841, 37765, 27446, -17485, -10258, 22432, 10017, -17223, -659, 26934, 16239, -1599, 858, -4332, -12166, -286, 10169, -4468, -7924, 13134, 9645, -26662, -28459, 15510, 29280, -9047, -26623, 14947, 30486, -23569, -50416, 6739, 47813, -5968, -49453, 1272, 37749, -17094, -54770, 1216, 50408, 7805, -38503, -10631, 25003, -256, -35085, -10848, 32036, 17982, -26643, -25469, 7002, 5659, -22369, -13232, 22764, 22274, -15049, -22944, 698, 9769, -7018, -11434, 10265, 21615, -5103, -30566, -11141, 16468, 4319, -14964, 7807, 27057, -2541, -31191, -4163, 23142, 2061, -13164]
762a3164K7308J1148l5783k4128L4848K8184k8527k2699L5791K5511m9667l9721
$$ y = [-13164, 14144, 25292, -10491, -34619, 229, 28413, -114, -22813, 12978, 38489, -11178, -50899]
$$ [...]
##END NTUPLES=NMR FID
##END=
