##TITLE=1H_AT-38C
 CCl4+Pyr-d5, 56 sc, 
 14.3.2019
##JCAMPDX= 6.0         $$ Bruker NMR JCAMP-DX V2.0
##DATA TYPE= NMR FID
##DATA CLASS= NTUPLES
##ORIGIN= UXNMR, Bruker Analytische Messtechnik GmbH
##OWNER= root
$$ XWIN-NMR		Version 3.5
$$ Thu Mar 14 15:33:26 2019 Russian Standard Time (UT+4h)  she@DPX200
##.OBSERVE FREQUENCY= 200.1315
##.OBSERVE NUCLEUS= ^1H
##.DELAY= (6, 6)
##.ACQUISITION MODE= SIMULTANEOUS
##.ACQUISITION SCHEME= undefined
##.AVERAGES= 64
##.DIGITISER RES= 18
##SPECTROMETER/DATA SYSTEM= spect
##.PULSE SEQUENCE= zg30
##.SOLVENT NAME= Pyr
##.SHIFT REFERENCE= (INTERNAL, Pyr, 0, 15.7039)
##AUDIT TRAIL= $$ (NUMBER, WHEN, WHO, WHERE, WHAT)
$$ ##TITLE= Audit trail, XWIN-NMR		Version 3.5
$$ ##JCAMPDX= 5.01
$$ ##ORIGIN= Bruker BioSpin GmbH
$$ ##OWNER= she
$$ F:/spectra/data/she/nmr/H-F/1/audita.txt
$$ ##AUDIT TRAIL=  $$ (NUMBER, WHEN, WHO, WHERE, WHAT)
(   1,<2019-03-14 15:32:11.53 +0400>,<she>,<DPX200>,
      <continue with go, POWCHK disabled, PULCHK disabled
       configuration hash MD5:
       00 E9 B6 7A A2 85 ED C7 34 08 36 98 17 FE 4E 26
       data hash MD5: 16K
       A9 7F 45 DC 5F B3 54 FB E8 47 26 21 B6 7F AF 87>)
$$ ##END=
$$ 
$$ hash MD5
$$ 4C C5 12 DF D5 0D 62 F9 8B 85 33 D6 64 EE 58 D0
##$RELAX= 
##$RELAX= 
##$RELAX= 
##$RELAX= 
##$RELAX= 
##$RELAX= 
$$ Bruker specific parameters
$$ --------------------------
##$DU= <F:/spectra>
##$EXPNO= 1
##$NAME= <H-F>
##$PROCNO= 1
##$TYPE= <nmr>
##$USER= <she>
##$AMP= (0..31)
100 100 100 100 100 100 100 100 100 100 100 100 100 100 100 100 100 100 
100 100 100 100 100 100 100 100 100 100 100 100 100 100 
##$AQSEQ= 0
##$AQ_mod= 1
##$AUNM= <au_zg>
##$AUTOPOS= <>
##$BF1= 200.13
##$BF2= 200.13
##$BF3= 200.13
##$BF4= 200.13
##$BF5= 200.13
##$BF6= 200.13
##$BF7= 200.13
##$BF8= 200.13
##$BYTORDA= 1
##$CFDGTYP= 0
##$CFRGTYP= 5
##$CHEMSTR= <none>
##$CNST= (0..31)
1 1 145 1 1 1 1 1 1 1 1 1 1 1 1 1 1 1 1 1 1 1 1 1 1 1 1 1 1 1 1 1 
##$CPDPRG= <>
##$CPDPRG1= <>
##$CPDPRG2= <>
##$CPDPRG3= <>
##$CPDPRG4= <mlev>
##$CPDPRG5= <mlev>
##$CPDPRG6= <mlev>
##$CPDPRG7= <mlev>
##$CPDPRG8= <mlev>
##$CPDPRGB= <>
##$CPDPRGT= <>
##$D= (0..31)
0 1.2 0 0 0 0 0 0 0 0 0 0.03 0 0 0 0 0 0 0 0 0 0 0 0 0 0 0 0 0 0 0 0 
##$DATE= 1552562918
##$DBL= (0..7)
120 120 120 120 120 120 120 120 
##$DBP= (0..7)
150 150 150 150 150 150 150 150 
##$DBP07= 0
##$DBPNAM0= <>
##$DBPNAM1= <>
##$DBPNAM2= <>
##$DBPNAM3= <>
##$DBPNAM4= <>
##$DBPNAM5= <>
##$DBPNAM6= <>
##$DBPNAM7= <>
##$DBPOAL= (0..7)
0.5 0.5 0.5 0.5 0.5 0.5 0.5 0.5 
##$DBPOFFS= (0..7)
0 0 0 0 0 0 0 0 
##$DE= 6
##$DECBNUC= <off>
##$DECIM= 24
##$DECNUC= <off>
##$DECSTAT= 4
##$DIGMOD= 1
##$DIGTYP= 9
##$DL= (0..7)
0 120 120 120 120 120 120 120 
##$DP= (0..7)
150 150 150 150 150 150 150 150 
##$DP07= 0
##$DPNAME0= <>
##$DPNAME1= <>
##$DPNAME2= <>
##$DPNAME3= <>
##$DPNAME4= <>
##$DPNAME5= <>
##$DPNAME6= <>
##$DPNAME7= <>
##$DPOAL= (0..7)
0.5 0.5 0.5 0.5 0.5 0.5 0.5 0.5 
##$DPOFFS= (0..7)
0 0 0 0 0 0 0 0 
##$DQDMODE= 0
##$DR= 18
##$DS= 0
##$DSLIST= <SSSSSSSSSSSSSSS>
##$DSPFIRM= 0
$$ [...]
##$SUBNAM2= <"">
##$SUBNAM3= <"">
##$SUBNAM4= <"">
##$SUBNAM5= <"">
##$SUBNAM6= <"">
##$SUBNAM7= <"">
##$SUBNAM8= <"">
##$SUBNAM9= <"">
##$SW= 24.9337058887773
##$SWIBOX= (0..15)
0 0 2 0 0 0 0 0 0 0 0 0 0 0 0 0 
##$SW_h= 4990.01996007984
##$TD= 16384
##$TD0= 1
##$TE= 0
##$TE2= 300
##$TE3= 300
##$TEG= 300
##$TL= (0..7)
0 120 120 120 120 120 120 120 
##$TP= (0..7)
150 150 150 150 150 150 150 150 
##$TP07= 0
##$TPNAME0= <>
##$TPNAME1= <>
##$TPNAME2= <>
##$TPNAME3= <>
##$TPNAME4= <>
##$TPNAME5= <>
##$TPNAME6= <>
##$TPNAME7= <>
##$TPOAL= (0..7)
0.5 0.5 0.5 0.5 0.5 0.5 0.5 0.5 
##$TPOFFS= (0..7)
0 0 0 0 0 0 0 0 
##$TUNHIN= 0
##$TUNHOUT= 0
##$TUNXOUT= 0
##$USERA1= <user>
##$USERA2= <user>
##$USERA3= <user>
##$USERA4= <user>
##$USERA5= <user>
##$V9= 5
##$VALIST= <valist>
##$VCLIST= <CCCCCCCCCCCCCCC>
##$VD= 0
##$VDLIST= <DDDDDDDDDDDDDDD>
##$VPLIST= <PPPPPPPPPPPPPPP>
##$VTLIST= <TTTTTTTTTTTTTTT>
##$WBST= 1024
##$WBSW= 4
##$XGAIN= (0..3)
0 0 0 0 
##$XL= 0
##$YL= 0
##$YMAX_a= 655982
##$YMIN_a= -710665
##$ZGOPTNS= <>
##$ZL1= 120
##$ZL2= 120
##$ZL3= 120
##$ZL4= 120
##$ABSF1= 10
##$ABSF2= 0
##$ABSG= 5
##$ABSL= 3
##$ALPHA= 0
##$AQORDER= 0
##$ASSFAC= 0
##$ASSFACI= 0
##$ASSFACX= 0
##$ASSWID= 0
##$AUNMP= <proc_1d>
##$AZFE= 0.1
##$AZFW= 0.1
##$BCFW= 1
##$BC_mod= 2
##$BYTORDP= 1
##$COROFFS= 0
##$CY= 11.3945322036743
##$DATMOD= 1
##$DC= 2
##$DFILT= <>
##$DTYPP= 0
##$F1P= 18.9103706918063
##$F2P= -1.10871071338519
##$FCOR= 0.5
##$FTSIZE= 0
##$FT_mod= 4
##$GAMMA= 1
##$GB= 0.15
##$INTBC= 1
##$INTSCL= 1
##$ISEN= 128
##$LB= 0.24
##$LEV0= 0
##$LPBIN= 0
##$MAXI= 10000
##$MC2= 0
##$MEAN= 0
##$ME_mod= 0
##$MI= 1.114404
##$NCOEF= 0
##$NC_proc= 0
##$NLEV= 6
##$NOISF1= 3.799351
##$NOISF2= 2.8
##$NSP= 1
##$NTH_PI= 0
##$NZP= 0
##$OFFSET= 15.70392
##$PC= 1
##$PHC0= -9232.162
##$PHC1= 33.60026
##$PH_mod= 1
##$PKNL= yes
##$PPARMOD= 0
##$PSCAL= 0
##$PSIGN= 0
##$REVERSE= no
##$SF= 200.130013532006
##$SI= 16384
##$SIGF1= 3
##$SIGF2= 2
##$SINO= 400
##$SIOLD= 16384
##$SREGLST= <1H.CDCl3>
##$SSB= 0
##$STSI= 0
##$STSR= 0
##$SW_p= 3612.71676300578
##$SYMM= 0
##$S_DEV= 0
##$TDeff= 0
##$TDoff= 0
##$TI= <>
##$TILT= no
##$TM1= 0
##$TM2= 0
##$TOPLEV= 0
##$USERP1= <user>
##$USERP2= <user>
##$USERP3= <user>
##$USERP4= <user>
##$USERP5= <user>
##$WDW= 1
##$XDIM= 8192
##$YMAX_p= 0
##$YMIN_p= 0
$$ End of Bruker specific parameters
$$ ---------------------------------
##NTUPLES= NMR FID
##VAR_NAME=  TIME,          FID/REAL,        FID/IMAG
##SYMBOL=    X,             R,               I
##VAR_TYPE=  INDEPENDENT,   DEPENDENT,       DEPENDENT
##VAR_FORM=  AFFN,          ASDF,            ASDF
##VAR_DIM=   8192,          8192,            8192
##UNITS=     SECONDS,       ARBITRARY UNITS, ARBITRARY UNITS
##FACTOR=    0.0002004,     1,               1
##FIRST=     0,             0,               0
##LAST=      1.6414764,     0,               0
##MIN=       0,             -710665,         0
##MAX=       1.6414764,     655982,          0
$$ Real data points
##PAGE= N=1
##DATA TABLE= (X++(R..R)), XYDATA
0 0 0 0 0 0 0 0 0 0 0 0 64 -64 64 -64 88 -128 128 -187 192 -241 256 -320 372 -417 475 -549 631 -708
28 -708 805 -909 1026 -1154 1295 -1447 1613 -1803 2000 -2227 2472 -2736 3037 -3361 3710 -4118
44 -4118 4561 -5060 5618 -6257 6994 -7844 8843 -10049 11523 -13375 15790 -19087 23869
57 23869 -31513 45691 -81218 389251 310035 -471523 -381189 86806 474192 181449 -304316
68 -304316 -480292 -98736 299672 320918 -54559 -316127 -228077 99789 262558 160347
78 160347 -59571 -137111 -67009 44742 69387 39841 -7832 -26668 -33869 -5644 38992 70487
90 70487 36662 -31794 -78364 -52315 10172 51230 37616 -6207 -51765 -65815 -35055 36311
102 36311 91988 75975 -7560 -66129 -25592 74761 109047 18259 -103171 -110392 10218 108285
114 108285 47227 -115984 -182781 -55048 135262 176698 38375 -98582 -76236 49318 97726
125 97726 12504 -73597 -40137 61943 83414 -7180 -84815 -45257 46463 46847 -60343 -131026
137 -131026 -50790 103238 144486 13937 -135933 -117461 55132 178184 103909 -76782 -145077
148 -145077 -19075 148837 155162 -16982 -182102 -169605 -6293 123422 86479 -61868 -147335
159 -147335 -67686 100317 184135 93882 -70848 -138147 -40028 104643 134704 21038 -107937
170 -107937 -114288 -7258 85467 60046 -41427 -98127 -47947 48122 84396 29194 -45624 -62608
182 -62608 -15748 32777 39000 24120 19755 24515 14400 -8102 -13108 1743 4262 -27997 -60034
195 -60034 -39813 24659 61918 22954 -50267 -72456 -10732 68120 72642 -937 -61002 -27211
207 -27211 65862 107699 40071 -70323 -104810 -32228 54375 52538 -30280 -85169 -41892 50679
219 50679 83817 18996 -69138 -76194 6772 86975 74796 -12327 -66786 -23531 62935 79909
231 79909 1002 -82198 -68778 25307 81414 27473 -71531 -98811 -27516 50718 43178 -31227
243 -31227 -66296 -2412 95187 116370 31093 -62422 -63003 19540 74253 27215 -66576 -96556
255 -96556 -30075 48651 47680 -25179 -77640 -47864 32150 75864 46455 -10186 -27696 10874
267 10874 53942 47490 -7402 -58953 -56566 -11264 27975 25366 -4232 -24564 -19899 -1205 10651
280 10651 6351 -7798 -16999 -9694 8481 28086 30562 15406 -11338 -28178 -17745 13253 41241
293 41241 34229 -7194 -44485 -32445 16711 41308 -3575 -75703 -87292 -9281 83390 88642
305 88642 2507 -76875 -53726 50132 115182 62376 -52060 -98864 -24873 79940 86697 -20301
317 -20301 -122598 -107651 4426 85713 51271 -42466 -75597 -8700 82164 93097 18059 -57047
329 -57047 -53547 14279 63884 41225 -22397 -57035 -29701 13954 17616 -18731 -46735 -26844
341 -26844 16531 36387 19956 -4635 -4911 12493 19779 3026 -16289 -12941 12995 31890 18932
354 18932 -13725 -30232 -13276 11326 8156 -19840 -37445 -16526 21148 32511 3971 -27079
366 -27079 -24346 8409 32813 26603 5189 -2927 11044 25932 17948 -8860 -28175 -26018 -12407
379 -12407 -9077 -16788 -16046 2395 17709 8952 -14205 -17534 11418 40919 35456 606 -21590
392 -21590 -495 35041 34091 -13404 -64490 -61647 -4765 46631 36517 -24134 -59445 -24063 44604
405 44604 67103 11628 -56271 -55965 14945 79754 65726 -12267 -67156 -43132 25196 57449
417 57449 16430 -50580 -65909 -10273 50689 47960 -12861 -63264 -46127 14207 50153 30929
429 30929 -10024 -19533 10211 40209 35212 -1067 -28669 -27842 -4663 11745 4824 -11711 -17953
442 -17953 -11828 -5509 -8684 -9688 -812 11604 17045 13377 14858 22040 23389 7915 -17378 -25833
456 -25833 -11907 9217 10307 -11250 -28631 -23126 4372 21294 7298 -21012 -27002 5046 39336
469 39336 38051 3276 -26408 -15069 16579 29065 3075 -28426 -25866 5568 29623 16342
481 16342 -19514 -37180 -20616 8512 14414 -6539 -22991 -5535 28682 40403 14750 -18584
493 -18584 -19598 9263 30220 16256 -15755 -25174 -3832 22051 15646 -23885 -52992 -39277 7041
506 7041 38601 24965 -11001 -23175 6593 42605 42075 -104 -36001 -25136 17768 40128 15323
519 15323 -30602 -49645 -23684 14301 22745 -3299 -27628 -17351 17066 36398 20603 -11014
531 -11014 -20397 -2563 17697 15995 1393 -5267 1315 6543 -351 -8835 -9051 -4075 -6940 -17649
545 -17649 -19888 -4153 19197 23908 2708 -19493 -14214 15154 35680 20125 -13938 -24689 3841
558 3841 38745 28598 -17126 -54246 -41656 4244 31296 14700 -19821 -29915 -3949 28682
570 28682 30022 607 -24540 -15772 20229 42783 29533 -6425 -28196 -19100 2023 6152 -10041
583 -10041 -25215 -19524 2652 18588 13139 -6179 -15517 -4027 16383 19352 5152 -6779 4481
596 4481 21155 18177 -7229 -30006 -22493 6314 17923 -3443 -29012 -26307 7911 33360 19305
609 19305 -16860 -33414 -9205 28128 34976 5406 -23185 -14954 17224 30360 7257 -27540
621 -27540 -29570 -2599 21764 15045 -8924 -19891 -10382 947 -2283 -12637 -11037 4258 20869
634 20869 21078 10585 6021 12089 15742 1601 -18537 -24253 -8068 9273 4576 -19180 -30007
647 -30007 -14488 11689 19461 4445 -10420 -4057 18412 33845 24345 -3370 -24169 -20400 256
660 256 13798 4457 -16383 -23788 -7320 16695 21424 635 -22498 -23541 -83 24251 23408 157
674 157 -20454 -12268 11850 24574 9468 -15080 -18156 5193 26242 19232 -7542 -24214 -18781
687 -18781 -4745 -2575 -12687 -14861 -2926 12410 16050 8454 4831 10492 17559 10861 -6344 -13286
701 -13286 -2590 9972 3800 -18846 -30949 -15072 9895 13396 -5776 -18715 -1759 26958
713 26958 33030 6657 -20469 -19620 3349 19065 8580 -13498 -16148 2929 22629 16327 -10356
726 -10356 -26648 -17135 3850 11524 -1007 -14552 -8763 7581 13493 6221 -4867 -4538 7948
739 7948 16530 16002 7282 -3104 -6976 -7466 -8914 -12518 -14988 -12240 -1644 8172 9452 2534 -1426
754 -1426 3165 11128 12289 2892 -7248 -7475 5970 15287 7719 -11887 -23563 -12072 9656 15032
768 15032 -3228 -21796 -13696 14436 28040 7949 -24161 -27790 757 26362 24059 -2089 -14399
781 -14399 797 23453 22324 -5566 -28880 -23945 380 13112 -410 -18506 -15726 5438 16445
794 16445 7742 -6386 -3778 13339 22973 12086 -4674 -8391 -346 2918 -7961 -19218 -16498
807 -16498 2224 15918 10289 -4977 -11048 64 13298 10015 -7637 -18190 -7691 11215 19281
820 19281 8816 -5377 -8672 -441 9103 8893 564 -9268 -10471 -4186 4153 1394 -9552 -19722
834 -19722 -15029 3315 18295 18156 7417 580 6283 15725 10624 -4721 -18352 -17890 -4612 4221
848 4221 -1580 -13837 -12038 2485 11927 5090 -7037 -2800 13686 21813 8279 -12306 -15276 295
862 295 10504 533 -16011 -16694 3672 22266 17273 -4957 -16751 -8596 7760 6639 -10838 -21951
876 -21951 -10371 12371 18950 5974 -9270 -4628 12039 19938 7512 -7275 -8635 2562 5822
889 5822 -4332 -20078 -22066 -9724 2575 6599 3358 2774 10532 18165 16729 3919 -7616 -8310
903 -8310 -581 2061 -900 -7793 -9994 -5252 1556 4080 811 -5290 -5123 4045 14080 13076 -1138
918 -1138 -13685 -12238 2724 10756 3124 -10571 -9540 6906 21968 16372 -2477 -17178 -11890
931 -11890 1950 5696 -4740 -17042 -12557 3955 14069 7131 -4180 -4698 6519 14479 8979
944 8979 -783 -2076 4161 4322 -7178 -16788 -15625 -3929 4351 693 -5334 -1587 9101 15096 7545
959 7545 -5129 -9818 -2317 9590 9760 -878 -8749 -5362 5647 7571 -2128 -11760 -10143 1797
973 1797 9675 4797 -3909 -8558 -4327 3981 6741 124 -5489 -2434 7823 16063 11189 -2349 -11753
988 -11753 -7260 1958 3399 -5121 -13468 -9542 2511 11734 7378 -4802 -8610 -1472 10550 12700
1002 12700 2184 -5945 -3369 6286 7728 -2212 -13896 -11968 1658 9368 5168 -4395 -5720 1313
1016 1313 6544 1858 -7501 -10475 -3470 6395 9221 3665 -2339 -826 5156 6792 720 -6541 -4518
1031 -4518 1043 3990 -603 -7306 -8484 -3396 -1056 -1164 -3018 -98 7193 11802 9903 2358 -2913
1046 -2913 -2182 3194 2381 -3877 -10754 -8739 1379 6681 1950 -8388 -10358 -1683 8960 9345 1053
1061 1053 -3956 265 8876 10164 1172 -11536 -12098 -969 8779 5983 -5084 -8376 -1666 8495
1075 8495 6918 -4849 -13711 -7355 6488 12685 5603 -4105 -5023 1707 9399 5724 -3235 -8410 -2618
1090 -2618 7922 9684 657 -9046 -9948 -2311 3557 284 -5536 -4056 2926 8615 7272 235 -4353
1105 -4353 -2637 2544 4076 1319 -2510 -1888 2535 5035 -288 -6886 -8099 -2739 2404 1571 -1930
1120 -1930 -1833 2489 5623 4119 -1661 -4639 -1581 3709 5670 1614 -1564 -566 2085 2437 -3668 -10012
1136 -10012 -7689 -70 5879 2494 -4469 -4337 2088 7733 5645 -2447 -5703 676 8791 10788 2293
1151 2293 -7126 -9807 -3666 2011 763 -6643 -9402 -1830 8466 11023 3548 -6227 -4149 4279 9482
1166 9482 4376 -4951 -6402 -533 5680 4069 -4945 -11031 -6154 3189 7952 3008 -4212 -3162 3120
1181 3120 7961 2595 -6401 -9116 -2217 4816 6963 645 -2438 -358 4829 4710 -732 -4404 -3732
1196 -3732 2089 4284 700 -4064 -5432 -1392 182 -1717 -3419 -705 5038 8711 5548 393 -1033
1211 -1033 820 1372 -135 -3991 -5413 -2260 -451 671 -1754 -4901 -2361 969 4056 2830 968
1226 968 2489 4933 5905 2895 -2930 -6471 -3167 62 1503 -2175 -3983 -2341 1806 6672 3563
1241 3563 -3922 -7505 -2845 6535 9413 3755 -5430 -5442 2383 7581 2528 -6778 -9537 -2783 8261
1256 8261 8199 -870 -8851 -6137 2541 5436 825 -5965 -5048 3679 10724 4440 -4002 -5106 -281 5247
1272 5247 2719 -3369 -4130 531 4757 2088 -3891 -5683 -2521 1014 1946 -1059 -2186 2029 4688
1287 4688 3744 -583 -3779 -359 3880 1570 -2052 -3217 -286 4783 2770 -3143 -5998 -5008 437
1302 437 3328 670 -1196 -1181 1610 3457 2649 787 -2862 -2600 5 4276 4016 1430 -3347 -4224 -1873
1319 -1873 604 666 -3371 -5220 -1135 4793 5308 953 -5523 -2306 3863 7461 1949 -5543 -4091 3129
1335 3129 7816 2748 -8641 -11411 -3032 6788 5173 -2491 -7837 -272 8966 10366 881 -8209 -6909
1350 -6909 2526 8410 1834 -6939 -6466 1999 6146 1520 -4959 -5120 681 5799 4138 -1515 -4473
1365 -4473 -1305 1475 -42 -4171 -3444 -745 3665 4684 1820 1755 1734 2192 -925 -2412 -2819 -891 -1083
1382 -1083 -1412 -3110 -1702 1777 2072 -584 -923 1745 4200 5250 1569 -1026 -1821 -1680 -3189 -3832
1398 -3832 -1963 -259 884 1614 1362 3095 5325 3229 -2223 -4912 -3079 3102 3004 -1128 -6080 -3906
1414 -3906 3314 6346 1694 -4819 -3388 4645 8704 2711 -6081 -7611 -868 4483 -362 -7450 -7931
1429 -7931 -13 8698 8520 1478 -4328 -1121 6353 6240 -1163 -8383 -5822 1179 3620 0 -5925
1444 -5925 -4356 1970 5754 2325 -442 367 3241 4108 938 -3844 -3626 -1304 -397 -928 -2494 60
1460 60 2813 4395 1926 -655 -1297 -16 -216 -1413 -2464 -2933 715 1099 610 -652 447 1421 1295
1477 1295 1753 1513 1197 -273 -2825 -3115 -2025 -119 -2092 -2920 -1450 4029 6846 3676 -78 -1957
1493 -1957 1050 3310 1525 -4741 -8661 -4525 4458 7821 293 -6561 -4112 4971 10096 4563 -3880
1508 -3880 -6655 -665 4650 2154 -6321 -9627 -4096 3894 5303 1865 -351 2049 5859 6156 407
1523 407 -5389 -5102 -1764 38 -2629 -5960 -4238 1648 4037 2329 -83 454 4952 4797 2217 -1208
1539 -1208 -2797 -2430 -1940 -2994 -4584 -2507 -1384 2309 4773 2847 2518 1262 2631 1204 410 -2131
1555 -2131 -2899 -2366 -1190 -378 -315 -868 -2320 -667 1761 3448 2549 -444 -2015 178 980 -1143 -4226
1572 -4226 -3672 -1438 2063 1428 -127 129 1205 3062 1960 -2399 -4415 -1674 1220 2613 -1125 -4451
1588 -4451 -935 3639 5306 358 -4722 -3812 2472 6238 1626 -4168 -6778 -2298 3942 3715 -666
1603 -666 -3927 -1297 4743 6099 2380 -2498 -4950 -2628 318 -1247 -3408 -3256 38 2692 2765 2547
1619 2547 2267 1956 2443 1337 -785 -1045 -543 -1285 -2437 -3487 -3382 -1212 1491 2186 1805 2309 2917 4471
1637 4471 3324 -227 -3994 -4767 -1891 -940 -1949 -2258 -1914 383 3026 4204 2952 59 -202 990
1653 990 2948 2510 -1320 -4540 -4242 -804 1644 482 -3113 -2409 1599 5880 5047 1460 -2314 -2095
1669 -2095 1415 2536 -1427 -4489 -3465 843 2971 2119 -2672 -3088 904 3376 1723 -1751 -3112
1684 -3112 576 3457 1855 -1730 -3680 -1202 2722 2432 300 -2944 -1654 763 2190 -373 -3130
1699 -3130 -3578 -4 3497 2131 -677 -842 1302 2398 1106 -1542 -3833 -2169 -912 816 565 -1223
1715 -1223 -1708 118 2853 3451 1810 -597 101 1133 1756 -861 -3274 -4628 -3924 -780 58 -121 -657
1732 -657 863 2994 3663 2222 -671 -124 -202 461 -1808 -3640 -2751 -901 1125 -2078 -2619 -1015 3762
1749 3762 5467 2584 -546 -701 1215 2290 343 -4265 -6262 -4513 1907 3711 870 -2746 -2037
1764 -2037 2390 5492 3423 -1897 -3566 -423 2728 1887 -1076 -3315 -2700 131 830 -201 -878 -766
1780 -766 531 2718 2078 -334 -2252 -2244 705 1137 -470 -1327 -1691 1664 1248 828 -583 -2400 -1919 281
1798 281 540 182 -263 498 2476 1622 155 -679 -557 1368 1956 -559 -3586 -2309 398 1721 333
1815 333 -3018 -1495 1276 4088 3571 369 -1459 -403 496 1091 -2126 -4507 -3232 -266 1605 403
1831 403 -1386 -66 2902 4444 1026 -1300 -1168 1764 1732 -1297 -4043 -4853 -1741 732 1455 -490
1847 -490 -2137 -96 3698 5436 4027 -1126 -3124 -1072 1055 1198 -2215 -4336 -3951 -57 2114 1691
1863 1691 257 -587 -381 2847 3407 1924 -143 -2143 -706 247 -263 -801 -1438 413 1062 379 -100
1880 -100 703 -86 1006 667 -1419 -994 508 1537 1064 -197 -2568 -1061 1226 1633 -792 -2650 -2048
1897 -2048 1608 3094 876 -2780 -2712 1076 2985 2117 -1139 -2357 -328 2338 2889 -1354 -3113 -1395
1913 -1395 993 1604 -1 -1963 -1876 1617 2440 1385 -1098 -2501 -71 1399 116 -1271 -2476 -970
1929 -970 449 1625 -1110 -1268 294 2823 2876 1380 -1236 -2126 218 1559 260 -2569 -3452 -2268
1945 -2268 802 1696 241 -601 -1012 670 2026 3482 841 -1247 -911 -376 571 -228 -1544 -3037 -1729
1962 -1729 153 1200 1106 295 -347 1265 1704 246 -1002 -1032 275 -647 -1310 -1550 -1575 404 1614 2
1980 2 -1695 -542 1195 3706 2028 -1069 -2001 -90 1842 601 -1774 -2041 -1064 1287 2197 349 -1289
1997 -1289 198 1859 2833 -170 -2045 -1522 933 2104 432 -2832 -2992 857 2811 1277 -2133 -1836
2013 -1836 735 2595 2327 -389 -2450 -1931 585 2041 980 -1313 -1668 136 1292 1536 48 -477
2029 -477 -697 824 1265 523 59 -220 -1034 230 1180 -142 -1020 -1134 -53 1337 1388 156 -1625 -2160
2047 -2160 1094 780 -840 -699 -775 1321 2219 1152 -220 -115 321 1678 -55 -1486 -1628 -41 1503
2064 1503 866 -1311 -118 494 3296 834 -790 -2273 486 1706 904 -1935 -3281 -1608 1642 1249
2080 1249 -750 -838 -1088 1303 2080 388 -2089 -681 -144 813 -709 -3037 -821 1751 2345 424 -613
2097 -613 -60 1381 2506 1486 -1093 -3342 -651 18 274 -1093 -2187 -1931 -225 2265 1282 864 262
2114 262 -581 47 252 1021 -1289 -1234 -2047 -638 741 1553 -358 -494 -645 1064 1980 1120 -918 -1517
2132 -1517 -149 306 -536 -1645 -748 281 1434 323 -589 786 1533 1801 -949 -2399 -1846 173 1998
2149 1998 -1011 -2824 -2228 1520 3339 1444 -1793 -1030 771 3158 737 -2094 -2435 -314 596 -209
2165 -209 -1342 -994 802 1266 1812 1357 -879 -20 1533 667 -1345 -3197 -2037 604 1209 -363 -818
2182 -818 110 2133 1626 121 -974 -1050 209 -699 -42 -955 -1035 -1322 220 964 1114 958 521 179 1352
2201 1352 1442 288 -1260 -2548 -1641 129 110 844 -1111 -679 1627 1989 1376 782 -185 226 1130 -86
2219 -86 -2519 -2680 -1265 793 73 -1265 -1267 646 3427 2892 -464 -1241 -810 213 -305 -1173 -3244 -3231
2237 -3231 526 2222 1157 343 -930 1393 3056 1300 -404 -1568 -525 -532 -280 -2730 -1068 -634
2253 -634 -228 1040 1313 1362 1794 2057 882 -469 -1573 -1630 -926 -123 -388 -513 -1019 693 2253 2281 1024
2272 1024 452 35 365 904 -703 -1072 -2001 -2389 167 1527 328 84 -7 1345 2595 1654 -662 -1938
2290 -1938 -1770 -463 -1022 -891 -2025 -405 1054 1564 1696 781 711 1680 1168 347 -1187 -2266 -1011 -1732
2308 -1732 -428 -1194 -894 518 2732 1853 1355 847 786 710 -960 -1732 -1925 -2060 106 -75 -472 -85 -136
2327 -136 1769 1939 1965 664 -1178 -341 -308 -497 -2067 -2194 -1564 -1263 -186 740 754 1572 2501 2070 915
2346 915 -362 -1052 -5 -1360 -2605 -2539 -2479 471 1837 1308 100 312 1498 2618 2560 -364 -2100
2363 -2100 -2379 -955 -1194 -694 -241 -1440 -129 2165 3181 2117 1080 -73 -286 92 -573 -2370 -2246
2380 -2246 -1708 -640 328 674 934 1864 2157 2219 598 -704 -957 -350 -775 -1367 -2326 -1939 424 1091 558
2399 558 529 488 1687 1965 2162 565 -2194 -943 -934 -1057 -1077 -1719 -1010 -168 1706 1465 530 600 1740 2224
2419 2224 83 -1684 -1973 -1531 -1359 -722 -1159 -1785 946 1805 1301 1447 579 -183 -190 87 -763 -1705 -2069
2438 -2069 -1800 1 817 -773 718 1034 2007 2558 526 -1104 -1625 -747 -45 -68 -92 -693 -1623 901
2456 901 2191 1446 289 -433 696 1030 1329 -852 -1694 -1072 114 -502 -506 -30 102 1377 1417 668 301
2475 301 -214 103 1192 -888 -2862 -1834 556 1407 -1020 -564 -809 899 2057 1794 -316 -298 -1351
2492 -1351 230 740 -756 -1805 -2726 -170 926 1009 1039 -242 -132 1321 1393 187 -743 -823 -815 -1185 -594
2511 -594 -628 890 689 519 91 -145 1927 1127 1900 358 -57 -1143 -859 124 -610 -1621 -815 -364 764
2530 764 1076 1172 -171 -515 217 1355 576 -1257 -1944 -946 45 707 963 -434 -672 -380 1597 1116 -172
2549 -172 -932 -373 389 -321 73 -1435 -624 1077 433 306 -724 -403 454 1293 -132 -586 -683 657 1968
2568 1968 585 357 -302 513 1697 645 -667 -2090 -608 309 395 -936 -1117 -281 -665 724 215
2585 215 540 802 148 763 -202 -466 -1247 -908 -577 177 148 -239 -125 291 344 -57 208 164 -107 -214 408
2606 408 -627 -1428 -1330 81 785 -375 -684 -882 1498 1218 506 529 167 288 1218 170 -128 -1835 -1495
2625 -1495 -136 665 325 -582 -668 -206 2299 971 191 -720 -291 526 389 -552 -1299 182 851 -763
2643 -763 -942 -996 -298 1136 415 431 -1652 -461 903 1482 1470 -678 -1722 -552 -150 793 -676 -1093
2661 -1093 -891 825 665 213 -436 1026 302 683 342 506 124 -563 986 71 -329 -1005 -702 -348 1124
2680 1124 503 102 -627 640 852 331 -96 -1005 -335 65 57 -1412 -1822 -1314 -688 757 574 -369 132
2699 132 302 1640 1222 513 -330 -685 -166 551 -331 -1633 -955 -384 278 -220 -686 27 1425 1131 1320
2718 1320 -861 -1145 85 -253 165 -456 -1264 -1250 1082 -29 734 -625 -122 154 1463 48 535 709
2736 709 -202 305 -130 -316 -837 355 1035 751 -652 -860 -421 854 658 -84 420 -412 652 612 77
2755 77 -581 -1524 39 -438 1024 -91 -220 -122 61 162 -347 653 -219 423 1337 587 167 162 -662 -253
2775 -253 85 -810 -185 -367 -272 1101 936 -455 -972 209 1122 684 -26 -1157 -753 -527 -113 -276 -1124
2794 -1124 -1154 -298 297 590 -349 -481 242 1252 1027 181 -1125 47 779 219 -1091 -1144 -385 -394 619
2813 619 -582 -138 1109 1031 801 933 255 -775 672 -242 -714 -1145 -2385 -953 35 -92 -947 -127
2831 -127 1430 1310 1619 1091 490 93 -390 153 -507 -213 -1374 -1589 -613 970 774 651 561 1125 901
2850 901 1147 -206 -814 -110 -900 -504 -173 -1342 -651 -172 520 690 871 647 141 660 1293 128 -685
2869 -685 -188 523 -465 -904 -1089 -191 290 769 -630 -374 857 777 772 89 115 -820 -408 770 437 -659
2889 -659 -1230 436 1150 231 -470 226 416 941 903 -476 -874 -694 -497 483 -163 -233 101 792 707 132
2909 132 -770 -745 -542 -257 226 -788 -1453 -164 211 631 -42 81 1141 370 388 -339 -807 -464 -1217 -1284
2929 -1284 -894 -512 -345 264 1147 1543 568 824 -256 488 -492 -452 -1342 -779 -651 -445 208 -404 501 283
2949 283 1532 2686 2428 -394 -1046 -344 -495 87 -1528 -1923 -1172 299 652 -44 30 1679 1815 1149
2967 1149 1039 -577 -1113 -25 -140 -979 -844 -851 -852 387 553 99 605 1847 1438 1182 -22 -658 -996
2986 -996 -1057 -492 -1289 -422 -374 275 1785 1166 948 686 561 795 329 -392 -1473 -419 176 -328 -652 -294
3006 -294 -338 1269 886 1256 392 188 -505 165 85 -398 -721 -1091 -134 807 578 363 -141 175 707 793 131
3027 131 -365 -747 -480 121 -1041 -624 239 345 778 515 27 279 605 514 -934 -851 -1508 -928 -660 -394
3047 -394 -543 1064 1339 1702 874 785 531 -54 -281 193 -1013 -1009 -1327 -975 -1267 380 553 500 940 1210
3067 1210 711 955 -201 -856 -548 -270 -698 -1155 -629 -1089 -458 1662 1725 1306 192 968 603 42 -1155
3086 -1155 -799 -1575 -337 -235 -2095 -872 172 1462 797 327 775 -226 -259 159 -1588 -1071 -1711 -1141
3104 -1141 -277 -629 232 245 1233 979 932 -198 -370 396 -334 -1035 -1811 -617 -759 -265 76 807 710 135
3124 135 1092 974 965 -294 -1105 -818 -475 -1186 -1359 -889 -296 -684 134 -92 892 857 579 333 -22 -649 -677
3145 -677 -37 -940 -821 -363 150 370 843 432 551 119 -143 201 -577 -1497 -896 -824 -552 -118 207 104
3165 104 -157 345 1179 575 -398 -281 61 189 109 -40 -713 -779 280 302 616 193 -41 756 158 968 -795
3186 -795 -1019 -543 -503 920 -1078 19 600 499 -81 1130 382 -504 74 400 -284 -521 -339 -1243 327
3205 327 26 277 -663 412 574 1034 685 401 -153 -920 629 -181 -946 -1799 -103 247 755 418 74
3224 74 418 1571 1698 277 -109 -1155 -543 -583 -1314 -1419 -672 -806 253 1059 97 628 540 310 469 -919
3244 -919 -842 -649 -360 -583 -1011 -442 509 918 526 807 -537 423 429 1260 555 -844 -866 -796 -60 220 -438
3265 -438 -882 93 662 171 761 317 63 34 -256 -68 -502 -942 -1152 -404 -10 650 -724 -703 -170 467
3285 467 27 -222 -794 -1030 -223 373 -435 -403 -287 14 1087 -156 686 -550 246 -376 -95 -131 -1380
3304 -1380 -1067 892 305 -901 -263 586 1346 208 172 419 -694 -1187 229 -1701 -950 8 -322 341
3322 341 919 39 -116 356 1361 890 195 289 -642 -445 109 -750 -910 -642 408 419 669 2161 397
3341 397 811 -441 506 94 -1190 149 -398 -673 -678 -206 -82 837 -50 666 -393 503 353 482 236
3360 236 227 -1135 -742 -1201 -133 417 -11 -605 5 777 961 607 122 130 785 86 134 -494 -553 124 -47
3381 -47 177 -533 -536 -419 221 756 901 -404 -31 -1733 -924 598 -675 -769 169 889 -20 -1274 56
3400 56 1212 596 -225 -205 -27 -239 661 841 -364 -913 932 640 956 280 -404 251 -291 -651 -60 -105
3420 -105 507 -562 -56 569 838 -314 -34 464 544 370 -1336 -372 -623 -329 -941 -24 -585 663 -138
3439 -138 575 681 -463 801 459 427 117 -983 -953 -383 -271 -870 -1245 -822 98 1025 1481 844 -458
3458 -458 -136 486 236 16 -462 -545 407 388 -306 -416 -704 24 1163 1097 108 310 567 1417 774 -25 -1994
3479 -1994 -858 -383 384 742 71 -50 770 906 559 201 361 74 975 316 54 -657 -1799 -334 258
3498 258 -212 -250 -324 145 -8 584 491 41 295 1351 384 -497 -692 -1531 234 -397 -907 -155 -455 815
3518 815 417 922 -24 -880 753 1251 -475 27 -273 -146 686 507 59 -50 36 296 844 -408 -352 -200
3538 -200 312 -685 550 -351 56 248 291 463 83 -195 -222 353 76 52 -818 -117 -800 854 1051 34
3558 34 1 193 437 610 281 7 -344 -822 -310 877 -398 24 623 322 422 -164 -111 -451 318 415 -443
3579 -443 -1139 -261 325 208 127 -457 -131 1078 472 154 349 -164 827 135 42 -226 -265 -443 137 -1221
3599 -1221 -526 -305 -715 346 88 529 606 -742 438 16 637 -72 205 184 -948 -564 139 -577 -236
3618 -236 662 -291 673 -194 -457 -143 -4 -652 56 -579 378 -291 -334 268 -115 -190 -80 -85 118 509 159
3639 159 221 639 -559 61 195 -350 963 1311 -357 -333 -454 -446 -292 -133 -137 40 650 -146 384 -632 129
3660 129 326 273 -115 298 -995 -526 -505 -134 657 -640 189 225 -3 662 141 48 503 489 25 -222 284
3681 284 -333 320 786 301 419 169 356 1025 611 -613 -675 420 -286 -204 -877 -306 -135 -824 258 234
3701 234 -496 -75 247 924 340 -517 -383 1490 33 662 -498 -479 792 534 765 121 -365 183 -314
3720 -314 842 260 -642 -738 -274 -16 29 -14 -706 505 334 502 41 129 -74 97 -750 183 -787 -295 255
3741 255 -633 -778 -47 368 980 441 629 224 -535 -1153 -128 -967 -1007 211 -1085 -105 491 148 -204
3760 -204 -1185 -309 250 3 -730 -1024 -1126 438 791 -229 -138 -455 713 644 697 484 -60 -730 94 129
3780 129 -758 -229 -196 4 -490 298 776 -152 436 1802 1011 -388 -240 -72 -713 -269 -188 556 355 659
3800 659 277 57 -83 -596 198 224 -681 -672 -616 -348 -560 -422 -944 -1452 57 -22 968 786 633 45 411
3821 411 -81 -52 -624 -1063 -595 211 197 -191 136 556 669 1225 57 620 -475 -787 114 -822 -1081 -541
3841 -541 -396 35 337 428 16 -18 1155 915 471 -483 480 -30 -564 -812 -145 -185 311 -270 -262 540 347
3862 347 1110 646 -392 -143 -74 -1116 -462 -122 -427 -990 -164 380 961 594 351 -329 -100 -335 -122 -507
3882 -507 -816 781 -56 -19 365 526 263 646 304 242 922 773 570 -651 52 -528 -1087 -829 774 -323
3902 -323 2 1130 979 666 176 -497 -575 -364 -306 -976 -452 -1050 -330 667 394 -29 61 263 109 679 -339
3923 -339 -352 -1209 -1165 -855 -11 -620 -256 478 479 350 488 -274 -13 389 -200 -349 -122 -943 445 -963 -557
3944 -557 -185 -602 597 930 486 506 566 467 203 -706 -203 -348 -396 -632 -127 192 -577 456 393 40 420
3965 420 457 261 90 -545 118 -188 -322 -94 -783 102 150 259 810 570 246 -37 -208 -569 -926 -144 -175
3986 -175 -550 -608 133 -511 14 633 367 401 707 157 -64 -274 -521 382 391 84 -674 -633 126 1131 1147 178
4008 178 606 -244 -465 -340 -185 -280 -766 178 349 633 52 -42 -319 -621 504 664 -172 -149 -132 -382 8
4029 8 240 -877 -306 70 147 742 1052 -186 -8 -103 -105 -711 -399 221 808 -268 106 -229 183 113 1286
4050 1286 -88 -159 -186 48 -524 -362 -703 -859 64 266 155 -89 253 14 347 892 -14 340 227 -743
4070 -743 -1017 192 -148 131 -157 79 512 349 -218 521 213 -123 13 -360 -1082 -476 196 -875 913
4089 913 -256 -902 -316 -292 -104 489 349 -159 -839 -612 -75 245 -187 40 -606 -208 -552 -278 1414 574
4109 574 383 -1168 844 560 50 769 -3 -785 -90 548 450 300 -88 -412 396 995 -139 -916 116
4128 116 156 1034 -1312 -236 -141 -333 376 93 -289 -661 180 -757 -203 30 398 -978 2 -313 -752 -1020
4148 -1020 36 352 505 -393 -612 -244 421 1093 184 -8 73 -528 205 -299 292 404 -11 -182 298 -215
4168 -215 -321 419 -111 1027 644 99 -10 -875 652 -144 42 -148 -305 208 433 589 -224 -209 -9 -311
4188 -311 348 158 -197 1 1205 -356 -293 -960 177 72 244 -303 122 -225 591 -73 -316 -20 -629
4207 -629 248 492 261 -838 -308 -852 285 -456 -84 375 -786 466 329 -117 -306 482 324 142 149
4226 149 -743 273 660 -579 -846 -551 -167 573 691 -96 114 -160 -540 573 353 312 -5 -808 -971
4245 -971 393 -194 -251 416 -231 239 -308 768 -425 554 -545 264 255 -44 -613 -39 645 -56 114 -36
4265 -36 4 331 1653 519 886 -507 342 587 180 -120 -205 807 34 338 195 202 -467 170 -182 142
4285 142 2 -1049 522 -759 451 -57 802 480 -812 -436 -18 -1106 -366 175 -596 107 -221 321
4303 321 265 353 66 325 397 -19 1081 364 -228 -136 -773 -510 -307 -77 -50 -387 39 -64 553 819 830 635
4325 635 191 107 59 -83 38 -454 -419 289 -542 -393 -69 206 -436 390 -204 510 28 1093 -120 162
4345 162 -196 95 -806 -598 4 330 -371 399 407 330 -149 -518 246 -485 69 -9 8 -185 -22 319 -327 68
4367 68 -680 426 498 205 642 -497 -128 -806 58 -1406 -350 -187 256 21 -34 -354 840 179 -82
4386 -82 -228 341 168 576 -469 -602 364 -100 -78 488 -989 -556 354 -387 -417 -383 -685 110 -84 -97 570
4407 570 -288 -353 276 -714 -2 -883 46 -1303 -127 -603 545 -328 -351 -424 358 435 396 1261 49 510
4427 510 -63 138 -479 -706 -804 -361 186 -884 -506 489 176 824 487 -24 -315 15 -866 -404 -664 609
4447 609 -247 468 -922 -163 -408 544 -259 49 271 -57 -121 609 -650 -1114 -783 -631 -54 -860 28 197
4467 197 -679 542 539 -28 551 275 886 -112 170 -1051 -370 -720 319 -175 -95 234 -84 282 867 -167
4487 -167 -59 -362 -537 53 -425 -49 -684 -143 -41 -407 -312 872 238 -151 179 -97 -922 -215 255 -82
4507 -82 117 -512 -840 544 834 -234 -124 402 -289 173 490 746 -115 261 823 -322 610 -561 485
4526 485 791 789 594 -366 -93 -1196 -236 -52 -659 -393 -324 227 728 -32 -319 223 211 9 -769 -11 -261
4547 -261 -561 -722 15 150 69 516 -122 654 340 551 642 -240 -65 246 -783 -851 -137 -191 -1160 -482 -32
4568 -32 224 205 76 960 -55 280 -166 766 147 278 -918 -701 -640 183 -346 -155 -361 641 435 701
4588 701 205 284 -57 -639 -140 -282 -126 -221 -263 72 -102 108 352 820 -72 268 -223 58 1100 767 376
4609 376 -14 -526 -49 40 250 -92 -1002 -455 16 -492 -688 -361 -11 271 -253 904 -549 284 -163 -37
4629 -37 213 -75 -125 -645 -432 -308 344 -801 -710 419 739 -345 976 580 -169 76 390 -1397 -1042
4648 -1042 -398 -823 -464 -1042 169 234 236 255 328 737 -69 430 166 -50 -103 168 -478 652 -209 546 -89
4669 -89 -1098 305 222 485 370 -135 -263 -496 -726 -797 735 -441 72 87 969 -340 95 583 821 41
4689 41 317 -552 99 -647 8 -801 574 410 -487 274 943 497 -104 136 -389 -870 -364 -757 -436 -382
4709 -382 -1107 -192 -262 117 985 62 258 219 172 -609 163 111 346 -490 231 641 191 -302 -345 -837 239
4730 239 741 -356 -209 -400 -1408 120 -258 745 -680 682 -233 490 168 -98 19 923 1019 60
4748 60 -164 -599 -220 -194 684 -34 -297 -69 202 249 971 194 655 48 -543 245 -493 -508 -616 124 -192
4769 -192 -135 760 387 576 -137 1185 244 -221 -774 -382 751 -1170 -412 172 225 49 -609 -190 186 477
4789 477 -138 -650 207 -119 26 -438 612 -247 -26 337 321 1190 -617 242 -97 -376 187 -35 -443 -163
4809 -163 -261 -210 -176 -111 -180 -464 317 169 656 -368 -57 829 -496 -39 -553 262 369 -99 -554 -123 295
4830 295 -229 67 59 510 135 -223 156 -543 -362 653 -16 122 630 63 -17 916 307 69 -399 4 -465
4851 -465 734 -14 -458 -538 -99 -14 255 867 -192 335 663 470 -223 6 -140 -309 755 -451 11
4870 11 500 -899 -384 -219 -909 -850 -4 -561 -431 190 -506 -104 -94 572 -394 192 -1043 713 223 -268
4890 -268 822 398 -853 -930 245 -121 190 -165 -402 -104 -680 -134 491 786 521 552 -124 818 417 -118
4910 -118 501 -276 826 134 587 -811 -81 545 228 -512 59 910 -650 -673 -487 -102 34 158 367
4929 367 -353 304 340 -1379 212 -285 628 862 -584 -760 -535 -644 -195 -476 -643 96 -251 130 647
4948 647 635 269 774 -391 840 -593 -755 -308 930 -598 -799 290 248 849 159 -477 -45 -490 -415
4967 -415 68 565 1149 -224 80 -714 -56 -5 581 -207 10 1027 741 760 703 -729 624 113 -253 -421
4987 -421 -89 -206 -40 -112 -305 292 -571 -366 -227 23 64 -1501 217 114 -655 4 210 -47 328 246
5007 246 -420 -252 -1275 358 -68 -378 -430 -283 358 -855 -618 -421 -572 -487 560 216 -62 -383 -242
5026 -242 -205 -334 -89 93 -59 59 -292 499 -183 338 16 198 284 -481 -16 -404 22 -118 -118 510 230
5047 230 -253 113 -286 -524 -656 -642 -104 246 347 -84 150 -493 174 -495 -302 709 29 73 -313 -376 -492
5068 -492 -353 -63 165 -851 -157 9 445 308 193 234 -693 1523 878 -523 127 -769 -72 -1025 355
5087 355 17 -541 80 -501 -225 -565 466 -34 157 -215 26 107 -461 346 109 239 -1158 -194 758 -723
5107 -723 -294 588 -151 475 10 212 339 -700 69 319 289 -211 -360 -119 -265 224 -185 49 74 52 193
5128 193 680 -417 -285 124 -107 -154 -786 478 479 484 -70 197 -580 -295 -692 409 -69 284 64 -656 -428
5149 -428 -99 795 34 -56 583 -135 186 -164 218 -237 459 687 -353 713 -321 1309 171 70 -632
5168 -632 -125 280 869 99 845 -632 -183 -262 229 -20 -347 439 469 413 -486 -824 -771 -429 190 639 588
5189 588 1199 -233 16 406 129 1059 -655 -588 390 -776 -256 -60 462 -142 -521 27 -319 -196 -1
5208 -1 720 145 229 214 -263 -170 279 555 -170 -114 566 436 450 816 -776 609 21 503 389 -150 4 -221
5230 -221 -226 180 -464 76 -471 -216 -191 -106 -127 657 287 -190 -573 41 -931 34 -56 821 -165 -384 199 -530
5252 -530 417 131 -581 -52 5 698 -318 -1636 -761 -172 -286 -175 136 -525 403 279 -160 -622 -449 -121
5272 -121 -184 524 243 6 893 31 653 580 54 334 76 -607 -352 -305 199 -35 392 -80 -989 584 -76
5293 -76 -600 -1057 347 -59 83 553 -1083 203 210 -401 -355 358 -453 231 682 101 81 -404 -562 113 -906
5314 -906 128 46 2 133 115 564 160 -53 -190 710 102 -42 -326 -42 -769 -144 -151 15 918 -37 894
5335 894 -83 27 -357 -556 995 28 -100 61 203 -133 -683 317 -555 -647 200 803 -27 105 -72 -361
5355 -361 -196 283 -665 -205 177 123 262 -700 -235 271 60 -250 -10 -632 270 -184 -390 356 781 401
5375 401 -10 924 -414 -700 582 -301 -864 -403 -782 -497 143 -320 578 2 -97 126 423 -204 1235
5394 1235 86 453 -852 -141 -681 453 436 -281 -634 27 622 682 740 743 -371 304 -161 -77 3 -929 393
5415 393 183 -410 41 -245 100 1048 607 267 -701 -385 706 -25 315 -486 99 134 431 -253 581 495
5435 495 -819 -536 598 -20 -400 188 91 193 270 -556 -1130 -203 -153 -868 -61 232 631 81 -342 381
5455 381 -167 420 -297 661 873 -321 -108 561 322 177 378 65 -798 -602 351 -352 153 -917 -282
5474 -282 149 233 43 -458 -41 257 81 423 668 -332 1014 195 -883 -973 -699 -106 211 498 -38 66
5494 66 309 158 828 -544 -544 306 165 143 -444 480 281 -49 804 -190 430 698 202 -12 -404 1107 -447
5515 -447 443 410 250 -216 -88 242 627 535 722 -50 -492 -30 342 -109 -764 -319 -310 -222 -255 -60 -179 242
5537 242 -157 -530 88 -26 -596 -143 -163 761 -319 -267 -365 -12 -739 -275 -300 774 382 485 -363 492 248
5558 248 -684 -346 -509 626 -104 -71 -846 -35 332 56 344 -386 -433 673 -155 -295 -482 -555 122 -163
5578 -163 -2 225 -90 -464 -859 275 -404 871 339 -275 126 130 752 -284 209 709 158 -417 114 -212
5598 -212 698 84 15 -75 48 -302 81 -663 -617 125 31 295 -106 -492 -590 -69 142 -354 -128 185 -15 652
5620 652 -187 101 0 -359 -669 -97 694 557 577 407 -378 -740 -532 -405 87 295 -267 -617 844 -322
5640 -322 119 -15 -551 -167 -492 -722 -531 -63 440 -157 -861 605 -117 157 735 361 -273 377 535 153
5660 153 -41 -277 -188 611 686 268 -946 -204 339 11 221 525 -257 67 313 -258 -102 -315 -700 639
5680 639 275 -1176 -815 -394 574 1110 279 640 -121 -222 90 -94 -94 169 -381 546 -236 -191 -43 -750 32
5701 32 -96 -251 238 110 371 501 -110 -563 -533 -1190 -331 -197 -172 209 -42 164 148 143 886 288 485 377
5723 377 479 549 413 -256 -22 -428 -817 -60 256 135 446 42 -240 253 -145 209 -673 345 -705 104
5743 104 -196 851 351 -555 -350 498 245 494 -666 474 73 -26 17 210 127 -20 -499 -534 699 -307
5763 -307 -3 -364 423 -36 -329 -718 558 17 -277 -591 427 360 -388 -809 -34 133 288 108 285 1176
5783 1176 194 222 569 241 58 -90 76 283 -442 -253 -262 154 371 235 68 -94 -307 -208 -420 -221 177
5804 177 -308 845 296 -21 -48 32 -1075 -36 334 492 1735 1083 -186 236 672 -155 -204 -139 -80 215
5824 215 -61 -678 472 67 -94 797 488 -284 -83 227 -159 -96 -104 263 334 127 -101 -178 78 -390 107
5845 107 -150 -522 -42 -450 231 -595 0 92 1147 -582 246 767 -921 690 -468 532 66 114 -26
5864 -26 -693 -193 586 -499 -6 19 345 -161 384 237 389 -501 836 -548 -131 -84 194 -614 123 430
5884 430 257 595 -86 -825 201 772 312 -1178 -40 -420 1185 -465 -402 -420 139 -214 158 556 -126
5903 -126 -219 -145 -877 -687 -587 -93 -202 -549 528 -32 52 98 -356 592 73 -974 -127 -505 -617 579
5923 579 -171 -8 -279 185 -254 -138 389 509 461 800 -222 985 -163 264 -635 -207 697 -640 512
5942 512 -360 600 273 -168 -89 -810 -297 196 429 -172 -689 -265 -113 -397 315 -2 -741 -31 -352 -21
5962 -21 -377 -310 -273 -669 20 -885 -118 -631 -668 199 163 -330 -306 -476 -373 440 18 613 444 34 -244 1148
5984 1148 393 -415 -752 404 -770 -551 -282 -349 140 -360 -357 156 -312 -338 -256 -562 -425 -780 285 -334
6004 -334 544 24 397 40 143 439 -305 -263 1101 -131 346 -88 913 -24 40 -167 30 776 -344
6023 -344 -446 523 -333 -423 -492 -330 -86 190 -133 -134 421 -525 358 371 -312 113 -457 685 -329 -500 675
6044 675 982 429 134 -219 807 -547 -106 -341 182 298 -321 -221 -283 672 22 799 108 -658 -420 -539
6064 -539 -328 -243 -170 -184 328 -856 -976 -692 854 -501 -227 -784 44 344 569 -423 -174 502 283 240
6084 240 -380 -388 304 -54 766 33 111 485 -279 25 384 -653 -10 1164 -351 127 -814 -389 566 221
6104 221 -114 223 539 -26 187 180 -19 570 -364 -479 -578 -56 -769 200 356 79 98 145 -346 -519 386 551
6126 551 -173 -69 463 -250 -119 -255 402 334 257 -812 218 191 640 -40 28 297 -726 -255 283 -98
6146 -98 21 -183 684 377 -264 -750 -76 285 -419 -223 -387 -223 30 -222 -122 64 412 51 104 -330 41
6167 41 -237 -213 -442 400 -246 -401 -484 -492 1107 505 -517 -98 -726 66 -594 342 196 -247 247 -523 -406
6188 -406 556 557 220 167 313 -384 973 34 -135 -627 562 -812 -181 -10 776 781 -198 -54 481 89 -44
6209 -44 180 45 -761 -79 -340 146 -860 -182 -185 -207 -374 -297 -440 421 -640 83 60 291 -67 234 18
6230 18 -118 547 -609 -57 175 -194 -321 -926 855 388 565 284 465 -12 -536 250 -74 806 -368
6249 -368 -23 -1492 476 295 -209 33 -706 781 -42 354 754 580 -459 203 -617 -507 145 402 412
6268 412 337 573 -805 189 -402 -516 -489 -434 -613 -106 258 -673 -149 -529 -245 -222 207 -443 -421 -1 -473
6289 -473 531 -618 -580 -2 -406 -512 -117 52 -492 -257 -126 -588 -125 456 -246 153 303 93 582 -496
6309 -496 -438 576 -30 797 731 -190 712 -134 335 -304 -679 -612 -27 244 345 17 444 -471 -116 -519 -97
6330 -97 -33 -272 80 480 -192 481 546 -533 -364 -582 61 467 653 653 -575 -727 24 1133 -444 -463 -121
6351 -121 -363 -530 373 -233 495 229 -665 -855 -513 149 69 -415 -503 -441 -197 -113 260 90 -333 -487 -60
6372 -60 -19 180 -147 135 406 664 14 263 -1128 33 18 636 -257 442 -379 -109 166 -796 -159 14
6392 14 -154 141 92 321 28 -397 411 -122 68 -490 420 730 -596 777 827 169 112 -465 243 189 -1066
6413 -1066 -236 -405 -435 301 -478 731 66 -97 -432 -219 -106 -345 15 -418 8 -39 773 -513 120 105
6433 105 248 459 183 422 -200 283 -280 -944 54 -119 -419 -443 12 301 -755 420 -4 676 388 537
6453 537 59 21 1058 285 -695 481 -678 250 932 -646 -38 92 11 -2 -17 -397 562 -545 -215 -236
6473 -236 -192 -136 -105 69 -669 -52 866 -16 244 -31 -893 -1169 486 321 -257 -389 -160 -229 -291 130 -41
6494 -41 268 -541 -102 202 19 30 530 61 -666 -427 365 -195 -34 269 167 19 -417 -436 69 476 220
6515 220 -352 -215 290 739 -178 72 304 149 677 -422 408 -440 77 384 400 -933 212 267 162 -152
6535 -152 -396 153 -592 -669 112 -711 -104 -1 -546 92 -210 20 387 -372 191 -570 -578 6 -140 479 314
6556 314 -537 -184 -156 231 -408 20 -645 34 -695 -672 183 312 -312 306 10 571 68 -265 -173 -975 -946
6577 -946 439 -199 255 -589 219 -439 274 191 109 -79 181 263 -193 -632 -439 29 664 586 258 -408 -381
6598 -381 -178 974 176 -171 -567 426 -8 -118 68 -481 -80 -724 -542 -163 176 -90 -138 -147 127 473 422
6619 422 -499 158 -839 725 206 98 160 112 -20 509 157 38 1253 -303 -264 313 632 27 -481 -326
6639 -326 159 -236 -241 -229 -577 -114 444 -230 -162 182 -325 361 777 53 -115 -375 1333 -122 -529 -478 -145
6660 -145 -12 -660 -120 326 -843 -162 332 -53 699 -161 -69 -292 -18 237 -444 346 419 -397 -637 302
6680 302 184 -1051 -291 -108 79 492 261 432 -273 -306 266 343 -75 -220 527 -166 797 -8 26 155 130
6701 130 -147 -120 205 185 891 -269 293 -170 -544 299 403 -23 -1077 334 310 -749 85 182 -47 -146
6721 -146 -207 -278 -231 -8 -175 -926 -907 865 -163 82 157 481 207 934 -265 -83 503 -212 165 380 -260
6742 -260 285 433 -235 22 -262 656 160 -276 -339 545 99 28 -67 -121 959 187 -298 429 -889 154
6762 154 -14 698 123 -1247 423 59 358 -106 558 -618 -487 475 -51 -375 -322 359 141 -35 -321
6781 -321 -157 272 403 -53 -72 209 218 -268 -189 412 -55 391 -564 521 231 -492 -384 -781 -261 211 539
6802 539 -29 362 -12 45 41 -424 573 385 353 51 -566 256 769 -671 169 304 -107 839 712 -462 487
6823 487 -853 -532 -182 348 258 -140 -295 -123 -288 280 138 -1 313 197 -174 -135 191 -199 -339 -718
6843 -718 -17 433 -485 179 -221 -373 367 369 721 -406 24 197 321 479 323 -443 -428 -11 67 296 764
6864 764 743 -800 368 -830 -315 335 702 438 -309 141 -491 286 201 73 267 -101 -4 -4 141 327 -451
6885 -451 -288 -598 431 383 -309 -107 267 557 -38 -59 -389 317 446 -1052 -132 -356 116 -448 -338 -461
6905 -461 159 -49 518 -333 190 -26 63 313 676 -100 267 -71 84 -700 -652 -755 1223 458 1077 103
6925 103 60 -471 -153 609 241 326 224 534 -30 117 -277 172 657 497 735 -360 -701 440 -177 320
6945 320 448 -161 -42 155 -130 890 -502 -641 -55 1116 165 314 297 162 374 -144 255 105 245
6964 245 674 213 -228 104 -252 -183 196 -278 -321 -97 262 -104 -381 291 -191 -420 448 164 -377 375 792
6985 792 240 352 -130 -549 85 -536 -67 -408 -3 438 -974 12 272 -113 307 -64 304 -119 443 430
7005 430 -143 181 80 -576 348 -214 543 -53 422 1202 1180 333 -442 -779 3 31 -311 183 242 650 176
7026 176 230 128 661 -163 225 -445 -579 186 -269 486 -545 365 161 -536 -293 358 -891 -156 333 36
7046 36 317 561 -480 -257 -1166 -454 -343 359 -307 -698 162 439 -635 -307 185 73 107 -74 166 -453
7066 -453 -340 -421 -75 206 82 -359 -436 -105 473 -710 -1047 908 222 -232 -231 -521 -309 -707 -148 361 -819
7087 -819 2 265 458 -282 -95 916 -837 611 607 -368 159 -607 -199 -607 44 567 -59 -567 535
7106 535 -130 50 -324 535 379 1100 -41 -321 -103 -262 19 -236 164 -222 -602 190 -299 -78 87 -476
7126 -476 -247 -125 171 24 437 -8 303 362 191 -390 -151 -275 -733 -15 -373 508 418 -64 1071 -403
7146 -403 260 -118 -162 380 -1032 -680 329 541 370 570 138 378 -481 -420 -157 -26 253 -174 363 91
7166 91 -557 -88 545 -388 204 493 -331 890 99 491 669 216 -151 737 493 -124 -101 293 -631 -87
7186 -87 168 560 643 89 -20 953 -549 -496 449 383 -538 -800 63 187 184 -19 -101 -130 -117 47 153 349 76
7209 76 -985 838 -108 75 -39 99 -435 -478 -536 205 7 99 -237 76 721 433 -567 596 -117 -431
7229 -431 610 381 -946 -790 237 3 -173 704 -152 -324 -91 -156 -20 387 -619 276 -696 -446 292
7248 292 93 -47 432 525 295 -401 -296 1294 -152 535 -184 103 377 -87 -541 -71 -33 -121 -652 227
7268 227 -220 1275 -209 496 349 -213 542 141 -695 -120 302 374 -382 -448 -613 -324 959 -63 240
7287 240 561 383 326 409 -43 275 446 439 104 -115 -149 613 85 -548 132 145 315 -434 418 311 -472 -25
7309 -25 -132 437 -927 -168 185 -345 -453 903 382 76 -136 -11 136 -438 597 -49 -184 225 -125
7328 -125 75 792 14 -364 85 -211 370 -190 585 6 127 -6 -12 113 910 -653 -6 -340 172 -239
7348 -239 -162 -463 -204 -53 207 410 -293 -142 103 267 -5 -499 -298 634 427 192 -122 -600 -258 100
7368 100 247 852 320 -362 276 -12 100 718 -164 924 -162 79 -74 355 -259 -42 323 152 -592
7387 -592 1113 -230 592 331 -810 -171 362 147 -390 31 182 318 324 99 750 -340 65 -293 212
7406 212 -17 456 211 -754 227 87 -581 321 404 -271 -73 -1237 -655 -1257 -1190 817 14 -663 117 -615
7426 -615 -127 672 -114 -220 370 -3 -446 -97 124 71 542 -594 11 -243 -464 -638 429 114 1073 -547
7446 -547 -396 545 -237 -350 29 -397 43 -108 -142 -434 -424 564 88 -238 -225 121 -196 716 271 -327 278
7467 278 -849 41 -376 266 66 -57 540 404 69 1047 680 151 -940 143 281 -743 196 314 -251
7486 -251 407 318 -36 -41 -44 -361 32 599 -694 436 347 -163 273 243 625 54 -164 -193 186 -194 -102 248
7508 248 292 -312 -408 -147 -236 -181 -278 -41 -140 203 -582 330 -425 -31 -529 76 288 248 -54 -933 113 -588
7530 -588 68 357 431 249 -162 -166 33 -444 -443 33 53 44 85 609 138 179 470 -189 402 -359 172 -154 -656
7553 -656 44 373 247 77 300 -742 -126 -346 -57 -520 -479 -294 173 695 -2 -41 591 -932 234 -269
7573 -269 382 83 -559 -296 598 -721 -619 619 -100 458 236 -180 921 387 567 529 60 465 182
7592 182 517 -327 -158 910 -545 1103 801 286 -601 -348 203 759 270 81 252 -974 -121 -152 -562
7611 -562 -92 -231 261 607 -373 17 -512 149 -110 546 -505 70 352 -376 901 -154 84 -66 121
7630 121 326 -27 -144 96 -209 374 698 -450 155 -708 157 404 6 -118 -343 168 79 344 -55 282
7650 282 -337 -225 40 487 -208 -468 -190 645 118 416 361 382 -1051 -870 -1065 -75 242 88 661 -364
7670 -364 2 1044 -219 -309 713 154 234 651 443 351 -72 252 480 738 76 194 104 -9 474 437 423
7691 423 -585 258 281 48 -765 114 -121 -93 111 182 178 269 -251 701 -769 98 -872 1057 -173 453 513
7712 513 259 -275 529 -325 -685 23 -814 -207 272 -22 -220 -784 -798 -185 40 -241 -60 -63 79 258 -539
7733 -539 -59 -175 -817 -31 333 37 -190 158 743 -14 40 -118 302 243 -167 353 278 360 -210 605 -381
7754 -381 -280 55 -579 -415 -1026 -498 289 586 -216 -100 -614 -31 186 899 -661 166 326 60 393 -556
7774 -556 271 -235 -307 99 -157 -383 779 -835 398 44 423 -90 -289 -12 -741 -37 -169 18 589
7793 589 225 -299 224 -418 -200 -230 -378 -1076 -758 -462 -596 -180 93 -448 24 -233 -107 -55 27 -2 -88 -19
7815 -19 -450 -424 205 -520 -613 -199 487 -651 -165 228 320 128 552 -80 -127 106 -214 344 -57 340 -552
7836 -552 -49 -497 21 325 -228 -624 -632 37 198 -1041 424 52 -65 751 474 -629 624 -120 618
7855 618 -464 -15 84 -60 -151 -362 -493 715 -73 -751 506 500 122 334 562 31 634 -475 77 -169
7875 -169 -165 -287 -27 -131 507 -646 173 78 747 320 61 -221 -251 328 6 -424 -16 527 370 328 -31
7896 -31 -314 -749 189 -804 -956 -123 255 -629 265 389 208 -575 62 590 447 482 -39 228 234 -368 -122
7917 -122 -206 -505 -67 -228 -384 66 -387 183 -69 190 799 341 716 -699 86 -374 21 164 40 -100
7937 -100 -1145 -358 -665 -41 38 663 -118 -329 82 437 234 287 -51 618 -669 395 408 -1045 -809 -458
7957 -458 180 119 489 -192 -121 -694 227 -225 244 -236 293 266 1278 -86 -704 229 -263 -198 75 -409 238
7978 238 674 -682 716 -482 -184 241 570 184 244 586 997 -200 385 287 -220 -216 121 -163 -29 -35 715
7999 715 499 -365 186 -522 -313 364 23 -293 274 135 124 -441 26 779 -11 213 -333 -700 -162 46
8019 46 377 -191 233 -642 520 -133 131 -515 159 87 512 307 -286 781 -954 596 -195 -25 -847
8038 -847 -430 -822 -592 -8 335 -412 -323 -514 616 -72 312 -106 -186 66 171 275 47 668 571 -9 297
8059 297 -335 -100 308 -332 -103 -36 60 250 471 203 -204 -411 282 -459 -277 494 706 -312 -194 -197 -32
8080 -32 197 318 -595 155 1429 -427 468 -858 -439 526 3 -413 78 -572 198 327 97 7 409 -554
8100 -554 345 -363 186 -819 -384 -170 34 -259 76 -561 93 934 -297 414 -399 -960 -370 875 -858
8119 -858 -377 -861 77 -326 1410 -108 1113 207 -746 37 -163 -190 440 315 71 -659 -201 -72 490
8138 490 341 378 -99 251 -239 615 -204 -602 -166 109 -235 -358 -75 -424 -30 -75 85 -545 -1 588 656
8159 656 747 469 320 503 -175 146 -374 -51 341 161 359 -480 115 586 -256 -97 -399 196 222 510 -492
8180 -492 -485 -320 577 428 -687 -225 1084 56 -243 -69 -337
8191c37
$$ Imaginary data points
##PAGE= N=2
##DATA TABLE= (X++(I..I)), XYDATA
0 0 0 0 0 0 0 0 0 0 0 0 0 0 -60 64 -64 64 -64 64 -121 128 -128 166 -192 203 -255 278 -322 376 -416 462
30 462 -523 588 -667 745 -836 924 -1028 1143 -1263 1404 -1557 1714 -1902 2108 -2337 2590
46 2590 -2886 3214 -3597 4046 -4571 5209 -5989 6997 -8318 10161 -12901 17425 -26255 50061
60 50061 -256910 -710665 -201564 453992 655982 145696 -385947 -392536 100587 435708 275837
71 275837 -173636 -370909 -170244 153447 216525 25895 -176000 -169167 -28272 80237 70590
82 70590 19170 -6704 6944 20167 29739 36230 29298 -10576 -53851 -56661 -9826 35551 36111
95 36111 -999 -29913 -27102 -1099 30927 50854 34125 -24196 -86642 -81126 6493 88045 64798
108 64798 -54585 -128013 -45157 130767 214240 104256 -84339 -150702 -43737 75070 45323
119 45323 -92742 -150745 -43858 98244 101544 -21601 -99337 -29597 89386 103778 18479
130 18479 -31145 24883 89721 38718 -94472 -150181 -55362 74254 74023 -52048 -130607 -40678
142 -40678 126064 163058 11593 -158025 -146733 36499 180791 122807 -63926 -163019 -66632
153 -66632 110538 168706 46027 -123146 -163145 -39337 107915 121741 -10185 -141598 -128544
164 -128544 12552 129418 94962 -38408 -113085 -39234 99391 152094 65834 -63913 -105918
175 -105918 -37373 44829 45192 -26549 -81283 -59805 5018 37072 14568 -19521 -17163 10686
187 10686 29404 33314 37916 41546 19308 -30740 -64032 -37739 19203 39052 -4471 -54839 -39816
200 -39816 34595 83002 39087 -56282 -99968 -43313 47646 70671 2872 -63456 -37100 59553
212 59553 110434 52001 -55226 -89032 -18149 70138 69247 -18865 -93356 -72356 12146 57892
224 57892 11584 -67457 -74294 12069 101502 92208 -186 -63308 -25393 58579 74426 -3039
236 -3039 -81852 -63481 27939 76473 18879 -79970 -103179 -24450 63820 63556 -14415 -64129 -16031
249 -16031 72773 93323 14652 -71281 -62310 27036 86416 47485 -41616 -77218 -28898 37298
261 37298 38777 -22780 -77270 -62450 4971 59700 52815 4568 -23051 -2582 36331 44029 11535
274 11535 -25679 -32038 -6541 19432 19593 -2465 -28930 -38345 -27087 -3495 16801 20376 9974
287 9974 -4243 -7491 5598 22016 23381 -2333 -34158 -37081 8832 63568 66314 2908 -66334
300 -66334 -62065 11596 64427 27900 -63357 -101294 -34013 68742 89718 4378 -89567 -77151
312 -77151 36218 128158 97116 -20893 -90022 -35201 66575 86203 -9333 -114731 -113720
323 -113720 -14246 70406 57349 -20975 -65301 -23988 49883 74546 26324 -32970 -35887 16038
335 16038 56167 37838 -18575 -50189 -31876 1622 6194 -15301 -27495 -8563 22365 28514
347 28514 5892 -15861 -13805 5107 16290 2870 -13125 -6083 23169 39763 20832 -19738
359 -19738 -34412 -10333 20215 17988 -14124 -36007 -21978 8582 16431 -6380 -30241 -24662 6029
372 6029 32055 31820 16337 8083 15602 19583 7344 -17054 -24619 -11836 -821 -9772 -25450 -20339
386 -20339 3839 18846 -234 -29185 -26829 15988 56191 49624 2197 -33158 -16855 29674
398 29674 43935 1132 -59313 -66064 -6445 57219 51387 -18879 -74578 -48972 27369 66001
410 66001 26487 -42855 -56960 2309 70831 69650 1348 -61952 -51005 16145 62577 35988
422 35988 -30726 -58435 -22735 29547 34390 -13276 -54461 -44435 4646 40841 33795 3072
434 3072 -11664 2604 23616 24511 4658 -12852 -11450 3520 9075 748 -13164 -18429 -17679 -18964
448 -18964 -19432 -7806 11008 22821 16265 2670 2096 16751 24824 12700 -11430 -22692 -7113
461 -7113 17783 21081 -6401 -36410 -34748 -3110 22048 11326 -19318 -28167 2349 37854 35418
474 35418 -507 -29437 -17519 15826 32006 12172 -16127 -17886 7191 25533 10113 -25925
486 -25925 -42246 -22657 11830 18243 -4458 -21877 -6940 24751 30500 3476 -25740 -20097 17021
499 17021 43302 31259 -7633 -27112 -12204 14075 14148 -20791 -51445 -40546 7227 42464 28640
512 28640 -15868 -36877 -8883 35683 46414 14082 -21198 -18618 14795 36473 17014 -26593
524 -26593 -48533 -29298 8515 21967 961 -21507 -15826 9671 24680 11210 -7729 -12162
536 -12162 2418 11383 9455 4483 6914 10556 3451 -10663 -16039 -4978 8407 3688 -16894 -25145
550 -25145 -7875 19970 25544 -5408 -36472 -28826 12516 46466 34943 -4784 -22275 501
562 501 33596 30621 -10494 -46743 -39337 534 28796 16129 -21007 -40740 -21291 15531 30872
575 30872 13886 -8172 -5879 19594 38672 25051 -7792 -29648 -24338 -3498 6756 -2522 -15689
588 -15689 -15702 2160 15178 7733 -10680 -17107 1506 21510 18120 -5044 -15978 -132 24011
601 24011 22187 -6317 -28404 -14810 17913 29715 5151 -28706 -32754 -2651 23309 10963
613 10963 -23917 -38401 -10594 30505 41291 14760 -15343 -10480 14524 25518 5295 -18508
625 -18508 -18607 982 12435 2013 -16279 -21558 -10955 -1689 -2483 -6472 2824 17949 24754 12876
639 12876 -5669 -7369 6360 15260 3502 -16501 -19037 2246 20035 12595 -14162 -30682 -18778
652 -18778 5156 16658 6361 -11533 -14453 2874 23630 25269 4719 -16833 -13939 8485 27882
665 27882 20978 -6568 -28202 -22377 -1627 9148 -3089 -23645 -25811 -425 28943 33908 10192
678 10192 -14277 -13869 7138 20583 7005 -13289 -16221 2818 17044 9794 -9286 -16204 -8342
691 -8342 2521 1421 -6696 -6622 3251 9827 1429 -11823 -10004 5689 18419 12452 -3806 -4807
705 -4807 12758 27648 12668 -18086 -33137 -16958 6484 6982 -15583 -26565 -8682 20462 27081
718 27081 6812 -13968 -8881 15999 31230 17879 -7919 -18334 -6568 8145 1099 -19647
730 -19647 -27591 -13510 9469 17877 8350 -1422 -1375 5732 6929 88 -6621 -6651 108 7492 8625
745 8625 3183 -3370 -2369 2840 6123 2302 -4558 -7117 -1860 1080 -2279 -13804 -19992 -10656 6243
760 6243 17356 11751 1866 2294 17337 28972 15997 -13628 -33229 -20687 5695 11992 -9877
773 -9877 -30702 -19879 12303 28259 11848 -14919 -15472 9969 32929 24687 -5178 -22696 -11255
786 -11255 9221 10486 -9742 -24050 -11234 14216 22533 6184 -11802 -10792 2505 4913 -6357
799 -6357 -15328 -5962 9632 14662 3413 -6534 -1024 13107 16627 5235 -8830 -9426 3757 11035
813 11035 -666 -21206 -27493 -13919 4521 10318 1811 -3757 4595 19221 23926 14772 -2499
826 -2499 -12218 -11737 -2634 4257 858 -9411 -14995 -8366 5038 10325 1667 -9383 -8311 7163
840 7163 18429 13624 -771 -13725 -8246 4523 7760 -2062 -8085 -776 13594 16204 1909 -13818
854 -13818 -12457 285 2959 -8489 -18816 -8949 12481 19920 5904 -10474 -6756 12263 22552
867 22552 10222 -10418 -14125 1319 13086 4068 -18137 -27133 -11931 9055 12151 -615 -8990
880 -8990 2528 19073 18958 -1383 -14382 -9281 5537 10664 1443 -7482 -5246 5244 8435 1106
894 1106 -10202 -11854 -1841 6354 5201 -2209 -7323 -3618 4223 6783 -431 -3307 112 8788 15193
909 15193 10765 357 -8999 -11175 -5168 35 -4116 -13374 -14613 -3387 13232 17320 3860 -11269
923 -11269 -6284 10420 18651 8336 -8312 -13620 -477 11526 7499 -9932 -18462 -9242 6595
936 6595 14456 2928 -7602 -6086 3376 6312 -4038 -13036 -8274 5343 10777 5323 -374 4020
950 4020 11882 10205 -2859 -12689 -9258 1731 5110 -2951 -13574 -13193 -1445 8389 4785 -4164
964 -4164 -4172 7399 19510 17959 3217 -7895 -7245 143 257 -7388 -13882 -11933 227 8663 6988
979 6988 -776 -7442 -2179 6516 10411 4937 -5417 -7234 2222 10026 6414 -6926 -13394 -6924 6921
994 6921 10669 3792 -6146 -6451 1301 7108 1848 -11628 -15308 -4402 8788 12805 2992 -4205 395
1009 395 9586 10363 -455 -9656 -7668 3797 7539 1043 -8587 -11065 -3630 1794 1821 -3844 -4246 3336
1025 3336 11326 11571 2688 -4208 -3281 1075 2458 -2480 -4264 -1526 3819 3197 -847 -5974 -6004 -1826
1041 -1826 590 -482 -3379 -3166 3865 8681 6471 -652 -4995 -1296 7749 9737 2952 -7156 -6254
1056 -6254 1738 5105 -2113 -12536 -14548 -4647 9248 10227 3231 -2866 640 9698 12808 2190
1070 2190 -10214 -10612 1235 10339 5145 -7605 -12680 -4526 6129 6593 -2519 -9360 -3897 6581
1084 6581 12911 5382 -7011 -10433 -2772 6744 6073 -1358 -6303 -528 7511 9619 781 -8719 -7604
1099 -7604 -1376 2907 197 -4754 -5283 174 4479 3700 -1120 -4829 -82 6269 8285 3127 -1242
1114 -1242 -2056 2617 1969 -3273 -8884 -8182 -1114 4126 2807 -1755 -1746 1214 3801 2417 -1700 -3461
1130 -3461 1143 6823 6293 563 -4078 -2694 2096 3001 -2898 -9246 -5111 3400 8037 1663 -6701
1145 -6701 -8293 -1192 5699 7151 1159 -3507 630 8695 9631 2463 -8132 -11344 -3655 4385 2285
1160 2285 -5652 -9449 -2640 6293 7953 648 -6564 -3790 5615 10144 5557 -2530 -5831 -1023 4649
1175 4649 2263 -5589 -10591 -5517 4744 9878 3937 -4607 -3906 2084 5112 599 -5604 -7239 -152
1190 -152 6231 4940 484 -3269 -1935 2600 3013 64 -1458 -370 4272 4022 -2393 -7031 -8231 -2096
1206 -2096 567 -1465 -2937 367 6600 7423 4263 34 -1683 446 1794 501 -2364 -4182 -2571
1221 -2571 -981 -428 -3299 -5576 -3149 2494 5284 3591 1672 1761 4464 5173 1488 -3881 -7135 -3388
1237 -3388 2091 4610 794 -5021 -5151 124 5524 4272 -3588 -8691 -3280 6555 10031 3447 -6356
1252 -6356 -7275 548 6762 4908 -4012 -7780 -506 7215 6893 -1485 -9937 -7753 1425 5058 252
1267 252 -4782 -2474 5188 7778 3418 -4171 -3759 1014 4699 2625 -2129 -2743 507 3329 106 -4022
1283 -4022 -4270 -386 3563 2378 -1158 -1079 1783 3639 36 -4610 -4485 251 5772 3347 -170 -2291
1299 -2291 1344 3800 2037 -2826 -5296 -4059 -1016 1443 844 -913 -2339 -1809 1137 3498 2407
1314 2407 1263 -685 1388 3598 4151 962 -4978 -6671 -3775 1202 2703 -2469 -3534 348 6476
1329 6476 6753 -807 -7078 -4347 5477 8459 1305 -7193 -5876 3741 8430 2346 -6784 -8285 1332
1344 1332 9408 7167 -2379 -8311 -3353 4900 5746 -3768 -9238 -4345 6117 9384 2884 -3456 -2211
1359 -2211 2046 4736 -1236 -6376 -5656 -210 3435 1746 -2345 -3000 -151 2949 2278 -624 837 1441
1375 1441 2993 925 -557 -2407 -597 -654 -1738 -1811 -436 3078 3025 941 -2228 -710 367 -129 -3229
1392 -3229 -3098 -821 1793 1859 220 1218 1912 -821 -1003 -753 2650 3217 1311 -2572 -4613 -1551 2506
1409 2506 1901 -3543 -4593 163 6832 8513 1094 -5314 -3040 3284 4272 -2773 -8457 -5985 3569
1424 3569 7251 2079 -5883 -5320 3547 8757 3294 -4443 -6542 -101 5060 3819 -5093 -9620 -3162
1439 -3162 4345 6175 1282 -3272 380 5283 5030 -1372 -6004 -5512 -975 -275 -1967 -3792 -253 3820
1455 3820 5254 1810 875 1219 3007 3732 -434 -2143 -3271 -2639 -2800 -3040 -4193 -2413 2132 4193
1471 4193 3770 2782 3203 3390 625 -1357 -2526 -3366 -3791 -3383 -1883 557 2159 1311 -95 878 3195
1488 3195 4488 144 -4746 -3924 1314 2218 -1488 -7284 -7879 -994 7177 7792 926 -4320 -276 7247
1504 7247 8063 -1612 -10397 -8156 -333 5268 1250 -5466 -4289 2220 7160 4588 -1442 -3027 429
1519 429 3043 2886 -2347 -5339 -2134 1313 1322 -1781 -2820 386 5273 6011 1403 -2571 -1718 -73 -1226
1536 -1226 -2917 -5056 -2732 969 3131 4161 1749 1616 2302 2929 937 -1315 -2832 -3266 -1567 -1400
1552 -1400 -2077 -2344 -2170 754 3862 5658 5758 3149 2652 1478 220 -1776 -4920 -7987 -5732 -1536
1568 -1536 1634 1246 1514 2569 6495 7120 4081 301 -2031 64 -1289 -3058 -6115 -5979 -2211 956
1584 956 1546 -527 200 5337 8668 7132 601 -4481 -4583 -832 267 -4289 -9846 -6162 985 6606
1600 6606 5851 1100 -404 2832 6691 5055 -666 -5021 -5737 -915 368 -1983 -4931 -3673 1728
1615 1728 3100 4208 3243 3324 3033 2002 -1201 -3597 -3667 -2129 -2102 -1337 -763 750 2790 2480 1837 588
1633 588 345 1545 1267 291 -2504 -3745 -2762 -535 1471 -154 -975 643 2593 3859 4180 274 -2737
1650 -2737 -3944 -2571 -279 -1624 -3634 -3249 1252 5365 6687 3019 -1523 -1346 2197 3354 127
1665 127 -4834 -5997 -3554 555 1885 -1228 -1417 357 5908 7055 4323 193 -800 310 519 -3848
1681 -3848 -8267 -6189 -1542 2118 1710 -150 884 4866 7630 5369 -720 -2174 -1745 -19 -1384
1696 -1384 -4215 -6503 -5179 -1027 1962 1295 897 1621 4219 6149 2827 -450 -3494 -3080 -2532 -2518 -4221
1713 -4221 -4177 -2222 1443 3099 3560 2084 1406 2016 3357 2637 -271 -3347 -2615 -1512 19 -1696 -2189
1730 -2189 -1772 430 3591 3341 2084 1109 970 1593 874 -2654 -3277 -1899 -239 457 -714 -2012 328
1747 328 3321 2553 -714 -3272 -1500 2464 3111 580 -3283 -3668 31 4521 3088 -457 -3631 -1017
1763 -1017 3809 4309 775 -4404 -3935 -1037 1872 268 -2081 -1696 1448 4277 3584 1091 -1468 -1275
1779 -1275 -358 -265 -1457 -2779 -3307 -1419 513 1370 105 547 1815 3453 2706 650 340 -660 -1039
1796 -1039 -1136 -2545 -3455 -2667 -1138 1530 1819 501 885 1542 3279 2325 -584 -1768 -2068 861 792 -2425
1814 -2425 -4555 -3292 129 2479 1005 295 576 3209 4533 3274 -1211 -2390 -2553 -751 -19 -2652
1830 -2652 -3565 -1436 1325 2198 987 -1385 124 3507 3106 1096 -2130 -1454 -384 1249 -123 -3868
1846 -3868 -3761 -1046 2468 2837 1300 -1561 -1634 3242 4407 2540 -1682 -3438 -1459 229 1518 175
1862 175 -1497 -2792 -249 885 1472 307 -973 -1709 1400 2503 821 -567 -1303 -157 -761 97
1878 97 -1257 -534 1260 461 327 -1498 -247 201 609 1000 -766 -975 1089 2691 1727 -1246 -2742
1895 -2742 -895 1896 2251 -499 -2920 -1379 1005 2490 -16 -2669 -2185 1194 3945 2306 -143
1910 -143 -2287 -859 1350 1125 -1403 -3921 -2302 1199 2453 932 -492 -1042 1413 1993 156 -1405
1926 -1405 -1267 -281 973 267 -1155 -2461 -988 1140 1461 -347 -1736 -199 2973 2595 1667 -1056
1942 -1056 -2163 -1106 1259 1549 -718 -2770 -1920 747 1114 999 860 -1237 10 2040 3057 1842
1958 1842 -1684 -1609 -103 200 -606 -1593 -2493 -1094 399 901 215 467 670 1622 1438 -688 -1821 -581
1976 -581 377 649 -707 -2229 -1359 1143 1883 760 -1869 -1406 877 2351 901 -732 -2077 114
1992 114 1543 538 -1729 -2059 457 1670 2083 -910 -2237 -440 1960 2268 -173 -2718 -842 1703
2008 1703 2150 104 -2945 -2231 916 2518 126 -1304 -861 -199 2005 3201 428 -1599 -902 1216
2024 1216 1706 955 -1056 -1578 -480 440 542 -858 -1412 81 -132 700 1222 461 7 -1199 1397 848
2042 848 942 -1164 -2558 -874 1240 1162 -517 -1825 -1077 1631 1850 521 -912 -158 1141 1753 -419
2059 -419 -1254 -1739 866 1310 812 -774 -1207 1357 2442 523 -2410 -3186 595 2428 708 -2134 -2342
2076 -2342 613 2118 1627 -274 -1410 667 1460 1928 -1029 -1682 -414 220 394 -1034 -1586 -1117 1498
2093 1498 2486 -724 -2571 -419 2140 1855 -693 -2462 -1658 732 2310 733 -1121 -886 144 629
2109 629 889 -416 -194 -1852 -700 -159 11 453 -1661 -1534 -1636 279 1568 1531 1167 -362 -265 568
2127 568 741 -299 -3472 -2020 603 790 327 -1231 256 1735 1801 596 -205 168 1122 106 -1493
2144 -1493 -2470 -1235 780 1283 -595 -1000 -251 2294 3650 502 -2917 -2066 533 1042 -168 -2460
2160 -2460 -1900 505 2171 1548 -363 177 1315 1396 983 -811 -1767 -1331 138 -585 -1873 -1957 279 586
2178 586 1880 1075 -438 603 1927 2321 -238 -1816 -1764 142 -569 -1625 -1309 -1283 712 1499 2205 802
2196 802 1220 448 235 549 289 -1987 -1766 -1761 -732 641 221 -101 -122 956 1979 2815 875 -1130 -2263
2215 -2263 -71 -232 -715 -2244 -2647 1067 2325 1385 215 727 1128 1839 682 -1998 -3012 -1545 -483
2232 -483 -544 -1697 -1823 -606 1817 2870 1263 -569 -430 461 1133 191 -2572 -3198 -873 -125 124 -566
2250 -566 673 1798 1581 1594 741 12 144 -231 -1096 -1403 -2376 -1552 -378 859 283 204 1098 2318 3693
2269 3693 1504 -589 -1466 -1400 -558 -690 -1967 -2427 -1700 213 1923 3799 1088 1199 310 718 1072 -546
2287 -546 -1820 -3055 -1417 -239 -59 -271 -22 1283 1391 2870 2196 -116 141 230 440 -870 -2390
2304 -2390 -2432 -1240 -233 1350 454 1246 2004 2587 1760 -33 -731 -124 -1387 -1951 -1280 -2036 -1118 540
2322 540 688 1406 789 1056 2494 2543 1097 -1009 -2230 -1073 -1138 -956 -2252 -1011 269 474 1172 626
2340 626 296 1035 552 -256 -1707 -1349 -1267 -1054 312 -1796 -1723 -284 2392 2024 857 -1134 -833 404
2358 404 1121 -105 -1663 -2633 -2311 -509 1876 719 -174 131 730 1874 2168 512 -1935 -2009 -1036 -200
2376 -200 -229 -1608 -863 -630 272 1262 2043 1145 1215 584 983 65 -1281 -1659 -1045 -1108 -1773 -1354 -49 2491
2396 2491 2926 2427 6 -583 813 131 412 -2253 -2125 -2232 431 440 -102 265 576 1738 2508 763
2414 763 -1498 -1322 -213 -660 -1584 -2571 -1748 -183 1555 1244 653 687 1160 1992 851 121 -1510 -1635
2432 -1635 -402 -637 -990 -2228 -705 889 2398 2316 676 458 867 1210 1156 -797 -3067 -1121 -684
2449 -684 -190 282 -1246 -520 264 1823 2459 1349 244 -542 877 169 -947 -2410 -1511 -396 1193
2466 1193 691 -77 302 1217 1482 1587 1154 -797 -412 -804 -1017 -1686 -2041 -1645 832 2048 134 -212
2484 -212 -60 998 936 488 -1091 -2459 -85 469 -155 -377 -786 -330 1603 2229 1583 282 -854 -391
2502 -391 293 346 -1034 -1905 -368 -130 189 -815 13 1082 496 560 -33 -131 -458 -478 -1387 -1478 -1670 -1236
2522 -1236 -440 1673 113 -474 51 746 394 522 737 -1707 -1693 -685 240 88 -1391 -1777 318 2012
2540 2012 1709 214 -1130 -283 1266 911 -104 -1539 -1115 -879 470 603 -2005 185 992 1333 1142
2557 1142 227 -664 507 612 466 -1156 -2138 -1845 -434 380 -567 -428 -6 892 2668 1064 -782 -29
2575 -29 13 233 -455 -1419 -2048 -1373 513 697 571 123 331 1234 1906 1104 -195 -720 -198 -365 -825 -1369
2595 -1369 -1232 315 -73 -479 554 261 250 349 -22 -553 -1485 -626 272 -743 -216 -273 -1181 -304 676 1191
2615 1191 -259 -730 967 129 1002 789 -528 -1562 -328 54 1206 108 -940 -1130 134 1975
2631 1975 -743 -1241 -1145 393 1248 -77 89 -687 19 724 636 -164 -561 2 1053 1153 -684 -596 -1265
2650 -1265 819 599 176 -542 -481 625 1768 1638 -1444 -391 -128 212 -399 -826 -1278 -1468 -172 -169 -393
2669 -393 -304 1035 1181 987 922 312 -444 117 705 -451 -393 -257 -1186 309 27 445 -28 379 731 1165
2689 1165 1775 513 13 -59 301 535 -1035 -1038 -1427 -317 1134 196 556 791 1440 1478 1233 -788 -153
2708 -153 -514 567 -903 -1504 -1660 -857 106 422 608 -753 -200 1352 1328 1050 156 -324 -1158 -729 -145
2727 -145 -1077 -1647 -1174 390 489 1351 -525 155 1660 1078 186 -226 -698 -188 123 67 -1574 -1109 -9
2746 -9 1037 559 -110 183 710 1278 1202 1337 -318 -710 -639 509 651 87 -1099 -1348 293 -386 203 -323
2766 -323 -950 67 207 32 737 -397 845 673 880 30 -97 -975 -970 -379 561 -1451 -1166 -135 1125
2785 1125 815 -259 238 615 1349 1228 709 -710 -1383 -469 130 -444 -1061 -102 -173 699 666 -160 733 1485
2805 1485 1648 1033 -6 -892 332 540 -356 -1607 -721 -930 924 761 430 -38 468 248 898 332
2823 332 -35 -708 -346 -98 -511 -816 -983 239 139 1066 -24 283 560 905 956 771 380 -218 -173 -437
2843 -437 -253 -906 -692 -400 248 694 -20 -418 17 1050 681 286 -166 -35 -86 -489 -206 -994 304 53
2863 53 528 812 653 111 -855 76 598 223 -927 -509 543 771 121 -759 -1673 -174 -473 394 -531
2882 -531 -593 -573 -222 480 -220 131 -593 1153 741 585 -524 -1205 -896 -143 33 -472 -1559 65 784
2901 784 666 814 -182 769 956 1243 16 -803 -1354 -304 -327 -407 -410 -1140 -870 392 1383 265 1121 334
2921 334 345 160 -9 -579 -985 -1077 -677 146 -1093 -40 435 266 152 468 -484 424 560 155 137 -356
2941 -356 -1237 -403 -117 -45 -862 -1085 147 1115 1553 574 -619 -53 326 -249 201 -564 -195 -50 1185
2960 1185 1417 -264 -385 717 793 490 -513 -1234 -1299 -209 -24 723 532 385 317 647 759 -1033 -239
2979 -239 -770 -128 -1203 -803 -385 -632 1254 858 399 928 699 595 770 323 -63 -1091 -590 -12 -1044
2998 -1044 -871 -204 33 346 1262 505 730 924 1243 408 -135 -16 -1800 -1171 -49 -407 386 -889 518
3017 518 273 1459 1568 149 776 60 355 -410 -1285 -1080 -1224 -321 639 326 1378 471 887 744 72
3036 72 -347 -25 -304 540 -688 -1531 -1180 -593 -254 456 162 86 108 284 418 -107 -78 -1333 -53 -1062
3056 -1062 -247 66 194 142 660 359 -191 5 833 12 -78 -549 -2020 -737 -184 -436 334 -766 312
3075 312 1430 677 1040 450 89 -909 140 -636 -1068 -1516 -1319 -351 583 720 1299 440 1556 688 324
3094 324 -1107 -678 -79 -338 -490 -928 -706 426 216 -381 317 171 1071 1184 707 -154 -607 77 21 -1030
3114 -1030 -486 -539 508 22 873 668 877 1035 -79 156 554 -612 -677 -978 -1098 550 23 -672 -119
3133 -119 410 828 540 213 769 -56 -493 -659 -844 -1177 -704 950 698 1363 151 667 610 510 1324 -1002
3153 -1002 -603 -666 705 -605 -777 -998 -991 277 463 -498 871 512 864 798 735 -451 -552 -1040 -362 -693
3173 -693 -100 169 -68 845 889 1350 1229 1359 47 -119 -830 -737 -1171 -338 354 -428 -30 265 56 1534
3193 1534 1365 959 -30 198 -1144 206 -283 -1082 -1464 -377 -61 -56 477 580 1109 537 527 60 -646 -748
3213 -748 -933 -579 -796 -368 -484 272 481 617 -364 -174 1206 1705 878 77 199 -772 -256 38 -105 -609
3233 -609 -29 -516 450 227 -233 -712 -377 173 205 744 -585 -293 845 439 33 207 81 544 165 437
3253 437 -258 -304 60 90 -967 396 -42 285 115 469 1106 -279 -281 -365 -275 34 -976 -1047 -1452 362 577
3274 577 36 -120 154 1275 734 770 1049 -346 72 385 -976 -1167 -1008 -1129 -1124 129 -94 -272 653 45
3294 45 410 638 590 -187 -301 -323 761 -1030 -250 168 116 -34 598 -141 709 892 583 32 19 327 -83
3315 -83 508 -237 -1086 -193 -433 -53 38 -1075 -951 -199 1235 1312 -360 -720 -78 52 112 -736 -707 43 -258
3336 -258 91 -387 -696 -360 -74 315 453 637 433 -269 -233 764 -633 205 -186 911 -123 -342 146
3355 146 -214 407 526 -9 -331 181 -701 1022 644 -40 101 -81 824 724 -420 -888 -557 -235 1041
3374 1041 216 -863 1000 253 604 -19 -308 -236 -122 118 681 68 -765 -336 236 414 -501 -314 -333 1037
3394 1037 257 407 -500 211 -144 222 215 -101 -282 -12 238 80 -140 181 -447 301 301 988 -282 -26 134
3415 134 -436 248 -535 -632 258 -643 -245 244 -650 535 652 473 89 526 335 723 96 390 245 -522
3435 -522 -1318 -255 -101 -1 -464 -234 481 818 1463 -197 191 517 521 861 -292 -469 -789 -91 -161 -820
3455 -820 -1236 -1032 -344 786 764 879 -178 474 788 -155 227 313 -745 298 -371 341 -867 -143 459
3474 459 425 994 511 -394 -289 600 -533 88 -68 -738 323 -244 -294 94 308 644 -134 777 590 -831
3494 -831 102 -67 -251 -921 -59 -700 125 -228 -227 -947 -721 -263 -165 -238 870 -589 222 85 325 938 -1262
3515 -1262 11 417 278 52 -955 189 -179 -38 634 -154 512 -32 1334 184 66 -115 968 557
3533 557 -66 -290 318 -498 -457 -683 348 -144 -843 -166 -20 1236 517 -399 -394 904 14 21 399 -206 -304
3554 -304 -435 525 -3 -642 306 -99 341 -370 -587 -228 436 443 -120 386 -737 -60 646 -352 13 522
3574 522 -76 459 528 -387 -1013 119 642 772 116 -394 -300 -26 -366 404 113 -781 449 506 -7 953
3594 953 100 -425 694 122 22 -696 -204 939 291 -998 -188 -59 44 551 -337 -210 562 1123 890
3613 890 1503 275 272 351 -313 -69 -736 67 -466 -582 169 775 357 -171 235 301 702 -435 -712 -677 -286
3634 -286 -47 599 -164 502 106 714 194 811 -92 232 689 94 -1397 -767 -84 -437 -204 -454 14 183
3654 183 619 209 238 770 223 436 -102 -147 -439 -1115 13 659 434 90 428 255 960 256 838 449
3674 449 -88 124 -147 -125 -96 -150 -421 831 453 135 -188 -540 658 570 -290 -51 -399 -974 -668 -155 537
3695 537 -14 13 805 804 536 -649 -80 -198 -204 -11 -686 -580 -691 -413 521 211 -475 845 595 706 -44
3716 -44 856 90 218 -743 -628 -218 227 335 501 253 135 345 -993 790 -106 294 -905 -927 -606 -694
3736 -694 -851 -1039 192 -73 73 114 471 -315 586 -756 265 -553 -681 -1352 -56 -555 -772 -417 30
3755 30 1008 451 270 224 287 -313 450 -1022 -1228 -958 -280 -126 171 -53 -162 952 1264 1055 688 -193
3775 -193 -751 -348 -493 -787 -586 -1092 -365 161 1152 -84 966 824 593 99 -164 -187 -110 -659 -292 -292 -284
3796 -284 173 60 664 552 962 -122 1023 259 -89 -820 -278 -991 -250 -361 -306 116 131 1263 826 291
3816 291 449 -44 208 214 18 -342 -462 -973 -718 312 -589 96 545 1312 271 839 771 -839 56 45
3836 45 -252 -825 618 -578 -559 -328 835 74 142 -61 -244 -139 -561 -368 932 -622 -519 350 507
3855 507 231 623 908 1532 1356 -263 92 -723 -751 -814 -59 579 48 -325 -99 -202 138 384 896 -561
3875 -561 2 -222 123 -511 -828 -428 -1218 -295 523 422 167 6 -154 1082 802 -310 -386 -158 -1015 -170
3895 -170 -664 -346 649 540 574 518 553 267 770 758 830 635 -948 -738 -312 -245 -570 -263 -182 435 1208 491
3917 491 240 522 849 -266 436 -922 -704 107 -574 -40 -709 345 -675 985 -24 156 -511 -238
3935 -238 62 -559 -392 -139 93 -5 -129 747 502 -661 773 575 183 -37 -1068 24 -279 296 -527
3954 -527 388 192 87 527 629 703 -843 -729 179 -646 11 -558 -548 -361 -538 -59 240 -705 176 414
3974 414 1211 873 -180 -474 -558 -1372 -157 0 844 326 598 383 -445 -1 -11 -424 409 -642 -928 -777
3994 -777 -620 -87 -691 60 461 322 419 71 164 137 355 -475 -275 -359 -616 -424 444 -168 -525 -133 536
4015 536 1132 366 993 38 -574 -161 278 -168 -232 -837 -1146 -167 -324 -289 94 1088 171 566 378 161 501
4036 501 -461 432 -82 -138 -420 -144 -449 -484 -5 415 114 -199 232 243 -376 -185 715 -1 450 -959 98
4057 98 406 989 445 -72 -9 -284 -233 411 549 -348 -40 682 878 -639 740 -174 -14 -384 262 -560
4077 -560 40 303 -167 327 45 903 405 646 -470 -556 154 504 782 488 -109 974 -241 100 -191
4096 -191 -51 740 -139 109 -628 65 663 288 -365 -182 -977 -244 -386 -494 -475 344 756 -430 -276 -714
4116 -714 399 -90 -157 573 36 286 -439 110 624 -1024 270 9 349 11 288 158 -407 -284 -396
4135 -396 171 225 256 -45 11 124 91 100 439 672 580 -249 346 -416 3 -474 -530 -247 394 -498 437 -648
4157 -648 -815 -78 -477 -280 696 293 887 74 346 -199 688 -293 -861 -15 -523 210 -141 123 790 -24
4177 -24 -181 118 77 -273 257 185 9 -138 442 67 439 -15 -473 -595 363 452 -87 300 -34 437 -77
4198 -77 -528 -531 -442 394 -291 450 -312 366 215 -24 1048 119 -764 147 689 155 165 -720 -512 528 -237
4219 -237 -9 139 -128 1101 853 628 -58 1018 617 770 70 -141 847 -296 -302 -961 -33 230 -308 106
4239 106 933 1032 -7 -160 -395 621 221 468 -546 428 302 1440 -247 77 -437 -715 -428 -457 578
4258 578 71 -541 -397 869 -108 -622 62 401 258 -78 28 229 -191 908 138 -30 530 1256 389
4277 389 -290 -63 -855 -630 954 853 -18 10 -199 -124 339 -92 501 -427 72 315 -151 41 -245 -104
4297 -104 166 34 93 314 257 123 -674 -500 215 -556 231 -45 -165 341 -654 824 476 46 -460 -758
4317 -758 63 -191 767 -312 -72 151 294 -161 579 105 382 148 -113 219 51 -289 105 -119 -178 -76
4337 -76 377 -63 398 438 433 323 166 1660 201 102 269 -78 117 -702 -459 -552 -533 -189 423 212 532 -176
4359 -176 -81 744 536 -60 -111 -770 69 15 917 -1578 -549 -183 -660 620 -2 135 621 -607 197 124
4379 124 -132 -277 -913 -694 202 -164 686 -19 -267 166 -519 670 464 402 414 271 145 371 -178 269
4399 269 173 419 -1128 -585 -339 375 473 127 1170 1102 438 728 205 790 480 -9 641 254 -24 -702
4419 -702 -33 990 302 -370 -135 98 57 471 243 73 -195 -105 -355 380 -578 122 618 -88 -93 306 105
4440 105 257 226 391 -139 157 644 60 216 -552 -135 22 -11 -218 -124 484 -1495 281 894 737 325
4460 325 715 -29 -152 -181 -148 -798 -265 -300 -298 373 -96 20 -573 -167 -577 -380 -71 -177 1115 868 867 117
4482 117 -70 -359 -36 -394 -354 -61 -224 -90 213 187 6 666 291 -168 -337 637 -173 45 -921 194
4502 194 -209 -663 48 -194 20 -294 162 -49 -437 432 -332 -886 -718 -476 121 -13 -348 -712 -289 -303
4522 -303 1023 215 212 -308 182 344 -539 267 226 658 -164 3 -520 338 596 533 -713 -306 389 -128 -228
4543 -228 -1178 -328 -240 562 -306 508 471 -184 158 668 -135 -1086 -284 -414 -406 77 69 114 -303 52 60 956 551
4566 551 -494 343 -34 4 324 -1017 -235 -634 485 782 469 573 480 1033 1099 490 -419 -7 -43 -568
4586 -568 -192 -157 -760 -347 -14 220 364 655 734 1060 398 -285 -259 -928 -112 -94 -701 -506 -403 -41 -132 796
4608 796 216 999 513 -286 -634 811 458 -1576 -9 -304 33 -303 -460 1067 375 908 836 128 120 294
4628 294 410 -441 417 -846 -844 -131 104 269 670 159 280 488 -442 205 303 508 -720 239 -318 -228 -899
4649 -899 -557 706 191 373 593 -413 87 416 -138 297 -356 309 -1054 175 -485 605 1570 387
4667 387 -116 629 146 368 -547 -507 463 -651 1036 -269 15 169 550 -650 13 -248 526 1125 -670
4686 -670 -605 -515 -461 -515 587 1187 11 -454 150 367 364 264 -474 124 777 235 373 -520 -255 -654 -184
4707 -184 664 -163 -207 234 965 621 -533 281 -93 396 -1211 -419 -339 345 265 -7 328 -677 -394 -196
4727 -196 396 -241 -259 -61 -5 278 -263 -170 192 -23 -231 841 409 -957 187 304 -1 -238 477 -711
4747 -711 -95 -643 -278 -212 -407 86 59 820 -653 394 899 -475 -300 -91 59 919 -602 143 241 130
4767 130 801 -68 310 263 361 430 -100 609 -223 -678 -104 -54 -643 694 -934 23 428 -137 169 3 355
4788 355 -377 185 62 -333 70 -674 45 -317 -168 719 140 -32 221 8 -63 -457 218 429 -369 -158
4808 -158 397 26 201 276 451 -35 -440 -347 -174 531 -816 -118 -195 477 -79 63 420 -276 -94 -286 -37
4829 -37 181 -584 736 -624 373 429 -109 -325 -234 322 360 -353 156 419 301 25 -211 -330 -727 -287 -95
4850 -95 174 526 -216 -889 705 -225 427 143 -676 -189 921 303 230 -157 -502 -861 -700 -121 -39 -94 246
4871 246 -102 311 -84 -806 -397 -54 -287 -382 -175 341 421 144 -476 200 460 -390 -190 325 -504 -151 -126
4892 -126 294 581 -66 24 -952 270 153 -511 -332 -301 20 -132 560 -399 272 193 -525 496 137 -307
4912 -307 407 376 114 -281 -448 206 574 -272 -138 -561 -26 -886 244 -196 -563 110 87 494 34 126 705
4933 705 464 250 720 695 168 -442 -654 -816 -38 -250 -176 630 -540 -144 644 42 117 -26 -490 327 -696
4954 -696 412 111 -297 28 -340 -238 185 123 -164 556 -178 -70 129 716 361 204 234 507 172 -45
4974 -45 486 -853 -240 464 130 207 743 -812 1052 -117 -239 -413 337 137 -1086 -743 -517 395 289
4993 289 126 176 118 -257 -211 723 109 249 -8 315 46 357 89 -31 446 523 52 -285 -145 305 -163
5014 -163 -102 -334 -744 403 463 342 263 -242 278 -200 -401 -543 44 337 -322 18 -118 174 483 -195 -189
5035 -189 -260 -903 -856 -729 357 409 260 923 343 357 -490 -215 892 376 463 -177 -254 139 -113 -338 461
5056 461 -28 -52 53 60 368 476 356 405 258 119 724 244 -38 431 -424 176 495 22 296 -68 -548
5077 -548 -713 -102 -544 223 306 -257 -159 345 -269 200 -677 227 262 -851 729 123 -143 461 34 -370
5097 -370 -165 546 435 -268 -1075 82 429 -154 398 160 263 100 24 415 -112 -196 -756 62 158 784 -454
5118 -454 511 343 -531 118 -165 -737 666 -235 58 -218 306 1129 136 605 -57 -42 -161 -101 -245 -82
5138 -82 -187 -43 -624 -725 142 181 1144 158 246 876 241 -696 76 -893 -609 256 -55 50 -191 485 -113
5159 -113 -88 -828 -259 -249 2 6 -382 -88 -112 334 -140 103 949 -240 -865 -177 447 446 -382 206 -351 -423
5181 -423 575 97 -421 -758 538 242 283 -9 46 -44 -38 -58 -307 -921 87 -1507 75 50 -231 920 458
5202 458 -157 -523 426 227 -282 12 -177 -153 -286 -145 329 348 424 -208 828 478 -10 -125 -565 -356 -292
5223 -292 672 -687 -423 -212 -54 -584 -81 573 -147 163 -123 -804 -795 -442 247 -323 -622 -1213 -287 -52
5243 -52 364 339 186 -72 -182 456 407 142 -501 -97 -210 1228 -266 -51 293 206 -230 549 535 -717 815
5264 815 351 -240 -290 -367 -344 587 477 361 -45 -414 -330 602 596 -605 -378 -733 254 -194 55 17 -10 421
5286 421 621 -20 291 -530 262 -23 -229 -877 924 -745 -256 -377 55 137 -392 330 -812 63 -137
5305 -137 341 154 780 -103 -975 -125 -247 -128 78 94 404 -786 519 700 357 469 227 694 301 -628
5325 -628 -403 -806 -110 -152 289 333 -374 144 -261 313 464 -59 -421 -50 105 -270 2 -521 -633 -399 238
5346 238 306 154 -27 -87 1813 173 -597 -418 -573 -186 -265 -597 -130 297 11 -192 120 347 272 -14 -645
5367 -645 -69 456 -187 -184 829 -107 695 -49 1124 -284 183 -168 764 1008 -453 -6 195 -774 -117
5386 -117 395 308 89 -929 425 -341 -213 -1 -197 -142 791 -58 -422 -1274 -765 720 -355 -628 267
5405 267 341 -68 578 -248 -1059 137 -602 -263 -979 315 -180 -16 -1093 42 935 -390 72 -307 144
5424 144 424 -426 -574 -635 404 -90 450 -129 62 133 253 649 78 -362 406 -61 -444 -182 -91 -225 -53
5445 -53 -446 -115 19 485 465 109 223 -485 145 -95 163 173 -383 874 -143 388 829 -83 116 121 -684
5466 -684 -518 92 -196 294 -500 -214 273 436 -267 -98 -239 -200 -529 -61 93 -618 -290 -277 -276 -194 499 -251
5488 -251 311 -1100 -223 -537 726 -139 -430 -356 -387 -199 436 42 -404 160 -121 149 -22 -123 130 260
5508 260 588 -515 -200 318 -150 15 -415 -571 -229 -260 426 129 646 55 -421 1 -684 254 -714 208
5528 208 640 -377 -125 372 -158 -335 -895 -886 390 217 -170 206 -48 266 266 314 -231 18 217 938 97
5549 97 -244 39 467 -393 582 -348 363 -160 -414 359 242 -296 44 933 683 -386 -745 -580 145 -358
5569 -358 -677 -201 349 110 322 99 -234 45 574 -56 -430 -203 -270 -347 690 -516 -370 -349 -770 373
5589 373 -349 -459 -553 424 -417 434 -433 -201 2 130 -649 -24 -694 292 383 16 498 -235 1107 517
5609 517 1067 -379 743 56 -82 -409 -878 -364 -304 -214 -230 22 540 175 768 -80 -177 -370 188 10 -213
5630 -213 428 21 -196 -273 217 -100 -145 -481 -856 409 -71 480 -355 175 -177 310 37 -683 -560 -811
5650 -811 -106 -821 431 -131 563 35 206 357 611 -45 -41 172 244 448 -365 -36 -324 796 -111 486
5670 486 141 151 671 1055 506 456 275 -572 100 316 -930 -875 54 108 -249 -747 -163 -106 -116 -59 -401 229
5692 229 21 -378 275 -326 -740 502 -161 -161 -263 -317 -366 -334 -910 491 196 -210 -662 -157 -31 334 -147
5713 -147 -393 -130 -681 -266 326 -658 -215 -133 -55 -485 290 606 872 -63 436 821 -265 -197 -217 13 781
5734 781 84 36 170 -865 -26 -232 64 260 471 -790 -204 -582 531 -146 -313 597 -163 -49 -322
5753 -322 -444 -140 118 287 540 -298 98 -443 28 312 147 -481 96 78 -469 953 380 -8 320 759
5773 759 187 -391 82 -199 596 206 -384 4 -365 -787 297 -262 269 -188 -138 332 125 -152 703 22
5793 22 410 -327 42 98 -173 -134 900 -57 174 182 554 497 -173 8 408 -817 -8 -99 582 -25 -369 -81
5815 -81 105 -180 329 -93 161 433 -157 -205 -201 -720 5 334 -259 -253 -613 -336 617 216 448 305 -32 -418
5837 -418 -21 2 -171 -232 -351 -265 301 283 -780 -390 -231 -254 63 -975 -322 248 -24 365 -1058 -16
5857 -16 159 333 -274 39 216 926 444 -891 285 -330 -39 414 123 -166 -3 621 -1076 -163 -71 -73
5877 -73 74 436 24 -179 -487 -230 360 -263 116 -262 114 -398 -513 63 50 -633 58 -232 102 -572 -52
5898 -52 -941 -475 194 31 147 -167 208 363 322 250 -266 -643 -173 -96 213 471 -317 -463 779 -542 468
5919 468 163 315 -313 -224 426 186 466 -895 191 -75 -635 -459 -571 666 509 -69 24 101 -641 448
5939 448 1058 -180 604 -874 1342 -81 338 -151 -288 288 -467 291 -71 445 386 127 528 492 -414
5958 -414 -365 -482 -129 -1116 -1256 -243 -122 202 494 804 -537 -198 -408 45 -89 -510 304 36 -1252
5977 -1252 104 50 -297 -455 -183 77 503 450 444 247 -118 74 -550 -783 -122 257 -84 206 483 -185 -487
5998 -487 210 363 104 -352 239 289 -432 -205 -442 26 152 -630 275 183 -117 -108 622 419 42 -204 -479
6019 -479 -94 407 148 -591 61 662 4 373 -771 4 -141 558 -580 396 286 -493 958 -678 -300
6038 -300 -653 -255 415 -888 -479 -410 -73 -205 562 -441 -111 517 -961 166 297 37 264 1065 -253
6057 -253 755 503 -170 544 -156 -220 -47 -170 164 -70 433 1195 29 -191 462 -160 659 -683 90
6076 90 51 446 0 708 -45 29 0 27 32 189 530 66 59 -370 3 324 -630 635 151 -352 -40 -511 -367
6099 -367 -421 -669 337 645 330 -598 1010 357 -130 456 -524 -8 20 511 352 452 576 467 124 -488
6119 -488 -104 -123 -147 409 -196 308 -203 -127 759 429 -839 532 -529 47 -1075 -448 98 -444 -758 -278
6139 -278 447 -224 -231 435 68 303 -144 218 -6 -480 -209 477 52 568 -104 280 489 770 -200 603 31
6160 31 -290 453 211 675 -822 137 132 85 -36 241 71 16 450 -20 -719 62 252 126 -384 -98 -143 560
6182 560 883 394 -846 -213 835 110 1061 554 -477 208 -429 21 222 -29 -202 -7 -8 462 230 263
6202 263 -426 129 -262 -872 47 -62 47 -246 -685 242 -141 243 63 722 429 -125 -322 -590 198 -37
6222 -37 48 -794 534 573 1064 260 476 -211 45 675 677 334 -199 -415 -694 -213 -418 81 -151 354 -214
6243 -214 1082 -155 -244 -205 914 507 -35 694 -29 -227 -107 250 402 -63 -32 566 35 -91 -538 768
6263 768 692 112 -650 -116 -798 -501 1109 439 370 -249 245 -445 253 31 -126 -618 -539 -541 457 -777 -162
6284 -162 -769 474 -392 50 -408 -34 508 -226 130 105 -45 110 -320 -257 240 45 219 130 324 166 -477
6305 -477 -1206 862 66 488 -5 -583 169 -104 653 176 -809 102 -515 234 -306 298 -152 46 -186 -129
6325 -129 -238 230 -791 300 -97 -239 -11 -756 -282 362 873 377 -541 -622 454 -784 560 -22 -138
6344 -138 -1117 -338 -588 2 300 -933 16 -138 -168 -82 -62 732 580 -249 88 125 57 -1194 832 -375
6364 -375 -354 -109 712 205 -79 775 -485 -266 -13 -153 46 -4 -61 -36 321 276 -1 788 95 -580 -191
6385 -191 -58 -69 2 -362 664 909 -685 100 -184 465 -420 540 692 183 -621 -17 54 34 421 139 -18
6406 -18 611 29 -127 606 -548 651 192 104 402 348 -86 -221 455 -26 51 249 -67 -74 883 -159 131
6427 131 -165 -165 -518 -23 -488 -478 -430 -242 -54 -401 -637 108 145 192 -229 -73 -589 161 369 189 25 46
6449 46 225 -147 468 131 214 339 -133 3 -730 22 274 335 299 132 -338 -895 -345 41 -149 -747 -727 -551
6471 -551 -30 568 764 -828 704 219 23 347 281 387 267 458 -855 371 -405 291 -40 467 845
6490 845 -357 182 54 254 1077 131 1076 888 -304 -393 -515 -549 -206 -408 -45 215 -265 14 943 -225
6510 -225 -259 578 140 -420 -615 295 -376 -421 310 359 173 342 -591 -170 -368 -298 576 95 -400 405 78
6531 78 -119 67 -299 806 107 506 291 -309 114 -105 323 125 658 673 -306 -237 285 19 72 -369 244
6552 244 58 -696 573 -1 -453 1384 948 -97 -375 554 -82 84 -564 -222 237 -400 -261 0 295
6571 295 234 297 400 595 375 -97 298 -511 10 126 -28 -479 -170 -194 673 -368 -273 350 83 693 -140
6592 -140 -52 -365 105 -7 455 -663 106 -294 716 98 -133 25 93 -440 665 440 -43 84 392 458
6612 458 278 149 87 -22 -787 -294 -519 575 -484 52 -103 -1528 44 163 -170 -223 -26 -250 -822
6631 -822 -92 156 -237 -225 -64 -356 -701 -458 -320 -63 -209 -563 761 234 46 -242 455 253 103 1
6651 1 141 -579 174 289 138 -142 -58 552 313 -528 152 -818 5 -60 -424 -660 197 -364 -603 -36 348
6672 348 980 6 -293 -1131 469 -561 164 167 -420 117 175 100 1171 178 -640 -489 270 524 1010 622
6692 622 686 -230 287 233 181 415 -940 -660 -377 -341 722 601 -372 -192 -173 -598 -646 -382 303 -217 -168 -551
6714 -551 -581 281 186 -726 -360 430 88 -179 119 243 -901 227 -956 279 -24 330 268 -695 83 -144
6734 -144 202 89 734 -153 -772 414 830 171 8 222 270 -456 -5 -202 -47 -36 -777 657 -167 79
6754 79 291 -111 201 162 241 -551 127 -383 -148 -475 -620 -162 -44 290 216 -498 -471 207 -48 958 492
6775 492 185 -513 -295 364 -481 -472 -83 -997 -411 453 223 419 -460 139 161 127 158 628 -178 327 1050 -239
6797 -239 -358 432 249 330 -665 118 -438 129 -347 47 237 -277 633 768 417 790 -274 -421 70 -233
6817 -233 839 465 683 -184 180 408 14 -78 134 224 701 -751 157 1272 935 -139 311 -345 52
6836 52 231 646 -516 437 -36 -189 -157 -389 -278 324 517 369 -220 -619 263 -6 274 -328 114 -420
6856 -420 -48 -854 272 -80 -306 153 112 825 498 -528 -177 405 26 76 1256 329 424 -76 317 -513
6876 -513 -204 220 -496 -335 -334 -60 -353 -519 -181 279 173 -555 -144 -28 179 -225 -606 -202 406 -252 462
6897 462 -363 891 962 923 68 177 493 -173 -110 -56 -784 -388 -466 853 703 7 -52 -141 -949 65 265
6918 265 -292 434 -43 652 341 -307 353 301 96 206 425 140 68 437 583 155 -160 145 -582 500
6938 500 -383 189 -86 -380 -140 -26 96 573 -178 -75 383 -191 460 525 -146 494 379 -632 -220 701
6958 701 431 281 317 -225 48 851 484 -116 589 715 -148 -595 103 -299 458 184 -830 53 -105 -969
6978 -969 -286 -20 -664 -128 215 -459 590 935 703 -119 -345 747 -361 -140 695 -118 -923 -60 -321
6997 -321 -115 64 308 -126 799 -592 -219 271 -5 -115 352 494 269 692 -97 359 46 158 -173 -77
7017 -77 -571 567 1114 -1157 -281 557 331 -860 975 -426 671 859 -361 -1522 -530 -366 461 15
7035 15 -370 224 525 489 99 7 -591 82 -482 -73 -310 -202 -404 -417 617 -216 344 -113 970 634 295
7056 295 -46 -515 -71 -225 -87 -3 -414 150 500 74 -282 158 564 694 -248 805 -381 -58 -63 220
7076 220 51 291 -262 167 -463 -9 1410 -21 -104 -154 -211 145 412 -50 87 319 -294 913 96 -148
7096 -148 -230 -243 -169 -443 498 -781 -93 -563 255 216 -247 184 -180 726 -160 646 -308 -198 -104 70 42 -678
7118 -678 199 91 1139 -72 -29 -263 464 105 588 -307 -749 -448 152 641 578 122 157 -451 -146 -222 418
7139 418 464 -601 -166 558 -212 515 -83 -1141 -809 500 384 476 472 133 3 -451 -100 154 90 -423 -6
7160 -6 383 415 112 595 526 -810 -453 -728 -436 154 -427 -655 -7 154 -454 619 407 -397 -52 283 -391
7181 -391 -233 -248 -946 54 157 -326 7 635 145 68 -57 -1157 -377 -594 -242 118 -149 -208 296 647
7201 647 279 361 -328 -55 -268 745 -77 -353 -125 135 459 -288 624 -691 88 278 111 7 -545 220
7221 220 208 793 -427 723 -83 -21 -610 589 -955 759 619 99 -131 -236 301 -795 -699 -570 494
7240 494 259 -392 -272 -134 -222 99 411 -530 -158 -392 -443 151 578 -402 256 -391 494 784 -614 208
7260 208 -574 -493 624 -366 -212 -150 321 383 581 -639 -81 554 -186 556 153 194 -2 -35 -246 589 -457
7281 -457 -469 616 992 -123 758 -241 140 385 531 226 760 50 -311 305 165 360 -159 -550 -260 78
7301 78 164 -273 -158 938 -116 -234 463 -206 -331 -468 -280 232 16 -69 483 -505 -71 20 230 -212 93
7322 93 -327 631 -117 177 318 662 -437 266 262 -89 300 281 708 -331 549 74 -256 -121 381 225 -139
7343 -139 190 419 268 -71 643 -40 -661 501 -237 98 11 -676 -288 135 -760 -412 266 -302 143 -635
7363 -635 115 397 -958 305 -243 -156 -55 -454 -742 16 -240 -304 -1241 683 110 -111 194 -491 288 -399
7383 -399 -123 249 477 -693 516 217 131 368 -830 148 188 -109 314 -636 -656 23 -519 907 845 429
7403 429 658 337 255 -599 153 1235 178 696 -663 -347 1 641 148 276 394 -259 -85 -463 -124
7422 -124 -193 -59 -279 105 -453 -308 -162 -662 163 -426 -23 -414 -64 -613 -620 -375 442 -85 -20 12 302 -111
7444 -111 -48 -516 964 215 210 -327 -120 -213 -455 -192 43 321 -405 -255 -98 331 -236 309 -578 -424 -87
7465 -87 -169 408 -168 262 -303 -229 634 281 -354 408 -763 -549 -111 -26 187 285 229 -263 -235 174 644 207
7487 207 -542 242 -415 577 -379 -260 -169 799 50 73 215 -498 412 583 20 -302 810 302 33 190
7507 190 817 -239 343 280 446 294 -460 -181 167 166 230 314 -96 -64 549 -427 -358 -448 -728 420 40 -814
7529 -814 0 273 -454 -1166 333 -281 78 198 -422 -362 73 -258 -25 -841 177 -222 -90 -50 -435 175
7549 175 121 -32 439 -461 -192 52 15 -404 -363 489 -20 -175 107 -412 -382 325 874 -472 -847 -319 839
7570 839 -76 -24 -253 511 -173 1064 -620 1153 499 101 -28 197 -852 -648 506 -944 -1059 -321
7588 -321 -44 -792 320 -566 376 -124 260 577 99 -607 122 -479 -195 -99 46 738 -408 13 353 199
7608 199 362 -137 183 -664 510 473 -409 -362 302 163 512 59 671 -38 -367 -402 557 -373 28 -375 -296
7629 -296 -246 213 -88 -809 333 -891 87 162 -337 -337 224 66 525 -263 154 -626 635 -481 825 -785
7649 -785 -707 1481 401 -94 398 -28 -150 275 -162 -771 198 22 -364 -119 -208 548 -584 498 363
7668 363 -1050 -523 -342 -84 146 86 549 126 -472 41 -284 -358 615 797 -19 -2 -411 -312 -310 244 316 11
7690 11 -73 42 497 163 -1065 415 1025 -444 189 -737 211 108 -251 41 451 618 24 231 424 287
7710 287 493 202 -31 -273 485 43 -285 -351 633 -483 -181 842 404 -181 814 -797 554 656 -347
7729 -347 -629 16 -481 127 -377 70 971 -1152 -131 -731 224 -1053 85 -522 359 -390 -169 7 300
7748 300 -260 -373 350 -255 113 166 -213 901 351 -44 95 -89 15 672 618 -603 -278 97 3 -36 130
7769 130 -954 -192 515 -550 341 -157 270 -686 -145 -171 255 -1 -276 -161 -89 3 -209 314 500 -156
7789 -156 -527 111 632 385 -68 367 608 -431 99 401 45 -173 496 139 548 114 1015 645 838 244
7809 244 3 -446 -319 409 -119 677 -18 687 -322 230 581 -223 -267 -123 208 -95 781 428 473 -251
7829 -251 149 176 -402 -497 133 -427 434 336 315 -343 -459 -369 -236 155 -122 -499 -113 -1061 141 376 61
7850 61 574 458 155 -68 897 -457 491 -461 41 -479 -230 -170 -628 386 296 932 -352 509 -381 595
7870 595 233 -576 -672 -759 468 215 106 -201 -337 -427 -72 -99 147 58 8 -545 -456 289 -491 740 -244 -540
7892 -540 284 -106 284 192 275 243 -621 -375 -484 -774 286 610 386 37 484 -664 220 -103 520 668
7912 668 -312 -330 281 -45 101 -336 9 375 549 -564 -227 242 575 -258 -30 779 19 794 -118 25
7932 25 -766 -656 611 -45 -85 803 124 218 -1151 184 -278 -320 62 -146 -301 -25 545 -234 635 -153
7952 -153 -126 -176 -366 402 500 214 -145 245 558 -208 73 75 -23 -304 -227 -477 527 411 1144 -90 -1 -5 53
7975 53 730 -3 -99 -241 -115 -37 -64 -357 -255 840 -115 -545 60 152 -756 -165 5 215 -471 97 449
7996 449 -109 -496 -267 315 231 191 -382 773 329 296 300 112 664 -90 -145 -246 -123 -253 -389 78 983 -761
8018 -761 378 23 -209 -1082 633 91 -216 -84 203 -80 -243 456 -7 32 -381 -322 -266 1106 -164 251
8038 251 -517 104 -694 185 -366 -248 -611 108 -21 -174 36 -85 -5 45 -176 6 -310 233 205 777 -512
8059 -512 325 719 -565 32 249 -23 -622 73 -151 794 -283 545 107 11 -21 -179 244 280 412 292
8079 292 -401 -84 14 -28 197 188 253 269 61 341 -32 -385 -49 -57 75 -205 453 -227 52 -77 -914 -327 -220
8102 -220 -114 -29 698 -86 -53 -224 -29 -729 -33 -86 -2 31 185 -282 -66 -787 -373 600 164 -94 165 -443
8124 -443 -209 559 -163 648 -75 -478 -53 -174 699 -1082 -103 32 -378 100 642 1064 -47 -356 -600
8143 -600 -680 665 -168 -240 -466 -68 515 117 -602 622 330 137 -338 -448 -354 574 1019 -682 224 -424
8163 -424 659 -213 -96 388 157 763 -129 512 -341 -395 -303 -2 97 -187 873 457 -510 290 -507 125
8183 125 275 783 -175 -3 626 -591 625 -246
8191b46
##END NTUPLES=NMR FID
##END=
