##TITLE=1H_AT-29_T 
 DMSO-d6+CD3ONa
 108 sc, 
 29.08.2022
##JCAMPDX= 6.0         $$ Bruker NMR JCAMP-DX V2.0
##DATA TYPE= NMR FID
##DATA CLASS= NTUPLES
##ORIGIN= UXNMR, Bruker Analytische Messtechnik GmbH
##OWNER= root
$$ XWIN-NMR		Version 3.5
$$ Mon Aug 29 15:20:51 2022 Russian Standard Time (UT+4h)  she@DPX200
##.OBSERVE FREQUENCY= 200.1313499994
##.OBSERVE NUCLEUS= ^1H
##.DELAY= (6, 6)
##.ACQUISITION MODE= SIMULTANEOUS
##.ACQUISITION SCHEME= undefined
##.AVERAGES= 108
##.DIGITISER RES= 18
##SPECTROMETER/DATA SYSTEM= spect
##.PULSE SEQUENCE= zg30
##.SOLVENT NAME= THF
##.SHIFT REFERENCE= (INTERNAL, THF, 0, 15.7039)
##AUDIT TRAIL= $$ (NUMBER, WHEN, WHO, WHERE, WHAT)
$$ ##TITLE= Audit trail, XWIN-NMR		Version 3.5
$$ ##JCAMPDX= 5.01
$$ ##ORIGIN= Bruker BioSpin GmbH
$$ ##OWNER= she
$$ F:/spectra/data/she/nmr/H-F/1/audita.txt
$$ ##AUDIT TRAIL=  $$ (NUMBER, WHEN, WHO, WHERE, WHAT)
(   1,<2022-08-29 15:19:18.40 +0400>,<she>,<DPX200>,
      <continue with go, POWCHK disabled, PULCHK disabled
       configuration hash MD5:
       00 E9 B6 7A A2 85 ED C7 34 08 36 98 17 FE 4E 26
       data hash MD5: 16K
       5C 41 BA CB 98 28 08 49 14 3A EF 0C 46 ED DD E9>)
$$ ##END=
$$ 
$$ hash MD5
$$ 9C 71 75 B2 FD A2 BE 9B EC 37 C6 F1 EF 84 0D 77
##$RELAX= 
##$RELAX= 
##$RELAX= 
##$RELAX= 
##$RELAX= 
##$RELAX= 
$$ Bruker specific parameters
$$ --------------------------
##$DU= <F:/spectra>
##$EXPNO= 1
##$NAME= <H-F>
##$PROCNO= 1
##$TYPE= <nmr>
##$USER= <she>
##$AMP= (0..31)
100 100 100 100 100 100 100 100 100 100 100 100 100 100 100 100 100 100 
100 100 100 100 100 100 100 100 100 100 100 100 100 100 
##$AQSEQ= 0
##$AQ_mod= 1
##$AUNM= <au_zg>
##$AUTOPOS= <>
##$BF1= 200.13
##$BF2= 200.13
##$BF3= 200.13
##$BF4= 200.13
##$BF5= 200.13
##$BF6= 200.13
##$BF7= 200.13
##$BF8= 200.13
##$BYTORDA= 1
##$CFDGTYP= 0
##$CFRGTYP= 5
##$CHEMSTR= <none>
##$CNST= (0..31)
1 1 145 1 1 1 1 1 1 1 1 1 1 1 1 1 1 1 1 1 1 1 1 1 1 1 1 1 1 1 1 1 
##$CPDPRG= <>
##$CPDPRG1= <>
##$CPDPRG2= <>
##$CPDPRG3= <>
##$CPDPRG4= <mlev>
##$CPDPRG5= <mlev>
##$CPDPRG6= <mlev>
##$CPDPRG7= <mlev>
##$CPDPRG8= <mlev>
##$CPDPRGB= <>
##$CPDPRGT= <>
##$D= (0..31)
0 1.2 0 0 0 0 0 0 0 0.06 0 0.03 0 0 0 0 0.0002 0 0 0 0 0 0 0 0 0 0 0 0 
0 0 0 
##$DATE= 1661771499
##$DBL= (0..7)
120 120 120 120 120 120 120 120 
##$DBP= (0..7)
150 150 150 150 150 150 150 150 
##$DBP07= 0
##$DBPNAM0= <>
##$DBPNAM1= <>
##$DBPNAM2= <>
##$DBPNAM3= <>
##$DBPNAM4= <>
##$DBPNAM5= <>
##$DBPNAM6= <>
##$DBPNAM7= <>
##$DBPOAL= (0..7)
0.5 0.5 0.5 0.5 0.5 0.5 0.5 0.5 
##$DBPOFFS= (0..7)
0 0 0 0 0 0 0 0 
##$DE= 6
##$DECBNUC= <off>
##$DECIM= 32
##$DECNUC= <off>
##$DECSTAT= 4
##$DIGMOD= 1
##$DIGTYP= 9
##$DL= (0..7)
0 120 120 120 120 120 120 120 
##$DP= (0..7)
150 150 150 150 150 150 150 150 
##$DP07= 0
##$DPNAME0= <>
##$DPNAME1= <>
##$DPNAME2= <>
##$DPNAME3= <>
##$DPNAME4= <>
##$DPNAME5= <>
##$DPNAME6= <>
##$DPNAME7= <>
##$DPOAL= (0..7)
0.5 0.5 0.5 0.5 0.5 0.5 0.5 0.5 
##$DPOFFS= (0..7)
0 0 0 0 0 0 0 0 
##$DQDMODE= 0
##$DR= 18
##$DS= 0
$$ [...]
##$SUBNAM2= <"">
##$SUBNAM3= <"">
##$SUBNAM4= <"">
##$SUBNAM5= <"">
##$SUBNAM6= <"">
##$SUBNAM7= <"">
##$SUBNAM8= <"">
##$SUBNAM9= <"">
##$SW= 18.0517283424941
##$SWIBOX= (0..15)
0 0 2 0 0 0 0 0 0 0 0 0 0 0 0 0 
##$SW_h= 3612.71676300578
##$TD= 16384
##$TD0= 1
##$TE= 0
##$TE2= 300
##$TE3= 300
##$TEG= 300
##$TL= (0..7)
0 120 120 120 120 120 120 120 
##$TP= (0..7)
150 150 150 150 150 150 150 150 
##$TP07= 0
##$TPNAME0= <>
##$TPNAME1= <>
##$TPNAME2= <>
##$TPNAME3= <>
##$TPNAME4= <>
##$TPNAME5= <>
##$TPNAME6= <>
##$TPNAME7= <>
##$TPOAL= (0..7)
0.5 0.5 0.5 0.5 0.5 0.5 0.5 0.5 
##$TPOFFS= (0..7)
0 0 0 0 0 0 0 0 
##$TUNHIN= 0
##$TUNHOUT= 0
##$TUNXOUT= 0
##$USERA1= <user>
##$USERA2= <user>
##$USERA3= <user>
##$USERA4= <user>
##$USERA5= <user>
##$V9= 5
##$VALIST= <valist>
##$VCLIST= <CCCCCCCCCCCCCCC>
##$VD= 0
##$VDLIST= <DDDDDDDDDDDDDDD>
##$VPLIST= <PPPPPPPPPPPPPPP>
##$VTLIST= <TTTTTTTTTTTTTTT>
##$WBST= 1024
##$WBSW= 4
##$XGAIN= (0..3)
0 0 0 0 
##$XL= 0
##$YL= 0
##$YMAX_a= 13350029
##$YMIN_a= -13388013
##$ZGOPTNS= <>
##$ZL1= 120
##$ZL2= 120
##$ZL3= 120
##$ZL4= 120
##$ABSF1= 10
##$ABSF2= 0
##$ABSG= 5
##$ABSL= 3
##$ALPHA= 0
##$AQORDER= 0
##$ASSFAC= 0
##$ASSFACI= 0
##$ASSFACX= 0
##$ASSWID= 0
##$AUNMP= <proc_1d>
##$AZFE= 0.1
##$AZFW= 0.1
##$BCFW= 1
##$BC_mod= 2
##$BYTORDP= 1
##$COROFFS= 0
##$CY= 11.3945322036743
##$DATMOD= 1
##$DC= 2
##$DFILT= <>
##$DTYPP= 0
##$F1P= 2.36226072786647
##$F2P= -0.459571619588291
##$FCOR= 0.5
##$FTSIZE= 0
##$FT_mod= 4
##$GAMMA= 1
##$GB= 0.15
##$INTBC= 1
##$INTSCL= 1
##$ISEN= 128
##$LB= 0.24
##$LEV0= 0
##$LPBIN= 0
##$MAXI= 10000
##$MC2= 0
##$MEAN= 0
##$ME_mod= 0
##$MI= 1.114404
##$NCOEF= 0
##$NC_proc= 0
##$NLEV= 6
##$NOISF1= 3.799351
##$NOISF2= 2.8
##$NSP= 1
##$NTH_PI= 0
##$NZP= 0
##$OFFSET= 15.70392
##$PC= 1
##$PHC0= -18053.37
##$PHC1= 26.60069
##$PH_mod= 1
##$PKNL= yes
##$PPARMOD= 0
##$PSCAL= 0
##$PSIGN= 0
##$REVERSE= no
##$SF= 200.130013532006
##$SI= 16384
##$SIGF1= 3
##$SIGF2= 2
##$SINO= 400
##$SIOLD= 16384
##$SREGLST= <1H.CDCl3>
##$SSB= 0
##$STSI= 0
##$STSR= 0
##$SW_p= 3612.71676300578
##$SYMM= 0
##$S_DEV= 0
##$TDeff= 0
##$TDoff= 0
##$TI= <>
##$TILT= no
##$TM1= 0
##$TM2= 0
##$TOPLEV= 0
##$USERP1= <user>
##$USERP2= <user>
##$USERP3= <user>
##$USERP4= <user>
##$USERP5= <user>
##$WDW= 1
##$XDIM= 8192
##$YMAX_p= 0
##$YMIN_p= 0
$$ End of Bruker specific parameters
$$ ---------------------------------
##NTUPLES= NMR FID
##VAR_NAME=  TIME,          FID/REAL,        FID/IMAG
##SYMBOL=    X,             R,               I
##VAR_TYPE=  INDEPENDENT,   DEPENDENT,       DEPENDENT
##VAR_FORM=  AFFN,          ASDF,            ASDF
##VAR_DIM=   8192,          8192,            8192
##UNITS=     SECONDS,       ARBITRARY UNITS, ARBITRARY UNITS
##FACTOR=    0.0002768,     1,               1
##FIRST=     0,             0,               0
##LAST=      2.2672688,     0,               0
##MIN=       0,             -13388013,       0
##MAX=       2.2672688,     13350029,        0
$$ Real data points
##PAGE= N=1
##DATA TABLE= (X++(R..R)), XYDATA
0@%%%%%%%J08k16K16k16L24n40P56r72J188j404J720k152K675l212L772m508N367
$$ 0 0 0 0 0 0 0 0 108 -108 108 -108 216 -324 432 -540 648 -756 964 -1188 1487 -1725 2047 -2461 2906
24B906o321P408q645J0007j1529J3314j5340J7511j9875K2548k5551K8855l2474
$$ 2906 -3415 3993 -4652 5355 -6174 7140 -8200 9311 -10564 11984 -13567 15288 -17186
37a7186L6462m0815M5554n0789N6583o2873O9654p7075Q5248r4187J03922j14557
$$ -17186 19276 -21539 24015 -26774 29809 -33064 36590 -40485 44763 -49424 54498 -60059
49f0059J26216j39015J53123j68752J86080k05331K26906k51330K79198l11245
$$ -60059 66157 -72858 80265 -88487 97593 -107738 119168 -132162 147036 -164209
59a64209L48545l92671M45844n11367N94463p03739Q54590j077859J446022k191816
$$ -164209 184336 -208335 237509 -273858 320605 -383134 471456 -606403 839619 -1352197
69a352197O191114j2819669j260461K1033923j1165032n337173P040616n307288
$$ -1352197 4838917 -7980752 -9241213 11792710 627678 -4709495 2331121 -2976167
77b976167K692815R625253j6433701k023492K1282957p986602j6870563J4602562
$$ -2976167 -283352 9341901 -7091800 -9115292 12167665 4181063 -12689500 1913062
85A913062N055777j0438986L899797n92079m934908J2497919l318514j6619952
$$ 1913062 6968839 -3470147 429650 -162429 -5097337 7400582 4082068 -12537884
93a2537884J3423076J1640712j8458579j375797J3856473n693502l055841M609674
$$ -12537884 885192 12525904 -5932675 -7308472 6548001 854499 -2201342 2408332
101B408332p213745M291729J0104196j4289087m678287J8532366m460548j3876389
$$ 2408332 -4805413 -513684 9590512 -4698575 -9376862 9155504 4694956 -9181433
109i181433R898773L873996p280221M630208k113700n989534J1917256q4738j5728267
$$ -9181433 717340 4591336 -2688885 1941323 -172377 -6161911 5755345 5670607 -10057660
118a0057660Q632568J1395818j3030698k615706R825390m030311r61253L842991
$$ -10057660 -1425092 9970726 -3059972 -5675678 4149712 119401 -841852 3001139
126C001139p613234K741192J0354041j0668029o003230J4050303j606557j0411000
$$ 3001139 -4612095 -1870903 8483138 -2184891 -8188121 5862182 4255625 -6155375
134f155375O487056K245973m899972M891330k090381o409877R569715J877182
$$ -6155375 331681 2577654 -2322318 2569012 478631 -5931246 3638469 5515651
142E515651j2422512M876655Q983146q597647k002265O407974l514979K42852
$$ 5515651 -6906861 -2030206 6952940 -1644707 -3646972 2761002 -753977 -511125
150e11125L885625o813017P43076Q986475o714140n722464R563715j84087p184453
$$ -511125 3374500 -3438517 -2695441 6291034 -423106 -6145570 3418145 3234058 -3950395
159c950395M271458J214791l648280M262103j093987n677579O470196K499357
$$ -3950395 321063 1535854 -2112426 2149677 1055690 -4621889 1848307 4347664
167D347664q692025K536023O326135n518527j202866M195001l037223M85776L545862
$$ 4347664 -4344361 -1808338 4517797 -1000730 -2203596 1991405 -1045818 -560042 2985820
176B985820n219829k49259O821530m192270m423432O433537N213m825264L178588
$$ 2985820 -2234009 -2483268 4338262 145992 -4277440 2156097 2161310 -2663954 514634
185E14634N38756k946497L419455l54648m450768M229582K177791n898953J447633
$$ 514634 1053390 -1893107 1526348 1171700 -3279068 950514 3128305 -2770648 -1323015
194a323015M282612l669280o59241K916822k374601J76769K799456l386433n80277
$$ -1323015 2959597 -709683 -1368924 1547898 -826703 -649934 2149522 -1236911 -1817188
203a817188M541051k458206l027263M049723J02342l107615K082586L84665k058508
$$ -1817188 2723863 265657 -2761606 1288117 1390459 -1717156 365430 750095 -1308413
212a308413K186466j1759k935593K539332J575286l710018P15185K792954k216530
$$ -1308413 878053 866294 -2069299 470033 2045319 -1664699 -949514 1843440 -373090
221c73090n50794J881892j395022k6437J769003j998484n01319K818364j325407
$$ -373090 -923884 958008 -437014 -463451 1305552 -692932 -1194251 1624113 298706
230B98706j985421K338629K47728j850577J085424K66304j106706J281974q3302
$$ 298706 -1686715 651914 899642 -950935 134489 400793 -705913 576061 492759
239D92759j784854J533868J040477k187204K71530J647427j142017l64465R60831
$$ 492759 -1292095 241773 1282250 -904954 -633424 1014003 -128014 -492479 468352
248D68352p48527Q0460J004103j206956l70696J661153n75713j225231J118121
$$ 468352 -280175 -199715 804388 -402568 -773264 887889 312176 -913055 205066
257B05066L13172q94403L96128J03235m66401O89021l9223r87067O72105O95573
$$ 205066 518238 -376165 19963 123198 -343203 345818 306595 -680472 -8367 687206
267F87206r64509j29903P34614k57260j80490K07575l19694J81404M74792n91898
$$ 687206 -277303 -407206 327408 70148 -110342 97233 -222461 -41057 433735 -158163
277a58163k68170P38811p4240n50981K62154J91049j63280R6844j31499j66828
$$ -158163 -426333 312478 238238 -312743 -50589 140460 -22820 74024 -57475 -224303
287b24303M14133M0629n12112J39738M13133k20773k24352J45469P9872K9096
$$ -224303 189830 230459 -281653 -141915 271218 50445 -173907 -28438 51434 80530
297H0530l8113j95349P4208K69154j16610k51156J21245K00532q4109j62782K0667
$$ 80530 42417 -152932 -78724 190430 73820 -177336 -56091 144441 60332 -102450 -81783
308h1783J53384L7693j52169q0597J36775J13139j07619j41441Q4841J67379o5331
$$ -81783 71601 109294 -42875 -123472 13303 126442 18823 -122618 -37777 129602 64271
319F4271j91699M4019J96042j3211j81353k5732J54576O5397j24365j00280R5385
$$ 64271 -127428 -83409 112633 99422 -81931 -107663 46913 112310 -12055 -112335 -16950
330a6950J31932o8009j66301M3568J88536l0485j84082K6185J46313r009q9382
$$ -16950 114982 46973 -119328 -75760 112776 82291 -101791 -75606 70707 61698 -27684
341b7684m3876M9145J28674n6202k05909J05030K17401j54146j38431J37932K1420
$$ -27684 -71560 -22415 106259 50057 -155852 -50822 166579 12433 -125998 11934 33354
352C3354j8084M2087j62900J7059L00096j75238k84853L08856J12954k84587R8855
$$ 33354 15270 57357 -105543 -88484 211612 36374 -248479 60377 173331 -111256 -12401
363a2401O7904j76114K36158K2449m29203K84010L58832n21154o0022M78053k50164
$$ -12401 55503 -120611 115547 137996 -291207 -7197 351635 -169519 -229541 248512 -1652
374a652j29251L14593l19520k5888N63991m59209m20002P99512k7237p15984M37012
$$ -1652 -130903 183690 -135830 -161718 402273 -56936 -476938 322574 295337 -420647 16365
385A6365K17910m65421L76262J4271o40555O53994L68809j080867K59916R30912
$$ 16365 234275 -231146 145116 159387 -481168 172826 541635 -539232 -279316 651596
395F51596p71352k72769P25518m33618o5272O57733q07923j89895J296730o63720
$$ 651596 -119756 -392525 332993 -100625 -165897 491836 -316087 -505982 790748 127028
405A27028j038030J269876J92907j114080O10052K16524p33821Q52135P851j348818
$$ 127028 -911002 358874 551781 -562299 47753 264277 -469544 382591 390442 -958376
415i58376J101639R13865j796042J39828J523930j014534m13169R93349p81199
$$ -958376 143263 1057128 -738914 -599086 924844 -89690 -502859 490490 -290709
424b90709K0109J209029j375454n50271K135067p18429j745637J635382M67814
$$ -290709 -270600 938429 -437025 -987296 1147771 429342 -1316295 319087 786901
433G86901j447131P69592J75934j041208J363909R9766k119360J403735J572358
$$ 786901 -660230 109362 285296 -755912 607997 707763 -1411597 -7862 1564496
442A564496k367214j38978K020216j094121n20959J143870j133053J36195J795469
$$ 1564496 -802718 -941696 1078520 -15601 -536560 607310 -525743 -389548 1405921
451A405921j912433j003311K929879o40772k433309J873228P37872j676672R59968
$$ 1405921 -506512 -1509823 1420056 779284 -1654025 219203 957075 -719597 240371
460B40371L9048j422655J985368K95621l013509J607835K338971k856390m78052
$$ 240371 279419 -1143236 842132 1137753 -1875756 -267921 2071050 -785340 -1263392
469a263392K436213j173378n15819J341007j634063J82644K553154k355501j643125
$$ -1263392 1172821 -557 -516376 824631 -809432 -626788 1926366 -429135 -2072260
478b072260L614994l61752l013232J900862R29876j728857J187270j75056j849775
$$ -2072260 1542734 1180982 -1832250 68612 998488 -730369 456901 281845 -1567930
487a567930K557610O25505l784249J537577L025966k978885q70484K523145j088218
$$ -1567930 989680 1615185 -2169064 -631487 2394479 -584406 -1454890 1068255 -19963
496a9963l48305J392937k126125K16658L245385k598649k310370M006300J05074
$$ -19963 -368268 1024669 -1101456 -884798 2360587 -238062 -2548432 1457868 1562942
505A562942l356938J660665J016287j577563J434957m33132k328642L037380J113650
$$ 1562942 -1793996 -133331 882956 -694607 740350 307218 -2021424 1015956 2129606
514B129606m425215J218172L623968k843725j210948K412351j074446n2859J589032
$$ 2129606 -2295609 -1077437 2546531 -297194 -1508142 904209 -170237 -223096 1365936
523A365936k699410K5375M000099k554025l028230M075900O02380l373610J415511
$$ 1365936 -1333474 -1308099 2692000 137975 -2890255 1185645 1788025 -1585585 -170074
532a70074Q12405j465776J903282n67430k962248L271399J757299m716593O74252
$$ -170074 642331 -823445 1079837 512407 -2449841 821558 2578857 -2137736 -1463484
541a463484L860940k411330j298850K040294j166680L18877J841704l110936l41296
$$ -1463484 2397456 -13874 -1312724 727570 -439110 -120233 1721471 -1389465 -1730761
550a730761M456999k129087l508550L650472J057462k989133J060707M65845j277095
$$ -1730761 2726238 597151 -2911399 739073 1796535 -1192598 -131891 333954 -943141
559i43141K260923n71563l407774L142949K324454m548249L3224L717926j806702
$$ -943141 1317782 746219 -2661555 481394 2805848 -1742401 -1709177 2008749 202047
568B02047j172686J575299j355295O14331K172239l285842q35440M590112j523084
$$ 202047 -970639 604660 -750635 -136304 2035935 -1249907 -2085347 2504765 981681
577I81681l650913L032795J186447k438978J010721J3656j376370K646659k90183
$$ 981681 -2669232 363563 1550010 -888968 121753 135409 -1240961 1405698 1115515
586A115515l783614K705758K736535m031329m17084L221746j382702p61053J286493
$$ 1115515 -2668099 37659 2774194 -1257135 -1674219 1547527 164825 -596228 690265
595F90265j697109O72416K543916l106949j353618M286978q22780l401265K264128
$$ 690265 -1006844 -334428 2209488 -897461 -2251079 2035899 1213119 -2188146 75982
604G5982J096136j807775R98946l16257j461936K685461Q9146l721120J995381
$$ 75982 1172118 -635657 363289 47032 -1414904 1270557 1359703 -2361417 -366036
613c66036K813140l176904p29399K506131r64154l69258J038374j817845N35773
$$ -366036 2447104 -729800 -1459199 1046932 82778 -286480 751894 -1065951 -530178
622e30178K637277k591037j666468L617399k37815k852511J572758Q12741j293091
$$ -530178 2107099 -483938 -2150406 1466993 1229178 -1623333 -50575 762166 -530925
631e30925J100980m57821j619399K472617N09035l359093J284168K548407k346536
$$ -530925 570055 112234 -1507165 965452 1474487 -1884606 -600438 1947969 -398567
640c98567o81715J819441q80119p744J048046j868408K24976K573229j941505
$$ -398567 -1080282 739159 -140960 -148704 899342 -969066 -744090 1829139 -112366
649a12366j733151K808397P5843k165840J122857M46761r78119J176795l95445
$$ -112366 -1845517 962880 1038723 -1127117 -4260 442501 -535618 641177 245732
658B45732j649201K004966P74599k715233O85219K056873j585429n39026J231702
$$ 245732 -1403469 601497 1376096 -1339137 -653918 1402955 -182474 -721500 510202
667E10202p58589J44996R73406j601446m6837K166033j258897j528812J946380
$$ 510202 -248387 -103391 870015 -731431 -778268 1387765 128868 -1399944 546436
676E46436K26492j489018P65262J90475p46867J067935k30151j466025J425346
$$ 546436 772928 -716090 49172 239647 -507220 560715 330564 -1135461 289885
685B89885Q25751j969869K96480J479715j032864l14243Q29047p06684J60411
$$ 289885 1115636 -854233 -557753 921962 -110902 -425145 403902 -302782 -142371
694a42371R18620j234332k55421J655141p23826j172847J264079J80194r58592
$$ -142371 776249 -458083 -713504 941637 217811 -955036 309043 489237 -469355
703d69355N93604K7345o28213Q83770m5819j172406Q91845P12006j285033J01996
$$ -469355 124249 151594 -476619 407151 361332 -811074 80771 792777 -492256 -390260
713c90260R50901o51401j42878N50334n70565R3496P35704q05174l04144J086966
$$ -390260 560641 -90760 -233638 316696 -253869 -160373 575331 -229843 -533987 552979
723E52979l51831p72379P31974J16559n68118M09133n647m66046N82580O6388
$$ 552979 201148 -571231 160743 277302 -290816 118317 112670 -353376 229204 295592
733B95592p78898M60944N01629p24037J2232N40757l80026n9452L59812l81525
$$ 295592 -483306 -22362 479267 -244770 -232538 308219 -71807 -131259 228553 -152972
743a52972M242M95408m25236k50154O02655j42388m28916L84377M9073l13482
$$ -152972 -148730 346678 -78558 -328712 273943 131555 -297361 87016 136089 -177393
753a77393K63678L188l09889L16522R3638m27079J99436K76529l53273L588K67903
$$ -177393 86285 89473 -220416 96106 189744 -237335 -37899 238630 -114643 -111055 156848
764A56848k08029k2201K09060k03081l2673K63569j74313j44721K65954m6912
$$ 156848 -51181 -73382 135678 -67403 -100076 163493 -10820 -155541 110413 63501
774F3501j92007J68434K1812j47260J20297J8371j44738J14518N9817j63583N7326
$$ 63501 -128506 39928 61740 -85520 34777 53148 -91590 22928 82745 -80838 -23512
785b3512J09873j23477o610J02953p3249j9606P9746n7882k6713Q2836l9331m9970
$$ -23512 86361 -37116 -43726 59227 -14022 -33628 46118 -11764 -38477 44359 5028 -44942
797d4942P1012o210n4542M3191J2299m3608K5026J6090l6105J6287J9354k9533
$$ -44942 26070 19860 -34682 8509 20808 -22800 2226 18316 -17789 -1502 17852 -11681
809a1681M059K2543j8542p876J9969n950j0211R719K286q240L578K633n251K119
$$ -11681 -7622 14921 -3621 -11497 8472 2522 -7689 2030 4316 -3924 -346 2287 -2964 -845
823h45L005l088j332M470o59m176L457J613k437l65N11J213m26k295J616K244
$$ -845 2160 -928 -2260 2210 1551 -2625 832 2445 8 -357 154 1367 941 -1354 262 2506
839B506n829L975N057j0455K365J1654j3659l964K3605j6532j5048L1571r213
$$ 2506 -3323 652 5709 -4746 -2381 9273 -4386 -8350 15255 -1277 -16325 15246 6033
852F033k7010L2986J177l7431L4947Q481n1951M0493K7328p3773K8183N9710p6425
$$ 6033 -20977 12009 13186 -24245 10702 19183 -32768 7725 35053 -38720 -10537 49173 -27252
865b7252J528P4197o8251r841Q6085p7149l2855J25711o7939q9880J41712j2320
$$ -27252 -25724 48473 -19778 -29619 56466 -20683 -53538 72173 4234 -85646 56066 43746
877D3746j26484J10172K1255j23589J09302K4484j67348J26850J01289k26920
$$ 43746 -82738 27434 48689 -74900 34402 58886 -108462 18388 119677 -107243
887a07243N5143J89721j82574l3588J80433j38696k8141J95031j80957q0961L01128
$$ -107243 -52100 137621 -44953 -78541 101892 -36804 -64945 130086 -50871 -131832 169296
898A69296j35331k35098K95077K2716k68217J82401N4634k20862K09189M4028
$$ 169296 33965 -201133 93944 116660 -151557 30844 85478 -135384 73805 117833
908A17833l38662K40010K31433m28778M2421L72939k80413r1952K86610k20027
$$ 117833 -220829 19181 250614 -178164 -135743 237196 -43217 -135169 151441 -68586
918f8586k9427L38712l32865j63314N43369j86150m46668M51670R7068m11592
$$ -68586 -98013 240699 -92166 -255480 287889 101739 -344929 106741 203809 -207783
928b07783K51128O1985l29442L69424O3398n87625L74581M29913o62236j3171
$$ -207783 43345 105330 -224112 145312 208710 -378915 -4334 425579 -236657 -249828
938b49828N74571l51704j44013L70988l36323J949N28990n24602k97313Q28379
$$ -249828 324743 -26961 -170974 200014 -136309 -134360 394630 -129972 -427285 401094
948D01094j86316o91012N55869J99282n06779K95917L6157m36333N55863J09088
$$ 401094 214778 -476234 79635 278917 -227862 68055 104212 -332121 223742 332830
958C32830q63342M52082O75398q27743j34759P16403l53492j58891M09153m77047
$$ 332830 -530512 -78430 596968 -230775 -365534 350869 -2623 -161514 247639 -229408
968b29408L2048P62914o81746n00405J068422r7723r01204N72745K74756n34755
$$ -229408 -197360 565554 -116192 -616597 451825 354102 -547102 25643 300399 -234356
978b34356L74922l6779n90216P71692K20565j164532M56891R37629r18569k62955
$$ -234356 140566 103787 -486429 285263 505828 -658704 -201813 735816 -182753 -445708
988d45708P86046l63268j01517M68548o87495L9993J047592q01321p46902J254826
$$ -445708 340338 -22930 -124447 344101 -343394 -303401 744191 -57130 -804032 450794
998D50794L4274j048284N38860K98871n17937M87431j23412p74379R57466L84344
$$ 450794 485068 -563216 -24356 274515 -243422 244009 120597 -653782 303684 688028
1008F88028j401624L62410J145710q83658l75089P52393l58895n352N30046q68755
$$ 688028 -713596 -351186 794524 -89134 -464223 288170 -70725 -76077 453969 -414786
1018d14786k6236J288859p76431r86760J269324K12401j055178M42497K41492
$$ -414786 -441022 847837 71406 -915354 353970 566371 -488807 -46310 195182
1027A95182m73565O33718j68360r87537J042426O03728j516607J89264J242737
$$ 195182 -278383 355335 186975 -800562 241864 845592 -671015 -481751 760986
1036G60986p69713l98373O57976m23352J18468O51058j046371j48389J494619
$$ 760986 -8727 -407100 250876 -172476 -54008 597050 -449321 -597710 896909
1045H96909o87531j167580J205081L29269r78141L93231J18778m67048Q10034
$$ 896909 209378 -958202 246879 576148 -401993 -8762 110016 -357032 453002
1054D53002j70067j190401J049314Q04847j522847J2097J231111o22362l57027
$$ 453002 282935 -907466 141848 946695 -576152 -564055 667056 44694 -312333
1063c12333N42298n03793K05621P77240j113713l19157J555139m84835j234411
$$ -312333 229965 -273828 -68207 709033 -404680 -723837 831302 346467 -887944
1072h87944J001246L96713q04145L52167j2154m86802R13565o8170j305792Q87066
$$ -887944 113302 510015 -294130 58037 45883 -440919 472646 404476 -901316 -14250
1082a4250R55572j345712j64231J081812m62939k43726M42108o03654K23411R05437
$$ -14250 941322 -404390 -568621 513191 50252 -193474 248634 -355020 -131609 773828
1092G73828j068485m96707J486077k68249j177368P82323L61096o26193L84372
$$ 773828 -294657 -791364 694713 426464 -750904 31419 392515 -233678 150694
1101A50694j27514n47747R72407M8635j337154P09933R98197j136312k36931Q87198
$$ 150694 23180 -524567 447840 496475 -840679 -130746 867451 -268861 -505792 381406
1111C81406l76370j04136L90827o87640J93155R72896r44059o04170J309049r2993
$$ 381406 5036 -99100 291727 -395913 -202758 770138 -173921 -778091 530958 437965
1121D37965j019888N73395K74462m64800M17377j75382n98266R05765J90399j224087
$$ 437965 -581923 -8528 265934 -198866 218511 43129 -555137 350628 541027 -683060
1131f83060M58485R30241q42356k53923O49106l09707O102L72514o87987Q6238
$$ -683060 -224575 705666 -136690 -390613 258493 -51214 -45112 327402 -360585 -274347
1141b74347R49659p13353o42755J028564L7453p93383M04435J58078l48892M43866
$$ -274347 675312 -38041 -680796 347768 385221 -408162 -3727 154351 -194541 249325
1151B49325j64700o18534P68023K87497j031902K63340P79099o02908j96159M60663
$$ 249325 84625 -533909 234114 521611 -510291 -246951 532148 -70760 -266919 193744
1161A93744l00907P6649L73397o38569n564Q48778n04483n90321P64248Q0520
$$ 193744 -107163 -30514 342883 -295686 -301250 547528 43045 -547276 216972 297492
1171B97492n74724L01439N9187k81955M29786j06096n80540N75823L22447p80806
$$ 297492 -277232 24207 83394 -198561 231225 125129 -455411 120412 442859 -337947
1181c37947J15640N82125l96541j23651L10393k74650P8890L56105m99918r5511
$$ -337947 -222307 359818 -36723 -160374 150019 -124631 -45741 310364 -189554 -285065
1191b85065O64186k87934m74469M98251Q3776l75645K22584M222k37114L60215
$$ -285065 379121 91187 -383282 114969 198745 -176900 45684 49906 -187208 173007
1201A73007l1349m77215L69586K93773n27811L4940L92061k59636n9183K16859
$$ 173007 141658 -335557 34029 327802 -200009 -165069 226992 -32644 -91827 125032
1211A25032k37572N3146L05474l51388j22743M69152j54428l31978L13206M8320
$$ 125032 -112540 -59394 246080 -105308 -228051 241101 86673 -245305 67901 116221
1221A16221k35589J73101j5093j93758K66937J3722l46734K16144K20212l26526
$$ 116221 -119368 53733 38640 -155118 111819 125541 -221193 -5049 215163 -111363
1231a11363Q636K37087j66086j8329J48858j75964J6373K23633k05546j09761
$$ -111363 -102727 134360 -31726 -50055 98803 -77161 -60788 162845 -42701 -152462
1241a52462K81885o7782j97968J74634K2563j37163J18270o917j39264J55314
$$ -152462 129423 61641 -136327 38307 60870 -76293 41977 35060 -104204 51110
1251E1110L7795k06012R7885J36651j69743l270J28122r5595o419R4071j03557
$$ 51110 88905 -117107 -19222 117429 -52314 -55584 72538 -23057 -29476 64595 -38962
1262c8962p122J31930r5062p2598J41831k6676r9758Q7509J0211p5542O7051J853
$$ -38962 -46084 85846 -9216 -81814 60017 33341 -66417 21092 31303 -44239 22812 24665
1274B4665p9487P2034L0798r8580L7099O7535p7632n55O0066m7502o763N0945
$$ 24665 -54822 17212 48010 -50570 -13471 54064 -23568 -24123 35943 -11559 -18322 32623
1286C2623m5796j1124N8322l3068l4246N4814p646l9294L3621N867l2698K3582
$$ 32623 -13173 -24297 34025 957 -33289 21525 13879 -25415 8206 14073 -18625 4957
1298D957Q488l1212J9565J5636l1703P918K2991k1549l968K0023j2538o019J5178
$$ 4957 13445 -17767 1798 17434 -14269 -6351 16640 -4909 -8877 11146 -1392 -7411 7767
1311G767p105q519J3819l770r484J1280K93j0014N311N201q806K737N720p026
$$ 7767 662 -7857 5962 2192 -7292 3988 4281 -5733 -422 4779 -4027 -1290 4430 -2596
1325b596Q19M440l249o36L803l582j371N095j990k148K504m23k929L400o05k419
$$ -2596 -1777 2663 -586 -1222 2581 -1001 -2372 2723 733 -1415 1089 666 -2263 1137 532 -1887
1341a887M410j678m402N021J253p216N451K768q091N396K798r605O855M995j3031
$$ -1887 2523 845 -3557 1464 2717 -4499 952 3720 -4371 1025 3823 -5782 1073 6068 -6963
1356f963M827J2276j4669j342J5410j3212k387J7332j5015o994K5767j3852k0453
$$ -6963 -2136 10140 -4529 -5871 9539 -3673 -6060 11272 -3743 -10737 15030 1178 -19275
1369a9275L1996k450k9369K5533N301l0132K5740P570m0875K9506K5051n5496
$$ -19275 12721 10271 -19098 6435 11736 -18396 7344 14914 -25961 3545 28596 -26900
1381b6900J4850M6653m7192o699M6997l8204p293N2352m6987k1681P8966l7525
$$ -26900 -12050 34603 -12589 -19288 27709 -10495 -17788 34564 -12423 -34104 44862 7337
1393G337o0788Q1920M85p1534N4468J2363o4523O1866J1826r4964O7463O2723
$$ 7337 -53451 28469 28954 -42580 11888 24251 -40272 21594 33420 -61544 5919 68642
1405F8642j20278J6567J02493q3986k0456Q3944o9495p405R8976r5198m6418J55287
$$ 68642 -51636 -35069 67424 -16562 -37018 46926 -22569 -29974 69002 -26196 -72614 82673
1417H2673n5776j24124J31521K2689j20401P8237J8414j00694J08452J9987j70188
$$ 82673 26897 -97227 34294 56983 -63418 14819 33233 -67461 40991 60978 -109210
1428a09210J09068J22789j95132L403J66781j10692l8936J15630j05803k120J63095
$$ -109210 -142 122647 -72485 -69082 97699 -12993 -51929 63701 -42102 -44222 118873
1439A18873j57142q9829K51136o3125k05806J78235M9899j59998J05434Q101j44159
$$ 118873 -38269 -128098 123038 59913 -145893 32342 82241 -77757 27677 35778 -108381
1450a08381J78893L2935k71309J48349K04930k66899k6923K26525j29228m1896
$$ -108381 70512 103447 -167862 -19513 185417 -81482 -108405 118120 -11108 -53004
1460e3004J40776j62956R085K47366k21354j54451L44174m3548k84229J95726
$$ -53004 87772 -75184 -66099 181267 -40087 -194538 149636 106088 -178141 17585
1470A7585P8172j78817J31987j2416j95568K51382O8949l74391J53271K96730
$$ 17585 95757 -83060 48927 36511 -159057 92325 161274 -213117 -59846 236884
1480B36884l03030p5070K56560j27426l1138J58015k24837J1982L40879k65576
$$ 236884 -66146 -141216 115344 -12082 -43220 114795 -110042 -98060 242819 -22757
1490b2757k37794M13367R61l43482J89571R0864j76583J69032m3244k59598L25627
$$ -22757 -260551 152816 153777 -189705 -134 90730 -85853 83179 39935 -219663 105964
1501A05964J20881m73178J38573L78729l13962j09769K57789j38311P912J86615
$$ 105964 226845 -246333 -107760 270969 -42993 -152762 105027 -33284 -25372 161243
1511A61243l10977J097M45974k84697l25299M47411N0948l60795J71550O7933
$$ 161243 -149734 -148637 297337 12640 -312659 134752 185700 -175095 -3545 64388
1521F4388j67998K33213o7367l44387L73921J99392n32002Q0714M26392k76270
$$ 64388 -103610 129603 62236 -282151 91770 291162 -240840 -160126 266266 -10004
1531a0004j27420K27990j55506M9504K25480l71244m4748N22745k48047m04252
$$ -10004 -137424 90566 -64940 -15436 210044 -161200 -205948 316797 68750 -335502
1541c35502M25047J09105l41080J42475L6802j63115K88277o5066m19275L77754
$$ -335502 89545 198650 -142430 45 36847 -126268 162009 96943 -322332 55422
1551E5422K80032n44003J2307M34726k27525j17702J90992j89790Q4424K81240
$$ 55422 335454 -208549 -196242 238484 10959 -106743 84249 -105541 -21117 260123
1561B60123m14116j06298N69491j91855m40596L74651J28224k91190J43648k0876
$$ 260123 -153993 -260291 309200 117345 -323251 51400 179624 -111566 32082 11206
1571A1206j79366L53212l9571m87037L45564L43225n04674m3901L90736j79810
$$ 11206 -168160 185052 145481 -341556 4008 347233 -157441 -201342 189394 9584
1581I584p2868J58745k37140R6424L38881m10780j77207N58670j11079m31640
$$ 9584 -63284 95461 -141679 -45255 293626 -117154 -294361 264309 153230 -278410
1591b78410K93871J25209k26128J47128n7683k01336L70636J1030n01434K70926
$$ -278410 15461 140670 -85458 61670 3987 -197349 173287 184317 -317117 -46191
1601d6191L69984m26626q2714L27583j43607l1358J43551k66682Q2407L69608
$$ -46191 323793 -102833 -185547 142036 -1571 -32929 110622 -156060 -73653 295955
1611B95955l66792k24638N03347m6661l83211K24989R2570j74327J72549q2632
$$ 295955 -70837 -295475 207872 161211 -222000 2989 95559 -78768 93781 11149
1621A1149k31514L64965O3227m79201J93555L52034l36299q1921K47857j35090
$$ 11149 -220365 144600 207827 -271374 -77819 274215 -62084 -144005 103852 -31238
1631c1238J9990J44345k84701M7527L76929k96784k43727M11713Q17l06674J67624
$$ -31238 -11248 133097 -151604 -104077 272852 -23932 -267659 144054 144871 -161803 5821
1642E821N0651j35880J84325p5697k43359L14306J04539m13090J15534L06245
$$ 5821 56472 -79408 104917 29220 -214139 100167 204706 -208384 -92850 213395
1652B13395k45978p2258J81594j20520L5335J43727k58182P432L38612k11673
$$ 213395 -32583 -104841 76753 -43767 -8432 135295 -122887 -115455 223157 11484
1662A1484k31929L13810K5160k32925J26724J9476j11305J78482n4841k33127
$$ 11484 -220445 93365 118525 -114400 12324 31800 -79505 98977 44136 -188991
1672a88991K48578J20895l29792O2929K39927j75691m4052J28631j17969M3761
$$ -188991 59587 180482 -149310 -86381 153546 -22145 -66197 62434 -55535 -11774
1682a1774J42297k22016k3556K84207j40702j94886K23902K5345j60909R9849
$$ -11774 130523 -91493 -115049 169158 28456 -166430 57472 82817 -78092 21757
1692B1757m671r4927J61460l1012k02804J76139J16716k38011K7472J70456j17616
$$ 21757 17086 -77841 83619 52607 -150197 25942 142658 -95353 -67881 102575 -15041
1703a5041k3323Q9223j02297L3763J25162j63538m0688K10348p9698j47319J44337
$$ -15041 -38364 50859 -51438 -17675 107487 -56051 -96739 113609 33911 -113408 30929
1714C0929K2565j04609P3120j0382p6471J22627p067j57134J10870R7080j56857
$$ 30929 53494 -51115 22005 11623 -64848 57779 50712 -106422 4448 101528 -55329
1725e5329N945J12507p5313q946O2349q1772K0677R9537j09723m2472J41341l9955
$$ -55329 -49384 63123 -12190 -21136 41213 -40559 -19882 79655 -30068 -72540 68801 28846
1737B8846r8269Q7220J1921o2963N5502j3456n9807Q6277P341j08747O0715O8633
$$ 28846 -69423 17797 29718 -33245 22257 8801 -51006 35271 42612 -66135 -5420 63213
1749F3213r0746j929O3621m4965k64M1230n7775Q547P0235o0671l7202Q0746j2286
$$ 63213 -27533 -29462 34159 -10806 -11070 30160 -27615 -19068 51167 -9504 -46706 34040 21754
1762B1754n7336M4196N681l3625L5181p233m3174N0048J3847o1848K3950M1637
$$ 21754 -35582 8614 14295 -19330 15851 8618 -34556 15492 29339 -32509 -8559 33078
1774C3078m3561l151L0536k4732K780K4383l2688k751M1043k4007k4252L5202
$$ 33078 -10483 -13634 16902 -7830 -5050 19333 -13355 -16106 24937 930 -23322 11880
1786A1880j199k4501J9218j396j4677J9903o43k6313J9528J4475k7086N310J6259
$$ 11880 10681 -13820 5398 4002 -10675 9228 8585 -17728 1800 16275 -10811 -5501 10758
1799A0758j4216M69J0385j3859J737J6632j4369p602J7465l708j0159Q714Jo387
$$ 10758 -3458 -2989 7396 -6463 -4726 11906 -2463 -10065 7400 3692 -6467 2247 2248 -4139
1813d139Q522l249q097R662M728j1964J051P731k791k038P60k502K565M466p076
$$ -4139 4383 1134 -6963 2699 7427 -4537 -3486 4245 1454 -584 176 -2326 239 4705 -2371
1828b371l107J0049j263o966K107K958M25l79m498M81O336L93q591J262P861l099
$$ -2371 -5478 4571 3308 -3658 -1551 1407 1832 1453 -3045 -2564 3772 4165 -4426 -3164 4697 1598
1844A598m351J456J475J781o31o464M512P388o943n639O173K367l873J480m213
$$ 1598 -2753 -1297 178 1959 1328 -5136 -624 6764 -179 -5818 355 2722 -1151 329 -3884
1859c884L789P419r411n964J2169J870j0940L463M579m094L302j937q103J1556
$$ -3884 -95 7324 -2087 -8051 4118 5988 -4952 -1489 3090 -1004 2298 361 -7742 3814
1873C814O846k0143M013J5987j1285o168J1290o500M68J0053j5319l966K6348
$$ 3814 10660 -9483 -5470 10517 -768 -6936 4354 -2146 -1678 8375 -6944 -10910 15438
1886A5438j2207k0086K2951L450k0087J2477K360j4817J9631J31k9426K2646J9598
$$ 15438 3231 -16855 6096 9546 -10541 1936 4296 -10521 9110 9241 -20185 2461 22059
1899B2059l7271M023K9549k2858m703K1669k2208L588L0533l4437j4117N0354
$$ 22059 -15212 -11189 18360 -4498 -9201 12468 -9740 -6152 24381 -10056 -24173 26181
1911B6181j6975l8282L9220M971l3728K8470j870l2879M0720N650n6787L4770
$$ 26181 9206 -29076 10144 15115 -18613 9857 7987 -24892 15828 21478 -35309 -539
1923e39L8930o1270L636M8078l5831n652L5945m0275L74N7029n1030k9898P8137
$$ -539 38391 -22879 -19243 28835 -6996 -12648 23297 -16978 -16604 40425 -10605 -40503 37634
1936C7634k0549o0769N7109P496m8234M0911m10n0506N8267J4156q7126M6584
$$ 37634 17085 -43684 13425 20921 -27313 13598 13188 -37318 20949 35105 -52021 -5437
1948e437O1557q3988k547O9519m8364q404N0720n7214L16Q3632p2679m8196J10341
$$ -5437 56120 -27868 -30415 39104 -9260 -17664 33056 -24158 -23842 59790 -12889 -61085 49256
1961D9256k1298q5556P0922J5226o2455N5125n375p0424Q5347K1166j23023N6491
$$ 49256 27958 -57598 13324 28550 -33905 21220 15845 -54579 30768 51934 -71089 -14598
1973a4598R1392j07406j0272Q6485n8009m663O1270q2362M710J14717r3124p0948
$$ -14598 76794 -30612 -40884 45601 -12408 -17071 44199 -38163 -33453 81264 -11860 -82808
1985h2808J40583j3772j12471P7301K3769o9778O6616j3112q9620J10772L4530
$$ -82808 57775 44003 -68468 8833 32602 -37176 29440 16328 -73292 37480 72010
1996G2010j57483N6473J21866j16907k6068R4723n8504M10O9764j06387J146J50122
$$ 72010 -85473 -29000 92866 -24041 -50109 44614 -13890 -13480 56284 -50103 -48957 101165
2008A01165j02450j04773J59984O182j27862P1586K3117o5793Q1895k2352j17941
$$ 101165 -1285 -106058 53926 60108 -67754 3832 26949 -38844 43051 20699 -97242
2019i7242J35148N9798j89531M4198J46732j13041l5857Q8876o3149J7481Q0890
$$ -97242 37906 97704 -91827 -47629 99103 -13938 -49795 39081 -24068 -6587 74303
2030G4303j35834o331J85608j03854j34944J65178K4104j27504O4327J1063o2562
$$ 74303 -61531 -67862 117746 13892 -121052 44126 68230 -59274 5053 16116 -46446
2041d6446J06265k9637j47130J47758Q8281k05374K1236J57723r5579l8858P4914
$$ -46446 59819 30182 -116948 30810 119091 -86283 -65047 92676 -2903 -41761 33153
2052C3153p1560L2624R8603j56325k6681K09567q4035j56766J46392M2132j11418
$$ 33153 -38407 -5783 92820 -63505 -90186 119381 35346 -121420 24972 67104 -44314
2063d4314N5100o988o3719J31321k2521j77901J38989J19768j96995n941J48538
$$ -44314 10786 3798 -59921 71400 48879 -129022 9967 129735 -67260 -73201 75337
2074G5337p4499k5039N9141q9897M4934J21531j64711n5263K16222n5546j61762
$$ 75337 838 -24201 34940 -54957 -10023 111508 -53203 -108466 107756 52210 -109552
2085a09552J21515L9432q6034O1046k9904p2212J50150q535j94010J19193J34811
$$ -109552 11963 51395 -34639 26407 -3497 -75709 74441 65906 -128104 -8911 125900
2096A25900j73155k2243J25594n9676o479N2919j08152M1454J41423j52478p8468
$$ 125900 -47255 -69498 56096 -3580 -10059 42860 -65292 -23838 117585 -34893 -113361
2107a13361J99146k6295j47513R1902L1375o5357O8646l7541q7396J47065J9179
$$ -113361 85785 59490 -88023 3879 35254 -30103 38543 1002 -86394 60671 79850
2118G9850j89273Q2077J37126j34856l0339R6023n3768J2848N4062j18638K6679
$$ 79850 -109423 -27346 109780 -25076 -55415 40608 -13160 -312 53750 -64888 -38209
2129c8209J49151j24850r2872J67032m447j20216O9320J3911n1018P8498l8421
$$ -38209 110942 -13908 -106780 60252 55805 -64411 4909 18820 -32198 46300 7879
2140G879r7015J33662L7415j69728N3758J19326j01984k1515P0448n5318K2623
$$ 7879 -89136 44526 81941 -87787 -34029 85297 -16687 -38202 32246 -23072 -449
2151d49N7889j12227Q633J40079r3003q9312J28792M146r1292N5216J352m4469
$$ -449 57440 -54787 -46154 93925 922 -88390 40402 44548 -46744 8472 9824 -34645
2163c4645P8952k6231r7518J04627M8176j34881K8172R5687p3128j3962N1647
$$ -34645 44307 18076 -79442 25185 73361 -61520 -33348 62339 -10789 -24751 26896
2174B6896n2211K1365N9199r4591p961J18020n9916p8799R3621O167o4978M4515
$$ 26896 -25315 -3950 55249 -39342 -47303 70717 10801 -67998 25623 31790 -33188 11327
2186A1327m892m1433P0694j2563q6519P4947M7113j00954J5170P0998n3799n493
$$ 11327 6435 -34998 35696 23133 -63386 11561 58674 -42280 -27110 43888 -9911 -15404
2198a5404M0176m9437J7240N4804p4186j4058R0351l7644n9641O5973L292m5119
$$ -15404 24772 -24665 -7425 47379 -26807 -40865 49486 11842 -47799 18174 21466 -23653
2210b3653L6427q086l5247N6123m461o7655N1341L8698p0082O189M9637l7191
$$ -23653 12774 4688 -30559 25564 21103 -46552 4789 43487 -26595 -20406 29231 -7960
2222g960k580L0131l7377P553M5845m9577j6078O1816k0833m2557M2773L344l1482
$$ -7960 -10540 19591 -17786 -10233 35612 -13965 -30043 31773 10940 -31617 11156 14500 -16982
2235a6982K6074m154k8012L8510K160m8505L1084K8957m6007L992L1579k5137
$$ -16982 9092 4938 -23074 15436 17596 -30909 175 29132 -16875 -12883 18696 -6441
2247f441l96K0524k5189L010L2803l2146j3907M1764j1720k7624K5629K188j9578
$$ -6441 -6837 13687 -11502 -8492 24311 -7835 -21742 20022 8302 -19322 6307 8495 -11083
2260a1083J7719j755k0467K5169K876l0500J6656J9191k5848N84J8243j4978P76
$$ -11083 6636 4881 -15586 9583 12459 -18041 -1385 17806 -8042 -7458 10785 -4193 -3417
2273c417J2281j5968J780J8728j6187j0798K3044l588j6487J3660J372j0493R800
$$ -3417 8864 -7104 -5324 13404 -2783 -13581 9463 5875 -10612 3048 4420 -6073 3727
2286C727j123j2105J4099L732j7271O107J2479j2656j619R621n959n77O654p849
$$ 3727 2604 -9501 4598 8330 -8941 -2834 9645 -3011 -4630 4991 -968 -1545 5109 -2740
2300b740j886J0326n315p001J0970n93q561N241Q36m317M735M58o575M859L905
$$ -2740 -4626 5700 385 -6616 4354 3761 -4800 441 1277 -3040 1695 2153 -4422 437 4342
2315D342p020P30N428l494k355M787l032r4L217l584j577N397j329m363L061J254
$$ 4342 -2678 -1948 3480 -14 -2369 2418 -614 -708 2509 -1075 -2652 2745 1416 -2947 114 1368
2331A368j772R11o08k050L525K50l775P95L004j784j085J700j327N82K000k162
$$ 1368 -404 507 -101 -2151 1374 1624 -2151 -1356 1648 -136 -1221 479 -848 -266 1734 -428
2347d28r37L138j554j941L030K7j998J462q31j512L119r7l707L155R65k888K96
$$ -428 -1365 1773 219 -1722 1308 1335 -663 799 -32 -1544 1575 1478 -2229 926 1891 -997 -701
2364g01J772k085K544N89m951K431M222n219j640N703l920LM619m762l26N542
$$ -701 1071 -1014 1530 2119 -2832 -401 3821 -1398 -3038 2665 -1255 -1252 3367 -1395 -1721 3821
2380C821l803l695O938o13o392M080J920n175M097L86o231O638K807r785J898
$$ 3821 18 -3677 3261 2648 -3744 336 2256 -2919 1178 1564 -4667 1971 4778 -5007 -3109
2395c109J0077r427k004Q915n700q02P605q210k708J3109o808r094J2622L75j1640
$$ -3109 6968 -2459 -4463 4452 -1248 -2050 5555 -2655 -5363 7746 938 -8156 4466 4841 -6799
2410f799Q174K951j0564R934M11j4088J0554J0702j8831K184J5642j2726l161
$$ -6799 1375 4326 -6238 3696 4107 -9981 573 11275 -7556 -5372 10270 -2456 -5617
2423e617J2148j0229J98J4637j6078n730K2510q800j8289K1072J707j6233J1826
$$ -5617 6531 -3698 -3500 11137 -4941 -10671 11839 3039 -15250 5822 7529 -8704 3122
2436C122L86j5113J8130K724k6227J7133J7463k8516J453K2161j5412l134J6491
$$ 3122 3508 -11605 6525 9249 -16978 155 17618 -10898 -9445 12716 -2696 -5830 10661
2449A0661j8348J411K4509k3808j3135L5174q651k6505K4248M896k0846J6614
$$ 10661 -7687 -6276 18233 -5575 -18710 16464 7813 -18692 5556 10452 -10394 6220
2461F220j990k2536K8455O090l8855J9413K7976l5352k146K7978j8809j655J9692
$$ 6220 4230 -18306 10149 16239 -22616 -3203 24773 -10579 -12725 15253 -3556 -5211 14481
2474A4481k7284K632L5850l0529k2265M5738l323l8045K7253N208k2456K3043
$$ 14481 -12803 -10171 25679 -4850 -27115 18623 15300 -22745 4508 9716 -12740 10303
2486A0303n474k8859L6910J0968n2866K1384L7740l9685n637L0391k0597J802
$$ 10303 4829 -24030 12880 23848 -29018 -7634 30106 -9579 -15216 15175 -5422 -3620
2498c620K2792l6166J639N0181l7424l1412N2847r00m0236K6194M149k2412K9413
$$ -3620 19172 -16994 -15355 34826 -2598 -34010 18837 17937 -22299 3895 8044 -14368 15045
2511A5045p901m0041M5231J8911o2013J5916M6279l7394j0224K9872k3513P497
$$ 15045 7144 -32897 12334 31245 -30768 -14852 31427 -5967 -16191 13681 -9832 -2335
2523b335K7805m5757k459O0403l4151m3588N6017N807m3200K4616K394k2587L7846
$$ -2335 25470 -20287 -22746 37657 3506 -40082 15935 21742 -21458 3158 5552 -17035 20811
2536B0811r886n0062N0041K6976o8994J1904N1747l6828q993K7452k9172J2610
$$ 20811 10925 -39137 10904 37880 -31114 -19210 32537 -4291 -13284 14168 -15004 -2394
2548b394L5384n4505p540P0215l1889n0084N2766Q477l8450K4641n458k3241M6895
$$ -2394 32990 -21515 -29055 41160 9271 -40813 11953 20430 -18020 6621 1163 -22078 24817
2561B4817r518n9335M9532L6814o7668K987M9148k9923o152K3965l3985J5447
$$ 24817 15299 -44036 5496 42310 -25358 -22371 26777 -3146 -9298 14667 -19318 -3871
2573c871M0613n5722j6700P3302k2686n2837M5223J1485l3591K4786r085k7332
$$ -3871 36742 -18980 -35680 37622 14936 -37901 7322 18807 -14784 10002 917 -26415
2585b6415N1449l481o5514M2867M2736o0151k671M2486k4800j321K0828l8906
$$ -26415 25034 21553 -43961 -1094 41642 -18509 -21180 21306 -3494 -4815 16013 -22893
2597b2893J5759M8234n4619k4589P0180j3845m9416L5917P573k4938K7230j4200
$$ -22893 -7134 41100 -13519 -38108 32072 18227 -31189 4728 12301 -12637 14593 393
2609C93l1579N4791J439o4923L3354M5054n1817n504L5033k2365N191J8641l9699
$$ 393 -31186 23605 25044 -39879 -6525 38529 -13288 -18792 16241 -6124 -933 17708 -21991
2622b1991R021N3416m7574l0626O1855m907m3893K8104M324k0104K9069j4581
$$ -21991 -12970 40446 -7128 -37754 24101 19194 -24699 3405 7729 -12375 16694 2113
2634B113l3540M8950J0720o1841K3083M2562l9687p879K7684j9450P577J9981
$$ 2113 -31427 17523 28243 -33598 -10515 32047 -7640 -15519 12165 -7285 292 20273
2646B0273m1077M466N2430l6512l2860M9407O2l4557K2621N17j7201K9335j1708
$$ 20273 -20804 -16338 36092 -420 -33280 16127 16189 -18368 4253 4770 -12431 16904 5196
2659E196l5316M1877J4990n3295J5608L6263l0130m270J8450j9268R893K0903
$$ 5196 -30120 11757 26747 -26548 -10940 25323 -4807 -9077 9373 -9895 -2 20901
2671B0901l7284p85M6011k6058k9986L8098O29k3045J5841k090j5379K9237r293
$$ 20901 -16383 -17168 28843 2785 -27201 10897 11526 -11519 4322 2232 -13147 16090 6797
2684F797l2776L2802J6261l9344N407K8705k1914r28J4349j8226P191K0620l0180
$$ 6797 -25979 6823 23084 -16260 -10853 17852 -4062 -4990 9359 -8867 -1676 18944 -11236
2697a1236m742L6929j6680k3604K6551J104j8016J4697k952j4622K4568l752k7237
$$ -11236 -15978 20951 4271 -19333 7218 8322 -9694 5003 2051 -12571 11997 8245 -18992
2710a8992K1509J5921k9581L502J9654j5585M09J1081j6559N757J7686k1700n963
$$ -18992 2517 18438 -11143 -7641 12013 -3572 -3163 7918 -8641 -2884 14802 -6898 -12861
2723a2861K6898j0230j8324J9142N54j2936J3042m310j0283J6304k38k0749J3699
$$ -12861 14037 3807 -14517 4625 5179 -7757 5285 975 -9308 6996 6758 -13991 -292
2736b92J2385j9432J745J3700j1277L16R403j2445K307J4269j3792n802J7117
$$ -292 12093 -7339 -5594 8106 -3171 -2855 6548 -5897 -3590 10679 -3113 -8915 8202
2749H202m950j2231J1987P1q361R099k650q580J1758J197j4063P744Q408j0986
$$ 8202 3252 -8979 3008 3079 -5282 3817 1167 -7413 4345 5542 -8521 -777 7631 -3355
2763c355M34P511o729jN895p440M69R710p309n865J1169k177o389N582Rn072N557
$$ -3355 -2921 4590 -2139 -2140 3755 -3685 -3216 6494 -815 -6680 4489 2312 -4077 1505 1514 -3558 1999
2780A999j04o820O848J232p325K851N185o092j92N109k855k36K597l132l69M608
$$ 1999 1895 -4925 1923 3155 -4170 -1319 3866 -2226 -2418 2691 -164 -400 2197 -935 -1304 3304
2796C304l954j965M431q00l979M060N06l093K178J26l320L494R46m260J567K435
$$ 3304 -650 -2615 1816 1016 -2963 1097 1603 -1490 688 814 -2506 988 1934 -2326 -759 1676
2812A676l071J83K277j916J6K618j645j566K710j543j912K710j76k140J828L96
$$ 1676 -1395 -1212 1065 -851 -835 1783 138 -1428 1282 -261 -2173 537 361 -1779 49 445
2828D45r46O57M91j080M02R41j097L44O96j321l86J735j151j18N13o78K46N19
$$ 445 -501 156 647 -433 -31 910 -187 157 853 -468 -854 881 -270 -388 125 -553 -307 212
2846B12j657Q62P75p42l34K93J038o36J75O54j073N35l87m03l5J597j953P67J597
$$ 212 -1445 -583 192 -550 -884 -591 447 -189 -14 640 -433 102 -285 -688 -723 874 -1079 -312 1285
2865A285k123M78O05l40K40P84j073k21P06k36j896K272L25l325K803K15j389
$$ 1285 -838 -360 245 -95 145 929 -144 -365 341 105 -1791 481 806 -2519 284 499 -890
2882h90P54Q75j911J125P45j935K96K290k461M86K041k378k97K044j721l97K268
$$ -890 -136 739 -1172 -47 698 -1237 -941 1349 -1112 -626 1415 -963 -1260 784 -937 -1334 934
2899I34k28l137L903n0l603L529j34k824K422P08l912K191K281m292N94M863m256
$$ 934 706 -2431 1472 1422 -2181 1348 1214 -1610 812 1520 -2392 -201 2080 -2212 -1618 3245 -1011
2916a011l47M184l852m19L840l501j096N727k469m529N145n7m291L149J862m965
$$ -1011 -1358 2826 -1026 -1445 2395 -1106 -2202 3525 1056 -3473 1672 1615 -2676 473 2335 -2630
2932b630L813P92o501N183M607r632J534P184n603J2L792m428J77O268n902m337
$$ -2630 1183 1975 -4526 657 5264 -4368 -2834 4350 -1253 -1241 2551 -1877 -1700 4568 -1334 -5671
2948e671J1094k741q346Q017N51o205M781M01o651P133J464j0645N645Q363j1320
$$ -5671 5423 2682 -5664 2353 2904 -3301 1480 1881 -4770 2363 3827 -6818 -1173 7190 -4130
2963d130k33R557o918M32N744q506P28J0315r102o647J4909j702j2421J0360J092
$$ -4130 -4363 5194 -1724 -1292 4452 -4054 -3326 6989 -2113 -8760 6149 4447 -7974 2386 3478
2978C478p915O794m89q755J1643J689j4709O062J0660j2126j187R067n785M85
$$ 3478 -4437 2357 1868 -6887 4756 6445 -8264 -2202 8458 -3668 -4855 4212 -1573 -1088
2992a088N665r795P9J5369j1551q675J6725k036j1691Q254M11o052R151k499j1925
$$ -1088 4577 -5218 -5139 10230 -1321 -9996 6729 4693 -6998 1256 1667 -4385 4766 2267 -9658
3007i658J3746O011j9862O604J3509j2829j818Q007p157K470Q964j4006q84J8909
$$ -9658 4088 10099 -9763 -3159 10350 -2479 -4297 3710 -3447 -977 7987 -6019 -6903 12006
3021A2006j0892j3005J8010j97j3203Q174N31p169J1639l067j4825J6282P455
$$ 12006 1114 -11891 6119 5922 -7281 893 1424 -5745 5894 2827 -11998 4284 11739
3034A1739k1738N715J4197j2021j902Q458r767M487J0824j6635k582K2202j1248
$$ 11739 -9999 -4284 9913 -2108 -4010 4448 -5319 -832 9992 -6643 -9225 12977 1729
3047A729j4953J8113J271j3004R553j628q223J5713l817j8550J4906J2444k2151
$$ 1729 -13224 4889 6160 -6844 2709 1081 -7142 8571 4754 -13796 1110 13554 -8597
3060h597J882J5558j0546j844Q056j1509N999J3821j9422m383K2886q058j5680
$$ -8597 -6715 8843 -1703 -3547 4509 -7000 -1001 12820 -6602 -10985 11901 3843 -11837
3073a1837J4973K485r931P755l254q511J7102k065k1801J5611J3190k0973R35
$$ -11837 3136 5621 -4310 3445 191 -8320 8782 6717 -15084 527 13717 -7256 -6321
3086f321J5034j0221N91O628j3147M301J6002j7515p183K3290o207j5609J1962
$$ -6321 8713 -1508 -917 5711 -7436 -3135 12867 -4648 -11831 11459 5252 -10357 1605
3099A605K699r207R185l701j0487J7372J189k1199J1190J3709j6480r10J0791
$$ 1605 4304 -4903 4282 581 -9906 7466 8655 -12544 -1354 12355 -4125 -5035 5756
3112E756p444J849N633j3462M414J6892j6240r470K0619l177j4331J0253J360
$$ 5756 -1688 161 5794 -7668 -3254 13638 -2602 -12072 8547 5370 -8961 1292 2652
3125B652n579Q683n127j0960J6894K348k0889Q442J5426j5008r50Q842q298L811
$$ 2652 -2927 5756 629 -10331 6563 8911 -11978 -3536 11890 -3118 -4068 4774 -3524 287
3139B87N985j2876J713J6363j2350r989J6966n65j2310R356j068o224J0174m821
$$ 287 6272 -6604 -4891 11472 -878 -10867 6099 5534 -6776 2580 1512 -4712 5462 641
3153F41j1080J4914L882j8007N778J2490j0175p97N523o490L455O627j2970P06
$$ 641 -10439 4475 8357 -9650 -3872 8618 -1557 -2354 3169 -3321 134 6761 -6209 -5503
3167e503J5273r646r222J4366o82r513P123j374m696J0023m244j0601J1468M984
$$ -5503 9770 124 -9098 5268 4586 -4927 2196 822 -3874 6149 1905 -8696 2772 7756
3181G756j4704M390Q252o406r78M182n468K748O656j0578j506J2993o326p949
$$ 7756 -6948 -2558 5694 -712 -1690 2492 -2976 -228 6428 -4150 -5656 7337 1011 -6938
3195f938R780l77n872N515k097m300R739k704r921P649N923j0596J453P772o374
$$ -6938 2842 2465 -3407 2108 11 -4289 5450 2746 -7175 474 6397 -4199 -2746 5026 -1348
3210a348p42N315o230J653P392q001k560R399l104o390O717n44l439M413l012
$$ -1348 -2090 3225 -3005 -1352 6040 -1961 -4521 4878 1774 -4616 2101 1557 -1882 2531 -481
3225d81l821P765j090p646N967L957p405P52M094k559l56K182m573K478M674n637
$$ -481 -4302 3463 2373 -5273 694 4651 -2754 -2002 2092 -467 -823 1359 -3214 -736 3938 -1699
3241a699j045O065j609m469L965q82k469M319j883m342O594L8o734L857L328m885
$$ -1699 -2744 3321 1712 -2757 1208 326 -2143 2176 293 -4049 2545 2583 -4151 -294 3034 -1851
3257a851J074L033l429J17K764k764J4L733l928q58L675p55k014J543J18j592
$$ -1851 -777 2256 -1173 -1056 1708 -1056 -1042 2691 -1237 -2095 1580 825 -1189 354 472 -1120
3273a120K615j633r45K260J165l955J244K513l206J015Q25k123R57J601k480J047
$$ -1120 1495 -138 -1083 1177 2342 -1613 -369 2144 -1062 -47 778 -1345 -388 1213 -1267 -220
3289b20J795j999k18J848j53k162J571m34n09L82L42j521J614M81k373O67J817
$$ -220 1575 -424 -642 1206 1053 -1109 462 28 -481 -99 243 -1278 336 817 -1556 -889 928
3306I28j391R70P0q29j7J539j784O42L14m29j059J057O33j935J510o29k57J848
$$ 928 -463 507 577 -252 -269 1270 -514 128 442 13 -1046 11 644 -1291 219 -410 -667 1181
3324A181l55k084K083m37j122j16R46r9n9P0J95j01J51q45J48R00P8l55P2L63
$$ 1181 826 -1258 825 388 -734 -850 96 -3 -62 8 203 102 253 -592 -444 456 534 179 251 614
3344F14p78J017j030N06j263J294r52N54M67q7q51R13p26k29J016k49n90J128
$$ 614 -164 853 -177 329 -934 360 -592 -38 429 342 -509 404 -322 -551 465 216 -374 754
3362G54p78q39J084j322M93O33K72r51k72Q04k88J090o7r63J14K49J1J89M21j227
$$ 754 -24 -863 221 -1101 -608 25 297 -654 -926 -122 -410 680 613 -350 -236 13 24 213 634 -593
3382e93Q33K13q55k49J474n87j398J105K22RL36j132j81J282k24j284J003J21
$$ -593 240 453 -402 -651 823 236 -1162 -57 165 174 510 -622 -803 479 255 -1029 -26 95
3400I5o71J456r32r06Q46R26q39q65K031p79q74J141k62j018Q82r06o29J776k80
$$ 95 -576 880 -52 -958 -112 814 -25 -890 1141 362 -512 629 367 -651 231 -675 -1304 472 192
3419A92j825K558q20j100P58M92p31O48k10r27J309J017k912J158l49Q37l14J222
$$ 192 -1633 925 105 -995 -237 255 -476 172 -38 -965 344 1361 -1551 -393 -742 95 -219 1003
3437A003j497Q64R92k273o89K613j082r45J549m14j172J375P42k001K408j044
$$ 1003 -494 370 1362 -911 -1600 1013 -69 -1014 535 121 -1051 324 1066 -935 1473 429
3453D29j875J448J587l206K89K333j789M37J407j074r57K451j515j602L472l49
$$ 429 -1446 2 1589 -1617 -1328 1005 -784 -347 1060 -14 -971 1480 -35 -1637 1835 1486
3469A486k732K042l65k145K336k69j602K191O15l200J561K083k798p5K764k083
$$ 1486 -1246 796 431 -1714 622 353 -1249 942 1557 -1643 -82 2001 -797 -872 1892 -191
3485a91L33J091k558J486K297l197j474L900O8l840L501j371j468K834j363l152
$$ -191 142 1233 -1325 161 2458 -739 -2213 1687 1755 -2085 1416 45 -1423 1411 48 -3104
3501c104M867L74n385L189K826l999r24K816j498J145Q69k764J081M064l308k141
$$ -3104 1763 2137 -3248 -59 2767 -1232 -2156 660 -838 307 1176 -1588 -507 3557 249 -1892
3517a892L724j032k889K227O88j711K242j100l370N412P64n512K298L146m003
$$ -1892 1832 800 -2089 138 826 -885 1357 257 -3113 2299 3063 -2449 -151 2995 -1008
3532a008J72J782k907K557J266m471J273M911m216j454L788ml608K990j017j890
$$ -1008 -836 946 -1961 596 1862 -2609 -1336 3575 -641 -2095 1693 1689 -1919 1071 54 -1836
3548a836M072k453l443M916J675o303K835K857m082R18J900l234K380L104m551
$$ -1836 2236 -217 -3660 1256 2931 -3372 -537 2320 -1762 -844 1056 -2178 202 3306 -1245
3563a245j103O132m788k379M925j252k403L803k162j441M541k090l534M029K485
$$ -1245 -2348 3784 -1004 -3383 1542 290 -2113 1690 -472 -1913 2628 538 -2996 1033 3518
3578C518n720M92L322k154L40J566l364J870L834o591O77O042l823k371M162j757
$$ 3518 -2202 -1710 1612 -542 -202 1364 -2000 -130 3704 -2887 -2210 3832 9 -2362 1800 43
3594D3j265K466k283r92N289k520m431M105K726n655K343J798k830J794O25l433
$$ 43 -1222 1244 -1039 -2031 3258 738 -3693 412 3138 -2517 -174 1624 -1206 588 1213 -2220
3610b220K060L817n977m51N814k213l089L300r97j444L713l717j156M982q24m793
$$ -2220 -160 3657 -2320 -2771 3043 830 -2259 1041 44 -1400 2313 -1404 -2560 2422 1598 -3195
3626c195L612J335m150J639K298l056K641N98m239K315L701m893o63N387k505
$$ -3195 417 1752 -2398 -759 1539 -1517 1124 1722 -2517 -202 3499 -1394 -2057 3330 825
3641H25k633K641r90j031L105k371j999N443j884m328L196J870l899J986Q56k004
$$ 825 -1808 833 -157 -1188 1917 -454 -2453 2990 1106 -3222 -26 1844 -2055 -69 787 -1217
3657a217J244J714m473J888L910l996j365M390k005j394K368j639q19K464j481
$$ -1217 27 1741 -2732 -844 3066 -930 -2295 2095 90 -1304 1064 -575 -1394 1070 -411
3672d11j423K719O78m221K174K367l174P95O02j532J670J743m037O91L449l205
$$ -411 -1834 885 1563 -2658 -484 1883 -1291 -496 106 -1426 244 1987 -2050 -1359 2090 -1115
3688a115m88L336j820j500K339j040k0J193j680j841L609L46l208R66K403j975
$$ -1115 -1603 1733 -87 -1587 752 -288 -308 885 -795 -2636 973 1319 -1889 -923 1480 -495
3704d95J733p41j355J712J03k417J244K964l551p1K350j230q55J477j716m23L166
$$ -495 1238 497 -858 854 957 -1460 -216 2748 -803 -874 1476 246 -609 868 -848 -1271 1895
3721A895k454j160K366k7l038L576O36k251k05J501j393J127k79j007Q46K358
$$ 1895 -559 -1719 647 620 -2418 1158 1794 -457 -662 839 -554 573 294 -713 133 2491
3737B491j796j380J413p10r8O73j071m16K083r27j468J751k01j074J502O62j735
$$ 2491 695 -685 728 18 -80 593 -478 -894 1189 262 -1206 545 344 -730 772 1434 -301
3754c01P40p91j247J406R20j919P88J154q80r39J213o98L83J189j918J246J163
$$ -301 439 -352 -1599 -193 727 -1192 -404 750 -130 -1069 144 -554 -171 1018 -900 346 1509
3771A509j529j273J130J384k236N05K77k3J250j187j35J057n8r06j49O51q71K54
$$ 1509 -20 -1293 -163 1221 -1015 -510 -233 -256 994 -193 -328 729 671 -235 -384 267 -604 -350
3789c50L23K11r0J457p77j829J994n63K4O46j121k02J341j221L58q96Q50m14K61
$$ -350 -27 184 94 1551 774 -1055 939 376 400 1046 -75 -277 1064 -157 201 -695 155 -259 2
3808BQ40j078o4L08k8r65R68M24p55J795j182j281J495M83j062P58j28o18r1j49
$$ 2 842 -236 -300 8 -20 -985 -17 407 -348 1447 265 -1016 479 962 -100 658 530 -88 -179 -328
3828c28P00L22K19r42j65J424j786J2J349j016l6J194m73j69K92O3j678J488l06
$$ -328 372 694 913 -29 -194 1230 -556 -544 805 -211 -247 947 474 305 597 660 -1018 470 164
3847A64k22N77q38J76m13N08o40J33M05j25O15n09Q04k21O04j198l48P67l58q82
$$ 164 -58 519 -319 -143 -556 -48 -688 -555 -150 -275 340 -169 635 414 1018 -180 -528 239 -119 -1001
3867a001Q40O42J90k39N79r24k83R34k4n06L00j149Q39j75l74l65Q68j25n36Q55
$$ -1001 -161 481 671 432 1011 87 -196 738 714 208 508 -641 198 23 -351 -716 152 27 -509 346
3887C46j190L93P73l8q15P48j10j16K86J8l70J189p60j514J066J43k91j01P37
$$ 346 -844 -451 322 284 -531 217 107 -9 277 295 -75 1114 354 -1160 -94 49 -242 -343 394
3906C94J18q64J273j529M13N30j54q59O23J149m11j414J278j522J168k77p24J178
$$ 394 512 -352 921 -608 -195 335 181 -678 -55 1094 683 -731 547 -975 193 -84 -808 370
3924C70L90j373J359m51j100J811m43q20n1J222j250J408k55q76j44O9L60k06
$$ 370 760 -613 746 295 -805 1006 563 -257 -308 914 -336 1072 817 -59 -203 -134 226 20
3942B0m87M46m86N77K84n50Rnr69J571J18q50O32J89M0n93P93l54Q56j61j692
$$ 20 -467 -21 -507 70 354 -196 -187 -192 -1161 410 528 -322 310 499 539 -54 739 385 1241 1080 -612
3963f12M03m31J66N20M02j110N94J67m84r4J532j006p82R43O84j677Q97M38j007
$$ -612 -209 -640 -474 46 448 -662 -68 99 -385 -479 1053 47 -735 208 892 -785 112 550 -457
3982d57M45J049j475k24Q46m60O8J146j275k2K05L40q86J752k357N04J506l44
$$ -457 -12 1037 -438 -662 184 -276 -208 938 -337 -359 -154 186 -700 1052 -1305 -801 705 361
4000C61k464J068J282r90J020l7o80Q92j02k017J328J729j980l62J378q32j36
$$ 361 -2103 -1035 247 -743 277 240 -440 452 350 -1667 -339 1390 -590 -952 426 -406 -542
4017e42J636k128J7L291k429j255J832M11j093j08J882k502J781n11r47J041O79
$$ -542 1094 -1034 -1017 2274 -155 -1410 422 833 -260 -368 1514 -988 793 282 -665 376 1055
4034A055j885Q14K194k760j85J654k836K206N78j979k15L048j666j747K838l92
$$ 1055 -830 -16 2178 -582 -767 887 -1949 257 835 -1144 -1359 1689 23 -1724 1114 722
4050G22j309M92j2m45J173n66j900K251J174l512J706J447p28j382K332k203O49
$$ 722 -587 -95 -107 -552 621 55 -1845 406 1580 -1932 -226 1221 493 -889 1443 -760 -111
4067a11K024k582o75K499m5k828J988m89q38O91O33j368K571k94l161K051J802
$$ -111 1913 -669 -1344 1155 1110 -1718 270 -219 -1057 -366 267 -1101 1470 1176 -1985 66 1868
4084A868l297L74K350j778K72k35j841K341J713l102q78M017k253q66K116k39
$$ 1868 -1429 -1055 1295 -483 -211 -446 -2287 54 1767 -1335 -2213 1804 -449 -1315 801 562
4100E62r34J089j521n92J890L35j769Q50J528j948l98J716j171J298J84k565J193
$$ 562 -372 717 -804 -1396 494 829 -940 -90 1438 -510 -908 808 -363 935 1119 -1446 -253
4117b53J802j942j993L662j093r78J346m25J00K31l0j526J811Q84l086O97K891
$$ -253 1549 -393 -2386 1276 183 -795 551 126 226 457 427 -1099 712 1596 -1490 -793 2098
4134B098k583j63J602Lj252J612k747R76J600j836r56K176J013j955M22J170j771
$$ 2098 -485 -648 954 957 -295 1317 -1430 -454 1146 -690 -1646 530 1543 -412 10 1180 -591
4151e91R34o65j433L054K99l242J679Q73j054j45N11j222J836J91j709M97J264
$$ -591 343 -322 -1755 1299 1598 -1644 35 908 -146 -291 220 -1002 834 1025 -684 -187 1077
4168A077j358p00J929K26k132J429p95k88K153j784j288L262j904j282O05K049
$$ 1077 -281 -981 948 1174 -958 471 -324 -612 1541 -243 -1531 1731 -173 -1455 -850 1199
4184A199j721J286j97j470R77J005k183Q46K031k135j386K882n92n93N66j101
$$ 1199 -522 764 567 -903 74 1079 -1104 -258 1773 -362 -1748 1134 542 -51 515 -586
4200e86n4R68N67j554J713k78j692L43J927j447L57N12j550J987m90j915M12K148
$$ -586 -640 328 895 -659 1054 776 -916 -573 1354 -93 264 776 -774 1213 723 -1192 -780 1368
4218A368j272j289J479n89q10J19J016r02K280j572m94J583p4j829N88J138j400
$$ 1368 96 -1193 286 -303 -1113 -994 22 -880 1400 -172 -666 917 843 -986 -398 740 -660
4235f60O55q3J97M51O8j848n3K384k070N31J955q91n16O47k03r80N39Q09j607
$$ -660 -5 -88 109 560 628 -1220 -1273 1111 -959 -428 1527 636 120 767 564 -416 123 932 -675
4254f75J405L87k094J10J070l17k20j44R0K88J391k333o48K439o47l2N05j084
$$ -675 730 1117 -977 -867 203 -114 -334 -478 -388 -100 1291 -1042 -1690 749 102 70 575 -509
4272e09q13K076l13j110J627o17j814K011P02j390q1M84m39Q52j87r98J28J178
$$ -509 -1322 754 441 -669 958 341 -1473 538 1240 -150 -231 253 -186 666 479 -519 -391 787
4290G87j387O09R08j185n12R25p57l0R92N83j219J78J281j725P06N0q08J08K77
$$ 787 -600 9 917 -268 -780 145 -612 -642 350 933 -286 -108 1173 -552 154 204 -604 -496 -219
4309b19n53K97R41q65L11r7n52J44J427o08k08K0n72M3J225o7n75O17l03K35Q3
$$ -219 -772 -475 466 -399 -88 -185 -737 -593 834 226 18 38 -534 -491 734 667 92 709 406 641 724
4330G24o83M76N59q70m28J5P45q02M29K07J07q57J041L47l24p57j11q73J278m34
$$ 724 41 517 1076 206 -222 -207 538 -264 165 372 479 -378 663 1010 686 -71 -182 -1055 223 -211
4350b11q91J5J745m46o06J281n22r4n75L93l18O20j101J03Q35l43K71k3K65o24
$$ -211 -1102 -1087 658 212 -394 887 365 271 -304 89 -229 391 -710 -607 228 -115 156 133 398 -226
4370b26kP8j86K50M01l95l63N8P68R4p62Q0N93k50R81j301J24l76K9N50J22L9
$$ -226 -228 -150 -336 -86 315 -80 -443 -385 383 477 -285 -205 388 138 1119 -182 -58 -434 -405 145 267 306
4392C06p90Q24o30N92l30M2j4m02M39J102j136l44Q4J46L38p8l76O75O00j115
$$ 306 -484 340 -290 302 -28 14 0 -402 37 1139 3 -341 -257 -111 227 149 -227 448 1048 -67
4412f7m80J96Q79J42p95J14J302j383J69P24q20P1P88k77p31j28N70m56L24p49
$$ -67 -547 -351 528 670 -125 -11 1291 -92 77 801 -19 52 840 563 -168 -296 274 -182 142 -607
4432f07P53L76n67m96K20Q47l37J193j974P9N72o04O87j60M64j436P26M39r76
$$ -607 146 522 -45 -541 -321 526 189 1382 -592 -513 59 -545 142 -18 446 -990 -264 175 -801
4451h01J175p00l99Q54M03j532R61P64o21K58k59J47p64O27o66M61K78n38j67
$$ -801 374 -326 -725 129 532 -1000 -39 725 104 362 103 250 -514 113 -553 -92 186 -352 -519
4470e19J24L93L58r44M91K42N35j284n88P23J324r91j64J476k134Q23J31r32J763
$$ -519 -395 -2 356 -588 -97 145 680 -604 -1192 -469 855 -136 -300 1176 -958 -135 -4 -936 827
4489H27Q20k123p29J708m48p45O58n10k22R09P4j463J798r02j100J773Q71k375
$$ 827 1647 -476 -1205 503 55 -690 -32 -542 -764 145 219 -1244 554 -348 -1448 325 1196 -1179
4507a179M66J259j592O44J48n19J78J992j629p05K115j115n94J824r15r97R28
$$ -1179 -713 546 -1046 -402 -254 -773 -595 1397 -232 -937 1178 63 -531 1293 378 -619 309
4524C09r90l71K510j147j437J367O92j094K49J63j54l54O26j704K105N24k843
$$ 309 -681 -1052 1458 311 -1126 241 933 -161 88 251 97 -257 369 -1335 770 1294 -1549
4541a549K82K775j198n63Q80p25j41O05m15p13J349j14j258p5L096k768O71o0
$$ -1549 -1267 1508 310 -253 627 -98 -239 366 -49 -762 587 473 -785 -860 2236 -532 139 79
4559G9l17k35J550k235O48J988j601r28J653N69j334Q27o05n32J777j408r31K070
$$ 79 -238 -473 1077 -1158 -510 1478 -123 -1051 602 1171 -163 664 59 -473 1304 -104 -1035 1035
4577A035R1k062M61J755k138L41N97j342J515J468j812p31K558j395j471J910
$$ 1035 1126 -936 -475 1280 -858 -517 80 -1262 253 1721 -91 -822 1736 341 -1130 780
4593G80r04o06J637j011j218K559j464q05J574J403l291J095R23p89L14k65p47
$$ 780 -124 -730 907 -104 -1322 1237 -227 -1032 542 1945 -1346 -251 672 -117 197 -68 -815
4610h15O25J659k487m9J673K07j648J491o67j228K091j191n25J409l70j671K167
$$ -815 -190 1469 -1018 -1067 606 813 -835 656 -11 -1239 852 -339 -864 545 175 -1496 671
4627F71O14k365O63R09j528J648M70k637J481K157j862n78J732j583o55L42J794
$$ 671 1285 -1080 -417 492 -1036 612 1082 -1555 -74 2083 221 -357 1375 -208 -863 -521 1273
4644A273j327K99j269N77J937j710n83J331N65j681L10R53n75j164J946j855K42
$$ 1273 -54 245 -1024 -447 1490 -220 -803 528 1093 -588 -278 675 100 -1064 882 -973 -731
4661g31J266j159k09K981k077p52J793o93k47Q84l36j780J410k75j015J150R69
$$ -731 535 -624 -833 2148 71 -681 1112 419 172 1056 720 -1060 350 75 -940 210 1179
4678A179j946J164l32q01J080l78n97L21J814j513j209J933j0j107Q52M84j407
$$ 1179 -767 397 65 -736 344 -34 -631 -310 1504 -9 -1218 715 705 -402 450 934 -473
4695d73N25J17o14J083Q92k329R72J026r14l44M67n11L51N90j690P71J379j150
$$ -473 52 169 -445 638 1530 -799 173 1199 285 -59 408 -103 248 838 -852 -81 1298 148
4713A48l06Q34n65l52K39j35j457K790n98k031J885Q30k890J183J133j290L05
$$ 148 -158 676 111 -241 -2 -137 -1594 1196 598 -1433 452 1282 -1608 -425 708 -582 -277
4730b77Q93j346M48J385k027P11O28o41P22J68r1j421L93p85J433M86o96k54R61
$$ -277 616 -730 -282 1103 -924 -213 415 -226 496 664 573 -848 -455 -1240 193 679 -17 -271 690
4749F90O09k800P81P89o75J399p6l12l19O67p00k13P80j106K88M71M08j044P57
$$ 690 1299 -1501 -720 69 -606 793 717 405 86 753 53 -160 620 -486 -198 273 681 -363 394
4768C94m65m25J098p6j277J568o38n11N64k60q26J074K34q17L13J165j536O9J080
$$ 394 -71 -496 602 526 -751 817 179 -332 232 -28 -854 220 454 -363 -50 1115 -421 -352 728
4787G28q7o17J92o78p72Q36J141j469Q94L17j24n55k83J15R86l41o10N54K43l24
$$ 728 641 24 216 -462 -1234 -398 743 -726 168 485 361 -194 -477 -362 624 283 -327 227 470 146
4807A46l16L31O4L3M43q77l33O12n48m61R34n76K29P69p35M16p01J130p76L40
$$ 146 -170 161 225 258 701 -176 -509 103 -445 -906 28 -548 -319 450 -285 131 -570 560 -216 124
4827A24o79M20l20N44l11K90J33j01n5KO20j188J91j70P82P66j221n2Kk31r2M48
$$ 124 -555 -135 -455 89 -222 68 201 100 45 47 667 -521 -330 -500 282 1048 -173 -225 -223 -454 -546 -98
4849i8J07P64j84n53l18P1j40P64N85j388O09q79N61j31q12J964j254K39N44q64
$$ -98 9 773 589 36 -282 -211 -351 413 998 -390 219 -660 -99 -230 -1042 922 -332 -93 451 -413
4869d13J25M81M03j083P00k69Q2j12R0j175R90L39j83k12J40K98k84J735j984
$$ -413 -288 193 596 -487 213 -56 26 -86 4 -1171 -181 158 -25 -237 -97 201 -83 1652 -332
4888c32J32J092j328J37l0K58M21M92j350L38K62M63j192P93K17m47o81K58Q33
$$ -332 -200 892 -436 -299 -329 -71 350 842 -508 -170 92 555 -637 156 373 -74 -755 -497 336
4907C36l72R7Q8j016R35Jp18L27N09L5k70M91j659J640O9o46j33J362j993j19
$$ 336 -36 61 149 -867 68 69 -649 -322 187 222 -48 443 -1216 424 493 -153 -286 1076 -917 -1036
4927a036J588j40K79r92J282j292O28j23r40Q89j148M52J099m10L7k97L98o25
$$ -1036 552 412 691 -301 981 -311 317 194 -746 143 -1005 -553 546 136 173 -124 274 -351
4945c51N11m77l46N06O15j62q10l05O8J128j14m82j48L78n13J248p84o03M02M27
$$ -351 160 -317 -663 -157 458 296 -514 -819 -751 377 263 -219 -367 11 -502 746 -38 -641 -239 188
4965A88o12K70l5j16P26k3M00n33k50q4o09O47P80j297P2J021j410Q95j71o04
$$ 188 -424 -154 -189 -305 421 398 798 265 15 -69 -678 -31 749 -548 -476 545 -865 30 -141 -745
4985g45K76O55m10q69K379q51l48m12L86J87K06l5k75J12K6j90j94J011r30J107
$$ -745 -469 186 -224 -1093 1286 435 87 -325 61 248 454 419 144 256 282 92 -102 909 -21 1086
5005A086k45Jj164J292j658P96L15r04K86O23l76j267J211q59M72P26M5j650O90
$$ 1086 841 842 -322 970 -688 108 423 -481 -195 428 52 -1215 -4 -863 -391 335 380 -1270 -580
5024e80Q44q71J94Q13r44N46J27k43o0J308k106P14J010n00r99N90J29l96J26
$$ -580 264 -607 -413 400 -544 2 129 -114 -174 1134 -972 -258 752 252 -747 -157 -28 -424 -298
5043b98J301j789J214n66r69J848o14l2p71J390j89n53J094j906L26J386j381
$$ -298 1003 -786 428 -138 -1107 741 127 95 -676 714 525 -28 1066 -840 -514 872 -509
5060e09M05J905j568o08K70r16O93J272q85j158J979q20m55L18O03n90nJ117j139
$$ -509 -104 1801 233 -375 -105 -1021 -328 944 59 -1099 880 60 -395 -77 526 -64 -69 1048 -91
5079i1j83J623k189m8K192j848N91K61O05j172R97r94K32N49q89J6P43J02j302
$$ -91 -274 1349 -840 -888 1304 -544 47 308 913 -259 738 -256 -24 525 -364 -348 395 497 -805
5098h05P81j23K96L67n3k199K218o22o61L42J293q77K41N73j101J75O69j786N94
$$ -805 -24 -147 149 516 463 -1736 482 -140 -801 -459 834 -43 198 771 -330 -155 514 -1272 -678
5117f78J486m49j355J115R89k547J426J278o61l75J323l023J179J037k568J220
$$ -678 808 359 -996 119 1108 -1439 -13 1265 604 229 1552 -1471 -292 745 -1823 -603
5133f03O80p21q2J687j411O44J292j886o27J550j353m12K351p41n32o46R54m27
$$ -603 77 -644 -726 961 -450 194 1486 -400 -1027 523 -830 -1242 1109 368 -164 -810 144 -283
5151b83L08K78o23R4J166p39o32Q54j57l8k09%L9J513j223j324K164p74j922Q92
$$ -283 25 303 -320 -226 940 201 -431 423 266 228 19 19 58 1571 348 -976 1188 414 -1508 -616
5171f16J520j841J319L03o51O80o14j615J753J3m80n65J636j0j478M82l93Q8O60
$$ -616 904 -937 382 685 34 714 100 -1515 238 251 -229 -794 842 832 -646 -164 -557 -469 191
5190A91l08r11J503j39j1j02L62k35m04K86q04J248j8m58k4J44r11K88O28j018
$$ 191 -117 -1028 475 336 325 223 585 350 -54 232 -572 676 658 200 176 320 -591 -303 325 -693
5210f93J391j81R0r68J430p70p47J288m17j071q3K267j949J38J072o41M08M48
$$ -693 698 517 607 -361 1069 299 -448 840 423 -648 -731 1536 -413 -275 797 156 564 1012
5228A012j618L37J119m67l69L85q80P3K62j01l2J499j191o75M30J72j89j23J121
$$ 1012 -606 -269 850 383 14 399 -481 -408 -146 -247 -279 1220 29 -646 -216 -44 -233 -356 765
5247G65n13p00M43o58J28Q77p71n53J691n12j91J301r76J21j397M81Q10o95J343
$$ 765 252 -448 -5 -663 -535 342 -429 -982 709 197 6 1307 331 452 -945 -464 346 -349 994
5266I94j299P95m26o20P93O64j185O33n29r22J251M08p88k26P3O85R2l99K57j69
$$ 994 -305 490 64 -556 237 901 -284 349 -180 -1102 149 557 -231 -457 -384 301 393 -6 251 82
5286H2q0m54O67l4Q0j647J428k57k2Q43N48j198j71O18j694J371J15m46M2J82
$$ 82 2 -452 215 181 261 -1386 42 -215 -237 606 1154 -44 -215 403 -1291 80 195 -251 -209 -27
5306b7o58N37j098J697o46j76J164j188P72r98P69M85J06L69k217J306Q9j43j41
$$ -27 -685 -148 -1246 451 -195 -371 793 -395 377 -621 148 633 739 1108 -1109 197 286 143 2
5325Bj04M32n76n82J136N3K20l40r4o13K72M97p71J302r08J86j54Q00j388M60
$$ 2 -102 330 -246 -828 308 361 581 241 147 -466 -194 303 -468 834 -74 112 -42 758 -630 -170
5345a70R67j030oR98j163J300q79L4j645K260q38r1N81l13j76K58r22J198P5n79
$$ -170 797 -233 -239 759 -404 896 17 51 -1594 666 -172 -263 318 5 -171 87 -835 363 438 -141
5365a41J282j361l62Q66J25k08K29o02K60K30l53r05Q25n13Q88l42Q70n84j282
$$ -141 1141 -220 -582 284 409 201 430 -172 88 318 -35 -940 -115 -628 260 -82 788 204 -1078
5384a078MJ591o24Q0m8J015j506N94l01R22o31R5r48J013p9r89J055K77m65J45
$$ -1078 -1074 517 -107 -27 -75 940 -566 28 -273 649 18 113 -835 178 99 -890 165 442 -23 122
5404A22Q38r52o22R07O05j064m4L5N28k56n00L45l33L61N18r65J036o61M65l27
$$ 122 960 8 -614 293 898 -166 -210 -175 353 97 -403 -58 -391 -30 488 -477 559 -102 363 36
5424C6k00p47N05L48k16P9m5Q4J27l87L55r7l48L85J7M68r87J017m06q21M52L03
$$ 36 -164 -911 -406 -58 -274 -195 -240 -156 -29 -416 -61 -158 -506 -121 -104 364 -623 394 -12 -833 -381 -78
5446g8m2l33J044K3k170J604P60M28k116Q10Q66n11m60M98j164J113o22P78j286
$$ -78 -120 -453 591 614 -1556 48 808 1236 -880 -70 796 285 -175 323 -841 272 -350 428 -858
5465h58M21n77J332k53M45M53l66j135R84j8m31J50o32M54k63N79l68J19o8J92
$$ -858 -437 -1014 318 65 510 963 597 -538 446 428 -3 147 -485 -31 -294 285 -83 36 -32 160
5485A60n5L57j333P78K03k14M90L17k80J68j056K36J44o54J181k97L15N37j678
$$ 160 105 462 -871 -93 110 -104 386 703 423 591 -465 -229 -85 -739 442 145 460 997 -681
5504f81N09j301J458k24k15M78P54n81l56J6K57K76r25J256q51K71p66N00N03
$$ -681 -172 -1473 -15 -239 -454 24 778 197 -159 -143 114 390 -535 721 -130 141 -625 -125 378
5523C78m38L95j047J182n16q41J214K28j159Q22m55J22P84m20j161O37J006j324
$$ 378 -60 335 -712 470 -46 -887 327 555 -604 218 -237 -115 669 249 -912 -275 731 -593
5541e93L7J12P45p72M54j53p2R92q75Q16r26O47k25K29P1o77L95k30p67J267M76
$$ -593 -556 -444 301 -471 -17 -170 -242 750 -125 691 -235 412 187 416 487 -190 205 -25 -792 475 951
5562I51p43m51L22j70k82R55n86k38J77O65j463J091n7q75M94O56p86K53J84j2
$$ 951 208 -243 79 -91 -373 582 -4 -242 -65 600 -863 228 171 -704 -210 446 -340 -87 97 85
5582H5q59N65K90l62L74l09m72L91L44p6J57L5o53O22m17P5L73k57n89J506r75
$$ 85 -774 -209 81 -281 93 -216 -688 -297 47 -29 128 163 -490 132 -285 -210 163 -94 -683 823 -152
5603a52K85j71N46Kq98N94L01j22l98j64o37Q48Q00j376j19P00n25N03R90j088
$$ -152 133 -38 508 510 -388 206 507 385 -13 -177 -814 34 834 -542 -661 39 -486 17 1007 -81
5623h1r5Q01j567P10k15K77r32J038N44m7l24o91M32k11J181k377K212r21K13
$$ -81 -176 625 -942 -232 -447 -170 -1102 -64 480 433 109 -582 -150 -361 820 -1557 655 -266 -53
5642e3k14L16o23J023k00n4l15m83Q78j020J830j824J188j154R56q66J835j157
$$ -53 -267 49 -574 449 249 195 -120 -603 275 -745 1085 -739 449 -705 251 -615 1220 63
5660F3j89K18j47k69L76m36o6P54K54p16O09j17j44J60K79j831J579Qj523K32
$$ 63 -126 92 -55 -324 52 -384 -450 304 558 -158 451 334 190 350 629 -1202 377 385 -1138 -906
5680i06J174J9j065O92o46M01j8J40o27P84P52j535N47L57J35m6J40n56N57O74
$$ -906 268 287 -778 -86 -732 -331 -349 -209 -836 -52 700 -835 -288 69 204 158 298 -258 299 973
5700I73K6j032M83L8l60M36Rj248J149k83j041N71J009p07n67R21J20m95o72Q5
$$ 973 999 -33 450 488 128 564 573 -675 474 191 -850 -279 730 23 -544 377 497 2 -670 -585
5720e85K36J28l65P35K17m85m06l0J650p57K24m34o7K1q81R41M02n77n98q5Q60
$$ -585 -349 -221 -586 149 366 -119 -525 -555 1095 338 562 128 61 82 -799 142 544 -33 -631 -716 144
5741A44m43L5j15j74J473j14j744J268Q72j465m74J525k96j097R82L46k63R2k00
$$ 144 -299 -264 -379 -553 920 806 -938 330 1202 -263 -737 788 492 -605 377 723 460 552 352
5760C52j183M04Q59n84P02o42l79Q77l88p20L87k9P1L67K38k32j71J10l12K50
$$ 352 -831 -427 432 -152 550 -92 -471 406 18 -702 -315 -344 -273 94 332 100 -71 39 -273 -23
5780b3p87J115j82J13j47o80O02j43o32Q96n49l37P51K47M44j450O46l95M64o16
$$ -23 -810 305 123 236 89 -591 11 -132 -764 132 -417 -754 -3 244 688 -762 -116 -511 -47 -663
5800f63J384n59J55L45l32j012N21nm93R33r05N50J67o78J182P15k199J608m79
$$ -663 721 162 317 662 330 -682 -161 -166 -659 274 -631 -81 86 -592 590 1305 -894 714 235
5819B35J16j267J237l59o11P81J86m47J58M46m57n9rK08k08R10o91p20M57m95
$$ 235 351 -916 321 -38 -649 132 318 -129 29 475 18 -41 -50 158 -50 860 169 -551 -94 -589
5839e89P71L45o7l40o38N81l29p13Q78M17q06Q52r25j5J065n71J72l85o39J317
$$ -589 182 527 460 120 -518 63 -266 -979 -101 316 -490 362 -563 -578 487 -84 88 -297 -936 381
5859C81m22o56J136j229O96J005q82m7L22k6k6N09j812J145M94J5l76l29l5l34
$$ 381 -41 -697 439 -790 -94 911 29 -18 304 278 252 761 -1051 94 588 603 227 -102 -137 -471
5879d71M17mN46j251J271o71k30M26Q5l31M20j86m28n55J664j270J122j48j477
$$ -471 -54 -58 488 -763 508 -163 -393 33 118 -213 207 21 -407 -962 702 -568 554 406 -1071
5898a071J101N9k05M82pq27k6M64q76O01J77k84Q84K50l46j46M20q17M71m12j24
$$ -1071 30 89 -116 366 359 -468 -494 -30 -906 -305 -128 -412 472 722 376 230 650 -167 304 -108 -232
5919b32L76j71l28m47N04O23l06r00M92j62p69J386L31r01r8J589j398r1M38L91
$$ -232 144 -27 -355 -802 -298 325 19 -881 -389 -551 -1320 66 397 -504 -602 987 -411 -502 -64 327
5939C27N7j17n05j7L23q4K11K67n07j10j54O45j12r2R4j97L90l18j58L53j092
$$ 327 384 267 -238 -255 68 -16 195 462 -45 -155 -309 336 224 132 226 29 419 101 -57 296 -796
5960g96J251j210J741l24J89J95p57o35O10m14R26l55J20p34m40K53O12n05J97
$$ -796 455 -755 986 662 851 1046 289 -346 264 -150 776 421 541 -193 -633 -380 232 -273 -76
5979g6Q20p99L2j84O32r73m0N60n1J41L11p26L83P04q0k95j26m44m55J340n61
$$ -76 744 -55 -23 -207 425 -548 -588 -28 -79 62 373 -353 30 734 654 359 233 -211 -666 674 113
6000A13O35j057J86J277j162o44P05M46j67m85o0P49l87n00J89M85r05N68P33
$$ 113 748 -309 -123 1154 -8 -652 53 499 332 -153 -213 536 149 -351 -162 323 -582 -14 719
6019G19p71R11n99L94l01j199J331m43M01J04rl76k00j06J93j094P56j52J224
$$ 719 -52 859 260 654 353 -846 485 42 443 547 538 162 -38 -144 49 -1045 -289 -441 783
6038G83j691J768r02N88j134L77R12r36P84p86Q9M31n04r9k5k53N12l22P33M86
$$ 783 -908 860 -42 546 -588 -211 701 -235 549 -237 -148 283 -221 -320 -345 -598 -86 -408 325 811
6058H11J01r61Q6R3O58l42R2l98L47o38O69l65l88L57J70J67p14L98K17q00J162
$$ 811 912 -49 37 130 788 446 538 140 487 -151 518 153 -235 122 292 459 -255 143 360 -440 722
6079G22n24L08p76O62o83j03J37Q66n80K22j86R05q85L74k59o41N28K0N9Q6M0
$$ 722 198 506 -270 392 -291 -394 -257 609 29 251 65 970 85 459 200 -441 87 107 166 252 292
6100B92j196Q94N51p28m1K18o09k79J841l19p20K80l01k18M57RL18K11J81n24
$$ 292 -904 -10 541 -187 -228 -10 -619 -898 943 624 -96 184 -117 -335 122 131 449 660 841 317
6120C17k97q1j37j01l65l7J557r74LM1N48l15j328J514r60o31K240j536L68k24
$$ 317 20 -61 -198 -299 -664 -701 856 -118 -115 -74 474 159 -1169 345 -615 -1246 994 -542 -174 -398
6140c98O95n00k02N92l15J35L88o14r4O26k84m18Q52j125J487l59j236L16K17
$$ -398 297 -203 -405 187 -128 7 395 -219 -313 313 29 -389 463 -662 825 466 -770 -454 -237
6159b37P0j70M68l86O71o57N87n83J6J80n51k86J141j57j1Nl18M11q07P70R1m97
$$ -237 -167 -337 131 -255 416 -241 346 -237 -221 -41 -592 -878 263 106 95 100 -218 193 -614 156 247 -250
6181b50L01L60j219R55r12J026j171J84Q37N08r97K19L7j90N96p84R67j324J026
$$ -250 51 411 -808 147 -765 261 -910 -726 111 619 -378 -159 -122 -312 284 -500 467 -857 169
6200A69j70j343J174N63r75J184K76j502J096l64r57Q72K30L17p22O94j443J602
$$ 169 -1 -1344 -170 393 -582 602 878 -624 472 108 -849 23 253 570 -152 542 -901 701
6218G01m69Q9o59q2J97k83L95o64N88J79l84L96l15o50L19P06L36J29M58p89q35
$$ 701 232 321 -338 -420 -223 -506 -111 -775 -187 -8 -392 4 -311 -961 -642 64 400 529 987 198 -637
6239f37J087R6j178L41Q64l20l79K16k01k84J95R91r05J93K76k99j4J09M06j244
$$ -637 450 546 -632 -291 573 253 -126 90 -111 -395 -200 791 -114 79 355 56 42 151 557 -687
6259f87K70J59J24J125j447k57J053p26M7j88M8J485q32K02k20K60j078J607r61
$$ -687 -417 -258 -134 991 -456 -713 340 -386 -339 -527 -479 1006 174 376 156 416 -662 945 -16
6278a6L12m45r58J816q43M66p38P28m44k61J31l61p5Q06N54p42n63J450r00J64
$$ -16 296 -149 -1107 709 -134 332 -406 322 -122 -383 -252 -613 -688 118 672 -70 -633 817 -83 81
6298H1q2Q50O3j105Q08j7p64N72l60K4j40L61l99n09m1M80P2L83l02m00K18k14
$$ 81 -1 849 912 -193 615 598 -166 406 46 70 -70 291 -108 -617 -658 -178 -106 277 -25 -425 -207 -421
6320d21Q61L02p4n64O98r46l23m70J229q2r45J355q31O74r98mP01K1l03J93k89
$$ -421 440 742 668 104 802 -144 -467 -937 292 210 -735 620 -211 463 -535 -539 162 183 -120 73 -216
6341b16O84k11j7r64P48L66o72o15M21O27r18r5P0L63K85j98O98q65M87M49p68
$$ -216 468 257 240 -724 24 390 -282 -897 -476 151 -767 -862 -792 -429 -144 -342 356 -509 -22 427 -341
6362c41k82K53Q55m48K36J04j113L71L36kK08m17k14J41M41L30O05q05l5n21N29
$$ -341 -623 -370 485 37 273 377 -736 -365 -29 -31 177 -240 -454 -313 128 458 1063 258 223 -298 231
6383B31K3K57j57n9Q94j806P71K31j45r47P86j99Q7n58M80J06J108j519J313r20
$$ 231 254 511 354 295 1189 -617 154 385 240 -707 79 -120 -33 -591 -111 -5 1103 -416 897 -23
6403b3M72R2o11k21n84J450j022j09P77n84J08Q06K45k41j27j55L57m77J21l59
$$ -23 449 541 -70 -291 -875 575 -447 -556 221 -363 -255 551 796 555 428 273 630 153 274 -85
6423h5K45n14J067m71q88J300j394L70k51J362o91j19p9l38N72j06j07P3k71n37
$$ -85 160 -354 713 242 -646 654 -740 -370 -621 741 50 -69 -148 -486 86 -20 -127 -54 -325 -862
6443h62P92O0l17M73L18k54k7K66l24Kj115m39J629J64j191J233n71JO35p22O85
$$ -862 -70 -10 -327 146 464 210 183 449 125 127 -988 -1427 202 366 -825 408 -163 -162 473 -249 436
6464D36k67j64l88J475r18j52o39J511j004o04Q65n79O18n52P70l11n54p3O48
$$ 436 169 5 -383 1092 174 22 -617 894 -110 -714 151 -428 190 -362 408 97 -457 -530 118
6483A18p39Q27O9K17r03q51O99Q40j265J287n24M82j18o26J22J76M70J49L30r87
$$ 118 -621 206 275 492 -411 -1262 -563 277 -988 299 -225 257 139 -487 -365 -189 281 430 760 -227
6503b27N69p95m00M21K55N42P6m38r2K59L83m48J14J52j80k23L85k04n84Q51J00
$$ -227 342 -453 -853 -432 -177 365 441 3 -89 170 553 105 219 371 191 -32 353 149 -435 416 516
6524E16k24o68n14J218k1j223J481L69j187P2O09l14o49o8J327m46K77j125k12
$$ 516 292 -376 -890 328 307 -916 565 934 -253 -181 428 114 -535 -603 724 278 555 -570 -782
6543g82K58J109j096R1j000J827l59Q34r39p19R85j3o4q94Q44K08k7o38R32j059
$$ -782 -524 585 -511 -420 -1420 407 48 882 -57 -776 209 196 132 -762 82 290 263 -375 557 -502
6563e02J108m20k43M4L17n39m0k1J071j366R96L19q8q35O27P80j025j408P04R38
$$ -502 606 186 -57 -13 304 -235 -275 -296 775 -591 405 724 636 -199 428 1208 183 -1225 -521 417
6583D17j057K22N0Q24J06r17K94K08N35j58o7j124P53J47l19M39K85p83N37O46
$$ 417 -640 -418 -368 456 562 -355 -61 147 682 524 457 -667 86 233 -86 353 638 -145 392 1038
6603A038j279L40k78M77p58J272n84k34O2l03O19k37p11M90M88l31q10J039r23
$$ 1038 -241 99 -179 298 -460 812 228 -6 56 -247 372 135 -576 -86 402 71 -739 300 -623
6622f23j25N84J35R8o32J03R76p5k48l56J06j50P04k53r82R09L59O0l89K69o64
$$ -623 -748 -164 -29 69 -563 -460 516 441 193 -163 -57 -207 497 244 -738 171 530 590 201 470 -194
6643a94r5R26n66r18O68N22j146Q85m4L40j400J172o62r7R02K44j029P67J5l29
$$ -194 -289 637 71 -847 -179 343 -803 82 38 378 -1022 150 -512 -609 293 537 -492 275 290 -39
6663c9j23m50J051o00M62l60p79J374r69J013l77P5l88p83J084M9p22Q40N9o02
$$ -39 -162 -612 439 -161 301 -59 -838 536 -433 580 203 278 -110 -893 191 240 -482 358 417 -185
6683a85m93R57j056N34J161j422P55o72K23J2k73K79P93N31q23j580J509J10m46
$$ -185 -678 279 -777 -243 918 -504 251 -421 -198 -186 -459 -180 613 1144 321 -1259 250 360 -86
6702h6j57M09L37j521Q57m1K45M25k07n03O31R5k51K23m12M69r38j76J596r68
$$ -86 -243 166 503 -1018 -161 -202 43 468 261 -242 389 484 233 456 44 513 -425 -601 995 27
6722B7P31j281R13l85l06J214j192j62M0K75m53J107o62M65r43N55M87l8j070
$$ 27 758 -523 390 5 -301 913 -279 -441 -401 -126 -579 528 -134 331 -612 -57 430 392 -678
6741f78L62K59L33r2o44k65R11k5o81M27n88Q36K92J69n59l5r94R86N17k5o39
$$ -678 -316 -57 276 184 -460 -725 186 161 -520 -93 -681 155 447 616 57 22 -972 14 531 506 -133
6762a33l1N68p1J33k18J29q49J480o89Q8j477R97j364K560q38O16j75q58Q90j784
$$ -133 -164 404 333 466 248 377 -472 1008 319 407 -1070 -73 -1437 1123 285 901 726 -132 758 -1026
6782a026J286n52o44P31P05l70j97p41O11n9N29L71j720J541j26p87N63k82J588
$$ -1026 260 -292 -936 -205 500 130 -67 -808 -197 -256 273 644 -1076 465 339 -448 115 -167 1421
6801A421j253n76j78L67j77O98j089J100m64Q50j147J20M52J47p0J162k195J440
$$ 1421 168 -408 -586 -219 -396 302 -787 313 -151 699 -448 -328 124 271 201 1363 -832 608
6819F08m93R3J88k32J38q43R83j072N06j35K75L22k28m68P71q50Q6J82K96J95
$$ 608 115 208 396 164 302 -541 442 -630 -124 -259 16 338 110 -358 413 -437 -351 -169 127 322
6839C22m06M60m33J56q03R37K53R6l85k87j1j09L27Q38q44J84N93q29o5L32j056
$$ 322 -84 376 -57 99 -704 233 486 582 197 -90 -101 -210 117 955 111 295 888 59 -6 326 -730
6860g30J131R5n32p5L37M59n00q4o11Q32o90O56n29k85P96l99q8o59O56P45n26
$$ -730 401 496 -36 -111 226 685 185 101 -510 322 -368 288 -241 -526 270 -129 -217 -876 -220 525 -1
6881am54Q63k73j78K2R5M14q74p5r9P14n24J04p3k84k53p1J673o15L56L63k68
$$ -1 -455 408 135 -43 -21 74 488 -386 -461 -560 154 -370 -266 -339 -623 -876 -947 726 111 467 830 562
6903E62J73o20k56L18k30M61l25j28k70L16J25o84N00P45J76l56m94n51L29Mo13
$$ 562 735 115 -141 177 -53 408 83 -45 -315 1 126 -558 -58 687 863 507 13 -538 -209 -205 -818
6924h18O57K49k34K29K65R36j594Q2O91Q8K8Pk33q20N81o13J250m93k46j9K6J25
$$ -818 -161 88 -146 83 348 1284 -310 -228 463 551 579 586 353 -467 114 -499 751 258 12 -7 19 144
6946A44O1N0p80O38k45k68O66P32k43m66m22j62j093J771m21m50j21k52O43m43
$$ 144 205 255 -525 113 -132 -400 266 998 755 289 -133 -295 -1388 383 -38 -488 -609 -861 -218 -661
6966f61J854j269P98q52j40j04r8k94M60J083j090N74j42J50K82l44m74k96L56
$$ -661 1193 -76 722 -130 -270 -374 -472 -766 -306 777 -313 261 119 269 551 207 -267 -563 -207
6985b07N48p48J186n94K15n40m74O75m35K9J23n75J699j768R06L78j177R37m80
$$ -207 341 -407 779 185 400 -140 -614 61 -374 -345 -222 -797 902 -866 40 418 -759 178 -302
7004c02J104p66k38l14K17O50o66K46j94j54N33K22N3N34q91l23J61k18J68J481
$$ -302 802 36 -202 -516 -299 351 -315 -69 -263 -417 116 338 391 925 34 -289 -128 -346 -178 1303
7024A303j217j033J660j434O87n18N02L53m74N02j18N03m65l74n55M43K27R7J53
$$ 1303 86 -947 713 -721 -34 -552 -50 303 -171 331 213 716 251 -123 -678 -235 -8 89 242
7043B42p12P88n42L43p38N9M86m72j35J284r66J11J87P57l80j006J055r09J07
$$ 242 -470 318 -224 119 -619 -560 -74 -546 -681 603 -363 -252 -65 692 312 -694 361 -548 -441
7062d41J136m81j28J5J7m09J69QL89l79Mj87J308m61r46K89K59p9p00J163k51
$$ -441 695 214 86 101 118 -291 -122 -114 275 -104 -100 -287 1021 560 -386 -97 162 83 -617 546 295
7083B95n95J020j509O09Q01j216J013j69K67o72M66r8K26p82L16J88M10m24O27
$$ 295 -300 720 -789 -180 621 -595 418 249 516 -156 310 212 438 -344 -28 160 570 146 773
7102G73j154K59L22O8k32n4J06k27J35L89L28j644J29N99j37j85R47j743Q41p26
$$ 773 -381 -122 200 268 36 -18 88 -139 -4 385 713 -931 -802 -203 -340 -525 422 -1321 -480 -1206
7122a206J824r17L59k06J186j454O32n9o08N33R8k5q77K90R99m33l41N90k68k94
$$ -1206 618 -299 60 -146 1040 -414 218 159 -449 84 182 157 -720 -430 569 136 -205 385 117 -177
7142a77J73J18jJ12q76R79k77K18o31J154p12k73K97r44R43L40M87o79o36L51
$$ -177 -4 114 113 225 -651 328 51 269 -362 792 80 -193 104 -840 103 443 930 251 -385 -34
7162c4m53M51m67J066p83L50j47o32L54Q66L15k57p73J79o10L32n42O59j51K65
$$ -34 -487 -36 -503 563 -220 130 -17 -649 -295 571 886 629 -144 35 -575 -243 -785 -126 -277 -12
7182a2O92q61M49M47j627J14Q97n39L84l48Q12L25k58j045P03m12N80n06J087
$$ -12 680 -181 268 715 -912 -798 99 -440 -56 -404 408 733 475 -570 133 -279 301 -205 882
7201H82j325p0N44J25L12q90L84M20L9o31J42o97J200p75M63j076l70J656O4m90
$$ 882 -443 -513 31 156 468 -422 -38 382 421 -210 -68 -765 435 -340 123 -953 -1323 333 397 -93
7221i3n90R46m17J09O94j491J181l27n0O05k32o05K78n80R08k78O32r90J79J14
$$ -93 -683 263 -154 -45 649 -842 339 12 -38 567 335 -270 8 -572 336 58 690 -300 -121 -7
7241gJ96K6P4m44r04J113n2M90L07n65q15J016m06q51J357r65P34p00k65M31l59
$$ -7 189 215 289 -155 -1059 54 2 492 799 234 -581 435 29 -822 535 -430 304 -396 -661 -230 -589
7262e89P13l73M81k84L03p59Q08L6L5o4l84L98n40L51m40K06P08o02M29q15K58
$$ -589 124 -249 232 -52 251 -508 300 336 371 307 -77 321 -219 132 -308 -102 606 4 433 -382 -124
7283a24j96K8J063J75j504J578j143O01n80j29n17J48J441q05R26j477L64L29
$$ -124 -320 -292 771 946 -558 1020 -123 478 -102 -231 -748 -600 841 36 962 -515 -151 178
7301A78o47J122j86m86l84k00K62j69P47r6k93J003j703N06N50m50M97j08p6L96
$$ 178 -469 653 467 -19 -403 -603 -341 -510 237 141 -152 851 -852 -346 204 -246 251 143 67 463
7321D63q65P25p29K10j20J511j061L71o25l99Q61k22q4o32L68o75P13K5M9q1O7
$$ 463 -402 323 -406 -196 -316 1195 134 505 -120 -519 342 120 36 -596 -228 -903 -190 -165 -116 -197 -130
7342a30o3j34N44n4j083J209J34m13M63q78Q52j061P19L03j554Q20J094o9k34
$$ -130 -193 -327 217 163 -920 289 423 10 473 -405 447 -614 105 408 -1146 -326 768 699 465
7361D65p05R76j073m84J622p09k79k5l66N3J339j579K16R6j3P12M4k85o47N27
$$ 465 -240 736 -337 -821 801 92 -187 -212 -578 -525 814 -765 -549 -453 -466 246 290 5 -642 -115
7381a15k95k7R85j143L33M82m27o36L43R4J39R8m24m9R03l72K78N6m75R1K58k07
$$ -115 -410 -437 548 -595 -262 220 -207 -843 -500 -406 -267 -169 -593 -642 261 -111 167 223 -252 -161 97 -110
7403a10K4J48r10N97M59J10l95R94k097J044J3o24L39N14r51J59P27K94L54m55
$$ -110 -86 62 -848 -251 208 318 -77 917 -1180 -136 -123 -747 -408 106 -845 -686 41 335 689 234
7423B34m74N19n36J38J84o96R62j001L94J00R94Q0L20o78p75k12J453n69K0n69
$$ 234 -240 279 -257 -119 65 -631 331 -670 -276 -176 818 898 1218 540 -235 -447 1006 437 457 -112
7443a12l91N68m85K46J03J03R8l92N26m86j65k66N03L26r91J093K15L69j098R53
$$ -112 -503 65 -420 -174 -71 32 130 -262 264 -222 -387 -653 -150 176 -815 278 493 862 -236 717
7463G17j391R21J04m79N12j83j103J59k12J217J57q37Q49j787J809m82R91j463
$$ 717 -674 247 351 -128 384 201 -902 -743 -955 262 419 -418 431 -1356 453 -29 962 -501
7481e01J182o98q59Q81o38J488r20o79J249K56r29J181j551J717j815R75K82p15
$$ -501 681 -17 -876 5 -633 855 -65 -744 505 761 -168 1013 -538 1179 -636 339 621 -94
7499i4L3n41J057p71O45j55l50L97J3n91K12k5n0J006k28p57J62k20m53R79K40
$$ -94 -61 -602 455 -316 329 174 -176 221 234 -357 -145 -170 -220 786 558 -199 -37 -257 -710 269 509
7520E09n09j54O03o57L69n69J182p81P1J075j553J285q53Q16m81o62J45J32O78
$$ 509 0 -154 449 -208 161 -408 774 -7 64 1139 -414 871 18 834 353 -309 -164 -32 646
7539F46j342J103j291J359m42J91K81J92r33L26Q38m93M06j098O60l6m46J64K33
$$ 646 -696 407 -884 475 33 224 505 697 -236 90 928 435 841 -257 403 367 -79 85 318
7558C18o49O48p7P9K27o4j133O78j76k30Q75l88J32L03p55o98P9J26N76k12J94
$$ 318 -331 317 240 319 546 482 -651 27 -149 -379 496 108 240 543 -212 -910 -831 -705 -129 -341 -147
7579a47Q77q96m6k66Q15k27J44l17l4n01l24R36n45k90J420m72O6k68J38K83j260
$$ -147 730 -166 -212 -478 337 110 254 -63 -97 -598 -922 14 -531 -821 599 127 193 -75 63 346 -914
7600i14J430r92N1K49Q81p09M05q78Q4J031m65j454P13M23n94J083M24p27j35
$$ -914 516 -476 -425 -176 705 -4 401 -477 -393 638 173 -1281 -568 -145 -739 344 768 41 -94
7619i4Q57q99Q42j823J358J43m83K31n23n15Q25M10o14O16j28M5po38L63N3k90
$$ -94 763 -136 706 -1117 241 384 -99 132 -391 -906 -81 329 -285 331 203 248 241 -397 -34 19 -271
7640b71J365j278K66J012o29n23J062r55O2J13m18m16R82j66pl43K15q01Q54N29
$$ -271 1094 -184 82 1094 465 -58 1004 49 111 224 -194 -610 372 206 199 -144 71 -730 124 653
7660F53q45J211m26r15J388j472N02O10q50J93j83M13J12nJ32k6r42r5M44N28
$$ 653 -192 1019 593 -322 1066 -406 96 706 -144 49 -134 279 391 386 518 492 -450 -545 -101 427
7680D27k1K66m59l30R05l6q93n0K09K31l48l7k6N20n25L48k38K5m07L95n56J350
$$ 427 406 672 213 -117 788 752 -141 -191 18 249 -99 -136 -162 358 -167 181 -57 -32 -439 -44 -600 750
7702G50j057J56N76j100Q96o31J482o55m55n31j65M27O73N41n00Q74j012r49P58
$$ 750 -307 -151 425 -675 221 -410 1072 417 -38 -569 -734 -307 366 907 407 1281 269 -680 78
7721G8q8n52N90Q35j062K37j11q91R31J7o29Q81J22r39J146o06n83r33K129j167
$$ 78 -10 -562 28 863 -199 38 -73 -964 -33 -16 -645 236 358 -581 565 -41 -624 -1557 572 -595
7741e95O7J400q18k90N12m52R2j97N28k45J00k10n12J08J155l08N51q42q75N61
$$ -595 -528 872 54 -236 276 -176 -84 -281 247 2 102 -108 -620 -512 643 335 886 44 -831 -270
7761b70j18k73Q76L03j351J030j83L7j62K77L40p77L83m36l05P24q80K20J065
$$ -270 -388 -661 215 518 -833 197 14 51 -111 166 506 -271 112 -324 -629 95 -785 -565 500
7780E00J88n63k91k6J47M30q71J534q65o2j10M14Jp02k39R51n25j57M68n40K49
$$ 500 688 125 -166 -192 -45 385 -486 1048 183 121 11 425 426 -276 -515 436 -89 -246 222 -318 -69
7801f9K2P04j054J41J78K87q62J726k91K53j599J50O66J01n14K84J99l71L04l71
$$ -69 -47 657 -397 -256 -78 209 -653 1073 782 1035 -564 -414 252 353 -161 123 322 -49 255 -116
7821a16L4O4k77M90M22n00J61q6j13o69K42l03J10r2Q53j32N34n60l33K46l08
$$ -116 -82 -18 -295 195 617 117 278 192 79 -590 -348 -651 -541 -633 220 88 622 62 -271 -25 -333
7842c33o7J076p05P5L91K65r82L00k55M26l46N18j19J37K60q37rK43O6r59P43
$$ -333 -400 676 -29 46 437 702 -280 20 -235 191 -155 363 244 381 641 -196 -205 38 104 -855 -112
7863a12M05l24l29N25k77K12o86R83K87n19J78L97r65K12r80Q83J94J73K79m91
$$ -112 293 -31 -360 165 -112 100 -586 397 684 165 343 740 -225 -13 -993 -110 84 257 536 45
7883D5M39m92L17j74n50K45l36O84j22o4J255r97k99O9o3m8m78M08j94N85M22
$$ 45 484 -8 309 135 -415 -170 -506 178 56 -8 1247 250 -49 20 -43 -91 -569 -161 -355 230 652
7904F52m26J22M69m49j122J637q58m07Q55k32l49j78l77J141n70P87J2j509J139
$$ 652 226 348 817 368 -754 883 25 -382 473 241 -108 -286 -663 478 -92 695 707 -802 337
7923C37Q6r04J015K7n43L23k86k32J80J94j326K073j318M87l55R30j559Q49N0
$$ 337 423 -481 534 561 18 341 55 -177 3 197 -1129 944 -374 113 -242 688 -871 -22 28
7942B8j52M45o2K33p80K27O8K05j76j99K12J94R5P76j374o2R27K10l77j054J101
$$ 28 -124 321 259 492 -288 -61 7 212 36 -163 49 243 338 1114 -260 -322 605 815 438 -616 485
7963D85j209Q56K29k64N71j154N88q9Q58m89J10o65J34j30j13M77l64k86J006
$$ 485 -724 132 361 97 668 -486 102 13 871 382 492 -173 -39 -169 -282 195 -169 -455 551
7982E51j178O52j49l20k74M44m3r0O37r57O93M17P34j014K43m14j51K58K6M13
$$ 551 -627 25 -124 -444 -718 -274 -317 -407 230 -727 -34 383 1117 103 346 -68 -219 39 65 478
8002D78k16k87P5J44K76p59N56p37M53J33K51n69L9L2K55k90l20l83J205o14N79
$$ 478 262 -25 50 194 470 -289 267 -470 -17 116 367 -202 -163 -131 124 -166 -486 -869 336 -278 301
8023C01K05j009L59m89P36J40j30M50o03m8k00J440m02l13O79p45q50j3J260p35
$$ 301 506 -503 -144 -633 103 243 113 563 -40 -88 -288 1152 750 437 1116 371 -479 -492 768 33
8043C3k51L8l20R74j195k15Q91p9L02k73K00o81M36o01J104r94P94M7r51N49N38
$$ 33 -218 -180 -500 474 -721 -936 -45 -124 178 -95 105 -576 -140 -741 363 -631 163 210 -741 -192 346
8064C46K79j368O70Q0m8r8k70l58J118k19l2j29K8kN55l07K10l80k02K45P86n42
$$ 346 625 -743 -73 7 -41 -139 -409 -767 351 132 100 -29 -1 -3 552 245 455 75 -127 118 904 362
8086C62O34j654J003n72m2O94q1J86k68j11J26k86O59q09j72Q20k18r91R59p70
$$ 362 996 -658 345 -227 -269 425 344 530 262 151 277 -9 650 -159 -331 489 271 -720 239 -531
8106e31M18N37m34K70K44k18J6M91j105K52L4N32m16m89J0J38J30L83L34j423
$$ -531 -113 424 -10 260 504 286 302 793 -312 -60 -26 506 90 -399 -389 -251 -121 262 596 -827
8126h27L31K60O22k7l25L27N29p10n77O37N02l31j139j97O71J65P06p30p8M07
$$ -827 -496 -236 386 359 34 361 890 180 -397 240 742 411 -728 -925 -254 -89 617 -113 -191 216
8146B16N09j351Q26j26O5J95M13n41J28p14J01L91m21o64J90J043n40J81k54N4
$$ 216 725 -626 200 74 139 334 747 206 334 -380 -279 112 -309 -973 -783 260 -280 -99 -353 -299
8166b99J234j156K10q05J122j64r16J329k32K3n54MO73q43R13o54l26M91o63Q92
$$ -299 935 -221 -11 -816 306 142 -774 555 323 346 -208 -204 469 -374 539 -115 -441 50 -613 279
8186B79k98l5n22J043j100
$$ 279 -19 -54 -576 467 -633
8191f33
$$ Imaginary data points
##PAGE= N=2
##DATA TABLE= (X++(I..I)), XYDATA
0@%%%%%%J08k16J08j08K16k45L53n18O26o56P69j085J404j620J856k202K656l142
$$ 0 0 0 0 0 0 0 108 -108 0 -108 108 -137 216 -302 324 -332 437 -648 756 -864 992 -1210 1446 -1696
24a696L679m280M922n646O534p547Q587r688J0968j2444J4052j5780J7677j9761
$$ -1696 1983 -2297 2625 -3021 3513 -4034 4553 -5135 5833 -6611 7441 -8339 9338 -10423
38a0423K2026k4537K7326l0326L3531l7062M0989m5281M9924n4983O0546o6662
$$ -10423 11603 -12934 14392 -15934 17597 -19465 21524 -23757 26167 -28816 31730 -34932
50c4932P3418q0933Q9265r8501J08883j20720J34286j49897J68121j89814K16112
$$ -34932 38486 -42447 46818 -51683 57200 -63520 70766 -79131 88990 -100824 115288
61A15288k48703K90262l45201M21274n33569P15194j053957J880015p306877n853053
$$ 115288 -133415 156847 -188354 232920 -300649 414545 -639412 1240603 -6066274 -11919327
71a1919327K3517652p050895j2943560J0016613l33933l314577R063545j0263436
$$ -11919327 11598325 4547430 -8396130 1620483 1286550 -2028027 7035518 -3227918
79c227918o680681J9915983k926037k0469360J2473046J1167149j3659029J41909
$$ -3227918 -9908599 10007384 7081347 -13388013 -914967 10252182 -3406847 -3264938
87c264938N604446n731168P143810J551108j5716760Q550640J5212891j7064053
$$ -3264938 2339508 -3391660 3752150 5303258 -10413502 -1862862 13350029 -3714024
95c714024o613409J7252864k963930q901143O331736k695112p90922R767998r618574
$$ -3714024 -10327433 6925431 3961501 -4939642 1392094 -1303018 -2093940 7674058 -1944516
104a944516q271594J7495508R5544j7208337Q038888R165217r664649J026160
$$ -1944516 -10216110 7279398 7374942 -9833395 -1794507 7370710 -2293939 -1267779
112a267779L097782o363086P414662L663126j4858313M484260J4461070j1691960
$$ -1267779 1830003 -4533083 2881579 6544705 -8313608 -3829348 10631722 -1060238
120a060238p166950J2387674j365999n776582M901383l770750j106210R923535
$$ -1060238 -8227188 4160486 2794487 -2982095 1919288 -1851462 -2957672 6965863
128F965863o942056q921582J3203976K229819j3062884M719568O570319o559933
$$ 6965863 23807 -8897775 4306201 6536020 -6526864 -1807296 4763023 -1796910
136a796910J805630J826019o497173O135318M738545j1785358J569216J1412017
$$ -1796910 8720 1834739 -4662434 1472884 6211429 -5573929 -4004713 7407304
144G407304p385936n631884Q254230j241407l396162M434519l858585k028200
$$ 7407304 21368 -5610516 2643714 1402307 -1993855 2440664 -1417921 -3446121
152c446121Q611170l863547p932650Q746966K820871r010992K706342M417266
$$ -3446121 5165049 1301502 -6631148 2115818 4936689 -4074303 -1367961 3049305
160C049305m601894J858016J616410n596078L969114M554273q142376M0415Q039462
$$ 3049305 -1552589 305427 1921837 -3674241 294873 4849146 -3293230 -3252815 4786647
169D786647m494151l896159N410361j260203k101055L835252l082628k254324
$$ 4786647 292496 -3603663 1806698 546495 -1554560 2280692 -801936 -3056260
177c056260O539250k053928o049143N756627K267863o100051J928585K848346
$$ -3056260 3482990 1429062 -4620081 1136546 3404409 -2695642 -767057 2081289
185B081289l533876J679658J556634m389265K413588L648353n462753l51530N474565
$$ 2081289 -1452587 227071 1783705 -2605560 -191972 3456381 -2006372 -2357902 3116663
194C116663k879008k567783L677223j093735j544634K968107j926771j938953
$$ 3116663 237655 -2330128 1347095 253360 -1291274 1676833 -249938 -2188891
202b188891M307762r89166m074796L547602J609113l890493J206258J858327k380401
$$ -2188891 2118871 1129705 -2945091 602511 2211624 -1678869 -472611 1385716 -994685
211i94685J045832J201036k848537J344686K472384l375529m35021L497662j657202
$$ -994685 51147 1252183 -1596354 -251668 2220716 -1154813 -1589834 1907828 250626
220B50626j741937K290793n62449j074423J814071j065279j293007K617190m33115
$$ 250626 -1491311 799482 237033 -837390 976681 -88598 -1381605 1235585 802470
229H02470k584623K002013J150592k281465N46804J132473j280602N89790O14257
$$ 802470 -1782153 219860 1370452 -911013 -364209 768264 -512338 77452 691709
238F91709j701436Q48961J543795k006578l89241K056737q16752j044373J189715
$$ 691709 -1009727 -160766 1383029 -623549 -1012790 1043947 227195 -817178 372537
247C72537k68309n06865J002617o90400p71985J549005j10618j540141R34838
$$ 372537 104228 -402637 599980 -90420 -862405 686600 575982 -964159 -29321
256b9321P86567j101794J03461N39083n19420L28970K62872r16728L73917R02936
$$ -29321 757246 -344548 -241087 297996 -221424 107546 370418 -546310 -172393 730543
266G30543q81208m16085R10670j11452m75835K90762j01544m0388M48593m05408
$$ 730543 -150665 -566750 343920 232468 -243367 47395 -54149 -94537 354056 -51352
276e1352m07880P09940R4630o80916K01370L77099k48590k6418K8540j62150K86074
$$ -51352 -459232 250708 345338 -335578 -134208 242891 -5699 -32117 -3577 -165727 120347
287A20347J21467m92105N3797M83600j98332l19038K00910J40015o3599m6045
$$ 120347 241814 -250291 -196494 287106 88774 -230264 -29354 110661 47062 1017
297A017j21422M9808K46105r7225k70223J26432K28355j07679j76701N3520J55293
$$ 1017 -120405 -70597 175508 78283 -191940 -65508 162847 55168 -121533 -68013 87280
308H7280R490j53209o2360J46419R7530j23450j26465R6804J56523p5095j81604
$$ 87280 96770 -56439 -118799 27620 125150 1700 -124765 -27961 128562 53467 -128137
319a28137N5651J97742l1161j91979n510J67261M7190j38824q2599J07714J18451
$$ -128137 -72486 125256 94095 -97884 -103394 63867 111057 -27767 -110366 -2652 115799
330A15799q0044j50915N5065J78838l6328j91032K8029J68424k0397j17342j2494
$$ 115799 35755 -115160 -60095 118743 82415 -108617 -80588 87836 67439 -49903 -62397
341f2397O5298Q3522m4960j73349P5747K23915j36684j87432J57948P8362q9304
$$ -62397 2901 86423 41463 -131886 -56139 167776 31092 -156340 1608 79970 -9334
352i334K4283p0710k8532K44428q9263l15059K53388K14182l19859k227J95025
$$ -9334 14949 -55761 -84293 160135 70872 -244187 9201 223383 -96476 -98703 96322
363I6322j62032Q5566J28608l58304J23726M29157m26896k27849N40463j11010
$$ 96322 -65710 19856 148464 -209840 -86114 343043 -83853 -311702 228761 117751
373A17751l33720L26052j01031k08988M84198k11370n41267O69178K15880q18750
$$ 117751 -215969 110083 9052 -199936 284262 72892 -468375 200803 416683 -402067
383d02067K60603N04077n13403R4424K91483n70197L20715N69353r24380p2256
$$ -402067 -141464 362613 -150790 -56366 235117 -335080 -14365 554988 -369392 -441648
393d41648J084033n63755o44561Q32182j10677m56825O30167l80604n02865J134209
$$ -441648 642385 78630 -565931 266251 155574 -301251 328916 -51688 -554553 579656
403E79656k25491j264598J038366O55348j301802K60159P31833p82713L44760
$$ 579656 354165 -910433 127933 783281 -518521 -258362 473471 -309242 35518
412C5518M61522j207242N47470J244993j548060m19467J789724o54418j037074
$$ 35518 497040 -710202 -162732 1082261 -465799 -885266 904458 250040 -787034
421g87034J139461k32264n82738J128411p13578j002043J880295o3883k088092
$$ -787034 352427 120163 -462575 665836 -47742 -1049785 830510 766627 -1321465
430a321465J282162J170332j700835K21987R09882j063078O30581O99439j890687
$$ -1321465 -39303 1131029 -569806 -347819 562063 -501015 129566 829005 -1061682
439a061682O49591K005567k019055r07143K373855n77143j367161J301358l68565
$$ -1061682 -412091 1593476 -425579 -1332722 1041133 463990 -903171 398187 29622
448B9622o35622J642118j041775j567967K584334K15781k878567J388822J671636
$$ 29622 -606000 1036118 -5657 -1573624 1010710 1226491 -1652076 -263254 1408382
457A408382j982789J99064R91627j395091J014428J031935k693669O46340K885822
$$ 1408382 -574407 -375343 616284 -778807 235621 1267556 -1426113 -779773 2106049
466B106049k399081j481572K876354m69769j602950J486989o31513p48237K316067
$$ 2106049 -293032 -1774604 1101750 631981 -970969 516020 -115493 -863730 1452337
475A452337j286615k309858L184530O86263l553551J287551K080552k064677K29822
$$ 1452337 165722 -2144136 1040394 1726657 -1826894 -539343 1541209 -523468 -293646
484b93646R39088j761026J414447J443567l395990M38904L651122k448209k035662
$$ -293646 645442 -1115584 298863 1742430 -1653560 -1214656 2436466 -11743 -2047405
$$ [...]
8191G39
##END NTUPLES=NMR FID
##END=
