##TITLE=1H_AT-29_T 
 DMSO-d6+CD3ONa
 8 sc, 
 29.08.2022
##JCAMPDX= 6.0         $$ Bruker NMR JCAMP-DX V2.0
##DATA TYPE= NMR FID
##DATA CLASS= NTUPLES
##ORIGIN= UXNMR, Bruker Analytische Messtechnik GmbH
##OWNER= root
$$ XWIN-NMR		Version 3.5
$$ Mon Aug 29 15:12:15 2022 Russian Standard Time (UT+4h)  she@DPX200
##.OBSERVE FREQUENCY= 200.1313499994
##.OBSERVE NUCLEUS= ^1H
##.DELAY= (6, 6)
##.ACQUISITION MODE= SIMULTANEOUS
##.ACQUISITION SCHEME= undefined
##.AVERAGES= 8
##.DIGITISER RES= 18
##SPECTROMETER/DATA SYSTEM= spect
##.PULSE SEQUENCE= zg30
##.SOLVENT NAME= THF
##.SHIFT REFERENCE= (INTERNAL, THF, 0, 15.7039)
##AUDIT TRAIL= $$ (NUMBER, WHEN, WHO, WHERE, WHAT)
$$ ##TITLE= Audit trail, XWIN-NMR		Version 3.5
$$ ##JCAMPDX= 5.01
$$ ##ORIGIN= Bruker BioSpin GmbH
$$ ##OWNER= she
$$ F:/spectra/data/she/nmr/H-F/1/audita.txt
$$ ##AUDIT TRAIL=  $$ (NUMBER, WHEN, WHO, WHERE, WHAT)
(   1,<2022-08-29 15:11:40.23 +0400>,<she>,<DPX200>,
      <created by zg, POWCHK disabled, PULCHK disabled
       configuration hash MD5:
       00 E9 B6 7A A2 85 ED C7 34 08 36 98 17 FE 4E 26
       data hash MD5: 16K
       5C 10 B9 4C 3A EC 8A E1 9E 78 53 CE 59 B0 39 02>)
$$ ##END=
$$ 
$$ hash MD5
$$ 4C 23 F8 69 E1 B4 4B 72 37 CC 92 CB 14 F4 A7 E4
##$RELAX= 
##$RELAX= 
##$RELAX= 
##$RELAX= 
##$RELAX= 
##$RELAX= 
$$ Bruker specific parameters
$$ --------------------------
##$DU= <F:/spectra>
##$EXPNO= 1
##$NAME= <H-F>
##$PROCNO= 1
##$TYPE= <nmr>
##$USER= <she>
##$AMP= (0..31)
100 100 100 100 100 100 100 100 100 100 100 100 100 100 100 100 100 100 
100 100 100 100 100 100 100 100 100 100 100 100 100 100 
##$AQSEQ= 0
##$AQ_mod= 1
##$AUNM= <au_zg>
##$AUTOPOS= <>
##$BF1= 200.13
##$BF2= 200.13
##$BF3= 200.13
##$BF4= 200.13
##$BF5= 200.13
##$BF6= 200.13
##$BF7= 200.13
##$BF8= 200.13
##$BYTORDA= 1
##$CFDGTYP= 0
##$CFRGTYP= 5
##$CHEMSTR= <none>
##$CNST= (0..31)
1 1 145 1 1 1 1 1 1 1 1 1 1 1 1 1 1 1 1 1 1 1 1 1 1 1 1 1 1 1 1 1 
##$CPDPRG= <>
##$CPDPRG1= <>
##$CPDPRG2= <>
##$CPDPRG3= <>
##$CPDPRG4= <mlev>
##$CPDPRG5= <mlev>
##$CPDPRG6= <mlev>
##$CPDPRG7= <mlev>
##$CPDPRG8= <mlev>
##$CPDPRGB= <>
##$CPDPRGT= <>
##$D= (0..31)
0 1.2 0 0 0 0 0 0 0 0.06 0 0.03 0 0 0 0 0.0002 0 0 0 0 0 0 0 0 0 0 0 0 
0 0 0 
##$DATE= 1661771499
##$DBL= (0..7)
120 120 120 120 120 120 120 120 
##$DBP= (0..7)
150 150 150 150 150 150 150 150 
##$DBP07= 0
##$DBPNAM0= <>
##$DBPNAM1= <>
##$DBPNAM2= <>
##$DBPNAM3= <>
##$DBPNAM4= <>
##$DBPNAM5= <>
##$DBPNAM6= <>
##$DBPNAM7= <>
##$DBPOAL= (0..7)
0.5 0.5 0.5 0.5 0.5 0.5 0.5 0.5 
##$DBPOFFS= (0..7)
0 0 0 0 0 0 0 0 
##$DE= 6
##$DECBNUC= <off>
##$DECIM= 32
##$DECNUC= <off>
##$DECSTAT= 4
##$DIGMOD= 1
##$DIGTYP= 9
##$DL= (0..7)
0 120 120 120 120 120 120 120 
##$DP= (0..7)
150 150 150 150 150 150 150 150 
##$DP07= 0
##$DPNAME0= <>
##$DPNAME1= <>
##$DPNAME2= <>
##$DPNAME3= <>
##$DPNAME4= <>
##$DPNAME5= <>
##$DPNAME6= <>
##$DPNAME7= <>
##$DPOAL= (0..7)
0.5 0.5 0.5 0.5 0.5 0.5 0.5 0.5 
##$DPOFFS= (0..7)
0 0 0 0 0 0 0 0 
##$DQDMODE= 0
##$DR= 18
##$DS= 0
$$ [...]
##$SUBNAM2= <"">
##$SUBNAM3= <"">
##$SUBNAM4= <"">
##$SUBNAM5= <"">
##$SUBNAM6= <"">
##$SUBNAM7= <"">
##$SUBNAM8= <"">
##$SUBNAM9= <"">
##$SW= 18.0517283424941
##$SWIBOX= (0..15)
0 0 2 0 0 0 0 0 0 0 0 0 0 0 0 0 
##$SW_h= 3612.71676300578
##$TD= 16384
##$TD0= 1
##$TE= 0
##$TE2= 300
##$TE3= 300
##$TEG= 300
##$TL= (0..7)
0 120 120 120 120 120 120 120 
##$TP= (0..7)
150 150 150 150 150 150 150 150 
##$TP07= 0
##$TPNAME0= <>
##$TPNAME1= <>
##$TPNAME2= <>
##$TPNAME3= <>
##$TPNAME4= <>
##$TPNAME5= <>
##$TPNAME6= <>
##$TPNAME7= <>
##$TPOAL= (0..7)
0.5 0.5 0.5 0.5 0.5 0.5 0.5 0.5 
##$TPOFFS= (0..7)
0 0 0 0 0 0 0 0 
##$TUNHIN= 0
##$TUNHOUT= 0
##$TUNXOUT= 0
##$USERA1= <user>
##$USERA2= <user>
##$USERA3= <user>
##$USERA4= <user>
##$USERA5= <user>
##$V9= 5
##$VALIST= <valist>
##$VCLIST= <CCCCCCCCCCCCCCC>
##$VD= 0
##$VDLIST= <DDDDDDDDDDDDDDD>
##$VPLIST= <PPPPPPPPPPPPPPP>
##$VTLIST= <TTTTTTTTTTTTTTT>
##$WBST= 1024
##$WBSW= 4
##$XGAIN= (0..3)
0 0 0 0 
##$XL= 0
##$YL= 0
##$YMAX_a= 971358
##$YMIN_a= -979328
##$ZGOPTNS= <>
##$ZL1= 120
##$ZL2= 120
##$ZL3= 120
##$ZL4= 120
##$ABSF1= 10
##$ABSF2= 0
##$ABSG= 5
##$ABSL= 3
##$ALPHA= 0
##$AQORDER= 0
##$ASSFAC= 0
##$ASSFACI= 0
##$ASSFACX= 0
##$ASSWID= 0
##$AUNMP= <proc_1d>
##$AZFE= 0.1
##$AZFW= 0.1
##$BCFW= 1
##$BC_mod= 2
##$BYTORDP= 1
##$COROFFS= 0
##$CY= 11.3945322036743
##$DATMOD= 1
##$DC= 2
##$DFILT= <>
##$DTYPP= 0
##$F1P= 2.36226072786647
##$F2P= -0.459571619588291
##$FCOR= 0.5
##$FTSIZE= 0
##$FT_mod= 4
##$GAMMA= 1
##$GB= 0.15
##$INTBC= 1
##$INTSCL= 1
##$ISEN= 128
##$LB= 0.24
##$LEV0= 0
##$LPBIN= 0
##$MAXI= 10000
##$MC2= 0
##$MEAN= 0
##$ME_mod= 0
##$MI= 1.114404
##$NCOEF= 0
##$NC_proc= 0
##$NLEV= 6
##$NOISF1= 3.799351
##$NOISF2= 2.8
##$NSP= 1
##$NTH_PI= 0
##$NZP= 0
##$OFFSET= 15.70392
##$PC= 1
##$PHC0= -18049.22
##$PHC1= 21.40069
##$PH_mod= 1
##$PKNL= yes
##$PPARMOD= 0
##$PSCAL= 0
##$PSIGN= 0
##$REVERSE= no
##$SF= 200.130013532006
##$SI= 16384
##$SIGF1= 3
##$SIGF2= 2
##$SINO= 400
##$SIOLD= 16384
##$SREGLST= <1H.CDCl3>
##$SSB= 0
##$STSI= 0
##$STSR= 0
##$SW_p= 3612.71676300578
##$SYMM= 0
##$S_DEV= 0
##$TDeff= 0
##$TDoff= 0
##$TI= <>
##$TILT= no
##$TM1= 0
##$TM2= 0
##$TOPLEV= 0
##$USERP1= <user>
##$USERP2= <user>
##$USERP3= <user>
##$USERP4= <user>
##$USERP5= <user>
##$WDW= 1
##$XDIM= 8192
##$YMAX_p= 0
##$YMIN_p= 0
$$ End of Bruker specific parameters
$$ ---------------------------------
##NTUPLES= NMR FID
##VAR_NAME=  TIME,          FID/REAL,        FID/IMAG
##SYMBOL=    X,             R,               I
##VAR_TYPE=  INDEPENDENT,   DEPENDENT,       DEPENDENT
##VAR_FORM=  AFFN,          ASDF,            ASDF
##VAR_DIM=   8192,          8192,            8192
##UNITS=     SECONDS,       ARBITRARY UNITS, ARBITRARY UNITS
##FACTOR=    0.0002768,     1,               1
##FIRST=     0,             0,               0
##LAST=      2.2672688,     0,               0
##MIN=       0,             -979328,         0
##MAX=       2.2672688,     971358,          0
$$ Real data points
##PAGE= N=1
##DATA TABLE= (X++(R..R)), XYDATA
$$ [...]
2044c067o781J7949k557j4879R706M757q407N127p89q327J2423J770j7575Q272
2058b378J3683j4316l988J2038m624k002N995r569J602J4247j2225r650J7976
2071F789j97j4693P666M276o793O218j753r718J2882L894j8778O346J4838j2756
2085a779m539J0352m664o3O169j1332J050J6032j1295j1562J6938J617j3351N554
2099h73L362n632P420k515j1231J3281O007j8491L167J4805r480m692P627m375
2113a620P49P236j1692j008J6432p937j2930J3873L538j1344M235J635m603Q305
2127D869k159j2259J1242Q204j6101K97J3003o636l659N572m950J943P264j0864
2141d234k669J5253n036j2343J0596L571q334L984r1m943Q824p67j2291Q490Q809
$$ y = [-3067, -9848, 8101, 5544, -9335, 371, 5128, -3279, 1848, 1059, -7268, 5155, 6925, -10650, -2378, 11305, -3011, -6999, 5039, 415, -1587, 4408, -5161, -3559, 10688, -1537, -11187, 6789, 6592, -8101, -435, 3841, -2952, 3266, 1513, -8205, 4677, 8571, -10207, -3861, 10977, -1779, -6318, 4034, -630, -693, 5476, -5856, -4806, 11226, -69, -11631, 5307, 6924, -6427, -873, 2489, -3143, 4277, 1762, -9469, 3812, 9819, -8672, -5505, 9300, -180, -4872, 2755, -1620, -871, 6365, -5327, -6335, 10097, 2160, -10770, 3103, 6641, -4703, -468, 1167, -3436, 4869, 2710, -9549, 1693, 9897, -6204, -5907, 7096, 460, -3199, 2373, -2577, -634, 6630, -4234, -6903, 8350, 3314, -9029, 1567, 5138, -3196, 788, 697, -4246, 4578, 3811, -8480, 10, 8819]
2156H819j2859j079R892m739k200M698n557J509Q283r092m878J3170k208j0188
2170f429O517L347n899L686m64n385P929J068j0919N222Q186q919j977P200l423
2185b60j105L875n071N87P759o447n287R434k51p538M186K437m415L914o90n143
2201d015N950K144q872L003O665n927j533M645k455m68L515m763r8O450m275m209
2217d243O413K08n219L086J133l250K942J47m425L877K311n820J282M579l391
2232c70j040K740j901j90K982l028r49M525k154l405L944L36l176K012L86k324
2248a612K389L30l124K209J790l477N28K861k448j41J893j788m1K065k077p86
2264a429K850r91k246K581M32k178R37N01j369J146O02j784J107J296k352J03
$$ y = [8819, -4040, -5119, 4773, 34, -2166, 2532, -3025, -1516, 6767, -2325, -7203, 5967, 3759, -6429, 88, 3435, -2464, 1222, 758, -4627, 3302, 4370, -6549, -1327, 6859, -2060, -4037, 3163, -260, -1365, 2510, -2561, -1974, 5785, -662, -5949, 3485, 3234, -4304, -118, 2319, -2096, 1818, 1128, -4015, 1935, 4079, -4793, -1790, 4875, -1052, -2585, 2060, -395, -863, 2652, -2111, -2209, 4241, -34, -4243, 2170, 2378, -2841, 245, 1378, -1872, 1070, 1217, -3208, 669, 2980, -2840, -1558, 3021, -370, -1410, 1330, -571, -761, 2221, -807, -1756, 2769, 615, -2790, 1154, 1490, -1686, 326, 712, -1612, 777, 1107, -2017, 192, 1982, -1495, -967, 1894, -554, -695, 1198, -590, -631, 1434, -643, -1429, 1421, 430, -1816, 765, 1197, -981, -44, 457, -912, 234, 836, -948, 159, 1455, -897, -794]
2280g94J732j308k15J388j034l26J249q18n12J388l16j447J370K50j232R16J23
2297D14p48O33J56r67L74Q31r17PQ21o22m68O43k28j9L36l50k12N87l0o85L68
2318g6M17p20M43M3k50m3K59l22L09K02l16k01K81Q6m33K21J87Pl06M2k89P38
2340B79J18n75K31J38r7J08Q6m35K15n6Q2j75K67l1l96L71l96J86K33k5j37k1
2362c0J75l56L69k09r0M20k24j69J39J30l38K46L9j0j24K17l20r3O27n50k13N63
2384A99m51p6N11j35n60Q17l38j77O93l02j074R63K85q13N61L42q26J62Q51j270
2404f38M02J182j220m29J502m96q87J281n10r87J273l28j253J679Q2j881J232
2421DO38j439Q74N57j335Q19Q81j926K80J916j329r35J763n33j098J665j479o55
$$ y = [-794, 938, -370, -585, 803, -231, -557, 692, -126, -638, 750, 434, -1013, 357, 607, -625, 291, 414, -334, 299, 455, -512, -138, 693, -224, -217, 604, -18, -486, 157, -71, -90, 246, -104, -316, 271, 241, -444, -76, 341, -379, 64, 107, -143, -186, 73, -249, 60, 262, -54, -255, 26, 112, -321, -100, 87, 94, -212, -170, -459, 279, 397, -178, 53, 191, 94, 202, 288, -147, 68, 12, 94, -81, 186, 155, -241, 130, -266, -80, 153, 128, -9, -30, 145, -211, 158, -51, -141, 279, 55, -114, 25, 155, -183, 63, 102, 92, -32, 185, -135, -228, 399, -151, -364, 199, -252, -328, 183, 48, -512, 305, -33, -210, 483, 181, -893, 70, 355, -458, 103, 445, -381, -219, 632, -638, -236, 946, -274, -703, 799, 303, -584, 697, 187, -800, 473, 145, -1108, 571, 653, -1228, 4, 642, -797, 77, 634, -701, 118, 999, -927, -647, 1269, -60, -995, 768, 235, -863, 802, -677, -1332]
2439a332K651o68k538K744N05k583R19J192j509J103M43k480J537J726k697l63
2455a350L223j854j473K106o39p53K001j809j514L787n12l807K867J647l376J091
2471c65J267k129J797Q46l466J717L357m556o64M527k015j983K941j635n97K899
2487A941k243k589N108n82m579K887K194l348J001J275k765K661J188n380K538
2502f93M282m473j685M652j578k110K723j842n82M313l100l567N927L66n818K474
2518g11K803l244J309P86l005K786K365o221J095O368m576k870N015j265j701
2533a066K625k459j091N370k716m913N945J431o488K601K875l086J368L94l979
2548c189M000L008o846K68O973m268l010M403q19j304K749l198j380O345k700
$$ y = [-1332, 1319, 651, -1887, 857, 1362, -1221, -302, 890, -619, 484, 927, -1553, -16, 1710, -987, -1350, 1873, 19, -1454, 652, 13, -740, 1261, -548, -2062, 1725, 1213, -2594, 273, 1920, -1456, -365, 902, -1227, 570, 1416, -2050, -333, 3024, -1532, -2196, 2331, 316, -1667, 1274, -361, -958, 1941, -302, -2891, 2217, 1635, -2944, -57, 2137, -1211, -210, 1065, -1700, 961, 2149, -3231, -693, 3589, -884, -2569, 2083, 505, -1605, 1118, -724, -1306, 3007, -93, -3660, 2267, 2633, -3185, -711, 2092, -1152, 157, 943, -2062, 724, 3089, -3132, -2037, 4331, -245, -3115, 1900, 635, -1066, 1559, -900, -1991, 3379, 663, -4250, 1695, 3126, -3362, -761, 2114, -972, 396, 790, -3189, 811, 3819, -3027, -2759, 4214, -54, -3064, 1339, 520, -784, 1965, -1233, -2613, 3732, 1032]
2563A032n929O139K143n603J281K458k673K274J94m743L502M302p230l14O703
2578C536k610l765M146j299r97L376l477k296O972j692o636N171L039n543J084
2593i91K348l116L144M26n601L551N021o670j469O297j975l224L212j571m27M090
2609C045l937k518O594n96o554L814K938m137J028J213k551K782J400o402L175
2624g06N111n416k372N596j332k377K552j895l53M219l140l813O189M76o116K741
2640f36K864l417J005J100l081K972J890n714J422N503m225k734M628r58j503
2655h84K219k149o41M322k687l527M835J017m815J928J985k439J094O71k880K579
2671F28K010n090O16N014l158j984K970o27j344K459k245p65L670j549l465L640
$$ y = [1032, -4897, 1242, 3385, -2218, -937, 1521, -1152, 1122, 1316, -3427, 75, 4377, -2853, -3167, 3536, 926, -2839, 1307, 8, -989, 2387, -1090, -3386, 3586, 1894, -4742, 429, 3468, -2075, -991, 1357, -1759, 1385, 1811, -3790, -239, 4782, -1888, -3357, 2940, 965, -2259, 953, -618, -1045, 3045, -892, -3410, 3184, 2588, -3966, -152, 2786, -1351, -323, 890, -1661, 1121, 2521, -3881, -706, 4405, -1011, -3383, 2213, 881, -1496, 1056, -839, -1192, 3027, -113, -3926, 2263, 2739, -3377, -636, 2228, -1189, -184, 916, -2165, 807, 2697, -3017, -1595, 3908, -317, -3051, 1577, 619, -884, 1335, -814, -1455, 2867, 180, -3347, 1488, 2505, -2310, -382, 1603, -836, 258, 929, -1951, 628, 2638, -2452, -1836, 3178, 20, -1964, 1006, 379, -965, 1494, -751, -1516, 2154, 605, -2860, 780]
2687G80J416l733R68J762j911R57P03k728J983K183l814k10L677j778j765K303
2703G93p21p78J760j658r29L054q99k915K897J136k540N71Q89j291R92N37k146
2720a248R16K187k822m70K837j391r37J220o04l71J735j284j352K716l73k424
2736a665J787J077k050P88M64r74Q92M09j821J029J455j678o28J823o11q31J137
2753F03o77m50J117q22p44J558j20j336R16M01o92J91J99p63N30P39j174K07J115
2772G98r91k77Q45m06l15Q38l90n15P44l26o56P60J51r04L04L86m19L49J16m33
2792c41J78M67m57l24Q84l97l84N33r0k85M92m62k1L42k79k44O14Q2l97M3j18
2813a64p8J18M16j41j82K96k92j33M29k27k06L46j79j24J43J57k28J24om3M6J10
$$ y = [780, 2196, -1537, -569, 1193, -718, 239, 942, -1786, 197, 2380, -1434, -1644, 2033, 255, -1510, 793, 72, -706, 1054, -604, -1533, 1521, 622, -2293, 604, 1740, -800, -229, 660, -631, 361, 898, -1248, -332, 1855, -967, -1437, 1400, 9, -928, 292, -312, -683, 1052, -232, -1584, 1132, 759, -1665, 122, 1199, -851, -63, 401, -573, 319, 728, -1093, -64, 1391, -287, -915, 908, 297, -534, 603, -74, -524, 593, -229, -973, 585, 465, -871, 45, 446, -246, -55, 144, -619, -89, 650, -524, -317, 798, -193, -470, 375, -31, -346, 492, 102, -413, 331, 5, -651, 109, 260, -644, -340, 46, -373, -24, 92, -341, -163, 304, -153, -477, 407, 10, -374, 159, 69, -216, 276, -186, -207, 135, -144, -388, 226, 308, -89, -46, -164, -242, -124, 292, 151, -31, 265, -27, -160, 269, 42, -164, 182, 3, -121, 22, 179, -49, 75, 69, 26, 72, 182]
2835A82l9j07J09j72M7N3k9k38J66l6L03l37loQ3rr7K95N6j77N9p2j30n4L58l76
2861a71J22l3M9J26j17j27j52N29l34J58k20J85K0J74k38k22L18j5j69J41Qp3
2883d1J10l3l28K71K66l04j31L81k94l8o7K00q4L28m14k96R11n70l06O20n2m80
2905c51O80k92k21L41K32o02K32M35p20K03L63m50K30k3p24N89N53q45p4Q49m16
2926a1m06N57j54k26M94p5o08O93j3q17P47P8p18L29N13m70K05L14o70K8P88q38
2948b60j83J098k43r15O19J57p56R03k49p63J036J21j515O41P88q60K02N73o03
2967b09P6N73o56m84J673j297p92J774l11r11Q72j95r68J381m28j248J473O73
2985I96j768M25J285j364J81O43q72L96J012j837K68J726r68j141J657k66q76
$$ y = [182, 143, 36, 145, -27, 20, 73, 44, -194, -28, -64, 239, -98, -101, -107, -24, -33, -130, 165, 221, 44, 103, 31, -99, -153, 205, -171, -49, -82, -33, 93, -24, -151, -303, 226, -108, 50, -170, 15, 35, 209, -29, -251, 67, 52, -117, 24, 32, -41, 69, 36, -292, -21, 245, -59, -190, 191, -103, -141, -208, -8, -92, 236, -178, -474, 437, -133, -439, 181, 129, -351, 329, 37, -184, 157, 389, -213, 19, 454, -266, -63, 300, -150, 80, 57, -667, -78, 475, -370, -444, 405, -11, -417, 140, -14, -240, 254, 179, -429, 264, 251, -566, 181, 259, -459, -130, 383, -87, 118, 432, -238, -210, 578, -260, -443, 655, 412, -503, 116, 273, -483, 420, 171, -592, 444, 565, -950, -309, 479, -381, -179, 394, -209, -133, 440, -216, -700, 973, -324, -1116, 658, 347, -564, 308, 113, -855, 526, 98, -1150, 323, 996, -772, -347, 938, -426, -245, 398, -474, -78, 934, -903, -635, 1091, 123, -1018, 639, 373, -503]
3002e03R05m28l92J332o75j656J858O25k014P50Q74q06l01J127j334N79J482k177
3020g54k73K455q58j721J613l21p01J027o04o95J965n40k079J536J397k256M13
3037c96J175j108M71O17j692P62J630k119n05K612j013j556J407k32o38J453j032
3054a64j025K298k09k477J620J170j842k0R82j007Q64M96j793P71K160k267j263
3071a706K775n17j589J257L3p26J596j181j334K493p5k532J211J623j602j25R01
3088E02j265J121P77k392L92K816k076j459K416j56j570J102k16n92J638o81k069
3105a712K396N97k480N16J700j208j51Q94j151O32J140k098K28K449j484j822
3121a554K057J91j152P34r7j083K046q19j795K012R18k636N57J690r64m31Q68
$$ y = [-503, 402, -26, -418, 914, 239, -1417, 441, 1066, -948, -198, 676, -130, -431, 696, -638, -59, 1423, -754, -1027, 1428, 570, -1151, 462, 141, -560, 467, -137, -832, 1133, 593, -1486, 50, 1447, -809, -396, 779, -329, 142, 759, -933, -171, 1459, -660, -1165, 1447, 434, -1122, 285, 53, -585, 868, -164, -1189, 1109, 900, -1577, 43, 1213, -629, -649, 333, -674, 190, 686, -1107, -336, 1824, -443, -1706, 1069, 552, -1037, 220, 253, -473, 1123, -58, -1392, 1101, 1026, -1506, -295, 1328, -274, -399, 502, -763, 358, 1135, -1257, -865, 1951, -125, -1584, 832, 676, -894, 208, -8, -600, 1038, 357, -1712, 684, 1281, -1199, -683, 1017, -191, -342, 552, -599, 33, 1173, -925, -697, 1752, 268, -1554, 503, 694, -458, 276, 179, -904, 1142, 323, -1472, 540, 1458, -1178, -621, 1069, 105, -326, 542]
3138E42j119M93J627k453j02K253j127j245J664lp80P04n41p98J862m93j788J437
3156A33J090j986P5J572j051L7O41j364O79J368j790m18K257r32j243J035J85
3173B88q02J086n03q66J521j29j719R75J372j606k06R78o52J12J003j545M41J604
3191A352j840o44J881m78q73Q00k64l39P27j32q27R99K15j462P97R48j269K5Q45
3210D61j015M97P94j323J36J482r83o84J047k61n99N42k4m12P26m45o19P93K57
3229C70r73L24P29o90P5M70m46J72Q6l55P5N93n02o45R67j59l89N12k04j52N08
3250C66m15j57M46R0o26K22K90n61L31K85l77J5N65p58q3P16l11n62Q59l79r9
3271a43K58k15N7L58j93l55L23L11p62M04Q8l05J41K11K2k34K24j48j75K22k17
$$ y = [542, -577, -84, 1543, -910, -1012, 1241, 114, -1131, 533, 530, -250, 454, -87, -885, 977, 484, -1304, 133, 1223, -763, -688, 884, -167, -130, 511, -853, -174, 1194, -596, -1014, 1243, 311, -932, 103, 288, -514, 572, 69, -797, 724, 595, -1124, -149, 1223, -383, -589, 389, -263, -151, 852, -693, -252, 1352, -488, -1132, 749, 271, -602, 198, -66, -405, 322, 190, -637, 362, 577, -885, -88, 860, -409, -384, 461, -554, -57, 737, -586, -450, 1032, 49, -635, 412, 151, -448, 94, 70, -342, 384, -61, -680, 113, 370, -603, -279, 450, -240, -165, 305, -141, 31, 117, -238, -163, 430, -72, -717, 250, 91, -298, 214, 10, -142, 366, -49, -206, 240, 330, -296, -74, 216, -345, -14, 271, -106, -91, 474, -284, -367, 349, 38, -524, 335, -44, -143, 115, -100, -43, 315, 122, -233, 90, 401, -361, 43, 131, -174, -33, 178, 200, -34, 190, 42, -133, 89, -128]
3292a28j7O45n27p3K8J50k16O7l1J9k9K48n4p9P5J08j53N9m0J58j16r0N8N5q0
3317C7j93K41j05l7p8L22k03K38k39Q0k93J82n0pL00k61P5K84l08o6j98K75M1
3340C7J28O2k80J50r3Lj71K71k49J46J86k93L92k22q5kJ99k47O1M4k63K78j41
3363h9Q2kk0q7N8K16k66J58K5ko3l07M44j82O2N8m0K1o7Q7n5K29j74r6K93l27
3389d4o2J61N1k50K59l82R8K08o6j36r0K69J36j62J77m84K36L26k51J69p4j15
3411b6rQ9j34Q5P0k64n8J29K80l19J57J15l80J57L13l43K17Qm43K53J81l97J16
3434b03L68j53rL19l72j1L28j75m50L52K52m02K61j25j88L20j2j90Q4M16p20J02
3456b08L16k46J08L52m82L21J72o11J61M70j98m12N30k7l86L45j67j45K58o7m45
$$ y = [-128, -145, 500, -27, -100, -72, 78, -138, -71, -102, -83, -112, 136, 82, 3, 78, 186, 33, 92, 52, 210, 94, 4, 62, 117, 37, -156, 85, -20, -57, -135, 187, -16, 222, -17, 63, -230, -48, -98, -105, 195, -66, 9, 293, -15, -81, -279, -4, 37, 165, 227, -53, 97, 4, 7, -164, 107, -142, 4, 190, -103, 289, 67, -18, -20, 179, -68, -7, 37, -226, 52, -89, -7, -9, -29, -116, -58, 158, -108, 50, 75, 73, 10, -297, 147, -35, 27, 85, 45, 66, -1, 86, 31, 260, 86, -10, 283, -44, -106, 55, 106, -144, 115, -267, -169, 39, -27, -163, -253, 16, 152, -10, 167, -317, -81, 245, -6, 163, 89, -26, -35, 54, -80, 5, 75, -189, -247, -118, 162, -157, 0, 115, -265, -108, 205, -138, 79, 87, -356, -103, 78, -319, -203, 165, 12, 3, 322, -50, -61, 267, 92, -358, -6, 246, -156, 105, -20, -208, 112, 100, -90, -6, 410, -310, -208, 108, -138, -30, 322, -160, 161, 333, -278, -117, 353, 155, -257, 273, 246, -140, 205, 38, -107, 151, 84, -361]
3477c61M63L73o91Q8M18k31jK94m19j40L20n31K21L91k4n04N28j50k41M34J02
3498C39n90K34N35r45L05P13p84J38K32l94J07L83l18l83J011o07j70Q02j91r44
3518e27O10rk23L21O8q06Q11J57q81N29O69p97k03O02n72L9M91n59K5N95l91p12
3540g63R66J60q06N02K43l64K76k47k94L57M20p14l9Q18o95j89L25k39M07J85
3560C09n19l42J268p59l07N60R2o12K00r6k40O22L2p96O57N81j107J66Q64p38
3580a65k79N09o3k48O49p72k03R08k22q20P77L18m45m0J04j23L89j27r02P85M71
3601E01q45p7Q20k97m9M0m92K80O41m73k77P10l11n75M38J72m79K82N8l50N12
3622B29n7p63O69Q74r43n42M53pj8L07l83N8P10m69m76Q48pp64K88J40k59L02
$$ y = [-361, 102, 475, -216, -128, 290, 59, 58, 352, -67, -207, 113, -418, -197, 194, 170, -334, 194, 44, -197, 237, 339, -251, -17, 518, -427, -122, 591, -193, -55, 177, -217, -110, 273, -45, -428, 583, -24, -194, 608, 417, -527, 83, 74, -149, 172, 240, -566, 245, 402, -479, 50, 719, -78, -281, 321, -251, -212, 279, -280, -255, 340, -51, -763, 203, 363, -443, 59, 302, -62, 214, -33, -327, 30, 450, -264, -303, 515, -180, -369, -44, -283, 124, 309, -210, -552, 716, -43, -350, 210, 302, -310, -110, -206, -446, 176, 208, -588, 69, 650, -457, -291, 573, -165, -444, 65, 2, -246, 403, -369, -572, 336, 114, -706, 71, 389, -56, -96, 8, -115, 274, 147, -755, 30, 501, -344, -421, 399, 102, 53, 93, -399, -119, 522, 49, -228, 482, 171, -404, 34, 206, -273, 9, 67, -283, 229, 172, -591, 78, 952, 9, -533, -80, -87, -105, 202, -181, -123, 587, 118, -358, 490, 483, -281, 7, 147, -112, 190]
3644A90j51n15N75J37p88L82O03o75n7N35k63p0L84o58Q8N72l58p42J040l3n60
3665c64L23J01j55K63j00n13N88L90j193O24M58o11J77J02j07k13L69l95J98N77
3685E19l82p16N73J64k07K29j96j74O70l70k88J71J63m99J14N67m03l43N48l45
3705b05n8O29m74l85O90j18l66L06J59l18Q0J80k94J88L3k18J58M13o31L0K44
3726D3j94M46j36l07J70K12k15j86K65j4j87L11J55o13M01P7n49Q6L07j30N1L33
3748C26l20j6J70l70L93p6j84J92k28k0j59M95nj58J10j51jn3q7kO6M63m38J6
3772c7O2N3m8j0M9j03K90l19j5K10k9j53M3R7l21J94k0L7q6K77k41J08n6m1P5
3797A6K94l77j07K8K61q1r0l7L4J45Qj39O7r1L6M8N5j05L9L6J87k71j29J76N7
$$ y = [190, 39, -476, 99, 236, -552, -170, 433, -242, -299, 236, -27, -97, 287, -371, -283, 289, -69, -811, 229, 196, -364, -41, 60, -95, 168, 68, -445, 143, 533, -660, -36, 422, -189, -12, 90, -17, -230, 139, -256, -58, 519, 137, -579, -6, 158, -49, 180, -16, -190, 480, 110, -178, -7, 156, -343, -229, 338, -65, -408, 140, -205, -263, 366, -108, -493, 197, 79, -287, 19, 178, -140, -60, 120, -174, 14, 47, -171, -13, 400, -231, -201, 43, -151, 295, 159, -148, 22, 234, 19, -167, 98, 84, -103, 208, 363, -250, 151, 228, -321, -235, 72, -58, -7, 326, 6, -10, 160, -210, 183, 107, -77, 115, -113, -133, -292, 203, 198, 40, 150, -1, -2, -55, -142, -144, -78, 385, -53, -37, 25, 78, 30, 20, 69, -34, 256, -63, -78, 132, 103, -50, -7, 90, -231, -37, -57, -20, -106, 171, -70, 38, -18, -59, 16, 310, -67, -174, -146, 115, 34, -56, -93, -59, 86, 94, -45, 22, -69, -33, 15, 70, -35, 4, 40, 227, -44, -173, 3, 60]
3822F0j06j3J06M4j7k5j7k92L50L6j42J56o7j81J71k7R5l78M55p2k03K3p3J64
3846D7j58J00J47j39J1q1J18n8m5Nl9p3J45Q2j80J07j03M6j45M25k75K43k85J73
3870F8j02J5K58k56N5RL10k43j03J52k15J19r6j19J14j96L27k43R2J23N2j45k68
3893b92L35n8j10K77k50J82k34o9N8l4L97K0m5J45m34J32J02n8K2k6j12l1P3m
3917a4q0j88L61j10j01k5N2L80l75R2j32K65m3k05L15l95K97O0j22k59K61jn3
3940b0j15m5p9N49m98J66Q7k05LK38j39L8k60K25J90j77K45k64k0m0M30l45k07
3963b43J48J7m7J87j60L54q0k74J26J12k0k30K38o3n6q7K01j03j69j4p5L46k53
3986a45M6K57%j88j21Q7k96M11j42J04k36N27j93k22N6R1M2k8j02j41M78k67N3
$$ y = [60, -46, -59, 47, 91, 74, 49, 32, -260, 90, 126, -16, 140, 73, -108, 63, 36, 131, -247, 208, 136, -67, -44, -117, 47, -111, -11, 136, -3, 8, -73, 45, -13, -58, -53, -92, -165, -20, 62, -118, -11, -114, -68, -213, 212, -63, 180, -105, 68, -34, -19, 239, -17, 38, 47, 357, 114, 11, 163, -52, 67, -29, -148, -34, -230, 97, -146, -54, 69, 121, -24, -292, 43, -15, -125, 152, -98, 84, -150, -219, -161, -195, 202, 222, 177, 322, -112, 20, 122, 64, 86, 60, -52, -83, -10, -14, -94, -282, 79, -31, -132, -157, -105, 275, -100, -8, -140, 125, 82, -123, 192, -203, 94, 154, 32, -227, 34, 33, -20, -135, -180, -259, 290, -208, -42, 45, -160, -157, 81, -58, -20, -280, -55, 135, -42, 203, -61, -81, -121, 309, -36, -243, -95, -78, -125, 62, -98, 256, 176, -98, 28, 140, 120, -110, 128, 65, 9, -78, 123, 20, -149, -163, -238, 108, -145, -99, 158, 158, -30, -151, -64, -360, 51, -91, 13, -223, 304, 111, -111, -55, 36, 78, 50, -52, -193, 285, 18, 71]
4009G1r1n7J79j98J6J28j7K3j28K03K9j72J6J12O2m69N78l22K02nk75J91J42j50
4033F8l4O7k0J18m34K71r0J0L3j25P0J99l08K18n3J34l86L83j65j86J68O1p9K81
4057B01j7k49M6Q0p5j29J55l20M36O2k90J30J62l88j5K79q6m3J11j14j9K85j26
4080G6l71K53J53j88J2M7j29Q0L02n25K83K63p06L87K87m71Q0J87J25j83K09k56
4102h5j14L09k9j20JK88l51l0K29m5j81M76k84k63L68l47K8L26k26j43K90k29
4124a32J90K80n95K35M50l06m48K28K94l27r1L45k78M09l02J4K57k2m27Q7N50
4145D11l44j4K6j15K12p3k30j5M00k09M5j5j11L1n4N9o1L7j70J11K31j26n4K2
4169fJ41K5l50K35Q8J03M1k87n4L10j44l52R5J60l4K16k00q1k85K30K6L5L04l96
$$ y = [71, -20, -77, 102, -96, -80, 48, 31, 54, -74, 129, 158, -14, 2, 114, 176, -293, 285, -37, 165, 160, -115, 76, 218, 68, 34, 101, 81, 199, -235, 36, -54, -44, -11, -136, -66, 133, -175, 43, -10, 124, -262, 121, -44, -230, -62, -1, -80, 201, 184, -65, -19, 61, -14, -143, 12, -308, 128, 190, -100, 30, 192, -196, -211, 68, -18, -61, 50, -64, -83, 202, 76, -295, -42, 111, -77, -65, -18, -147, -67, 235, -290, -7, 256, -450, -63, 224, -247, -167, 20, 145, -38, 171, -85, -199, 110, 81, -39, -38, 250, -101, -131, 98, 53, -128, 348, 64, -199, 169, -178, -150, 176, -50, -193, 97, -132, 58, 338, -257, -22, 428, 122, -326, -98, 196, -131, -222, 123, -155, 254, -48, -34, 223, 201, -226, -139, 411, 67, 53, 79, -36, 176, 103, -127, -142, 258, 49, 94, 79, -32, -1, -55, 4, -57, -20, -190, -79, 152, 26, -28, -6, 135, 160, -190, 45, 133, 236, 277, -10, -64, 246, 102, -250, -155, 5, -29, 187, -13, -94, -379, -149, -123, -88, 216, -180]
4193a80J70M3l9r8L86l23o5L30j77j31J03J05m00J24L22k41Q9Rp4j84L70j97R
4216d9O8K1l21K11K5K8k16L78p3k06O6j39M07k01l10K34k15K12J69k65J80O3J12
4239A79j55k55K28J37M2j49k9q1o9L58j74l5j48J98K02Lr9l30K29n7j15J4K5J63
4263H2j91j3K28k97J44M2K94l14p2J54K6Q1r5M1k29J96J31l30J25J20k0o2K82
4286C23m0l98J65j9j02K57j46j60j62L56j56P3p4K67k77L8K41j83K61k30J38l86
4308b14J65k8J13J15j64n7J46j01L3q5j9K12nj91J26mo4k44J07K66R8m3k63JN9
4333d1o4P7p0J70Kq4N3n3m8K38J20m88K51k6m43L78J16j53q1L26k37P2l5j22M44
4358C02j08j0k36L3L2K12l89K66o7j0KJ01n41K93J74j23k6K28p2K4j58K82l24
$$ y = [-180, -10, 33, -6, -104, 282, -41, -106, 224, 47, -84, 19, 124, -276, -152, 170, -71, 18, 27, -47, -231, 139, -58, -49, 19, 40, -281, -70, -45, -17, -233, 145, 72, -134, -68, -207, 200, -1, -311, -77, -292, -80, 89, -176, 4, 67, 179, 24, -231, -3, 134, 176, 27, -2, -83, -152, 206, 32, -3, -151, 47, 249, 252, 153, -177, 52, -5, -120, -106, -81, 82, -109, -122, 106, -191, -47, -5, 289, -25, -97, 57, 83, 164, 69, 110, -119, 77, 208, -122, 3, 123, 103, 41, 323, 283, -115, 50, 31, -71, 186, 40, -120, -282, 74, -82, -9, -83, 184, -93, -55, 186, 3, 264, 34, 172, -214, -49, -77, 36, 151, -13, -70, 76, -25, 8, -77, -96, 116, 111, -80, 46, 42, -22, -266, -159, 107, 205, 162, -101, -100, -41, -105, -28, -98, 72, 74, -10, 43, -10, -58, 180, 300, -188, 63, 37, -406, -28, 88, -65, -146, 180, -57, 15, -20, -142, 302, 194, 184, -52, -19, 13, 225, -164, 102, 35, 25, 27, 128, -413, -120, 54, -69, -95, 133, 61, 85, -73, 209, -115]
4381a15P6p1k5J76mO9p8Q4n2n9K71k10j1j58m5L75l68L1J46j8N8l04M8q1P1J96
4407BL0Pj00J56k38K97k58J16K39l33N1K74L3l79J89J49j71J5k08n9R3M9J18q9
4431a7q1l0J08O9j91N0L04j84m7O2r1j63n3K94m6Q8j66J49n9P4k0mj1n8j14J43
4457Fo3J30J24j14m57L81J09k25m2L72k54J99k26j1j17LO7O4K71J15j90l59L53
4480A36J24l45O4R2k3R6R7l96K19o8o6J66l51K59J71k86Q9K26k54o9J44l4mqJ9
4505bk9P4O5j19K2K09m78QK31K71m85j8M55l94K41J92j14o5m0j18K70K4j68M3
4529G5j47p8K0k0O3J28j11l6J03R5r8l75M17J8r7Q0p9Q8K8j83L06k60Q7k67K51
4554Hj22K60Q8j82j46J37j67mJ36m3J89m18L34k35j05J96J47j45k10J76K20k40
$$ y = [-115, -39, -110, -135, 41, 37, 106, 28, 112, 60, 1, 272, 62, 51, -107, -152, 223, -145, -114, 32, 14, 72, -232, -184, -265, -194, 2, 32, 39, -61, 95, -143, 154, -104, 12, 251, -82, -31, 243, 276, -103, 86, 235, 64, 79, -129, -188, -95, -46, 72, -17, -98, -128, -20, 49, -142, -92, 212, 28, -19, 43, -48, -211, -264, 30, -16, 72, -94, 55, -4, 70, 50, 46, 35, -23, -137, 6, -57, 73, 197, 83, -374, 7, 116, -109, -151, 221, -33, 166, -60, -71, -188, -185, -118, -54, 217, 332, 142, -217, 136, 260, -85, -21, 71, 48, 144, 241, -155, 64, -4, -70, 96, -255, 4, 175, -111, -22, 204, -50, -119, 25, -9, -13, -21, -2, -31, 43, 108, -11, 11, 220, -258, -250, -19, 252, -233, -251, 204, -190, 51, 243, 129, 64, 24, -94, 176, 200, 32, 75, -72, -150, -130, -150, -87, 41, -70, -106, -3, 92, -6, -381, 36, 54, -43, 37, -42, 46, 74, -109, 197, -63, 24, -243, 8, -114, 146, 234, 52, -94, 43, -124, -128, 8, -35, 154, -264, 70, -165, -270, -74, 73, -72, -282, -106, 114, -126]
4576a26J92k6J71L1j94q5J80K67n01M9M7K6k2J04k5J7l02J80K01j77j38p7J65
4599d3j54K59O1r3o6j42K10R7k51J21k7k7J2K12Q8k82Q7J99m15o4L13j21L6J10
4623A20k16J69P4k69K95m8n8O6k52JM7K42l63J39K71j90J09l43L59r7k21r8K40
4646b3k24K99L72o38K92m7J6O9j81J05P1l40L49J59j78p9j64J60J17k19j53K88
4668E1p3%j42K55R1j34k27K15l2K24m51J73k8p3l9p4R5K84k39L72k40k27P1lj81
4693c32K87l7L7M0J63l68J94Q7j28J45j65m8L1L15J41m81p5M06k92r0K19o6N0
4716C3j59n0Q4J5Q7J24k61Q4K40m24J32k7K08l6O1O8J46m35L80q1k06JM4qJ21
4741A41j18r0l0L43l00J66j68J53k86J46r7O5K2J62k02j5m8m9K41q2j2M1K0j8
$$ y = [-126, 66, 40, 211, 242, 48, -37, 143, 410, -91, -42, 5, 31, 9, 113, 88, 105, -197, -17, 184, 7, -131, -208, -43, -197, 62, 123, 30, -36, -178, 32, 129, -122, -1, -28, -55, -43, 169, 257, -25, 62, 261, -154, -218, 95, -26, 10, 120, -96, 73, 147, -122, 173, 125, 67, 133, -119, -118, -71, 171, -192, -53, 218, 28, 137, -206, 153, 56, -165, -263, -23, -247, 52, 424, -214, 78, 31, 47, 116, -65, 40, 111, -229, 120, 279, 101, 22, -142, 18, 135, -84, -237, 51, -22, -22, -164, 91, 182, 48, -179, 36, 4, 228, -223, -50, -78, -151, -190, -264, -169, 115, -124, 248, 8, -219, -148, -151, -332, -45, -82, -45, -5, 158, -210, -16, 71, -57, 88, -77, -125, -94, 221, 362, -119, -194, 212, -80, -170, 49, -17, 33, -126, -176, -92, -77, 10, 134, -127, -43, 197, -227, -95, -122, 86, 50, 111, 179, 325, -110, 270, 189, -17, -16, 28, 20, 141, 23, -67, -97, 246, -54, 112, -56, 97, -189, -43, -140, -75, -53, 109, -93, -108, -156, -205, 36, -46, -58, -17, 3, -15]
4765a5K10r3l8m3J0J45l92J48J63k26J26p8Q9k0j99J98n4J6J9O7j86L4J33J69
4789A83j39k13J99Nj33M7l2J0q8K59j99K06r9P2k62K99j52R6k62J11j15k9N28
4812B92n27mL01j72k5P5J55j62J48k38K44l1j42j1P8jl4p5J77O4j78q5R0Jj22
4837a82L57l6k36P2K40Q0j86j24J4j71Q8K17l62K19J71n8o6k02K34jj46O5K45
4860B32l97J31R9p4K71n02M10Rk79M6q6L02j62j55K05r0Np4J42J26m50L42l71
4883c20K67j3J1J24j84K61k61j64L16k51O0J24J73j39r1k2L10j71n0J83j67J6
4905A2n6K42k16j41J87j36%MJ00r4Q0J64m6j71J90j54n8r5k4K06j08q2M8j27K23
4930e2N8M3j6m5m5J75J60l48L9L73l96j0J45l6N1lk09l4K7L44l25L84k19q6m4
$$ y = [-15, 195, 102, 64, 21, 31, 176, -216, -68, 95, -131, -5, -83, 6, -14, -213, -15, -69, -53, -34, 33, -153, -119, 14, 183, 44, -169, 30, 35, -98, -51, -83, -73, -161, 98, -101, 105, 6, 78, -184, 115, -37, 59, -203, -92, -207, -236, 292, -235, -239, 62, -110, -135, -60, 95, -67, 81, -157, 87, 56, -86, -97, -19, -20, -54, -129, 48, 112, -66, -151, -61, -60, -182, 175, 139, -97, -25, 215, 295, 109, -15, -1, -172, -84, 133, -229, -10, 161, 103, 37, -165, 69, 68, -78, -13, 232, -165, -34, 65, -9, 262, -240, 170, 179, -100, -54, -140, 162, 0, -155, 50, -40, -35, -109, 33, 159, -291, 51, -320, -53, -66, -55, 69, -115, 146, -115, -279, 37, -214, -154, -30, 143, 4, -87, -109, 201, 30, -20, 163, -4, 12, -44, 198, -18, -159, 28, -108, -108, -104, -4, -98, -18, 146, 100, -71, 119, -35, -93, -188, -212, -6, -114, -196, -148, -275, -52, 6, 49, 33, -12, -57, 118, 278, -70, -31, 342, -54, -64, 81, 45, 96, 93, -116, -150, -123, 221, -104, 280, 61, -25, -69]
4955f9K63j71j2R3k62M34l94J76J03J17l42m4J16pJ64l05L8K65l44J29rJ2J12
4978F3l05K13m4P2NMj1J02kj73l5K51k08K27k72L11k94J44j31J13j45J01J76j23
5002C9R7M0p2j8P1l41R7j9P6k9j9J06m8k31M4J63O7j50k17M03J84k23PK29n11
5027b55L23o4m5Q5J4j47L53k98K8j72J90R8k03L5n7p5J41K46l09L3k72N92n14
5050b73M03j55J22n0j05KJ10m0l09M71k67K33p6j61N2P5L5k83J43K14jj54j00
5073a14L18k51J41rn7J37j61L47j58k73J42j47K31l11P6J59j95J31O9k82K49l20
5095b78J37J2p0K76k59r6M79m71J07J65J20n5J49l24K4J97j75mJ16o9l1K7J67
5118A44J03k63j64J05L0j24J49J5K02k40j05K0O9k31N37J4l43L4J31l62L20K37
$$ y = [-69, 194, 23, 11, 104, -158, 276, -118, 58, 161, 278, -64, -108, 8, 1, 165, -140, -102, 163, -181, -52, -61, -49, 63, -242, -29, -73, -1, 4, 8, -3, 99, 97, -76, -111, 140, -68, 159, -113, 198, -96, 48, -83, 30, -115, -14, 162, 39, 136, 176, 104, 86, 157, -184, -87, -106, -30, -59, -78, 28, -20, -251, -207, -44, 23, -127, -344, 59, 243, 20, 27, 256, -255, 68, 4, -41, 44, 58, -89, 264, -34, -6, -178, 12, 110, -93, -58, -115, -190, -49, 197, -112, -79, -351, 241, -273, 130, -25, 97, 47, -58, -56, 54, 14, -295, 176, -91, 142, 66, -95, -43, 32, 67, -216, -73, 141, 140, -14, -114, 204, -47, 94, 85, 28, 165, 4, 351, 193, -80, 62, -85, 146, -165, -89, 70, -125, 6, 75, -207, 42, -278, -141, -129, -199, 77, -182, -278, 201, -270, -163, 2, 122, 67, 216, -108, -84, 113, -62, -66, 50, -19, -50, -23, 144, 247, -16, -180, -75, -45, -169, -20, -5, 197, -43, -148, -128, -59, -290, 247, 261, -82, -48, 83, -279, 41, 278]
5140B78l35l5j73J01p8M69l05L9ll5K33k65M3K24j50p9J38p2kL4r4O7j83J44J22
5165H3j54j18K72J6k21L08k84j86L05R2r0kj75J87N8k92J40M2J69j48j09m8K33
5188G8q4j12J26l18L07o9J04J87q9kM1r5qk34J74NR5j46J42m4J27k08OJ38j56
5213c5k2J99k00J63j4j24O9N5Q9j76J92k51L82l92N4L21l19n7N6Kn1l7N8J5j33
5238a56M19j7l79j19N6K14J07n3j51K7OM2pj38J58n2p6J1K56j48k2k01J77J92
5262A46k94K33j92q7P1RK8j10K27k9J0Lk34J45M0o6P0o9N9P7L10n78J77R3J89
5287B28l14K46k26J75M8k84J24J4K17j00j7m39K46K93j11j13M6K4Pj29j49J31
5309h3j15K49qk63J71J3k38J21L04P1O5l43K45Oo2mj16R2k18K25o9k31K89J4j16
$$ y = [278, -57, -92, -265, -164, -242, 227, -78, -39, -42, -77, 156, -109, -66, 158, 8, -71, 67, -5, -7, 27, -67, 0, -183, -39, 83, -71, -189, 83, 99, -122, 186, -98, -284, 21, 113, 23, 21, -154, 33, 91, -201, -61, -19, 150, 2, -107, -155, 78, -6, -118, 8, -310, -3, -72, 32, 219, 130, 128, 169, 74, 66, -168, 6, 11, 106, -40, 102, 58, 185, -23, -17, 121, -35, -57, 142, -58, 105, 91, -33, 36, 91, 180, 4, 196, -55, 327, -65, -11, 310, -9, -66, -10, -8, -59, -96, -38, -23, -156, 263, 246, -133, -252, -196, 18, 125, 72, -79, -52, -46, -4, -11, -149, 9, -43, -119, -108, 148, 0, -22, -223, -46, 146, -148, 85, -107, -194, -123, -114, -86, -196, 31, 2, 12, 15, -219, -74, -34, -100, -30, -99, -40, 37, 347, -231, -54, 39, 228, -86, 160, -66, 109, 157, -127, -3, 11, 228, 128, 111, -328, -82, 211, 100, -13, 33, 57, 64, -65, -214, -83, -198, 51, 43, -220, -49, -36, -274, -153, 151, 222, 287, -56, 189, 195, 133, 129, 13, 105, -113, 112, 43, -188, 101, 115, -1]
5334ak79K14J36k04K36k15R0O0k33O5J92j88R8mK07k51K88m8k58k9J36p4K19k94
5358a37J8J19j19J10L1j0j48J4K88k33NJ15r5K24O8j77K8o8N3l86j14L86J0J32
5382A14l1l73l3J48J80j77Q3J10J1k37K12J20m2j30l1K35k7P0j85p6p3K6J32M4
5406G0l92L68K8j22J1j16K72O9m34J86K43l45J18K8j01N2J7O8l2m0J8J87P5q4
5430A44j6j49L9J28l21K06l94M57kj96J69r6m0m1P3M7ml3l4L4l62O64K5j95j0
5455I3l02L20m0k07J57J55l17j05K28L9oj40J84m4J58l0p5kk6q3J9P3j7j36K03
5480I9j93K50k18J29j33J03J12k94K47j73K76K21k85j71m0j06K35q1k35K56J02
5501A01j12j9p3M2J32M0p7k84L37ok14K05k21J19j14N4K38m2j75l6p4K14k3j4
$$ y = [-1, -280, -66, 70, -134, 102, -113, -23, 37, -196, -131, 61, -127, -29, -33, 174, -77, 211, 163, -95, -124, 12, -62, 157, -137, -119, 0, -119, -9, 22, 12, -136, -122, 166, -67, -62, 53, -42, 182, 250, 73, 101, 33, 86, -300, -414, -28, -18, 114, 83, -290, -323, -175, 5, -172, -89, 21, 32, -205, 7, 127, 85, -45, -76, 159, 132, 202, 17, -59, -132, -106, 26, 70, -322, 46, 74, -48, -37, -153, 119, 188, -246, -60, 183, -162, -44, -16, -117, -65, -48, 20, -12, -52, -34, 153, 228, 144, 128, -21, 18, 146, -175, 31, -363, 94, 92, -104, 65, -31, -71, -112, -39, 8, 4, -29, -63, -29, -391, 273, 298, 103, 93, -209, 111, 71, -136, 21, 176, -141, -246, -18, 21, 15, -125, 59, 15, 173, 143, 68, 66, 40, -43, -24, 49, 32, -104, 99, -94, 156, -62, 67, -66, 37, 149, -145, 102, -71, 205, 426, 141, -30, -70, -176, 59, -22, -257, -1, 101, -11, -30, -103, -61, 71, 111, 34, -250, 87, 81, -133, 72, -149, -30, -144, -90, 148, 106, -69, -105, -179, 35, 12, -2]
5525bJ36J09k87j39L76l02m6K09k07k8K0K83k74K42K13m69J22pJ97l58M14l30
5547a28K43j7m0J27k13m8J02J07j34j39J28j92N0K25Kk00J73Oj65L0k0O5p8L10
5571A94l08N2O8M4j53K83k27N2J62j63l5OJ04j61r6J01O0M5j27j45L65j18l5m4
5595g6L11l56J46n6P3o2O9k94M22r0J1K5j54k8K15K03l11N6j96J3J6N0p0J49k60
5620a94J62P3Q8j30j01r1J62l97N95l16J46j20j5L29k69Om0K18m28N91n14K59
5642A4j01Q9rlk2K33k46J34J22o2n0j20J74j68P5r3L5k04K47j3L28k85l16K05
5666c6l8J42m4l0j79J89r3n5P9rK80m1j99j21N1R2j7J37K18m95J80k28K36J32
5690A51j13j71J33j31K14J09j49J0N1r8J04O0q5j79P4J38J35k77J55j18j55j4
$$ y = [-2, 134, 243, -44, -183, 193, -109, -155, 54, -153, -181, -161, 122, -152, 90, 303, -166, -44, -51, 146, -212, 202, -128, 115, 98, 58, 185, -28, -76, 26, 133, -1, -140, -12, -204, -154, 71, 73, -127, 46, 52, -113, -83, -103, -38, -116, 194, -114, -62, 6, 50, -103, 180, -47, 5, 167, 4, -31, -25, 79, -82, -178, -77, -17, 28, -99, -244, 121, 3, -32, -76, 235, -121, 25, -31, 42, -20, 49, -245, 177, 87, 98, 123, -31, -59, 156, 359, 48, 104, -92, -79, -63, -13, -83, 66, -194, -32, 41, 129, -1, -102, -193, -31, -428, 167, -149, -3, -123, -138, 191, -78, -72, -112, 106, -322, 269, -245, 14, -87, 2, -7, -10, -32, 201, -45, 89, 211, 149, 99, -21, 153, -15, 60, -33, 2, -202, 45, 32, 360, 75, -241, -36, -74, 68, 24, -6, -185, 4, -89, -144, -65, -74, 206, 165, -34, -155, -104, -12, -29, 108, 326, -169, 11, -217, 19, 151, 38, -133, 0, -131, 83, 192, 43, 53, 104, 6, 110, 170, 85, -94, -20, 118, 253, -24, 131, 13, -142, -156]
5712a56J54o6r8J96j24O3N3R1m4j93Q0K09R5k68k10J22L0K07j14n9J15P2k23K52
5736A84k16j2k62L90K17m06J79k17J28L37k53j85O2J54j01N3p0L06l18J53j11
5757A2N6q5K03j88M2p5r6J43J56o9ol34K5J98O5J14m11L23n8J55n9j19l5JJ29
5782H7J15j44j24j84L77j03J6j84Q8K18l52J33J59j23PQ5j44j03K38k29L77j49
5804F1o4k31K50J23m09L18l7K23k81J65k03Q6j20L5R5K84n18K12q8NJ69j54J34
5827E5k77M61l79N61m53Q6k87M06k84J28K8j02J74k37N2L9k68K41l0M9J4j87K92
5850H2j51K96n36K15L30l75J6N9J54J9k08Q6L6p4R3k8J25j22j2j10J24j01O2O6
5874D6r8r4L80l54kM69n02J89J92l18Rp6J76R4k76J44j10J88j78L16l03n5J76
$$ y = [-156, -2, -68, -166, 30, -94, -31, 22, 113, 69, -124, -44, 165, 260, -8, -218, -96, -66, 141, 27, -32, 83, 155, -68, 184, -32, -44, -306, 84, 301, -105, 74, -143, -15, 322, 69, -116, -54, 100, -1, 52, -18, 288, -30, 123, 12, 68, -17, 186, -2, 40, -35, -131, 12, 168, 99, 93, -241, -216, -18, 47, 161, -250, 73, 15, 170, 111, -8, -43, -42, 87, 202, 58, -66, -250, 127, 24, 40, -144, -56, 162, -190, -57, 102, -21, -14, 71, -73, -176, 62, -167, 210, 61, -3, -234, 16, 139, -270, 48, 11, 234, -47, 118, -85, 1, -119, -84, 11, 295, -223, -11, -99, -94, 75, -79, 55, -222, 239, -140, 421, -32, 54, -233, 173, -111, 17, 45, -57, 117, -120, -68, -29, -297, -56, -86, -37, -23, -210, 82, -69, 227, -309, -94, 236, -139, -123, -64, 90, 109, -99, -13, 23, -51, 42, 14, 139, 17, 5, -105, 19, -82, -20, 46, -52, -146, 234, -120, -122, 347, -155, 34, 226, -92, -83, -159, 17, 111, -165, -21, -131, 57, -121, 195, -108, -163, 13]
5897A3k2oM0M9r9N5j16J78l8k10J63p4j37J42j00J79j25K35j20j06L54j46j7j36
5921d4Jj3j19K79l62L74j57J05n3p8l7O2p1K14L8k04P4l1K24k07J15j42J3J52
5945A33l7lJ9o8m7J20j48km4O8M1k12K09j8k24M14m2r1R4K8l84L80q6L2o9P1p0
5972F4l9l01J23M5o8J63J5L6p8P5J72j49q1m2O7m2K6o5L7K84j93J6J58j67p2M6
5998C0Mj93R2J5N8K68m41k2J88J34k59J65n1J92k73J21M7p5j57j08K90j36J15
6021DMj85J45NK44j64j04L7J45j13k19L97l07n9K48J39k91J4K01N8k55J94k96
6044a58R0J90J40k77J1J44j0j59k34r0N51j33KJL9j00J18J10k76M3j4P9J87k90
6068c6R9j69L9j14K41p7K09k19J54r4qJ99l87R7J10o8M2k1NL7Q0k68L34r9j24
$$ y = [13, -9, -15, 25, 74, -25, 30, -86, 92, 54, -156, 7, -67, -204, -62, -162, 17, -108, 127, 7, -99, 255, 109, 92, -44, -43, -56, -175, 104, -258, 116, -41, 64, 11, -67, -104, -42, -113, 101, 139, -65, 9, -22, 202, -5, 110, -32, -19, 133, 96, 93, 112, 44, -3, 117, -31, -33, -77, -9, 32, -180, 29, 11, -213, 201, 159, 68, 162, 190, -194, 186, 100, 132, 63, 134, 64, 25, -276, -153, -108, -176, -13, 2, 38, -40, 35, 207, 58, -23, -65, 2, -40, -14, -79, -42, 242, 49, 65, 223, 56, -16, 30, 34, -159, -67, -52, 6, 274, -167, -189, -1, 133, -126, 39, -12, 180, -93, 28, 75, 0, -157, -265, 25, -111, 4, 8, -177, -32, -27, 217, 53, -51, -14, 131, 18, -201, 196, -111, -170, 78, 217, -74, -60, 141, 199, -56, 138, -158, -68, 122, 262, -15, -4, 140, 130, -29, -263, -353, 198, 65, 67, 68, 107, 7, 125, 235, -41, 2, -12, 67, 254, -36, 63, -106, -67, -181, 60, -17, 192, -27, 127, 33, 25, 224, -163, -66, 44, -24, 18, -3, 2, 39, 119, -149, 185, 86, -38]
6093c8J72m01L66j82J60Oj02k88K10J07j90L89l58J84j83J45K1P6k02j6O3K21
6115A60k28k1NP2m1M9m4M5J4K7j36R5K0J6O7j61K1K1R8m4Mj57M5P2j89J02qP4
6143b2R7J27j20%jL1k11K36r8j86Q9k9L6m2J57N0o1k44J70o3P7j19K09j40J68
6168A11k58j1r6L74J3r5J51l41J90J48j34r5O1J4J85j16n2j43R0j90L31j97J42
6191H2k64K36j06L9K01k43K10l75K01%q0j32L16j67j55K28o1J55p1m5N7R7j71
6214d8LK15l77J92j25K02K02j73Pj49j32KJ69r5M9J39j64k3j25K31J02k0J30k75
6238f3mK31j25J26o4J09n7l21J21j76J98M5K85k55M8P4k72O0J65j28j84K04k4
6261go4M7o4q1L48n6o1l57J58K92l10K64l9O2k81M91m25L44l52L75l19j33K40
$$ y = [-38, 134, -267, 99, -83, 77, 83, -19, -307, -97, 10, -180, 209, -149, 35, -148, -3, 18, 94, -108, -124, -61, 160, -68, -89, -84, -12, -53, -4, -48, -3, 11, 38, -98, -3, 17, 33, 100, -61, -40, -19, 79, 35, 39, -118, -73, -1, -190, -88, -96, -22, 75, 202, 82, 82, 81, 112, -99, 137, 39, -147, -58, -87, -51, -93, 64, 114, 53, -191, -21, -84, -7, -126, 83, -57, 111, -147, -158, -254, 120, 133, 38, 189, -152, 38, 186, 52, -43, 18, 32, 217, 101, 49, -94, -4, -194, 137, -60, 82, -182, 54, -52, -13, 188, -55, 155, -220, -19, -19, -99, -231, 85, -82, -237, -9, -70, 85, 14, -31, 26, 123, -48, -45, 170, -207, -15, -140, 62, 264, 91, 98, -51, -183, -181, -12, -107, -58, 81, -83, -106, -231, 0, 102, 82, 212, -63, -67, 164, 39, 165, 101, 210, 153, -168, -47, -223, -25, 20, 305, 50, 98, 172, -100, -40, 125, -3, -187, 17, -7, -71, -24, -88, -169, 179, 123, 62, -295, -137, 155, -155, 109, 70, 132, -149, 342, -83, 261, -91, 284, -35, -168, 72]
6284G2k36K73k80K32j67O3k4K59l44j4J67N6o1Q1q3R2N7j13M0n9r9K68r5P6k71
6309a10L31k84P2n1Q3j38R8J86j83r1n0J76J4O8P2k12K0J36j87J18j77j24O4J15
6333e4J17q6p2J69k47J34J14k7N3j69K78l56J88lJ34j26m6r4lL0j62J69O9j38
6357a28qp4N1K5K4l0K45j0r1J07M8r1L0p0j15L7MM2Q8P3j85J1j60M5J15r7J96
6384H2j75J5N1M4o7r0J02J85o5J7L6k36j10K67K89j02r0j33Q4j20J29n9j64J34
6408B4J08j83l7J95m24M14j3j22K9q1K73j57L6k13L32j93P2j14j78K10J60k50
6430a12L3J89K28k26j34j31P6j33K04K5j9k58m9L17j31j02K23J30k32k74K52K63
6452A39m49J74j93K57q0J63j39R5K34k22O0rk46P8K18k02J26o6J0J23n1m0J66
$$ y = [72, -164, 109, -171, 61, -106, -43, -67, 192, -152, -166, 1, 57, -4, 77, -6, 86, 143, 30, 70, 11, -88, 180, 85, 161, -110, 221, -63, 9, -42, 41, -97, 1, 187, 4, -87, -137, 39, 53, 121, 193, -19, 1, 137, -50, 68, -109, -233, -169, -54, 63, -23, -95, 74, -173, -39, 75, 48, 101, -68, 210, -146, 42, 39, 173, 47, 1, -93, -96, -66, -228, -59, 10, -128, -136, -210, -159, -134, -110, -140, 105, 95, 4, 111, 159, 68, 98, 28, -87, -50, -46, -4, 84, 157, -28, -17, -177, -132, -17, -114, 82, -93, -78, -27, 17, -50, -140, -38, 147, 82, 99, 135, -101, -211, 56, 345, 243, 153, 20, 104, -16, 113, 54, -110, 24, 132, -51, -88, 107, -317, 97, 84, -38, -9, -90, 183, 26, 62, -151, 181, -12, 60, -54, -232, -22, 138, -112, -79, 110, 338, 112, -22, -153, -77, -210, -6, 19, 0, -258, -307, 10, -121, -223, 0, 130, -102, -376, -124, 139, -310, -136, -329, -72, -152, 11, -128, -33, 201, -21, 39, 30, -216, -138, 80, -122, 4, -62, -52, 71, 20, -20, 146]
6475A46j83k2r5L44j03M8k42J08J50l37L0O5Q1L0J21k37j34L73j71J45k68J64
6497A3j98K4L13Qk30J95r9J36j15K8nOP3r1k90J93j29L89l74J49k3J89l6n0r4
6522a8M6q6j25J11l0L1o3NJ74J1k63J66K50j62J8j66J34L4k10K49Kq7P1k04Q6
6547b6j29J84l3j3j30j47L94O2l76R1L39j46q4P6K3l15N11k34k14J58J19l4j81
6570a05JL03j94LRJ66q2J4L7J98n90J84L03l79Q1P7o0K07j07k26m0K10J83l8k00
6595d5J91j31K6K2Q7j28J4K9N4R9j64L1k62J89Q6k0Mk97M14j62j75J0O6L6K42
6620B16k19l6J9O1kk60K82j9k3R6Q7n0j95K10l71L97k87J45P2N2l56Q5M4J52l6
6645F4j78N5K09j1rl9L3q6j72P0M6n5P5J0l3j55m3j7j65L19N7R5j20J04l13K01
$$ y = [146, -37, -59, -154, 190, 87, 135, -107, 1, 151, -186, -156, -91, -10, 20, 141, -96, -230, 143, -28, 117, -151, 13, -185, -161, 152, 160, -70, 125, 26, 162, 47, 75, 70, 76, 149, 58, -232, -39, -168, 221, -153, -4, -27, 162, 126, 76, -18, 28, -58, -183, -72, -102, -71, -134, -129, 45, 56, -207, -41, 209, 47, 65, -101, 33, 67, -143, 106, 108, 21, 92, -112, -26, -155, 29, -4, -17, -147, -294, 100, 162, -214, -123, 216, 70, -14, 62, 85, -230, 281, 47, -167, -9, 110, 76, -105, -104, 199, 5, 8, 17, 183, 101, 115, 152, 350, -240, -56, 247, -132, -51, 26, -34, 173, 66, -160, -200, 10, 193, 155, -45, 146, 15, 41, 63, 150, 22, 36, 65, 119, 218, 54, 85, -177, 12, 98, 78, 82, -215, 199, 37, -138, -128, -62, -26, 216, -3, -39, -20, 41, 39, -221, 61, 42, 19, 115, 202, 152, -43, 167, -204, 193, -94, 51, 123, 175, -181, -96, -52, 100, 64, -114, -59, 150, 139, 130, 91, 124, 38, -134, -64, -18, -73, 2, 12, -21, -176, -219, -236, -401, -82, -25, 70, -50, 54, -259, -58]
6671e8j66R3K90j25n6l21L75J32k3j85L9J4N8q4jj01K62k25J15Pl36L62O5j45
6695a4L55k2l48j58J08O2K69n14J54O6j43R1N5O1o7Q7j06R2l14N45j34K8j69J9
6719CJ09L6k02K02j0j25M2j13J5P6N8l65K51j28K73P3l69K12j37N5M8j03j95M13
6743A19j45K63l95N1o6K81k66R3j8n5j10J65M02k31r9pK48r6l83K71J3R1j37j1
6767b2R8k50L8L8J10p2L29k14K99l35M3o4J09j03J03q9l35M15O2j70j03L63k91
6790d1JN7J64k99O5R6l4m0p5j31L71o3j11J54o3j06mmN5k22K00k60K70Q6m0k02
6816a76K79j37j91J34L55l16J45J5Q7j41j12j71K16j57K35l7j9L4p4N2KO4j98
6839a11J30J4k8k44K10o0L24k79J00j18N1JK68k22j67L81j24o7J19l63J7R8n1
$$ y = [-58, -224, -131, 159, 34, -22, -343, 32, 164, 141, -44, -5, 9, 67, -17, -18, -119, 143, -82, 33, 40, -296, 66, 131, -14, 341, 319, -29, -187, -79, -17, 252, -262, -108, -42, -185, -94, -39, 22, -45, 42, -64, 28, -286, 259, 125, 153, -16, 3, 112, 148, -54, 148, 138, 13, 55, -58, -43, 33, 91, -274, -23, -151, 122, 195, -174, 38, -99, -44, 4, -99, -294, 119, -26, 237, -158, -107, -173, 108, -158, -65, -83, -138, -248, -83, 319, 88, -11, -18, 230, 134, -249, 22, 35, 126, -11, -22, 76, -174, -136, -98, 12, -60, 269, 55, 354, 19, 62, -2, 107, 4, 107, 18, -317, 98, 160, -10, -113, 250, -41, -40, 17, 181, -118, -53, 43, 9, -31, -106, -237, 134, 71, -40, 114, 51, -55, -59, -63, -8, -230, -30, -290, -20, 66, 26, -176, 103, -34, -225, -91, 264, -52, 93, 108, 195, 54, -58, -229, -13, -170, 65, 28, 9, 43, -31, 21, 23, 87, -111, 19, 33, 5, -239, -29, -89, 235, -44, 56, -62, -11, -10, 258, 36, -131, 250, 126, 59, 178, -185, -168, -70, -121]
6862a21K67l10K58K7k3j37k47N16k60j56J05L5J46r5o4r4K22j9j44N7O4J56l51
6885a68K63l19K79j80j1J17K39j08j54k46J29K24j3l1N2j66J67jJ55k6k37J15
6907H0k11K86Q6j73q4J24l00J22n9M12j92m1k35Q2R3J0o8LK26j74pNK20l70K03
6932C8K03O7k84j10Q9o4L6j79J79P7o5k34L53K9J21j75l3j13J2R0Kj72J30p7J73
6957I3k18k20L95P2j56K9j29J42j06k4O3Q5j26o2L82p9l5J97k45j78J44RJ65k69
6981g1q9L42o5j93M5R7J90m11K27l4K4m8J01p4J03k59L43m38J98K0k79j14L78
7004gO9R3n3j46J42j08Q0j54J01o2J68J29l81K41j87J12j00r5J18J45n9q1K82
7027B47k47p8M2m7L5L22j28j78k6J39L8j57Q1q5N0j43j87L07Pj79J65j4QJ1j25
$$ y = [-121, 146, -164, 94, 121, 98, -39, -286, 230, -30, -186, -81, -46, 100, 5, -59, -153, 69, 50, -94, -37, 27, 183, -168, 95, -224, 55, -125, -136, -19, 220, 112, -42, -288, -159, 65, 52, 21, 73, -93, 74, 73, 228, 202, -35, 80, -131, 155, 241, 68, -16, 108, -192, -70, -129, 283, 91, 50, -185, -103, -10, 0, -68, -65, 161, -13, -20, -15, 205, -165, 38, 241, 308, 24, -86, 3, -61, -25, -204, -25, 52, -13, -247, 106, 135, 256, 81, 48, -65, -53, 37, 39, -133, -3, -80, 93, -125, -345, 50, 122, -34, -5, -134, 8, -98, -122, -59, 26, -100, -162, 220, 141, 106, 303, 58, -120, 24, 33, 198, -71, -160, 182, 117, -76, -31, 66, 256, -155, 72, 38, 62, 14, 115, 41, 144, -115, 228, -210, -12, 8, -271, -385, -7, 62, 155, 102, -44, 98, -10, 70, -84, 17, -45, 123, 252, -129, 112, -75, 37, -63, -158, -40, 105, 46, -35, 247, 0, -78, -36, -83, -48, 274, 146, -32, -58, 81, 119, -38, 43, -42, 8, -135, -322, -15, -8, -187, -22, -36, -28, -17, -142]
7052a42J53l9N9j31J5k2j9L68k62Q0j60q9K07j03j1J11J68j65R2p8Q4j43J12l2
7076E3kj18n9O1rM0J15l85M68k04J92m4O3k65J15j76K35k9j38q7L08j41POl19
7101c13M17j96J62j24p5K70j88P5j63L8J77O5n43M37o4KJ7l2P1k08P4J29P4p2
7125C0r0K84l41j13L07m5j7J21m98L02j27J40q5m5J0L06k66K89j88o9K10j43K28
7148B00j92r4K2M9Jj20K87J44k20l1j34j28J73M7n8l5R9j07K11j41ORK6l1Q3Q0
7174A46j18R5l26Q1P5j61K01j87J01n6O2J85l42K40K79j86nj10K72j15j77J09
7196F3J43n54K97J2L12k41kk4KN1j4rj15J41j45J54j34K20Qj30k44L03k64k3K59
7221F6Q0j58j27K21l09J26J27K39k58O1l23K3K64o7J48j76J98l1j56J77k22K9
$$ y = [-142, 11, -28, 31, -100, -85, -107, -126, 242, -20, 60, -100, -189, 18, -85, -96, 15, 183, 18, 110, 32, 116, -27, 85, 53, 51, -67, -126, -65, -74, -34, 81, -304, 164, -40, 152, 108, 171, -94, 21, -155, 80, 51, -87, -174, 134, -7, 0, 6, -313, 104, -92, 70, -54, -129, 141, -47, 28, -135, -97, 80, 145, -398, 39, -25, -23, -6, -38, 33, -175, -101, 28, 102, 30, -60, 224, -117, -230, 77, 32, 15, 136, -362, -60, -187, -47, -132, -177, -167, 139, -127, 162, -26, -95, 115, -28, 200, 8, -86, -64, -15, -14, -134, 153, 297, 77, 46, -88, -216, -43, 4, -54, -89, 10, -97, 114, -27, -21, -12, 14, -17, 66, 146, 28, 123, -203, -122, -47, -208, -7, -194, -93, -149, -87, 98, -244, -4, 275, 89, 84, -26, 246, 131, -46, 63, 206, -348, -51, -39, 273, 32, 30, 6, 8, 59, 45, 36, -79, 62, -83, 71, -63, 157, 165, 35, -209, 94, -170, -193, 66, 146, -12, -139, 82, -227, -101, 26, 265, 7, 68, -255, -232, 32, -35, 113, -63, 135, 104, -52, 125, -97, -68]
7243f8J09j34j20K52K36l90K11L10p37L76j3o5n0j62M26l80J79K39k98p4K47j01
7265gk02J69J29p9r6L17k15R0o2Kr0J44K7J8O3k00P1j15J8no5M6J37m2k30K8J29
7292b0p2J67m12N36j44K2l36L23r0m6J54N0p5Q4m6j65rK13q1N7k09j28J29J55
7316E7j77j3K84l7j31q3L03r6k23J79J0j80K2M6%K36j10k01K98j26r5o5O6J42
7340A06k9J1m63L30K13L5l72J10J57l02K36j22R6J2K40j88j32n0K05J19j42j78
7362a08J53R1j95J06q3J74k77J65q8K55r3k30O0K5K42n7K5j6On6j52K13k11M0
7386a1J35j93J30l50J28K29j46M9J5Q5j34J06k5j6l6j97m4J97J70j6p8L33j79
7409A52k58J53k89K12k0m8J03K64m32K74k07j7J12J09j57K41j86O1j52R3J60M6
$$ y = [-68, 41, -93, -213, 39, 275, -115, 96, 406, -331, 45, 32, -33, -83, -245, 181, -199, -20, 219, -79, -153, 94, -7, -209, -40, 89, 10, -86, 231, 16, 106, 44, 46, -44, 100, 127, 145, 208, 8, 79, -36, -18, -23, -88, -42, 95, 53, -177, -149, -20, -92, 75, -337, 199, 55, 77, -259, 64, -26, -72, 82, 132, 57, 141, 95, -70, -79, 134, 53, 110, -99, -227, -98, 57, -120, -133, 151, 114, -17, -100, 203, 107, -116, 63, 73, -107, -85, -39, -39, 197, 87, -114, 184, 58, -37, -102, -36, 106, 77, 88, -375, -45, 168, 203, -169, -59, 98, -204, 32, -90, 6, 18, 258, 70, -62, -112, 93, 212, 70, -108, 45, 136, -59, 47, -36, 138, -139, 26, -62, 193, 100, -130, -70, -45, 197, 140, 165, 149, 155, 99, -53, 160, -51, -11, 124, -69, 61, -289, -161, 68, -78, -29, -14, 71, -63, 43, 18, 2, -34, -231, -275, -78, 92, 76, -2, 331, 152, -106, 47, -242, -30, -50, -98, 5, 269, -163, 111, -96, -113, -1, 108, -49, 192, 6, 67, -85, 8, 168, 214]
7431B14j34J81j49q3j09m8P5j85M78k86N6j55J09J48j95r%n0J87J11k23J14J06
7454A53j08L1K5k61k8J94O7l05J08l6K52N5l34M4J60j15J73k45NJ86K31j23P1
7477B00R9k27n6j11K70l73K45j05J48j22j15M3K34j85k7L43k80j5j36M48j36k49
7499a07J78k07m6J64M6k67M40N3k70q7K35n2m1J42k91mK48j56J01j17R8M0r1n9
7523e0M0j72r8J96J32r9K64m20J55L1L31k10r0J05j29J23j97J30j32j29M05k18
7545c2m3J28j14J02p4J05o9K1j9m9K3M5O0n9j36J98Q3j36j43K9K03j52J96k43
7569g6Jm1j25J65j74J08J64j34O8m9L29k70OQ0N1k09K78M5k58j58R9J48k21K23
7593E0p3r4J17j54M0K19j04N9j52j8p3J45K5J61n5m0l53M01l37K3J95k52J93o7
$$ y = [214, 80, 261, 112, 29, -80, -128, -53, -238, 240, -46, 10, -145, -36, 112, -83, -92, -92, -142, 45, 156, -67, 47, 153, 45, 76, 101, -160, -188, 6, 73, -232, -124, -160, 92, 147, -187, -143, 17, -98, 75, -170, -165, 21, 252, 129, 200, 299, 72, 16, -95, 175, -198, 47, -58, 90, -32, -147, -104, 130, -55, -82, 261, -19, -34, -170, 278, 142, -107, 71, -136, -182, -18, 28, -239, 201, 254, -16, -103, 132, 80, 39, 181, -110, -114, 134, -22, 79, -38, 60, 100, 9, -50, -10, -182, -280, -84, 48, -51, 213, -207, -52, -21, 310, 100, 10, 115, -14, 109, -88, 42, -90, -219, 186, -32, -75, 53, -61, 41, -33, 72, 3, 24, 5, -44, -21, 24, 84, 25, -111, 87, 170, 34, -109, -80, 123, -29, 167, -76, -75, -116, -241, -76, -250, -142, 22, -112, -44, -93, 236, -34, -28, 52, 103, -106, 172, 217, -41, -199, -100, 48, -173, 50, -23, -117, 0, -154, -114, 105, 1, 60, -92, -110, -183, -38, -13, 148, 93, 53, -300, 101, -236, -213, -18, -270, -77, -144]
7617a44L35j75N7po4O9o0l04L41L6k36Q5Q9J07l67M24r0j55K58j65j38J49J9J27
7641A91k40k6J00J2j45K10k41m0K87k00j27L63j72Q7k5K39j81N3j00j17R4P6j17
7664a9J46J5M1j2j71o8r5P8j43K52n2j3j62Q7K3n0Q7J50j90L89k37O5l3k6j47
7689h5K59l60j85K09L58j87NKk03m3J52j6j8J70m1J53j60k0j07L31l11J17l1j17
7713a28M3rL04l00J84j12m6j94Q7J36j98K16k15L4K03kk04L03p9l7L53o39J11
7736a89L55r2j57J95l19j05M71j18j68P9J93j71M4R7j61J09k25k0K56J77k74O4
7758D1l6j26j06L30l32K18J50l02J34LL45m34K29m66L00n8K4M0N4j35J15Q0J09
7781A77o3j76j2j22K89k6l0j52R0J56j57J32k74P7J61k28J88J72n04K49K1j26
$$ y = [-144, 191, 16, 73, 66, 2, 71, 11, -293, 48, 84, -152, -67, 22, 129, -238, 186, 96, -59, 199, 34, -104, 45, 64, 191, -49, -75, 25, 37, -108, 102, -139, -179, 108, -92, -219, 144, -28, 59, 34, 273, 92, 145, 45, -72, 22, 98, -19, 127, 142, 183, 171, 0, -68, -163, -85, -228, 24, -28, -41, -203, -116, -93, -143, -56, 94, -96, 293, 56, 121, 88, 62, -85, 174, -186, -371, -162, 196, 9, 14, 16, -187, -230, -78, -94, -112, 58, 17, 170, 10, -10, -117, 214, -97, 20, -11, -128, -85, -94, 210, -90, 94, -18, -64, -258, -171, -35, -233, -17, -232, -198, 5, 3, -201, 102, 23, -14, 339, -300, -189, 166, 74, -83, 112, -207, -312, 159, 41, -127, -48, 145, -26, 18, 115, -46, 63, -162, -182, 74, 251, -23, 41, 5, -121, -227, 103, -229, -11, 139, -163, -29, -26, 319, -115, 114, -352, -52, -110, -86, -46, 8, -127, -12, 68, 177, 114, -62, -74, -196, 93, 67, 37, -115, -25, 131, -26, 106, -168, -91, 70, -158, 30, 202, -302, -53, -32, -158]
7803a58N3Rj32L59L2l43K06P5k50R3l6L3j02L42k14j36L55k17j62J62j3k19N35
7826B72m11K25k09J17J63l43n2L48l98L69j7J24j70j34J31K4L7n4j91kM27l56
7848a00J06j91k6K74n9j88O5J99Q7q5j09Q1N3k51N3J26j19j07J20p5P2l4K28k16
7872i6M6J55l5J66l87QJ6J02r8P2J4m9P2n8M5j88M29j08m9j38J97K2k63O2J41
7897G8k28l9K96J42l77L8J76jk88M27r6l48L07r3R5K8j07l64J57p7L86k3n6j31
7921i8o2k8J2J16K12k51K29j35J29o0N7j70r3M56k85j08j92J30J95k56L67k92
7943a27j17L48k3k02K83L4j26k78r9L05j3K67j86k76J35J34J1k58J49K33l09P8
7965c7j28N5J72j37J50j20R3p3L36n0k97K99l07m8J10p3J24O6r9q7j0j4K1j05
$$ y = [-158, -105, -96, -228, 131, 163, -180, 26, 101, -149, -56, -92, -59, -161, 181, -33, -169, 186, -31, -193, -31, -44, -263, 272, -139, 86, -123, -6, 157, -186, -238, 110, -288, 81, 64, 188, 18, -116, 15, 39, 76, 22, -169, -171, 256, -100, 6, -185, -211, 63, 4, -184, -119, 80, 167, 82, -27, 54, 107, -144, -91, 35, -84, -191, -71, -146, -74, -108, 120, -96, -50, 105, 70, 236, -151, -143, -127, -25, -123, -51, -37, -86, -14, -72, -27, -215, 214, 106, 57, -81, 116, 138, -125, -63, 78, -150, -189, 107, 249, -128, -90, 86, 85, -203, 224, 128, -220, 87, -6, 89, 117, 10, -354, -197, -274, 112, 89, 33, -98, -160, -188, -176, -60, 152, -99, 130, -5, 124, 64, 121, -49, -142, 314, 29, -79, -271, -141, 54, -202, 165, -127, -244, 104, 81, -121, 162, 196, 70, -208, -307, -2, -15, 252, 66, -210, -75, 59, 70, -188, -39, 194, -115, -37, -165, -110, 62, -75, 75, -45, 48, -25, 311, 261, -36, 263, -44, -92, 18, -55, 69, 135, 36, -51, -61, -75, -54, -159]
7989a59N8J40l49K20L46j78j54K63j92j67Q5J46k7J13j84N8j2N3j41JM05J3k06
8012A32k53J34L04m39K63o8j79m7K37j42K01k3Nk3J2k53m8L28r1j46R6K43k10
8035C3O0K28j04j76j8r3L2N6N9mj19J26J3j43l4o6K40n4J83p9K9j18L9j16K28
8060B02k61O4P1l23M24l42K76j42O3l3mm1O1j88R4mJ44k46J42j17L61j73j97J19
8084e0J87k9j75J33N2l6k09K04k1j39M47m71K21L5r2J16n37M78l11Q8o4K98l05
8107a80K34j35j0K84m4l5l28K71j63J18K3q1k35L4L73j91j12L07L6j73O9k1l52
8130c11L24J02k38K18r8K66r4k1j45k3P4N3L1n3j76k13K46J71oj2k03J08J55J2
8154A67j00Rq2K13m9j85r9j05K3J44O4J43j0j26j22j2J11J31j34n5J11P3l64R7
$$ y = [-159, -101, 39, -310, -90, 256, 78, -76, 187, -5, -172, -87, 59, 32, 145, -39, 19, 7, 60, -81, -80, 325, 338, 132, -121, 13, 317, -122, 141, 73, -106, -153, 84, -58, 143, 120, 125, 102, 114, -139, -187, 141, 50, -96, 0, 243, 33, 93, 321, 217, 41, 23, -70, -38, 18, 77, 73, -46, 80, 93, -50, -84, -150, 90, 36, 219, 140, 169, 51, 90, -26, 202, -59, 5, 76, -247, 177, -165, 111, -31, 32, -1, -5, -46, 15, -173, -79, -83, 61, -185, -43, -160, 201, 28, -169, -50, 137, 108, -67, 66, 118, 82, -127, 77, 56, -83, 364, -107, 114, 149, 57, 173, -364, 114, -197, -109, -173, 125, -180, 54, -81, -91, 193, 149, 114, -214, 57, -106, 12, 35, -46, -281, -247, 126, -65, -177, 130, 166, -7, 62, 41, -311, 13, 115, -123, 95, -3, 263, 169, 148, 3, -20, 54, 107, 138, 85, -91, -304, -58, 113, 107, 95, -108, 0, 155, 167, 67, 76, -6, 207, 158, -27, -126, -231, -208, -64, 0, 143, 133, 7, -115, -127, -16, 115, -19, -74, 37, 110, -254, -157]
8178a57L17k99L32j82j61J65J60j7Qj93o5o9K38
$$ y = [-157, 160, -139, 193, 11, -150, 15, 175, 158, 166, -27, -92, -161, 77]
8191G7
$$ Imaginary data points
##PAGE= N=2
##DATA TABLE= (X++(I..I)), XYDATA
0@%%%%%%Qj6QqJ6k4L2m0M8n3O5q4J04j20J43j74K07k44K85l32L82m38N08n87O67
31C53p52Q52r67J092j228J375j537J715j910K129k363K613k889L196l531L892
47B040m287M721n199N728o313O961p681Q490r411J0466j1679J3093j4774J6809
61H964j9325K2528k6753L2588m1173N4997q0652J42804n47197m08456J720889
72H59214n47265r21780P32994l2663k33936O55451p59820m62448J449005k39931
82D98821j478149R27588P94807r96819K1086M02023m17676N25222J03654j140050
92g59493O31675J099176j247477m74153J254931k17559o44187M59421j99277n4427
102a51370P09747p03231n97337J275941K386j253265N86658O65089p01516P7610
$$ y = [0, 0, 0, 0, 0, 0, 0, 8, -8, 0, -8, 8, -16, 16, -24, 24, -29, 36, -48, 56, -64, 79, -95, 112, -132, 153, -179, 203, -235, 273, -314, 353, -399, 453, -514, 578, -650, 725, -812, 903, -1007, 1122, -1241, 1372, -1517, 1679, -1852, 2040, -2247, 2474, -2725, 3003, -3310, 3651, -4030, 4460, -4951, 5515, -6164, 6929, -7845, 8964, -10361, 12167, -14586, 18002, -23171, 31826, -48826, 93978, -453219, -861675, 859214, 311949, -609831, 123163, 90500, -143436, 512015, -247805, -710253, 738752, 498821, -979328, -51740, 743067, -253752, -232666, 169357, -248319, 276903, 380557, -759493, -127818, 971358, -276119, -750272, 504659, 287100, -357087, 102334, -96943, -151370, 558377, -144854, -742191, 533750, 536136, -717129, -130471, 534618, -166898, -89288]
112h9288K23101m64810N40800K66287j083252L26923J056220q49778n26302Q98657
122B98558r6617m16592L56100k76698p9955P24050n07102o53535R63460J69315
132D80984r52543L36341M79023m74743J31778J34955m75535M44830L51445q60844
142d04309J04436Q37781n27825m16919N95180q7212k45931L23445k81524j51004
152b53882O32267k76709n88754O32808K17640o54308J89055L22772l33880J33427
162B0436J21665m10786K84976L43791n92074j5077N89006l12856k90059L89438
172A28460q7126j56297K81735k21514j76402M81720j32523m54090M06222J80465
182B50650m41584J30799K13290k57136J17557J21564l25339J64385K82692l90531
$$ y = [-89288, 133813, -330997, 209803, 476090, -607162, -280239, 775981, -73797, -600099, 298558, 201941, -214651, 141449, -135249, -215204, 508846, 1744, -651791, 311669, 480984, -471559, -135218, 343805, -130938, 840, 135795, -339740, 105090, 456535, -404309, -299873, 537908, 10083, -406836, 188344, 101132, -144799, 178646, -102878, -253882, 378385, 101676, -487078, 145730, 363370, -290938, -101883, 220889, -112991, 20436, 142101, -268685, 16291, 360082, -231992, -247069, 341937, 29081, -260978, 128460, 41334, -114963, 166772, -54742, -231144, 250576, 118053, -336037, 70185, 250650, -190934, -60135, 153155, -103981, 13576, 135140, -190199, -25814, 256878, -133653]
192a33653m5670M00074j96815j95261K67140p3851j18551K20019j34419j56437
202a67424L14120n3568l04088K46617J27796k82846Q0325J41200j73508P1868
212D92R6876k11076Q5208J89941k37496m2710K55076j13583j33219J66540l6266
223A9783q3790J35423p0276j04867J86111j9671j90277J39288R0922j66595L3851
234c0098Q7064r4068L8410N3111j23507N2072J16417j41148l5118J51972n4212
245B0895q1712Q6560j5622m2878P4168m2562o1467J09189k074j14935O4416O3477
257E7455q0102K709M3096l8616J9282K3924o4369K2408O7961o2508l5592O7877
269B3525l850l7798K1121m323o795L1361k5777l0624N1218R384n2396J2486L0757
$$ y = [-133653, -179323, 220751, 23936, -171325, 95815, 21964, -96587, 123432, -10987, -167424, 146696, 93128, -210960, 35657, 163453, -119393, -39068, 102132, -71376, 492, 97368, -113708, -28500, 161441, -76055, -118765, 136311, 22728, -110491, 56049, 19783, -64007, 71416, 1140, -103727, 82384, 62713, -127564, 11724, 102646, -63949, -30098, 56966, -37102, 1308, 54419, -69088, -17016, 99401, -41747, -76865, 75107, 20895, -60817, 25743, 10121, -32757, 41411, -1151, -62618, 46571, 44497, -70438, -6022, 57455, -22647, -19938, 23158, -15458, 3824, 27748, -36621, -14213, 53748, -8760, -44352, 23525, 19675, -18123, 2998, -1325, -8120, 23241, -2536, -33160, 18058, 27442, -24954, -12468, 18289]
282A8289j7812l974M563j1440J7811R121l4655L200L6807j3795k6359J4422J2796
295H974n871l649o907L220J6693p969j9200J0092J7800q845j3739M345J1838j43
309F639j1109l287J1046N919j0514q583Q297J1703n810j3977M299J4532k744j4304
323g893J188J2550K232j1423n253Q725Q573o081j0871M219J2153k638j3798K966
337e351J3111k722j0141j12O052N624l787j1678N085J5856r988j4100J2686P171
351G706q818R05l036k868J6606m381k2763J6495J6655k3602j915J7179j1255K581
365e11J0969k4101N366L2587k8333j9212L9325n692k7802K3895k796j8922L3416
378A8189r756m2331M4258K1951n9428J3925M0909l6976J565K6132m0266J6099
$$ y = [18289, 477, -3497, 1066, -10374, 7437, 16558, -18097, -14897, 21910, 8115, -18244, -3822, 8974, 3103, -546, -7453, -4233, 12460, 4491, -14709, -4617, 13183, 4338, -9401, -5056, 6782, 6639, -4470, -7757, 3289, 9208, -1306, -9889, -1592, 10111, 4301, -9676, -5377, 9155, 6411, -7893, -6705, 5845, 8077, -3346, -8599, 126, 8699, 2618, -8253, -4034, 8119, 5481, -8317, -5351, 7760, 5038, -5103, -5215, 837, 6461, 2674, -9004, -3919, 11937, 1949, -12151, 535, 7706, -1112, -207, -3243, -6111, 10495, 6114, -16649, -154, 16501, -7101, -9016, 8163, -3092, -511, 10458, -13643, -8277, 24310, -4023, -23235, 16090, 10398, -17404, 6491, 3695, -15227, 18189, 8433, -33898, 10360, 32311, -27117, -13192, 27717, -9259, -7694, 18438, -21828, -5729]
390e729M6995o2889j5144Q0944l2913n4087N9490r72l9156M4716j9870m4700Q0178
403C6863l260r8462O5069O0492r3282P719O0732n4905J6539M2199q7195K5554
415b1937J02503j03494m9516J32512l1799q7306P9020n250n1205Q1917l8876q8474
427h1905J31471J9582j60988P3538J05017j18672j459P5126p4807L4452O6522
438F7877j37796K2181J64523j28223r6123J71674j6197j13219Q7192j3335n8927
449e0373J22198n4488j39965J76824N4692k18743O8125J46765j32814q227Q2963
460D6957j01452N7140J02781j94727N235K34308j41517j48933K01337Q38j30629
471f8662R9736l0411p5779J74202n9240k04197K10310J02832k63720M9046J77040
$$ y = [-5729, 41266, -21623, -36767, 44177, 11264, -42823, 16667, 15695, -23461, 21255, 1385, -43315, 36863, 33603, -64859, 210, 60702, -32580, -24861, 35871, -19034, -2495, 39704, -47491, -21937, 80566, -22928, -72444, 60068, 28269, -59037, 19983, 14733, -36472, 45445, 6569, -81905, 49566, 69148, -91840, -18302, 86715, -31957, -33416, 41710, -33097, 1355, 67877, -69919, -47738, 116785, -11438, -107561, 64113, 47916, -65303, 21889, 8554, -50373, 71825, 17337, -122628, 54196, 108888, -109855, -41730, 105035, -27779, -36006, 46957, -54495, 2645, 105426, -89301, -84066, 150242, 8725, -140208, 61129, 61967, -68662, 31074, 663, -75116, 99086, 39846, -164351, 45959, 148791, -114929, -65883, 111157]
482A11157j34698n351Q2183j33877Q0084J44312k41033k4861K90081j32366j92112
493a56481K03890J8600j26823J04803n4807q8834K21516n5462k61838K21605J54537
504A80706k84302J5793J90631j20495L381P4697j67618R5759J93863k73897p0980
515a62462L32247j02345k27177J89413L0515j14406J19208q1434j17950K68259
525A33868k8628l19304K07543K04435k79331j2592J80894j13031K9488P7295k12058
536a31421R4783K48137k80147j23258L42818o0461k32566J58769K4034r0940J39808
547H9556j02950j51975K92376J2931l46669J64644K33477k41057l7225J49359
557F2467r9787N6806Q0305k41681P7932K85373k56135j68124L19127j4526k13774
$$ y = [111157, -23541, -28892, 53291, -80586, -502, 143810, -97223, -122084, 167997, 35631, -156481, 47409, 66009, -60814, 43989, -10818, -99652, 121864, 66402, -195436, 26169, 180706, -103596, -87803, 102828, -17667, -14286, 60411, -107207, -11448, 182415, -91482, -162462, 169785, 67440, -159737, 29676, 60191, -54215, 64993, -16441, -134391, 133868, 105240, -214064, -6521, 197914, -81417, -94009, 86885, -26146, 3342, 80637, -131421, -36638, 211499, -68648, -191906, 150912, 90451, -142115, 16654, 40688, -50252, 89556, -13394, -165369, 127007, 139938, -206731, -42087, 191390, -49667, -86892, 62467, -37320, 19486, 99791, -141890, -63958, 221415, -34720, -202844, 116283, 101757, -112017]
568a12017J21816O143o9415J64926j10681j88625K92492O0979l46607J12155K35790
579A66956j94529l7051J14099j09653Q1813J05346k62467L7999L08277k08031
589B759j95430K71968J3331j74580J02112k3718o6158J91048r3153k21392K59951
600F6738J06571l11814N6850K10907j41768k5687P9670j17042Q9195J26210k50498
611a10668o829K94456j42470j96349K04741L1217j27564Q3131m3060o7234J93477
622A12848o1848k26755K04502J31017k53398J5839J68023j01154m515O0276j27907
633h3072P8601J44647k16648m5435K55576q6764j69735J48582K1136q8876Q6362
644D4374n4380q1522J83584k3890k12585J44549J30376j89443p83J21007p8962
$$ y = [-112017, 9799, 15942, -53473, 111453, 772, -187853, 104639, 165618, -180989, -68834, 166956, -27573, -64624, 49475, -60178, 21635, 126981, -135486, -97487, 210790, 2759, -192671, 79297, 92628, -81952, 20160, -3558, -69716, 121332, 28179, -193213, 66738, 173309, -138505, -81655, 129252, -12516, -38203, 41467, -75575, 13620, 139830, -110668, -117497, 176959, 34489, -161860, 42881, 74098, -53466, 29665, -13395, -80629, 112848, 51000, -175755, 28747, 159764, -93634, -77795, 90228, -10926, -15441, 44835, -83072, -4471, 140176, -76472, -121907, 133669, 46905, -122830, 25752, 46888, -41988, 44374, -10006, -91528, 92056, 68166, -144419, 130, 130506, -58937, -59720, 61287, -17675]
655a7675J4711N3882j27573N4871J44951j65617o5760J98663m3575j31222R9679
666A5335J0824n9588P9216m7754q3022J48044N669j72715Q8284J10080j26925
677c2552p616P9291o0250K2200M8951j09190K8262J25555j11652o6867J39384
688E5516j9498q9716O7673j867m3917P3237l3081p9269J07151K3033j26563M9013
700a8288Q0040q1755k466N1041n1789K1058M7342q3964O191R6585o6545n4601
712e7151Q8486p854n6323M5580o338l3882N6845j6089o3066O6024K6348q0505
724c7925K2969N0929m7755n10L2205l7050J1922L8019n2614n439O1628l2784l6460
737c2865M8676k850l1930K8854n357k3957L5498l889m0630L3290J9797m3308J0001
$$ y = [-17675, -2964, 50918, -76655, -21784, 123167, -42450, -108210, 90453, 46878, -84344, 15335, 26159, -33429, 45787, -1967, -84989, 63055, 68724, -103991, -15707, 94373, -32552, -40168, 39123, -21127, 1073, 50024, -59166, -30904, 94651, -17001, -83868, 55516, 36018, -53698, 13975, 12108, -31809, 41428, 8347, -70922, 36229, 59262, -67301, -18288, 61752, -20003, -22469, 28572, -23217, -2159, 45183, -38781, -32590, 63995, -2550, -57151, 31335, 23481, -32842, 12738, 6400, -27482, 29363, 13274, -49792, 16232, 42580, -37925, -14956, 35973, -11782, -12292, 19913, -17137, -5215, 32804, -19810, -25249, 36379, 3595, -32865, 15811, 12961, -18969, 9885, 4528, -19429, 16069, 12180, -28450, 4840, 24637, -18671, -8670]
750h670K7618k6742K187J8890k3711M515K4737k6749p252L2399j4359j8938K4055
763G980k080j6198J6350k415j5044J7929J040k0527J3552J0592j8583L574J2246
776H416j2139O55R499j0161j35J1502r416m815J2341m005p573Q616o6o588N266
791A397Q16n754M521J855n928K631L753n065O25L631k944r31L048j830j164K586
807A247j182j177J737o9j528J254M37j281J24R91o63k87N36j32n77N84K58m89
825b17K2L07k96p2J43J45j32J69l2K88l42QJ75l01L01R0k56m25Q16k08j185J658
847F56J25k035J509J072k431Q21J891k818L17L050l297k35M210l387k459N653
863B642j691m384N408l72n237N369O49p401O658L003j0322M765P446j0264L64
$$ y = [-8670, 18948, -7794, -5607, 13283, -10428, -5913, 18824, -7925, -15177, 17222, 2863, -16075, 7980, 5900, -10298, 6052, 3637, -11407, 6522, 7562, -12965, 587, 11179, -7404, -3830, 8416, -3723, -3068, 6431, -3730, -3865, 7637, -1779, -6594, 5747, 1742, -5831, 2785, 2719, -3869, 1397, 2213, -3541, 980, 2835, -3093, -462, 3291, -1774, -1149, 2482, -462, -1393, 1655, -175, -1339, 1247, 65, -1112, 625, 556, -972, 282, 719, -562, -438, 553, -110, -397, 139, 7, -570, 14, 272, -217, -195, 112, -184, -256, -113, 32, -100, 69, 37, 325, -17, -9, 166, -135, 166, 256, 0, -425, 391, 183, -1002, 656, 781, -1254, 255, 1327, -1104, -283, 1608, -1210, -893, 2157, -1140, -1375, 2835, -552, -3011, 2642, 951, -3433, 1975, 1603, -3634, 1735, 2384, -5017, 1641, 4644, -5678, -913, 6533, -3731, -3367]
878c367R354q539n58R591j0197j863J4760r779r491J7149k374j4363J2862J604
892D789j2879J2328J006j7018J5242Q533k4400P569J9540j9868k644J8186j4589
905d205j171J7996j9363n280L0415j6559k2057L1084K70k6468J8758M329k0323
918a2574K1019J316l1970K6712J9246m2981P333L5392k8478p367K6416k1491Q8
931g339L0216l4462j0976N2142k2673l9839M4744O918l8428K3506M421k7342L4717
944A5605K24n1213L8380L5131o2077K492N1605l2522j2532L1361k9221L782M3309
957C4324m9138k0933P3712k1297n9379N1012J6120m3960K5587J187l4625M9535
969B2145L898p4002M4488N5583p5061p776O2198l2090j2744L3922m1810P189O3298
$$ y = [-3367, 5987, -2552, -3110, 6481, -3716, -5579, 9181, -598, -10089, 7060, 4686, -9677, 3185, 4789, -8090, 4238, 5244, -11774, 3468, 12001, -12399, -4830, 14710, -5158, -7802, 10384, -4205, -5376, 12620, -6743, -12023, 18392, 1833, -20224, 10860, 11130, -15338, 3420, 7749, -12574, 8445, 9761, -22209, 4503, 23749, -19232, -11899, 23493, -4985, -12352, 14064, -7427, -7339, 22877, -11585, -22561, 29581, 6908, -32931, 11813, 18731, -19697, 3809, 8230, -19112, 15605, 15829, -35384, 2996, 38127, -23950, -21458, 30147, -2375, -14907, 16454, -12767, -8985, 34324, -14814, -35747, 37965, 16668, -42711, 8301, 24421, -19539, 6048, 7235, -27390, 22145, 26043, -47959, -3471, 52112, -22949, -30725, 31473, -617, -13361, 20561, -21249, -14060, 49238]
982D9238o3031l8070R4243j4018p6996N2137K2531m5399L1397n872m6387O7818
994B7591J2565r8337M4224P7292q0988k0292O6825k9321r050L5952n6048P332
1006b2255Q4489o9948n8600J05569R13q7462M4826K5095m0966L7736j1403o0732
1018e2738P9484K8579j14856L1808R3549p3361l1343O1926k7915m20M0998p0425
1030c4714J39J04427o5557p9078J04995J5876q6408L6222K0068l7743N0458j4959
1042A3726p8361Q5802M7090j23790J6511J01472o2458l3833N3316l1954Q750N0649
1054D6920q2817j1748J19294n4375r4242R5633K8341p8335K8678J1725l6056O1533
1066C4551j2033r3076Q0000O5218j17940k804R7604m5866l0549M2034l7393J4354
$$ y = [49238, -13793, -51863, 42380, 28362, -48634, 3503, 26034, -19365, 12032, 6160, -40227, 27591, 40156, -58181, -13957, 63335, -17653, -37945, 28880, -441, -9491, 26461, -29587, -22255, 62234, -7714, -66314, 39255, 40168, -47294, -2468, 22627, -18339, 19397, 7994, -52738, 26746, 55325, -59531, -27723, 65826, -7535, -38878, 23048, -4867, -5287, 35711, -34714, -34575, 69852, 4295, -74783, 30212, 46088, -40320, -4098, 15970, -21773, 28685, 13726, -64635, 21167, 68257, -55533, -39022, 62450, -8, -33841, 19475, -12479, -3729, 46920, -35897, -47645, 71649, 17274, -76968, 18665, 47006, -31329, -2651, 9074, -26982, 34551, 22518, -70558, 9442, 74660, -43280, -46084, 51520, 5654, -24895, 17139, -20254, -5900]
1078e900O0844q4416k7747J20030l3625r7911P5677L3979o3413K5680J643l8924
1090c4083O9063k374j01703O5751P6829j03450j5402Q4628l4480k0721L5318m5843
1102b6467J5082P0897q0419m0995J13966j7666r1793N8082L0520m8708K7773o839
1114C433m3353P1183Q492j01584M8226P8979q2597k2425O7376k5758j0795L1175
1126B2352m9574R006P4543o4696n0970R5031j09p7591L8816K4045l5620K9407
1138A4640q810m7001O3248K0319r0292K7882P1544n8790k2773M8942k1546k335
1150d972K9952m9025J144P1377m7264n2083P3541P714n9710K7390J4634k7552
1162a4854L1237p291m7569N1860K6343p4237J3501N8943m0716j7702L4237k0181
$$ y = [-5900, 54944, -29472, -57219, 62811, 29186, -68725, 6952, 40931, -22482, 3198, 4841, -34083, 34980, 32606, -69097, -3346, 73483, -29967, -45369, 39259, 4779, -15942, 19376, -26467, -11385, 59512, -20907, -61902, 52064, 34398, -57395, 687, 31207, -17501, 10272, 3433, -39920, 31263, 39755, -61829, -13603, 65376, -17221, -39646, 27730, 1972, -8823, 22352, -27222, -18216, 56327, -8369, -59339, 35692, 35583, -42008, -3192, 20853, -14767, 14640, 5830, -41171, 22077, 42396, -47896, -20014, 51530, -7260, -30033, 18909, -2637, -4972, 24980, -24045, -22901, 48476, 1212, -50871, 22670, 30384, -29326, -1936, 12698, -14854, 16383, 9092, -38477, 13383, 39726, -34511, -21010, 37933, -2783, -20485, 13752, -6429]
1174f429J574K9649m2453o827O1005k9371m5966N0869J0605m1516J9265P203k2285
1187a4677K8569j882m2919L5345K7806n2929K628M2495k4890j2189K3302j7807
1199g148J332K7165l1350j1619M5615j4972l5137L2096Q707k6733J4169K948j8393
1212a3320K3145J990l3593K1357K3222l4518j031K7710j6077o043J6054j5192
1224f296M70K1704k0800j1214L0372o598k3447J8958N313j6311J0741J130j4263
1237a0241J5470M362k2486J0324J6550j9635j752J5672r209l324J0581r919j590
1250e197J4842j0475r064J6474j423j3597R968K986r269O374J557r326Q067M042
1264E959j2262M206Q878r127j569Q331n034j834O235n354j532P669m332n196P794
$$ y = [-6429, -4855, 24794, -17659, -24486, 36519, 7148, -38818, 12051, 22656, -18860, 405, 7608, -14677, 13892, 12010, -30909, 4436, 32242, -20687, -18059, 24436, -454, -12643, 10659, -7148, -5816, 21349, -10001, -21620, 23995, 9023, -26114, 5982, 14689, -12044, 2125, 5073, -13320, 9825, 11815, -21778, -421, 22801, -11717, -12748, 14962, -1115, -7158, 8896, -6296, -5826, 15878, -4922, -16136, 14236, 7638, -15809, 3149, 8462, -7849, 2892, 4022, -10241, 5229, 9591, -12895, -2571, 13979, -5656, -7408, 8264, -945, -4269, 6312, -3607, -5197, 9645, -830, -9894, 6580, 5157, -8440, 1528, 4514, -4755, 1619, 3176, -6150, 1917, 5959, -6303, -2097, 6781, -2346, -3915, 4416, -618, -2452, 3783, -1571, -3103, 4566, 234, -4962, 2832]
1279B832k82o279M508J205m334K712J523m697K944K523m783J085L790l507p12
1294a472L326k065j041K676j567j113K555q09j948K408q1k006J022J060j729N25
1310b59J207j304J55R06j047p8R84o13m93P52mn46L78J79k82K03j6k62O7K06k89
1331a56j34K86R9l05K15J07k27K91k01J11J12j72j62L10l53k23O47l60k13M63
1351A35k80m39Q93k30q54J120M6j161J032L20j255J007J87j516Q92J401k333M88
1369e47K124j989n73K370j521j178K718j842j306L933j391l494L754J009m461
1384b394K681J333m011K913J637n298K986M272o808N15O448n239j758N513l293
1399e03j808N906m294l772Q847k187q604Q203K204q121M347K812p268N764K865
$$ y = [2832, 2550, -3729, 779, 1984, -2350, 362, 1885, -2812, 132, 2655, -2128, -1043, 2747, -760, -1472, 1854, -211, -1252, 1424, -143, -1256, 1299, 490, -1458, 950, 869, -1137, -115, 945, -784, -259, 948, -356, -201, 705, -342, -420, 564, -49, -542, 210, 206, -340, 38, 217, -65, 138, 122, -140, -73, 133, -156, -290, -4, 95, -210, 5, 112, -115, 176, -25, 86, 198, 26, -136, 174, -179, -402, 245, -115, -328, 135, -145, -584, 309, 79, -775, 345, 391, -770, 262, 582, -673, 334, 521, -995, -103, 1298, -1035, -547, 1577, -412, -985, 1385, -136, -1314, 1404, -438, -1744, 2189, 798, -2696, 1058, 2067, -2394, 287, 1620, -2391, 522, 2159, -3139, -153, 4119, -2689, -2174, 4274, -965, -2723, 2790, -503, -2311, 3595, -699, -4471, 4376, 2189, -6415, 1788, 3992, -4129, 218, 3030, -4238, 1526, 4391]
1414D391j0397N165Q837j2183j203J1932o631m470Q706n589k615J0969p691p935
1428h714J5953k323j4781J1210N550j2352N638L853j0590R377M798j8010Q020
1441b371J5632j7994m386J7750p785o521J1520q821k932J7363j2744j2926K3981
1454I766p20k2366J3403Q912j5251P183L756j5025J4850Q059k6923Q226K4187
1467A8057k1570r102K1894q004o943J3397j2816l532K4663j5192k0916L0140L761
1480A3837k8887J2990J1868j6116R215K327j9731J9005J3864l5359N912L2298
1492B1223k2250j4020K3429p147o397J5961j8316n221L3509j6595k9800L4142
1504H518R285l2463J1061J2520j6158J3050J022k7042K4211K0358m1295J109L8012
$$ y = [4391, -6006, -841, 7996, -4187, -5390, 6542, -89, -4559, 4147, -1442, -4057, 6912, -779, -8714, 7239, 4916, -9865, 1345, 6895, -5457, 181, 4034, -6556, 2821, 7619, -10391, -2371, 13261, -4733, -9119, 8631, 846, -5675, 5845, -2976, -5908, 11455, -1289, -14215, 9766, 9046, -13320, 83, 8995, -6256, 927, 4683, -10342, 4508, 12567, -14356, -6130, 18057, -3513, -12615, 9279, 1275, -5668, 7729, -5087, -8619, 16044, 852, -20064, 10076, 13837, -15050, -2060, 9808, -6308, 2907, 5234, -14497, 4508, 18372, -16987, -11075, 21223, -1027, -15047, 8382, 1235, -5162, 10799, -7517, -12738, 20771, 4176, -25624, 8518, 17803, -14660, -3599, 8921, -7237, 5813, 6835, -20207, 4004, 24362, -16933, -15824, 22188]
1517B2188k0177j7021K2199q104l382J9271k3704r433M1188j3855l7184L2435
1529D421J5653l1936P737J0745j5662J7827J339l3976K4122K8640m3076o212M0716
1542B0338j5389j7948J9124r575j085K3552k7060j5157M5791q416m2354K8644
1554D65J9571k8869O014P420j6345K2292L847m0632K2389L5023m1638j1529L8803
1567A6811j1227j5133J6394j4299R90K9508k8860k1318M7222k254m2950K2551
1579b565J9040k3268P651K523j8839K6204P530m3313J6091L8764l4992j6307L3503
1592A2022p363j0788J4032j7071M6L3294k5583k6867M3018M995l9702J5292J7234
1605A2559j8029R040K42k1703K6560J2527m2591Q960L8497k6939j6995K6266o373
$$ y = [22188, 2011, -15010, 7189, -915, -4297, 14974, -8730, -18163, 23025, 9170, -28014, 4421, 20074, -11862, -4125, 6620, -9042, 8785, 10124, -23852, 270, 28910, -14166, -20378, 20338, 4949, -12999, 6125, -3450, -4535, 19017, -8043, -23200, 22591, 14175, -28179, 465, 20036, -8833, -2819, 4601, -11744, 10548, 14395, -26237, -3848, 31175, -10463, -21992, 16811, 5584, -9549, 6845, -7454, -6464, 23044, -5816, -27134, 20088, 17834, -25116, -2565, 16475, -6793, 858, 3381, -15458, 10746, 18276, -25037, -8946, 29818, -5174, -21481, 12022, 4659, -6129, 7903, -9168, -9122, 24172, -1411, -28278, 14740, 19735, -19967, -4675, 12559, -5470, 3570, 3812, -17891, 8669, 21196, -21395, -12435, 26062, -877, -17872, 8394, 2021]
1618B021o270J4756j9952k834L5317j9931k9748L5861R032l2775J0502J2308j4409
1631f122J1999l42k4289K3593J7058l8246K472L4030j8899j4312J9267o844k578
1644c213J4991j9374o250L3059j3062k8418K6900J0284k4930P303Q321j2235J2709
1657F085P78k3429J7725J7971l0192j728K7698j3166j0493J3886p294j296J5097
1670A1642j7078p873K7494o944k4062J9185Q544j7867N959M823j0789J2233K301
1683G568k1209J2554J6401k2104l332K0084q683p285J0780p709r95J4041j2594
1696b483q776K0607k805j8402J2622O763j2216M934K780r211R239L731j6173O739
1710b651J3863j4903l421J3787n827m681P756o272j375J1170p993q070J4364l67
$$ y = [2021, -4249, 10507, -9445, -12279, 23038, 3107, -26641, 9220, 18252, -14523, -4021, 8287, -6122, 5877, 5535, -18754, 4839, 21897, -16349, -13877, 20153, 1254, -13058, 6209, -635, -3213, 11778, -7596, -13846, 19213, 6151, -22267, 4633, 14917, -10013, -2710, 5611, -6624, 6085, 6863, -16566, 1159, 19130, -11062, -12790, 14908, 1742, -8751, 5135, -2159, -3455, 11642, -5436, -13309, 14185, 7241, -16821, 2364, 10908, -6959, -1000, 3823, -6966, 5267, 7568, -13641, -1087, 15314, -6790, -10122, 9962, 1279, -6006, 4774, -2935, -3930, 10111, -2483, -11259, 9348, 6543, -11859, 763, 7526, -4690, 244, 3024, -6187, 3052, 6783, -9390, -2651, 11212, -3691, -7112, 6675, 848, -3833, 3923, -2349, -3724, 7446, -547, -8617, 5747, 5380]
1724E380j2951P537M788q188M019K122p425O490L807j1497L575R791r118l164
1738d834Q646l270l137N444m278j457P808m390o341Q912L46p812M169L216n307
1753b285K929J286n035L605L232p096J221O460m909k230M745j694j680L275k586
1768g62j307M932k507l861M786R52m268J688K031k740J325O06k636J698K329m036
1784a770L49L498j926j951K406n02o58J498j113j013K163m32k155K009M87j583
1800f93N30O86q70K49N79j376P52J303j413n88J376k10p66M45m4k03N96l02o14
1819e63R23N3j005K72M42j26m5j2j95M52K98p83Q2O67l94l08m3J95L11r2j81k76
1841c28Q15o9q66L09N86l39l07O3K5O34l08o84L31P31p56j17L78l3p7K65p44L81
$$ y = [5380, -7571, -34, 4754, -3434, 585, 2707, -4718, 1772, 5579, -5918, -2343, 7448, -1670, -4834, 3812, 542, -2595, 2849, -1429, -2886, 4922, 532, -5809, 3103, 3449, -4363, -194, 3022, -2285, 644, 1930, -3105, 500, 3732, -3364, -2143, 4317, -592, -2822, 1923, 229, -1451, 1824, -762, -2069, 2863, 356, -3505, 1281, 2233, -2035, -347, 1684, -1056, 269, 875, -1761, -63, 2266, -1770, -1421, 2077, 151, -1800, 606, 104, -554, 944, -169, -1182, 981, 549, -1606, 403, 890, -693, -163, 523, -347, -98, 481, -895, -143, 1160, -253, -841, 535, 325, -441, 4, -40, -243, 353, 51, -563, 360, 413, -592, -320, 122, -4, -49, -61, -256, 196, 494, -289, -207, 460, 66, -242, -285, -90, 221, 129, -52, -328, 487, 418, -448, -139, 447, 108, -199, -136, -111, 523, 215, -469, -138, 593, -163, -280, 98, 65, -12, 253, -491, -110]
1863a10R86r05o19Q65K03r69M92rk37Q88o07r87J361O73j498J39J048r47K55M93
1883E15j247P79J132k089k72K569q90j951J955l02p80J368r65j228K966k84l553
1900b277K338J625k419K00J641j739Q85J173l216R03L931l840j503M082j036k144
1916a396K451j184j270L735k097l528N099R38o030K908K846l586Q47J623l422
1931b066K535K928o130N92O604m523l720N948j040l043L681k275k345O253k253
1946A146o573O957K733q078K539M322m635J705J908n575L853N136r191j87R597
1961E657n197n427P172j237l129N315m219l714R860k608r724Q569M351r706K333
1976a704M881n514K867K732q802M817Q206j1454k081J2351m735p092P576j306
$$ y = [-110, 876, -29, -648, 217, 420, -549, -57, -66, -303, 585, -22, -1009, 352, 1025, -473, -334, 714, -233, 22, 515, -732, 47, 1179, -910, -1182, 1387, 497, -1454, 501, 199, -581, 787, -178, -1406, 1560, 1276, -2277, 61, 1686, -733, -533, 1108, -631, 254, 1427, -1789, -886, 3045, -795, -2298, 1784, 748, -1396, 1055, -129, -1399, 2336, 239, -3289, 1810, 2748, -3282, -374, 2472, -1114, -267, 1356, -2066, 469, 3397, -2733, -2141, 4463, -60, -3780, 2168, 1128, -1915, 1766, -509, -2854, 3399, 1146, -5427, 1530, 4263, -3815, -1276, 3046, -1589, 116, 2024, -3551, 302, 5438, -3753, -3940, 5657, 460, -4967, 2205, 968, -2161, 3154, -1065, -4779, 5081, 2473, -7251, 1318, 5669, -4037, -1704, 3177, -2337, 530, 3262, -5540, -723, 7483, -3971, -6052, 6299, 1564, -5528, 2048, 742]
1990G42l288O867n215n646J2375j644j2957Q993P030j1091J355N724o033L620
2004H32L689j1399N032J1514j2500n144J4396l899p944P862j975l362Q363o094
2018f29p875J4312N43j5771Q581Q689j1168J154N451p024N254M561j4049M941
2032c030J4032j3359o538J4695k634q398P582l128k953J0731o787j0636J6127
2045E704K605j7795P134J0367j0388Q85M261p474O630N600j5564K639J6991j1966
2059c71r300J4472j167p644O672m288l053J2894o951j3114J6461M943j7628M409
2073c665J0240q616J440L202r210Q262P819j7337P37J8199r807j0200J2326o47
2087B743n543O296n532l703J4468n875j4788J4708O819j6116K749Q945o757K562
$$ y = [742, -2546, 4321, -894, -6540, 5835, 4191, -8766, 227, 7257, -3834, -2479, 3245, -2788, 832, 4521, -6878, -1846, 9668, -2832, -7976, 6420, 2521, -5423, 2439, 464, -2898, 5465, -629, -8504, 5808, 6351, -9420, -839, 7850, -3318, -2164, 3287, -3737, 1517, 6078, -7971, -3030, 11002, -2357, -8895, 5800, 3166, -5232, 2350, -778, -3731, 7000, 213, -10423, 5704, 8309, -9486, -2352, 8015, -2373, -1488, 2773, -4701, 1929, 7529, -8035, -5396, 11595, -371, -9671, 4801, 3634, -4010, 2662, -1626, -4679, 8215, 1264, -11850, 4611, 9554, -8074, -3665, 6575, -2041, -601, 2601, -6609, 1653, 9472, -7865, -7128, 11071, 1264, -8936, 3390, 2743, -2800, 3496, -2036, -5739, 8729, 2854, -11934, 2774, 9593, -6523, -3774, 5171, -1586, 976]
2101I76K127j0554Q195R576j6852j239J7525p177j0373R686k87l871O554o410
2115b124n052J5204l546j5572J1768Q395j3569R35P109n715L721K101j1050O770
2129f25J1228j4659m312J5723m125q993P223j197k437P587p000o238J4415j182
2143E408j4784Q577Q257j0325P36M454n080M527K624j1180M623J1627j1818n032
2157g386J2211j997o871N578j984k190Q165n837p081J1405J541j2472N137P150
2171E369p149O52K972n111M608L817j0302J808J0637p518n473Q557j083m350M451
2186A885k612k084P212l623p044Q722K439r434L228M948n106J032K224n190L996
2201E93L803p786L26Q261m992m250O039j121k697L453k147k259N913j814o157
$$ y = [976, 3103, -7451, 744, 10320, -6532, -7771, 9754, 2577, -7796, 1890, 1603, -2268, 4286, -2124, -7176, 8028, 4482, -11090, 678, 9073, -4496, -3561, 3548, -2167, 1554, 3655, -7395, -625, 10603, -4056, -8368, 7355, 3230, -5763, 1460, 263, -2174, 5413, -1587, -7825, 6590, 5408, -9376, -799, 7458, -2867, -2131, 2323, -2757, 1770, 4394, -6786, -2163, 9464, -2354, -7386, 4825, 2828, -4043, 1535, -449, -2639, 5526, -311, -7392, 4013, 5554, -6918, -1781, 5369, -1780, -1128, 1844, -3267, 1341, 5158, -5144, -3336, 7301, -217, -5690, 2867, 1784, -2566, 1885, -727, -2811, 4401, 778, -6266, 2456, 4895, -4539, -1311, 3637, -1469, -437, 1787, -3403, 593, 4396, -3390, -3064, 5197, 205, -4045, 1994, 873, -1824, 1629, -518, -2777, 3136, 1322, -4835]
2216d835O140J976o149J831L486l615J332J727m474K386L411n074o46N736k752
2231D80k986L791q17k140L157j854j934M150m62m150L309J731m087J163J821k349
2247a177Q30J862k877Q66K721l080o09L387j613j913K515n36j673K195q37j267
2263a206K253N2k686K072R89k397M61J349j678L97J285j797N66J801j951n73J802
2280G39p64j044J634k00p62Q03L9j238J412r9j423Q05J011j405P8Q91q76L1Q37
2299D69q95J70R77q02o37J009L7p15N05j1l20K20J16o92O23M12p49L47M03p84
2319c17J1M47k34J09K70o31K48M43n18l57O89Ql55m3L6K04J51j70l82K98J60o04
2341e37M81j56K14k01K23J87m97M18j98pL63k76q3J61k51O5J37K5l09M15p1l20
$$ y = [-4835, 1305, 3281, -2868, -1037, 2449, -1166, 166, 1893, -2581, -195, 3216, -1858, -2504, 3232, 480, -2506, 1285, 468, -1672, 1485, -369, -2303, 1847, 1385, -2765, 544, 2275, -1812, -649, 1172, -1177, -347, 1515, -1362, -496, 2225, -855, -1464, 1923, 310, -1603, 912, 376, -1297, 898, 61, -1206, 1047, 1099, -1587, 485, 1474, -923, -462, 887, -791, -394, 891, -906, -340, 1461, -490, -1063, 739, -25, -1069, 565, 365, -397, 406, 445, -793, 619, 520, -903, -98, 913, -492, -414, 477, -399, -368, 469, -426, -256, 721, -81, -718, 291, 328, -387, 118, 107, -213, 7, 123, -569, 54, 466, -283, 64, 467, -317, -306, 141, -93, 16, 286, -345, -97, 346, -172, -529, 160, 168, -187, -230, -194, 10, 161, -9, -391, -93, 67, -537, -56, -212, 2, -199, 24, 211, -286, 132, -66, -73, 290, 14, -69, 92, -159, -94, 43, 68, -241, 174, 103, -217]
2363b17J71K22n10K94Q5j93L6K39k65j01M81m76J13M42k83k93O21n08m35Q31k31
2384B3l84N77M3m54L20J10n52L59J33o18M90K37o34Q1P64p33K0N46o41p0J290
2405I07q12p88J124j81r08P55K29q99J204k41j377J207P71j938N58J376j151m14
2423e78J030q00l0J430j553m59K332r65j766J994k6j522J479r5j409J715K6k357
2441a554J532J629k486L3K011j530PJ500k137M02K556k617r99L356j046k701K375
2458C31L68j568J667m01k259K751Q62m030K057K668l366l28K574j899O3J996l031
2475a545L50M074l329k093M628o09l605K516P3j799K557j033k652L748J030n268
2491b957K220L490l728k25K558k297P37K274l908L87N046l526l580N480j96l817
$$ y = [-217, -46, 176, -334, -40, 45, -148, -112, 127, -138, -239, 242, -234, -121, 321, 38, -255, 366, -142, -577, 254, 23, -361, 216, 259, -195, 125, 235, -317, 42, 175, -443, 47, 284, -350, -269, 495, -238, -218, 328, -313, -383, 907, 95, -693, 431, 250, -658, 97, 326, -573, 631, 390, -987, 220, 991, -947, -389, 987, -164, -578, 452, -348, -378, 1052, -501, -960, 1372, 407, -1359, 635, 609, -913, 566, 471, -938, 777, 803, -1554, -22, 1607, -879, -846, 1165, -365, -358, 1142, -995, -593, 1963, -654, -1653, 1703, 657, -2044, 331, 699, -869, 798, 397, -1862, 889, 1751, -2279, -222, 2446, -920, -1248, 1326, -573, -510, 1486, -1545, -1195, 2879, -450, -2543, 2085, 1476, -2129, 387, 460, -1339, 1218, 185, -2467, 1281, 2311, -2957, -737, 2753, -975, -1200, 1358, -939, -202, 2072, -1836, -1449, 3597, 71, -3509, 1971, 1775, -2042]
2507b042K639M0j973L085r55m137M349K235o088J550M294l469o66K324k552J273
2523i3K967n200l32O488l104m733N239P98l709K191k08k450M458j036n500N029
2539H05L396o618K13N084l119n97K153l110J632L834n605j462P460k702n296M730
2555G98R86l253K256o50k751N517j126o523M884M329o324l79M852k989j25J846
2571A348l555J574M810n649k449P620j826n282M171P43k760K711j456l239N407
2586B168O44p381L984N087o059p03M279k459L13K149m616J423N734n432l463P053
2602B721m78n040L002R32k457L140j798l553N679J129p233K720M892m464j144
2617a952L359k423J158K230m846N36O125m389l995O091K47m166K213K84j748L078
$$ y = [-2042, 597, 637, -1336, 1749, 794, -3343, 1006, 3241, -2847, -1297, 2997, -472, -1138, 1186, -1366, -93, 2874, -2326, -2658, 3830, 726, -4007, 1232, 2030, -1679, 512, 304, -2146, 2312, 1276, -4224, 805, 4201, -2417, -2204, 2880, -239, -836, 1317, -1793, -161, 3673, -1932, -3394, 4066, 1364, -3932, 798, 1784, -1469, 787, 137, -2614, 2903, 1777, -4746, 138, 4467, -1857, -2236, 2616, -373, -498, 1348, -2207, -633, 4177, -1472, -3921, 3699, 1873, -3409, 762, 1505, -1255, 1456, 0, -3239, 2168, 2812, -4569, -585, 4502, -1557, -2260, 2019, -440, -127, 2022, -2594, -1171, 4563, -869, -4332, 2721, 2243, -2797, 205, 1137, -1320, 1820, 22, -3531, 2148, 3277, -3956, -1236, 3656, -808, -1952, 1407, -1016, 142, 2372, -2474, -1938, 4187, -202, -4197, 1894, 2141, -2025, 188, 472, -1276, 1802]
2633A802j455l927N029K094o607J439M661l641n71K217k021J051K454m431m33
2648b339N997l231m013M550N41l040J742J07j955L425q78m449L940K862n635R43
2664a433L426k368l31J441k040Q24K868m038q03N337k042l528L256N38k295J638
2680D50m34j723L192j95l990L028K399m063J92K688j743k76J602k244R27K679
2696B489l474j044M168j349k597J983O98j687J442j74j947K709J8l068J649K365
2712B181l031J1J858j341o7J550k164L06K573k441j216L147n22k111J589J27j141
2729f92J361k33j672J813O13k301P43J633j647q9J176j147L88P39j332K16J736
2746A305j203j064J578l9j236R34R7j014R25M8j406J468N77j670M56J105r97l85
$$ y = [1802, 347, -3580, 1449, 3543, -3064, -1625, 3036, -605, -1176, 1041, -980, 71, 2525, -1906, -2339, 3658, 427, -3586, 964, 1505, -1535, 207, 314, -1641, 1784, 906, -3543, 397, 3259, -2376, -1433, 1993, -375, -706, 735, -1305, -481, 2387, -1651, -2454, 2883, 841, -2687, 569, 1107, -1188, 450, 16, -1707, 1485, 1290, -2700, 328, 2727, -1336, -1144, 1544, -199, -475, 1127, -1117, -190, 2489, -985, -2029, 2139, 790, -1807, 176, 874, -813, 629, 455, -1492, 1217, 1235, -1833, -184, 2181, -850, -839, 1019, -322, -389, 1161, -1003, -697, 1876, -565, -1781, 1366, 844, -1267, 322, 449, -692, 669, 436, -1236, 577, 1190, -1111, -368, 1265, -382, -471, 705, -442, -54, 685, -647, -431, 1305, 102, -962, 616, 577, -659, 275, 372, -642, 283, 331, -1075, 393, 970, -700, -244, 861, -136, -521]
2764e21R47o98K19O88r65o6J111n53q30J125k21o26M91K22n58M16J22q78P64J98
2784C87q20L85K77o73J94M62j90k25N29n73l25Q12m14k30M54K4l37K41Q3r7O7
2805C1J20n55K67L72l64m8L72m50K89l8j68mM08k52j28L97M2l68K66O5k61J15
2827A08r2p5L5Q5m3j39K84j97kn7K33k45J9oJ56k31m2J83l7N6M2J13j47j18J73
2852E6J21l04J89N3k15L56l62P1%l2n1L7J56m4l44M09K00l50K0J31k38L65l00
2875g6J79j15M6j4LK7j62K35k6l40R3J81j06R6K45j67m88M32N0l87O35j87l51
2898a97M98ll41Q9J51l57N0J36l28M69K18n94J97L49l50k69N60m86J3K36j06j8
2920h3M16l23k89P08l76o26L55M00n02K84K86n62L17L96p27J46O11o30n20R05
$$ y = [-521, 426, -272, -53, 635, -330, -396, 715, 162, -668, 457, 236, -390, 101, 323, -235, 181, 303, -575, 189, 387, -433, -48, 229, -444, -250, 212, 22, -203, 326, -247, -572, 240, -174, -404, 50, 74, -263, -22, 61, -36, 31, 151, -404, -137, 235, -129, -177, 195, -255, 34, -4, -172, -176, 232, -20, -148, 249, 291, -77, 189, 254, -7, 108, 16, -59, -24, 61, 18, -121, 163, -34, -36, -93, 140, -105, -86, -92, 64, -167, -209, -26, -63, -7, 35, 148, 1, -117, 56, 177, -127, 62, 115, -100, 256, -106, -35, -35, -67, -118, -81, 75, 31, -313, 96, 296, -54, -34, 97, -141, 224, -76, 103, -12, 34, 20, 23, 50, -112, 123, 97, -243, -150, 31, -75, 21, 266, 99, -389, 43, 93, -294, 341, 154, -197, 301, 298, -43, 46, 197, -160, -110, 26, -302, 167, 385, -209, -12, 337, -13, -282, 278, -208, -195, 41, -65, -83, 333, 10, -279, 429, 53, -573, -218, 182, -320, -36, 250, -312, 5, 401, -326, -180, 431, -199, -719, 186]
2940A86m8l40N87n59L7R17q23n89R44K68j075L86K08o39P39J38j022Q28P92j665
2960g30K17J354r65k17O85n26k2Q56r64o95J730k55j641J213Q05j533N58N33r05
2979e02P40Q1j205J156Q04j596l9J642r52p20J022q85K23J143j344m00J797o42
2997C23j570J494N45j113K86L42r97J015K13j759J251J431j965n21K093r77n95
3014e04Q30r80J72J551j233j128K501n62k018J406Q78j230L39L78j379J677J45
3031H43k241J218J850k042p59K011n17q28J122j237J4J656j445j262K664j32k239
3048a324J257P59j406Q01J09j380J585R26k633M32K428j687q88J668n01m72J141
3065H15j601J02K030j123j903K507J61k169R92O67q95R84k73j764K010J037k912
$$ y = [186, 138, -202, 385, -174, -137, 780, -43, -632, 312, 580, -495, -109, 99, -540, 199, 337, -685, 143, 935, -730, -513, 841, -124, -341, 344, -182, -204, 652, -312, -1007, 723, 468, -1173, 40, 845, -688, -130, 403, -502, 238, 319, -886, 270, 1074, -522, -561, 1081, 129, -591, 431, -454, -231, 912, -432, -832, 965, 323, -1247, 247, 792, -321, -35, 307, -690, 325, 538, -1221, 30, 1461, -504, -1025, 1068, 91, -504, 326, -654, -482, 1069, -164, -1292, 1209, 647, -1371, 35, 913, -317, 22, 400, -979, 698, 843, -1398, -180, 1670, -372, -1131, 880, 363, -465, 657, -580, -566, 1090, -355, -1617, 1047, 915, -1324, -67, 692, -714, 87, 196, -1184, 401, 1327, -1306, -874, 1554, -133, -1021, 647, 146, -326, 815, -786, -684, 1346, 223, -1680, 827, 988, -1181, -189, 478, -417, 567, 294, -1470, 540, 1577, -1335]
3082a335N11K297j420j169J622o07j20J171j660n05K808j023k451K412Q73k571
3098a167J116M77p99J023k18j723J475J395k732O7K272j117r51J363o50Q7J186
3115A104j666o39K747o04k833K510M92j670L37M17j002J383J72k324J543J868
3131A835k589l53K031q03n86Q99n41j62J355j317j025K416o59j839J483N40j002
3148c17K87O43j400J510K01k042R59J479j646n52J533m68o18P68m95j04J398j300
3166a64j206K213j14j830R74R46j409J037k35q32J002N28j903P48J371j458m29
3183g61J157m71k73O86n27k20J506j012j231J644J89j422P85O69r99N25J07r97
3201f45O40O62j344L54J070p61o49J018m79j39Q49p90j47J034n65q63R88K98q63
$$ y = [-1335, -824, 1473, 53, -1116, 506, -101, -221, 950, -710, -1215, 1593, 570, -1881, 531, 1404, -1167, -51, 426, -373, 650, 432, -1291, 184, 1579, -1153, -1086, 1186, 69, -882, 481, -169, -82, 1104, -562, -1201, 1546, 942, -1891, 619, 1111, -559, -222, 195, -807, 576, 748, -1576, -33, 1835, -754, -1107, 924, 121, -465, 434, -107, -269, 1086, -231, -1256, 1160, 501, -1338, 145, 685, -317, -30, 613, -787, 723, 924, -1118, -159, 1320, -326, -878, 655, 187, -431, 337, -158, -262, 1136, -164, -1370, 843, 729, -1101, -127, 819, -590, 447, 212, -620, 382, 910, -993, -245, 1126, -332, -761, 396, -75, -348, 338, -189, -409, 1097, 85, -1146, 498, 687, -735, 50, 719, -280, 245, 352, -645, -5, 657, -687, -333, 737, -24, -673, 345, -134, -273, 576, -214, -361, 673, 108, -755, 233, 531, -332]
3220c32L8N80m48K88J89q37Q07M72j141l62J280o98l68P94m02k11P84m52n07J034
3240E08j19q21O39N7n20J71L96k65k8J60p73M78O69q54k07P49l58k07M26k18r3
3261b10N44o2m37M40j94n83L10M07n90M08K31k26k15L95l21p8N05l91l4J62M2
3282A03j88M6J6k20L85o1k70M19q6j44J64J5j50K2K08k33j4J09k59J50J10k7l91
3305b96L78k66R8J49M9j00N7j30j13K76p0L5j59J36J28k39J86k80K33R9k21kJ54
3328A02J06k07O0j6M0j09J15N5j44o7PM72k35r1O3K0l68K39K03l26L9N4P3k5k21
3353a61K52j68m0P3j02J46N3P2j81P7l9J17Rk55K33k06J89j20R5r3r1J46r2K16
3377A30K3J06n35M61q1k53K99r4j85j9J10j87M8O4K3R7J26j92J20O0l25K93M7
$$ y = [-332, -294, 286, -162, 126, 315, -522, 285, 757, -384, -746, 534, -164, -532, 262, -140, -351, 433, -19, -526, 508, 389, -432, 207, 264, -256, -85, 311, 46, 18, 178, -595, -117, 552, -302, -509, 240, -118, -325, 101, -117, -210, 334, 272, -165, 275, 81, -502, -192, 215, -375, 33, 264, 38, -177, 218, -103, -181, 324, -67, -101, 61, 103, -85, -39, -23, -243, 142, 81, -189, 230, 144, 0, 164, 179, 29, 51, 259, 26, 12, 121, -138, 12, 122, 95, -296, 82, -184, -86, 63, 112, 12, 69, -61, -174, 102, 32, 67, -92, 44, 172, -67, 119, -161, 72, 171, -50, -52, 102, 208, 1, 61, 45, 85, -24, 91, 146, 2, -65, -58, 414, 179, 88, 151, 171, -197, 42, 245, -81, -42, 12, 85, 60, -161, 91, -77, -117, -44, -146, 0, 53, 125, -56, 21, -18, 99, 108, -147, 86, -120, 69, -51, 44, -49, -140, 6, -86, 130, 153, 259, -276, 185, 104, -149, 150, 56, -129, -148, -38, -225, -177, -113, -90, 7, 133, -59, 61, 121, -204, 89, 136]
3400A36k0Qj66j42J11J65k31R3J13j29r4K71M2l54K57J18l20N08j84j95O8Pj36
3423g4lJ62k91KL05J3j60K28o4n3J51j91q4Q9K57n44K41J2p9J36N3r1j21J37m3
3448a2K5K21l85M6L08l35k71M86j94l28P20l41j28L90l50j78P38l54k37R5J09
3469B5j02J13j0j51mM36o56P5O78o18k21P60k65m62N63J1l44N04q5p89J014l60
3491A12o03M65L68n09J9J60j41n2M99p73K56N10k03k73N43j97l45K43l38Q6O35
3512D62m61l37M69L49p15J67M66n79o9L44n68M24K34l60j12Q24n05l45N16r6l64
3533b56L59j26k47N96k3r24Q26L23p63j60P40l40J59J5m46K21N15o45q1O80l38
3554H5o15P13l28R3M33k92k87O55j31j187J034K93o21j0O27o64K44J35o32N11
$$ y = [136, 116, 124, -42, -184, -73, 92, -139, -46, 67, -62, -156, 115, 157, -197, 60, 178, -142, 366, 182, -13, 55, 62, -74, -77, 85, -206, -204, 101, 114, -46, 182, 118, 65, 216, 25, -59, 30, 287, -257, -16, -4, -83, 53, 106, 15, -106, 31, -12, 13, 234, -151, -105, 203, -132, -403, 83, -111, -439, 281, -60, -188, 202, -148, -326, 412, 58, -179, -84, 25, -77, 36, 26, -125, -129, 307, -349, -274, 404, -214, -435, 325, 60, -402, 161, 172, -172, 332, 247, -542, 472, 112, -491, -26, 342, -167, -148, 12, -129, -181, 318, -455, -199, 311, 108, -165, 378, 181, -164, 79, -259, -173, 462, 1, -336, 133, 482, -233, -66, 400, -179, -248, 96, -472, -48, 186, -174, -286, 538, 33, -312, 204, 108, -256, 103, -23, -270, 326, 303, -621, 205, 528, -235, -395, 345, 5, 164, 179, -267, -46, 469, -176, -257, 423, 85, -530, 183, -145, -52, 381, 89, -198, 457, 326, -861, 173, 466, -155, -165, 462, -202, 42, 177, -455, 56]
3574E6N19o79m04J172p68m23P43o3j66K75l74o26J394m18p64P07K89p74L57J13
3594A66l40K69K66p53K48O05p50j92P64j01n73O79j32k13L69j87p60J157j07j045
3614f30N61M08m27p0M12m31J86M09q50O8R19n77n17Q22j7m98L17k47J39L02m00
3635a21l86O44K47q05L08L30k45K1J56n96M65J77m59n9J079q76l09O18N4m69L71
3656A45m10J87N34k69r32Q43L78q24L77J33j48j2J33j92J09L38o23O9Q30n91m84
3677d09O63j96l21M04k33j87M47L9o76N80L22p24K92P7j29qJ66n10L98O36p56
3698a25n3L68k67k60M67N4l07M25l80k18Q10m34l41J80M76l94j29M78n22K21p
3719D2j94J13K94m56r6K54L24k36J32N5l92J20l4o3L70j77m28K66M08k73j22R
$$ y = [56, 575, -104, -508, 664, -104, -527, 216, 153, -13, 262, -112, -738, 656, 238, -526, 181, 470, -304, 53, 166, -174, 95, 361, -392, -144, 461, -289, -481, 283, 182, -391, 288, 156, -57, 312, 125, -635, 522, 415, -630, -69, 339, -88, -158, 254, -177, 9, 418, -432, -364, 555, -22, -539, 283, 266, -232, 85, -162, -23, 279, -121, -507, 137, 384, -421, -113, 217, -28, -7, 149, -447, 18, 195, -264, -323, 756, -120, -429, 189, 243, -226, 145, -265, -78, 456, 187, -745, 98, 476, -348, 29, 162, 14, 2, 135, -57, 52, 390, -233, -164, 666, 75, -409, 254, 58, -263, 141, -92, -279, 168, 207, -469, 111, 433, -291, 1, 78, -51, -59, 107, -403, -5, 631, -125, -178, 190, -77, -337, 130, 184, -123, 302, -78, -296, 514, 80, -261, -81, 395, 1, -128, 350, -172, 49, 42, -152, -39, 255, -201, -297, -43, 281, 45, 177, 232, -160, -40, -74, -137, 233, 56, -372, -106, 302, 29, -93, -84]
3741h4J0Q2K27m99J2K62j76K62n9P5k37J62k01J21K29k56k02J04M3K29l5j41j46
3764b18J51Q2r5K05j8o9j90K79k90K9K78k56J92q9j27R3J29p6k40J69J29k41K10
3787C7L0r8oJ43l11J67K35k1k31j01L86k21j76K97j39j6J48k5J12l36J93l9J2
3810D0nm1J29j14j24J76j61J42l25k8L85j65J08n4j3j10K4P2J88k93K13k36lL00
3834A05j22M3l5K72k45P3k35R7%j96L53k44K62k15m2O14m90j28J74P0j00r8N5
3857c2j3PK38l50M7K76m01K43L43m21K8j86L10J10m04K29K3r4j2J59k63J02j3
3880g4Q0P9j30j34K25j79J31m2j53J25J92q0n7O5k35J13j06L53j09oQ7j86mj53
3904a98J42P8k62K65o1m8J66K54j69o2k8l0K0j07j02L78k16q5J90lk6J7j62MK03
$$ y = [-84, -74, 8, 235, -264, -252, 10, -166, 96, 37, 112, -125, 37, -164, -43, 186, -70, -272, -168, -125, 104, 69, -72, -218, -67, 15, -80, 125, 107, 38, -152, 127, -163, -134, 144, -112, 80, -9, -136, -43, 86, 10, -230, -61, 68, -173, 37, 67, -31, -37, 106, -205, -38, 197, 176, -55, -156, 230, 9, -167, 130, -9, -25, 123, 98, 210, -126, 67, 28, 40, 35, -6, 123, 9, -115, 61, -100, 42, -283, -311, 74, -91, 17, -37, -50, -160, -136, -64, 124, -169, 44, -192, -195, 105, -17, 26, -9, 263, 18, 91, -144, -47, -47, -243, 110, -134, 128, -87, -129, 485, -5, -133, 41, 111, 11, -87, -32, -45, -38, 200, -150, -103, 173, -228, 15, 358, -63, -35, -221, 89, 199, -205, 24, 47, -47, -59, 100, -163, -61, -74, 6, 85, -45, -179, 46, -133, -2, -44, -197, -72, 120, 40, -17, 48, -187, -74, -180, 173, 64, 58, 145, -41, -45, -198, -56, 22, -240, 25, -36, -84, 82, 336, 167, 105, 77, 47, 67, -40, -142, 236, 20, -65, 125, 122, 96, 113, -49, -45, 158]
3929A58k23J46j16o2L62j45q9j43J72j26K33r5l7k2K19l38J4JK87n23K55K85k85
3952g2L03j40n0K30kk47Q0j3p4l42N03o4m8j16R7NJ21k74J53J16J17l58R0K47
3976B62m39r7N26j62M7R6l87K59O6j41k08M1L43m24K07Ln0L5j31PO1L0j7K55j7
4001A65j09M1j43l55N98J8l78R8K44m31L3K44j05P4J08j17j71L40j87j63K50r5
4023d1k01J12J07J8j1K18k67J25P2k81mJ53N9j41J33j32J8K22p0j81L19k30l94
4046c97N99o8j91n6K09Q1R5l17j53L38K00m09j47M11k44Q0l72M44j8n4l95P04
4068C40k78j97j27K89M6j89L11m4r3J63k87P7K61l1l60O1L9j84L04M2j40j24M14
4091B93n66n0K22Q2k17J06J90l74L10j13r3K10l3k19J47J38j03o7K36J1k36K15
$$ y = [158, -65, 81, -35, -97, 265, 120, 31, -112, 60, -66, 167, 72, 35, 13, 232, -106, -92, -91, 196, -327, -72, 213, -72, 231, 91, 41, 271, 269, 22, 102, 89, 15, -327, 176, 112, 64, -52, 45, 50, 171, -103, 50, 166, 283, -75, 15, 262, -177, -274, 252, 90, 137, 233, -154, 105, 171, 30, -178, -137, 206, -218, -11, -8, -58, -23, -154, -147, -86, -56, -73, 182, 165, 56, 97, -46, -401, 197, 215, -163, -65, 179, -252, -219, 25, -80, -6, 102, -15, -186, 154, -33, -196, 54, -41, -242, -130, -23, -5, -16, 202, -65, 60, 132, -149, -153, 0, 59, -82, 51, -81, -63, 159, 89, -92, 227, -3, -397, 202, 134, -57, -113, 96, 177, 272, -45, -198, 140, 340, -69, -216, 195, -49, 31, -341, 103, 85, 31, -364, 340, 62, -135, -262, 27, 73, -116, 195, 151, 58, 221, -66, 11, 272, 241, -119, -58, -19, -203, 101, 143, 3, -121, 293, -273, -323, -101, -19, -236, -130, 60, -314, -4, -117, -210, 0, -33, -252, -105, 33, -70, -137, 99, 110, -126, 89]
4113H9k67K11M68m93k49M60K3n60K77Q8k22L26nq6J42j70l04J83N15n71P7N32
4135D64l67j29N8k28L4N65n12J78lj83k05N08j78oJ31j07k84J88M59n78K09K89
4157C03k27k37L81l90L7J06K7m11O07l66l66N33l11L38m9Q8n9J37O5l77K08q8
4179e1j11M4J99l8r4J17KN5J7M9j21Lq7RL86l06k39P7j30K42K05k04j4K63n16
4204b43r7K21J51lL3n4n8J61k9k81L02rN2k17K35k8k33J58j3q9J74p5k27J44J7
4229hk64K50j6J6k00K23j16l9K30k6j56K39kj99L13n18K19O9r4P1P2O7Q1p7L4
4254A69k92J68L2O4J32n2j57j22O2k0j80L36j88M3k28M07k46J59J25l29J14q4
4276h7R1j90Q0K6K95l87K29q8Nj12K18J76l32l6L44k43n1k4L8j18K83K20l23k06
$$ y = [89, -178, 33, 501, 8, -241, 219, 242, -318, -41, 47, -175, 151, 146, 60, 202, 32, -272, -89, 426, -145, -68, 464, 97, -32, 26, -202, -168, 397, -115, 63, 60, -123, -328, 180, 2, -4, 127, 20, -264, -76, 383, -195, 14, 303, 76, -161, 220, -170, -133, -27, 0, -411, 196, -170, -536, -3, -314, 24, -25, 63, 4, 141, 206, -171, 37, -51, -162, -118, 81, 43, -51, 66, 68, 123, 140, 189, 68, 71, -16, -7, 379, 73, -166, -89, -219, 23, 228, 24, 10, 273, -243, -340, -119, 32, 29, 62, 8, -50, 111, 82, -199, 103, 94, 146, -71, 164, 136, -97, 61, 48, -41, 133, 58, -169, -25, -8, -272, -22, -38, -22, -222, 1, -115, -154, 76, 50, -106, 133, 131, -68, 245, -273, -54, 15, -79, -8, 64, 131, 212, 135, 169, -123, 45, 77, 141, 273, 221, 64, -58, 4, -16, -196, 140, -48, -5, -233, 174, -72, 87, 212, -117, -3, -87, 4, -186, -106, -80, 215, -172, 57, -31, -26, -138, 80, 256, -76, -112, 232, -11, -62, -86, -48, -166, 117, 337, 14, -192]
4300a92J93j00N3q1N1ln1N6L72j69M4m49J52J4j12J44j6J9L50r8k43L52l46n8
4324a18L21m24J7L03Q0k47J94k19K36R0j54r8J36k42n6J63k0J86k29J7R3J71r2
4347A08m1m9m2J9J35k51K22J1k27L11j23j18J99j33j40M8Q7j0R9j76K32j09q9
4370c7l7j91L39k47K9J91L9j35O5O4Q6l9k68P6M0nJ2j67J01L04n2k30NJ72j59
4395d4k04K61l3k78M22j07J37k23J95k35Q2P3L0M9J18k06K47k21k9p2K1J22k1
4418H4k25j89K88K86k50j33P5K3J04O3P3j08j27j13J34j05R5K91k77pK6K3k4p8
4442g1K5J09r1j59K67n0J50j55N2j72l3o4K21o7J24k46K78k70K83j0j43j85J72
4465c5M7n0l05M35j85l9J11J99j68q3J24oJ68k82j79K21K4k81K29O8j19r9J55
$$ y = [-192, 1, -99, -46, -127, -76, -79, -130, -74, 298, 129, 173, -276, -124, -110, -222, -78, -94, -75, 275, 177, -66, 286, -60, -118, 203, -221, -204, 99, 179, -68, 126, -93, 143, 233, 79, -19, 117, -125, -181, -18, -38, 148, -81, -64, 29, 200, 108, 67, 18, -24, -5, 130, -121, 101, 112, -115, 196, 73, -45, 154, 21, -119, -71, 16, 6, 105, -71, 161, 52, -37, -74, -265, 74, -173, -144, 47, 86, -49, 16, 80, 166, 127, -141, -65, -25, -30, -18, -185, -84, 220, 168, -62, -57, 115, -44, -248, 13, -20, -298, 124, 17, 154, -69, 126, -109, -27, 46, 76, 125, 243, 37, 284, 63, 34, -38, -17, 105, 84, -141, -330, -42, 244, -6, -139, -64, -41, 63, 126, 199, 91, -36, -149, -15, -120, -25, 266, -11, -18, 8, 31, 7, -71, -46, 63, -28, -187, 80, 30, 180, 25, 77, -95, -128, -192, 29, -38, 86, -160, 118, -152, 131, 121, -22, -207, -35, 12, -38, -343, 92, -93, -132, -21, 178, 10, -73, 51, 45, 213, -69, -248, -27, -3, -284, -55, 13, -106, -205, -50]
4488e0J05o0L61l26L36j50j30j64N3j34J7l4K61k03M0K01j97p8J02Q0PQ5j35k36
4512b49J37K92l69L55N5j73j49L6j23L52o7k9j10j16K20q9K7k0j55P1K11n3k33
4535a79K51l9Q0K1k91K65j52q9N50l87L0j23M09l72N0j9k5k1L3J49j49J23j94
4558g9m2M49l47J97l02J33L10k89j77J39m7q8L1K19q1j5lk15J05n8L47o2m4l33
4582b52J25J46l9M7j42J59k26L0J47j8m4Q5N5o9M3p5K15k04q6J20k76M41k15R4
4606F1j37o9N9M13m96P5K18j60J03l51K74j3J6k03P9R6j31J30R5q1j8J50k36J67
4630D1J40k67J75om3M7L0k51O9L4O4j29p5K54O8j40J38j85J23m9q1p5K27j14j17
4655a22J95qj96K66p1k80L15J3j86k3J21j73K55j81P1K9M7K7k78K44J22j25K5
$$ y = [-50, 55, -5, 356, 30, 366, 216, 86, -78, -25, -159, -142, -176, 85, -118, -78, 123, -74, -152, -50, 30, 37, 122, -13, -249, -112, 180, -189, 166, 221, 48, -101, -65, -188, 164, 97, 68, -42, -158, 62, -27, 0, -20, -175, -104, 107, 54, -179, 72, 33, 113, 134, -157, 108, -44, -133, 417, 30, 60, -63, 346, -26, 24, 5, -20, -41, -8, 141, -8, 115, -79, -121, 328, -19, 178, -124, 9, 319, 30, -147, -8, -55, -143, -112, 107, 26, 11, 8, -207, -102, -160, 187, 125, 81, -252, -127, 19, -20, 27, -115, 44, -182, -152, -5, -23, -67, 18, 73, 4, 47, -28, 187, -17, -103, 17, -259, 182, -33, 61, -76, -145, -86, 327, -169, -94, 124, -36, 67, -284, -10, -23, -7, -210, -131, -35, -166, -36, 59, -22, -40, 110, -126, 41, 181, -86, 89, 83, 40, 87, 117, -134, -65, -31, 33, -96, -171, 83, 151, 11, 149, -36, 87, 38, -43, -118, 109, -5, -122, 73, 65, -131, 135, 64, -216, 99, 112, -74, -97, 24, -149, 106, -75, -4, 25, 72, 99, -179, 65, 187, 62, 87]
4678H7Q1L5k80J58j93J03o4J23j09j3J38r2K27j60pj6k61L63l8k00J53L0p0n6
4702f1ML2j79J94L6R4k23Q3o1J04m1k5R5Q7j4j03j16J30L9k57J95J41n1l42J77
4727f2O0p4OJ61k5L2l8K1Nj2j9LJ24L9k20j38P3k1J16R9j52K57l08k95J50K35
4753A7O6l5p1J53k3j35N5j13Q6JQ8K4m0K1J06jk55Q4j99J85n2K2J36N2o7j12j8
4780b5J39l5Q1j40M8K29j93k27K19k46q4M06j45mJ6k6r7K05R1l08L22l02l8J94
4804H0j97jL38j80J32K4k44k8n0K89O4j95j10J18j25K03J9j02l19N27l52K5N13
4827D29m36K6L18k91m0N1P0j43j85P7n3K12lK52k38k04J74Q1J15j57j31J05L74
$$ y = [87, 168, 203, -77, 81, -112, -9, -73, 50, -59, -72, 66, -26, 201, 41, 34, 18, -243, 120, 82, -118, 35, 65, -5, -61, -57, -25, -204, -10, 26, 120, -103, -20, -81, 23, -18, -43, 52, 139, 125, 22, -94, 36, 75, -182, 13, 154, 103, -239, -62, -2, -76, -70, 91, 66, 98, 60, 81, 86, 74, 55, 58, 182, 221, 1, -137, -64, -85, 31, 130, -22, 235, -73, -368, -218, 17, 83, 48, -23, 130, 107, -28, 27, -86, 0, 1, 89, 113, 73, 94, 200, 199, -56, 28, -171, 14, -38, -16, 120, 172, 105, -7, -25, 114, 79, 160, 20, 68, 297, 104, -123, 96, -150, -234, 172, 27, 23, 39, 13, -84, 121, 212, -96, 226, -76, -114, 80, -117, -118, 220, 40, 172, 196, -48, -76, -126, 163, 227, 32, -78, 40, -85, 118, 137, 35, -284, 243, -109, -84, 429, -7, 19, 337, 46, 6, 57, 127, -16, -201, -124, -177, 35, 32, 284, 46, -158, 16, 97, 212, 55, -76, 29, 403]
$$ [...]
8191I4
##END NTUPLES=NMR FID
##END=
