##TITLE=1H_AT-29+CCl4
 DMSO-d6+CD3ONa
 108 sc, 
 29.08.2022
##JCAMPDX= 6.0         $$ Bruker NMR JCAMP-DX V2.0
##DATA TYPE= NMR FID
##DATA CLASS= NTUPLES
##ORIGIN= UXNMR, Bruker Analytische Messtechnik GmbH
##OWNER= root
$$ XWIN-NMR		Version 3.5
$$ Mon Aug 29 12:29:48 2022 Russian Standard Time (UT+4h)  she@DPX200
##.OBSERVE FREQUENCY= 200.1313499994
##.OBSERVE NUCLEUS= ^1H
##.DELAY= (6, 6)
##.ACQUISITION MODE= SIMULTANEOUS
##.ACQUISITION SCHEME= undefined
##.AVERAGES= 108
##.DIGITISER RES= 18
##SPECTROMETER/DATA SYSTEM= spect
##.PULSE SEQUENCE= zg30
##.SOLVENT NAME= DMSO
##.SHIFT REFERENCE= (INTERNAL, DMSO, 0, 15.7039)
##AUDIT TRAIL= $$ (NUMBER, WHEN, WHO, WHERE, WHAT)
$$ ##TITLE= Audit trail, XWIN-NMR		Version 3.5
$$ ##JCAMPDX= 5.01
$$ ##ORIGIN= Bruker BioSpin GmbH
$$ ##OWNER= she
$$ F:/spectra/data/she/nmr/H-F/1/audita.txt
$$ ##AUDIT TRAIL=  $$ (NUMBER, WHEN, WHO, WHERE, WHAT)
(   1,<2022-08-29 12:28:38.81 +0400>,<she>,<DPX200>,
      <continue with go, POWCHK disabled, PULCHK disabled
       configuration hash MD5:
       00 E9 B6 7A A2 85 ED C7 34 08 36 98 17 FE 4E 26
       data hash MD5: 16K
       82 6D 53 71 4D D3 0A 98 69 2D BC 0D 96 F6 0E 4D>)
$$ ##END=
$$ 
$$ hash MD5
$$ CF 8C E1 48 25 AD 7E 7F 1B 80 34 3B CC 3F 85 C3
##$RELAX= 
##$RELAX= 
##$RELAX= 
##$RELAX= 
##$RELAX= 
##$RELAX= 
$$ Bruker specific parameters
$$ --------------------------
##$DU= <F:/spectra>
##$EXPNO= 1
##$NAME= <H-F>
##$PROCNO= 1
##$TYPE= <nmr>
##$USER= <she>
##$AMP= (0..31)
100 100 100 100 100 100 100 100 100 100 100 100 100 100 100 100 100 100 
100 100 100 100 100 100 100 100 100 100 100 100 100 100 
##$AQSEQ= 0
##$AQ_mod= 1
##$AUNM= <au_zg>
##$AUTOPOS= <>
##$BF1= 200.13
##$BF2= 200.13
##$BF3= 200.13
##$BF4= 200.13
##$BF5= 200.13
##$BF6= 200.13
##$BF7= 200.13
##$BF8= 200.13
##$BYTORDA= 1
##$CFDGTYP= 0
##$CFRGTYP= 5
##$CHEMSTR= <none>
##$CNST= (0..31)
1 1 145 1 1 1 1 1 1 1 1 1 1 1 1 1 1 1 1 1 1 1 1 1 1 1 1 1 1 1 1 1 
##$CPDPRG= <>
##$CPDPRG1= <>
##$CPDPRG2= <>
##$CPDPRG3= <>
##$CPDPRG4= <mlev>
##$CPDPRG5= <mlev>
##$CPDPRG6= <mlev>
##$CPDPRG7= <mlev>
##$CPDPRG8= <mlev>
##$CPDPRGB= <>
##$CPDPRGT= <>
##$D= (0..31)
0 1.2 0 0 0 0 0 0 0 0.06 0 0.03 0 0 0 0 0.0002 0 0 0 0 0 0 0 0 0 0 0 0 
0 0 0 
##$DATE= 1661761317
##$DBL= (0..7)
120 120 120 120 120 120 120 120 
##$DBP= (0..7)
150 150 150 150 150 150 150 150 
##$DBP07= 0
##$DBPNAM0= <>
##$DBPNAM1= <>
##$DBPNAM2= <>
##$DBPNAM3= <>
##$DBPNAM4= <>
##$DBPNAM5= <>
##$DBPNAM6= <>
##$DBPNAM7= <>
##$DBPOAL= (0..7)
0.5 0.5 0.5 0.5 0.5 0.5 0.5 0.5 
##$DBPOFFS= (0..7)
0 0 0 0 0 0 0 0 
##$DE= 6
##$DECBNUC= <off>
##$DECIM= 32
##$DECNUC= <off>
##$DECSTAT= 4
##$DIGMOD= 1
##$DIGTYP= 9
##$DL= (0..7)
0 120 120 120 120 120 120 120 
##$DP= (0..7)
150 150 150 150 150 150 150 150 
##$DP07= 0
##$DPNAME0= <>
##$DPNAME1= <>
##$DPNAME2= <>
##$DPNAME3= <>
##$DPNAME4= <>
##$DPNAME5= <>
##$DPNAME6= <>
##$DPNAME7= <>
##$DPOAL= (0..7)
0.5 0.5 0.5 0.5 0.5 0.5 0.5 0.5 
##$DPOFFS= (0..7)
0 0 0 0 0 0 0 0 
##$DQDMODE= 0
##$DR= 18
##$DS= 0
$$ [...]
##$SUBNAM2= <"">
##$SUBNAM3= <"">
##$SUBNAM4= <"">
##$SUBNAM5= <"">
##$SUBNAM6= <"">
##$SUBNAM7= <"">
##$SUBNAM8= <"">
##$SUBNAM9= <"">
##$SW= 18.0517283424941
##$SWIBOX= (0..15)
0 0 2 0 0 0 0 0 0 0 0 0 0 0 0 0 
##$SW_h= 3612.71676300578
##$TD= 16384
##$TD0= 1
##$TE= 0
##$TE2= 300
##$TE3= 300
##$TEG= 300
##$TL= (0..7)
0 120 120 120 120 120 120 120 
##$TP= (0..7)
150 150 150 150 150 150 150 150 
##$TP07= 0
##$TPNAME0= <>
##$TPNAME1= <>
##$TPNAME2= <>
##$TPNAME3= <>
##$TPNAME4= <>
##$TPNAME5= <>
##$TPNAME6= <>
##$TPNAME7= <>
##$TPOAL= (0..7)
0.5 0.5 0.5 0.5 0.5 0.5 0.5 0.5 
##$TPOFFS= (0..7)
0 0 0 0 0 0 0 0 
##$TUNHIN= 0
##$TUNHOUT= 0
##$TUNXOUT= 0
##$USERA1= <user>
##$USERA2= <user>
##$USERA3= <user>
##$USERA4= <user>
##$USERA5= <user>
##$V9= 5
##$VALIST= <valist>
##$VCLIST= <CCCCCCCCCCCCCCC>
##$VD= 0
##$VDLIST= <DDDDDDDDDDDDDDD>
##$VPLIST= <PPPPPPPPPPPPPPP>
##$VTLIST= <TTTTTTTTTTTTTTT>
##$WBST= 1024
##$WBSW= 4
##$XGAIN= (0..3)
0 0 0 0 
##$XL= 0
##$YL= 0
##$YMAX_a= 1064818
##$YMIN_a= -1440104
##$ZGOPTNS= <>
##$ZL1= 120
##$ZL2= 120
##$ZL3= 120
##$ZL4= 120
##$ABSF1= 10
##$ABSF2= 0
##$ABSG= 5
##$ABSL= 3
##$ALPHA= 0
##$AQORDER= 0
##$ASSFAC= 0
##$ASSFACI= 0
##$ASSFACX= 0
##$ASSWID= 0
##$AUNMP= <proc_1d>
##$AZFE= 0.1
##$AZFW= 0.1
##$BCFW= 1
##$BC_mod= 2
##$BYTORDP= 1
##$COROFFS= 0
##$CY= 11.3945322036743
##$DATMOD= 1
##$DC= 2
##$DFILT= <>
##$DTYPP= 0
##$F1P= 2.36226072786647
##$F2P= -0.459571619588291
##$FCOR= 0.5
##$FTSIZE= 0
##$FT_mod= 4
##$GAMMA= 1
##$GB= 0.15
##$INTBC= 1
##$INTSCL= 1
##$ISEN= 128
##$LB= 0.24
##$LEV0= 0
##$LPBIN= 0
##$MAXI= 10000
##$MC2= 0
##$MEAN= 0
##$ME_mod= 0
##$MI= 1.114404
##$NCOEF= 0
##$NC_proc= 0
##$NLEV= 6
##$NOISF1= 3.799351
##$NOISF2= 2.8
##$NSP= 1
##$NTH_PI= 0
##$NZP= 0
##$OFFSET= 15.70392
##$PC= 1
##$PHC0= -18050.45
##$PHC1= 24.00069
##$PH_mod= 1
##$PKNL= yes
##$PPARMOD= 0
##$PSCAL= 0
##$PSIGN= 0
##$REVERSE= no
##$SF= 200.130013532006
##$SI= 16384
##$SIGF1= 3
##$SIGF2= 2
##$SINO= 400
##$SIOLD= 16384
##$SREGLST= <1H.CDCl3>
##$SSB= 0
##$STSI= 0
##$STSR= 0
##$SW_p= 3612.71676300578
##$SYMM= 0
##$S_DEV= 0
##$TDeff= 0
##$TDoff= 0
##$TI= <>
##$TILT= no
##$TM1= 0
##$TM2= 0
##$TOPLEV= 0
##$USERP1= <user>
##$USERP2= <user>
##$USERP3= <user>
##$USERP4= <user>
##$USERP5= <user>
##$WDW= 1
##$XDIM= 8192
##$YMAX_p= 0
##$YMIN_p= 0
$$ End of Bruker specific parameters
$$ ---------------------------------
##NTUPLES= NMR FID
##VAR_NAME=  TIME,          FID/REAL,        FID/IMAG
##SYMBOL=    X,             R,               I
##VAR_TYPE=  INDEPENDENT,   DEPENDENT,       DEPENDENT
##VAR_FORM=  AFFN,          ASDF,            ASDF
##VAR_DIM=   8192,          8192,            8192
##UNITS=     SECONDS,       ARBITRARY UNITS, ARBITRARY UNITS
##FACTOR=    0.0002768,     1,               1
##FIRST=     0,             0,               0
##LAST=      2.2672688,     0,               0
##MIN=       0,             -1440104,        0
##MAX=       2.2672688,     1064818,         0
$$ Real data points
##PAGE= N=1
##DATA TABLE= (X++(R..R)), XYDATA
$$ [...]
2596a324J513l81r03l14M3K510p88m60K12k02n14J398n02o84J003p07j15m93J166
$$ -1324 189 -192 -1095 -1409 -1366 1144 356 -104 108 -94 -608 790 288 -396 607 -100 -215 -708 458
2615D58R7k077J666L20j192R62j76j18j98R07r73j92J249j218M72L1K29j140Q68
$$ 458 555 -1522 144 464 -728 234 58 -60 -258 649 -324 -516 733 -485 -13 18 247 -893 -25
2634b5r0O4J142j550m40R49N9k31M91J96K52o23m27N67k89q36P87J091m41j449
$$ -25 -115 -51 1091 -459 -899 50 109 -122 369 565 817 194 -233 334 45 -791 -4 1087 646 -803
2654h03J074j63j29M06l0l96L98P82p49p39R49q31L39J29J84l23K15r6o03K19
$$ -803 271 108 -21 385 355 -41 357 1139 390 -349 600 -231 108 237 421 98 313 217 -386 -167
2674a67O82n76M79m38K49p5N9m39M62j519J141M11j294R55J55o46K04N04p97K49
$$ -167 515 -61 418 -20 229 154 213 -226 236 -1283 -142 269 -1025 -70 85 -561 -357 147 -650 -401
2694d01J265r89l38N23L82O8q42n50R04o51Q73k32J345n66r48j8l96J95M30p09
$$ -401 864 -125 -463 60 442 510 -332 -882 22 -629 244 12 1357 791 -157 -175 -571 -376 54 -655
2714f55P26K53m23N18n89K36j061P64R07o54l34O3M33j15l5Q31m38j51o68P60
$$ -655 71 324 -99 419 -170 66 -995 -231 676 22 -312 -249 184 69 34 865 427 276 -392 368
2734C68l05O00o87p93Q13M63R16l65j174J027k73m00l44M25k44J32m10L37Q9o95
$$ 368 63 663 -24 -817 -4 459 1375 1010 -164 863 590 190 -154 271 27 159 -251 86 175 -520
2754e20O41K88j69K93o0n37J158p55k27j4p55Q64p95P17N46j268J738L19j971
$$ -520 121 409 240 533 473 -64 1094 339 112 98 -657 207 -588 129 675 -593 1145 1464 -507
2773e07L65Q16p13n13J661j883J797l34n32j145R31K51J55J6n8n07N00Q78k490
$$ -507 -142 674 -39 -552 1109 -774 1023 689 157 -988 -57 194 349 365 307 -200 300 1178 -1312
2792a312J330m81M90M63J53j01m27j309R72K10j54J3j43M49N32j272J18kQ18l7
$$ -1312 18 -463 27 490 643 542 115 -1194 -222 -12 -166 -153 -296 153 685 -587 -469 -471 347 310
2812C10P3k37O55j196J022o5m58k54k48Q76R7m48J90o32k98R73n95m84J239m76
$$ 310 383 146 801 -395 627 562 104 -150 -398 478 575 127 317 -315 -613 360 -235 -719 520 44
2832D4L70n54O2M47L82j271N07k3K82OO0o22L67K92n57P38l41k84M34l25K0J02
$$ 44 414 -140 -78 369 751 -520 -13 -36 246 252 312 -310 57 349 -208 530 189 -95 339 14 34 136
2854A36o68J017r7O11j264Q99p20l34O98n50N42k75K14j26m59J040p77j62K31
$$ 136 -532 485 388 999 -265 634 -86 -420 278 -272 270 -5 209 83 -376 664 -113 -275 -44
2873d4L03l35n14N19M59j410J196l55n8n57k34J698m50K28m52Jo34O2J208k81
$$ -44 259 -76 -590 -71 388 -1022 174 -181 -239 -796 -1030 668 218 446 -6 -5 -639 -577 631 350
2893C50o2n81L5R1m60k56Q87J30K2k75r69J043L63l23P76j336J000l12J115o97
$$ 350 288 -293 -258 -167 -627 -883 4 134 156 -119 -1088 -45 318 -5 771 -565 435 123 1238 541
2913E41m23R1o2l41N84j25q31j61N18Q7L34J77j14J81p06Q05l17M35p89k82J007
$$ 541 118 209 147 -194 390 265 -566 -727 -209 -122 212 389 275 456 -250 555 238 673 -116 -398 609
2934F09o57O21k17j092O13P16o45l95P38M75j73j370K73L86p99O15L33o26j18
$$ 609 -48 573 356 -736 -123 593 -52 -447 291 766 593 -777 -504 -118 -917 -302 31 -595 -713
2953g13J440j043P04Q6j67r4l33j66L33K27j99k30L30l46l17J26l33K22N60K73
$$ -713 727 -316 388 474 307 213 -120 -286 47 274 75 -155 175 -171 -488 -362 -695 -473 87 360
2973C60o92J702r72P90p81j22k7r89R16K47j39M65j6m30M94K22j371k45R93j30
$$ 360 -332 1370 398 1188 407 285 258 -731 185 432 293 758 742 312 806 1028 -343 -588 405 275
2993B75l89l26R48n20o8m54N96l25m46O87J43O61j648P25K34n70R1n92J282m25
$$ 275 -114 -440 508 -12 -80 -534 62 -263 -709 -22 121 782 -866 -141 93 -477 -386 -978 304 -121
3013a21n88k26R09L16p75L85N35L81p51j86l28N35J5l99L83L50o21l78J314j350
$$ -121 -709 -935 -26 290 -485 -100 435 816 65 -121 -449 86 101 -298 85 435 -186 -564 750 -600
3033f00J178p49K94O06o78M3m74J88j66M94M15j056K53M25R05n38k4k13m28M63
$$ -600 578 -171 123 729 51 94 -380 -192 -358 136 551 -505 -252 173 1078 540 516 303 -125 338
3053C38k62N09r88P36k33j4M9R6Q3K01K03j509n69J101O31L74o65q9l95M21RK56
$$ 338 76 585 -403 333 100 86 135 231 314 515 718 -791 -1360 -259 372 746 81 -8 -403 18 27 283
3075B83m81O94k12j43o51N86n52L83M27p83J178p76o90N72l87O72o45K30M73r5
$$ 283 -198 496 284 141 -510 76 -476 -93 334 -449 729 -47 -737 -165 -552 120 -525 -295 178 83
3095H3J29j2k13L78lK10k15n38J58n2N24k81l48J100q24J05L36O25l86j285L90
$$ 83 212 200 -13 365 362 572 357 -181 -23 -75 449 168 -180 920 96 201 537 1162 776 -509 -119
3116a19j17k47N77O41j6k54j506J444K83j206J083r53R07K72p50K22o55L29J90
$$ -119 -236 -483 94 735 719 465 -1041 403 686 -520 563 -390 517 789 39 261 -394 -65 125
3135A25Q5l26j48O01n47R61q16N38j190J413p95JRK7l94L81P47o27Q6n68N26m13
$$ 125 210 -116 -264 337 -210 751 -65 473 -717 696 -99 -98 -89 -62 -456 -75 672 45 131 -437 89 -324
3157c24M38k92J35Q11Jl89M38o58j63P3L41L22m36r1L00J16J52j223j39P09M88
$$ -324 114 -178 -43 768 769 380 818 160 -3 70 411 733 297 206 506 622 774 -449 -588 121 609
3178F09q49K20p17J318p59Q6O01p39j76O27j20m09q38K20K76Q19k38j335O50P97
$$ 609 -240 -20 -737 581 -178 -92 509 -230 -406 221 101 -308 -1146 -926 -650 169 -69 -1404 -754 43
3198D3l38l62J124j92o0R35j175Q05o00K21k76o51K12q04J389n65L55j60R67p50
$$ 43 -295 -657 467 275 215 1150 -25 780 180 401 125 -526 -314 -1118 271 -294 61 -99 868 118
3218A18K22k50J82k90j79Q71p63k5K18j64o47K96Q68p83R60Q6k17j187R98j075
$$ 118 340 90 272 -18 -197 674 -89 -114 104 -60 -707 -411 457 -326 634 720 503 -684 314 -761
3238g61J305q99Q12m53J8n15P91m17N12j41m03K16J34J28n18O43j095o22J259
$$ -761 544 -355 457 4 22 -493 298 -119 393 252 -151 65 199 327 -191 452 -643 -1265 -6
3257fK96r50R04k21j5o92J168r47K22J083r11k63P34p07J77j02O7O06r34j97p1
$$ -6 290 -660 244 23 8 -684 484 -463 -241 842 -69 -332 402 -305 -128 -230 -163 443 -491 -688 -759
3278g59J034l84K80J059l75p19j50j18Q91j017R55n12k20m59K66n9k99Q79j48
$$ -759 275 -109 171 1230 855 136 -14 -132 759 -258 697 185 -35 -494 -228 -287 -586 293 145
3297A45k01j90r49J113k0l12P98r07k88Q05n05N94n04M23m7L23r10N50n35N39
$$ 145 -56 -246 -1195 -82 -102 -414 384 -523 -811 -6 -511 83 -421 2 -45 278 -632 -82 -617 -78
3317g8L96m45J20q7l25J79Q81p48j20l24J533j647J113j1j213L12N08L63j27r90
$$ -78 318 -127 -7 -94 -419 -240 641 -107 -227 -551 982 -665 448 437 -776 -464 44 407 280 -710
3337g10J561j015J275j216P06j024J43L40N82j205K06P41n40J56k24J090q94l42
$$ -710 851 -164 1111 -105 601 -423 -280 60 642 -563 -357 384 -156 0 -224 866 -28 -370
3355c70K46O86k9n04k17o8O34P4k03N28j76m20N59k89j279J02M00K05Q19j610
$$ -370 -124 562 533 29 -188 -256 378 452 249 777 601 181 740 451 -828 -726 -326 -121 698 -912
3375i12R35Q1O36n05J12j58p32O63j104J053k81P84L88j77k87m08Lk50J46M22
$$ -912 23 104 740 235 347 189 -543 120 -984 69 -212 572 960 783 496 88 91 -159 -13 409
3395D09j151J90k30K74L16L15k59M48l85J79kL89j455P59K25n35K61O00j104M46
$$ 409 -742 -552 -782 -508 -192 123 -136 312 -73 106 104 493 -962 -203 22 -513 -252 348 -756 -310
3415c10K26l75O26J50r40Q84k4q33Q7r3M18r2L34K29Q0p53J143o38k17M00n7k
$$ -310 -84 -459 167 317 -623 261 237 -596 -509 -602 -184 -276 58 287 367 -386 757 119 -98 302 245 243
3437B43q06O01o53J777j318N51q42P33p19P5N35j490N34M51J97Q89l61J64p55
$$ 243 -563 38 -615 1162 -156 395 -447 286 -433 -358 177 -1313 -779 -328 -131 758 397 561 -194
3456a94n7J78M97j038O00L02m73k1M08M57j116J477p98L12r00N05j70O71p76l52
$$ -194 -251 -73 424 -614 -14 288 -185 -206 202 659 -457 1020 222 534 -366 139 -31 640 -136 -488
3476d88J076p70m30P32j88J09q53J899n99j000K00K78K43k85M64p19n70Q52m63
$$ -488 588 -182 -612 120 -68 41 -812 1087 488 -512 -312 -34 209 -76 388 -331 -901 -49 -512
3495e12K68k65M70N02q3k32m09j41mN08l16R12n13k02k98J17o9M92j83Q63m32
$$ -512 -244 -509 -39 463 380 148 -261 -402 -406 102 -214 698 185 -17 -315 -198 -267 225 42 905 473
3516D73p24J005n69r1M13m96j080M35J384k55m65Q0j062O79J725j363K80j04n12
$$ 473 -251 754 185 94 507 11 -1069 -634 750 495 30 110 -952 -273 1452 89 369 265 -247
3535b47L48J93m59O10j56j27n68K15M59M39q10p69J648o16K09j225R93m76P08
$$ -247 101 294 -165 445 289 162 -406 -191 268 707 -103 -872 776 160 369 -856 137 -339 369
3554C69n72j64p2K72M49L21n14p83R66o65l94J214j0m77r00J042j74k75P56J65
$$ 369 -203 -367 -439 -167 282 603 89 -694 272 -393 -787 427 417 -60 -960 82 -92 -367 389 554
3574E54k53j227Q02N52J19j00j614Q94O07j199J258k65k20J05n15L68k15J19N56
$$ 554 301 -926 -124 428 547 447 -1167 -273 334 -865 393 128 -92 13 -502 -134 -349 -230 326
3593C26p94M66R86j623J041L27j085L90O98q04K5q88J190j33q79J14M05n24J008
$$ 326 -468 -2 984 -639 402 729 -356 34 732 -72 -47 -935 255 122 -757 -643 -238 -762 246
3612B46p41J490l04j041R9p8P06Q8o67k04J083r03L58j66O85j114m02Q90j39J48
$$ 246 -495 995 691 -350 -251 -329 377 465 -202 -406 677 -226 132 -34 651 -463 -865 25 -114 34
3632C4n16O30q61J73Q5j04P51j94r0N9J07L60r40r2J054m48M24j066P54n27P38
$$ 34 -482 148 -713 -540 -455 -559 192 -2 -92 -33 74 434 -506 -598 456 8 432 -634 120 -407 331
3653C31O3k54K90o80o16R05r04m08J665N0l78j0l14K75O62p21K86l43L00L41m62
$$ 331 394 140 430 -250 -866 39 -865 -1273 392 442 64 54 -260 15 677 -44 242 -101 199 540 78
3674G8L68J57p67O43m62L12j020m8P14P90o02m02N72Q37r40p57J217q82q2R7O67
$$ 78 446 603 -164 479 17 329 -691 -739 -25 765 163 -239 333 1170 230 -527 690 -192 -274 -177 490
3695D90m50o0p5J628j560k14N0M96n17l9Q38r61N57l56k11Q91l70m8j80O65n94
$$ 490 40 -20 -95 1533 -27 -241 -191 305 -212 -251 587 -374 183 -173 -384 507 137 89 -91 574 -20
3716b0j76o38P86M28o45K90j06R14n83r4J45j087J315p18M46L99n25K56j049O59
$$ -20 -196 -834 -48 380 -265 25 -81 833 250 156 301 -786 529 -189 257 656 131 387 -662 -3
3736cJ039j526M02k90R01j13j109R10Q5K12j157J562j297j70K0J239j074P32k45
$$ -3 1036 -490 -88 -378 523 410 -699 211 296 508 -649 913 -384 -554 -534 705 -369 363 118
3755A18M4q2p39J362q13P98o58Q00p57r54R92j32J016k96p37j0l63L32M92j090
$$ 118 162 80 -659 703 -110 688 30 830 73 -881 111 -21 995 699 -38 -48 -411 -79 413 -677
3775f77j06j02Q10o44J284n35J05m27K7L52o71J034o33M03j2j19RJ26M44k79j56
$$ -677 -783 -885 -75 -719 565 30 135 -292 -265 87 -584 450 -183 220 208 89 98 224 668 389 233
3796B33J70q63N07p57J248o64O32p67n3Q28j45j019L83k65k52J217j28N88j055
$$ 233 403 -460 47 -710 538 -126 506 -261 -314 514 369 -650 -267 -532 -784 433 305 893 -162
3815a62M54j1j40l58M05p86Q7J65jP97p07Q02q88J044q54l5l83Q2Q95p56O71k84
$$ -162 292 281 141 -217 188 -598 -511 -346 -347 450 -257 545 -343 701 -153 -188 -571 -489 406 -350 321 37
3837C7q16M42J07P09q79O00k8o8L37l50n84N84J09j4P4n12j80M87K01O92j511
$$ 37 -779 -337 -230 479 -400 200 172 104 441 91 -493 91 200 186 260 -252 -432 55 256 948 -563
3858e63N87j70m0L12m61Q6P03m65p21O86j030R80L10qK3j071M16J241j613J158
$$ -563 24 -146 -186 126 -335 -249 454 -11 -732 -46 -1076 -96 214 206 229 -842 -426 815 -798 360
3878C60J03n56l83k98Q49l37K71j13K27M61n98L85L76j770J507m61L41k19O0j98
$$ 360 463 -93 -476 -774 75 -262 9 -104 123 584 -14 371 747 -1023 484 23 364 145 205 7
3898Gn26J224j783K053j958J258j37K3j69K68K85o55N04j607J005j4N21j88J45
$$ 7 -519 705 -1078 975 -983 275 138 161 -8 260 545 -110 394 -1213 -208 -222 299 111 256
3917B56j42j13J005j84r17k28N22o08N58n34K92N8l65k02P62K04J41l05J05P9
$$ 256 114 1 1006 822 -95 -323 199 -409 149 -385 -93 -35 -400 -602 160 364 505 200 305 384
3937C84p69m3L85Q01k53o67J38P43o87l85L35N44j115J023J79j198O74J13q01
$$ 384 -385 -428 -43 758 505 -162 -24 719 32 -353 -18 526 -589 434 613 -585 89 202 -599
3956e99O97M97N1n01o73J639k36l69L20l67o15o9J50j050L24M86L38L12m32j3
$$ -599 98 595 646 145 -528 1111 875 506 826 459 -156 -225 -75 -1125 -801 -315 23 335 -97 -110
3976a10J67J56q5L9j90j148J721q96L91m78Q22m33j29K35n20K82o26O78j38O92
$$ -110 57 213 128 167 -23 -1171 550 -346 45 -433 389 -44 -173 62 -458 -176 -802 -124 -262 430
3996D30J53p15M1k62l35j38M69n44J450l56o86J784j365M49o40J67M97k11P9p20
$$ 430 583 -132 -91 -353 -688 -826 -357 -901 549 193 -493 1291 -74 375 -265 -98 399 188 267 -453
4016d53O73J32r77k74J009m44K50L49j78q31J83j34R44j65j23m36P36L0N22j183
$$ -453 220 352 -625 -899 110 -334 -84 265 87 -744 -561 -695 249 84 -39 -475 261 291 813 -370
4036c70Q18j07L78n07o94Q70P01p11l62MN9Q80j022L60q63L37P82m96O6n02Q14
$$ -370 448 341 719 212 -482 388 1089 378 16 20 79 959 -63 297 -566 -229 553 57 123 -379 435
4057D35j41K40j67j106J113o67J164o73l22P60o07J70o54O66k36K9N9k56P18m28
$$ 435 294 534 367 -739 374 -293 871 198 -124 636 29 199 -455 211 -25 4 63 -193 525 97
4077I7l39N67o61O68k54l42M99oM27j458J184q74P42L63j825J108k7J71m43L27
$$ 97 -242 325 -336 332 78 -264 235 229 656 -802 382 -492 250 613 -1212 -104 -131 40 -403 -76
4097g6L82j96R3l08M85l06j59M10j433N49P69r77R55L48o09m49J423j156L42m49
$$ -76 306 110 203 -105 380 74 -85 325 -1108 -559 210 -767 188 536 -73 -522 901 -255 87 -362
4117c62L69m91L66J37q68J140j06j68N04k93r34L79P00o02N35m28m93J218p86
$$ -362 7 -484 -118 19 -849 291 185 17 521 228 -706 -327 373 -229 306 -122 -615 603 -183
4136a83O90j017J643j075r07J461m12L16m25n67P30j182Q75O05p71L40L62j103
$$ -183 507 -510 1133 58 -849 612 200 516 91 -476 254 -928 -53 552 -219 121 483 -620
4154f20J060q58j31N40o0J87m24K69O23k04n61n4O43K03j130J75J36P80J36r45
$$ -620 440 -418 -549 -9 -69 118 -306 -37 586 382 -179 -233 410 613 -517 -342 -206 574 710 -235
4174b35K94m57J93L88O5J44j210Q65j12L02l31O02j448P54o85N16K54p49J4N97
$$ -235 59 -398 -205 183 248 392 -818 47 -65 237 -94 508 -940 -186 -871 -355 -101 -850 -836 -239
4194b39J09N65K2K37n08L36l96R82k38j831J079K33L25j152J004P26j409n64o1
$$ -239 -130 435 457 694 186 522 126 1108 870 -961 118 351 676 -476 528 1254 -155 -719 -780
4213g80k16L14M44l05o3O75n2n91P2R9J98R52j89q86M86n38J27n10J043r0rM12
$$ -780 -996 -682 -238 -543 -606 69 17 -574 -502 -403 -205 747 558 -328 158 -380 -253 -763 280 190 181 593
4235E93p17P01j250J342r88K1k36R22q77l71Q82n2k94q3L13K66n94R97r6J00p42
$$ 593 -124 577 -673 669 -319 -298 -534 388 -489 -860 22 -30 -324 -407 -94 172 -422 575 479 579 -163
4256a63j67M4J043k04n21M79l33r16J292k73p35N9n3m0N07l23N27O72n19j128
$$ -163 -330 -286 757 553 32 511 178 -738 554 281 -454 -395 -448 -488 19 -304 223 895 376 -752
4276g52O50K24n6j248J081P03p63J35k99J047l21L82j539R27Q4m83Q9J95J97n53
$$ -752 -102 122 66 -1182 -101 602 -161 -26 -325 722 401 783 -756 171 255 -228 -139 56 253 -300
4296c00n10J194l46m12q6R35l72K81Q1J63L47n43n0j81J79j712J861K75j163J138
$$ -300 -810 384 38 -374 -460 475 103 384 465 628 975 432 382 201 380 -1332 529 804 -359 779
4316G79m76lM17j156N43j25L85o50L98N74j07m50m30K67k7J271o97j30k03l75
$$ 779 303 300 717 -439 104 -21 364 -286 112 686 579 129 -301 -34 -61 1210 513 383 180 -195
4336a95J09o0n2R7K59n98M60N28q92J210j88l61j164L42R67j55l95Q73K25l42
$$ -195 -86 -146 -198 -101 158 -440 20 548 -344 866 678 317 -847 -505 462 307 -88 785 1010 668
4356F68k20j522O17l34O22n98J511q58j81l22M47M12J13m00k74P80j271J011L87
$$ 668 448 -1074 -457 -791 -169 -767 744 -114 -295 -617 -170 242 355 -45 -319 461 -810 201 588
4375E88q68L43R73j074r3J050n53k16K10m26n29R10n82J070j120m68P75n63R06
$$ 588 -280 63 1036 -38 -131 919 366 150 360 -66 -595 315 -267 803 -317 -785 -10 -573 333
4394C33j744J546p13P35O43r56J05K8m18K68L85K10n39r38O83o32j9J101n44l97
$$ 333 -1411 135 -578 157 800 -156 -51 -23 -441 -173 212 422 -117 -1055 -372 -1004 -1023 78 -466 -863
4414h63J122n92r3j44N90m63N64l68N36l03O72K76n36j206J94O88q0R8L77m15
$$ -863 259 -333 -426 -570 20 -443 121 -247 289 -14 658 934 398 -808 -614 74 -6 92 469 54
4434E4O09j108L15k50M11m1k41Q7o57Q51K31QL27q47M07K00j123L39O66j084Q20
$$ 54 663 -445 -130 -380 31 -10 -251 -164 -821 30 261 269 596 -251 156 356 -767 -428 238 -846 -26
4455b6M8K84p73J21M21L43r9k71k48N33m7l05O69J05K2j101R56l55j02l40K13
$$ -26 22 306 -467 -346 75 418 319 48 -200 333 286 -19 650 755 777 -324 632 277 175 -165 48
4476D8m83J364j284N12m30j4P03p01P63L28j243R2J031j483M76K39j82K16M43
$$ 48 -435 929 -355 157 -273 -287 416 -285 478 806 -437 -345 686 -797 -321 -82 -264 -48 395
4495C95j393J956j747N08m8K05J85L38p15L9m36R2J376j343M81n09l17J205K00
$$ 395 -998 958 -789 -281 -329 -124 61 399 -316 -277 -713 -621 755 -588 -107 -616 -933 272 472
4514D72j352J007n41L89o90R57n03j86P37p55M33K11R8q46p84J014O00n66N86
$$ 472 -880 127 -414 -25 -715 242 -261 -447 290 -465 -32 179 277 -569 -1353 -339 261 -305 281
4533B81M51j212K84l31N97k80l39J302j149R21r58L02K4N16n11k35O75l02p17
$$ 281 732 -480 -196 -527 70 -210 -549 753 -396 525 -433 -131 -107 409 -102 -337 338 36 -681
4552f81O6Q31J083j778N91j81k86q5o02M06K67J13j71M57n63L44L96n00Q64p91
$$ -681 -615 216 1299 -479 112 -69 -355 -440 -1042 -636 -369 -256 -427 30 -533 -189 207 -293 571 -220
4572b20o86J404k08O73r99Q75l43p01K12n36L0N19j98M08j018J314j50o34N9R45
$$ -220 -906 498 290 963 -36 839 496 -205 7 -529 -499 20 -178 230 -788 526 376 -258 -199 746
4592G46lj609N63l04Q62k4r5L8K18M81o84j609J943m98K74o45M52M22l08k86K23
$$ 746 743 -866 -303 -607 255 231 136 174 392 873 189 -1420 523 25 299 -346 106 528 220 -66 157
4613A57O61o11K22n66J025p41o88K77l64P42J60p78O38N07m84o68J725q74J18
$$ 157 818 207 429 -137 888 147 -541 -264 -628 114 274 -504 134 641 157 -511 1214 340 458
4632D58r71J170m56o68J94J23J71L78K48J80j501O79M30o76m54K89J108n24J83
$$ 458 -513 657 201 -467 -273 -150 21 399 647 827 -674 5 435 -241 -695 -406 702 178 361
4651C61J30j008R84p73j91k66O86j37l73K10J009J7k10p55O48p41J699j481L54
$$ 361 491 -517 467 -306 -497 -763 -77 -214 -587 -377 632 649 439 -316 332 -409 1290 -191 163
4670A63M40r93J565m38r95M3J367j098k81m14j42kL14O29L85q00Q12l04k82K8
$$ 163 603 -390 1175 737 -258 -215 1152 54 -227 -641 -783 -785 -471 158 543 -257 555 251 -31 -3
4690cr7o5j18n97J594k70on86Q54r61O63l93O5k53l95J284r08l22J94p77P47J491
$$ -3 -100 -165 -283 -880 714 444 438 -148 706 -255 408 15 80 -173 -568 716 -192 -514 -320 -1097 -350 1141
4712A141j376N64p88N20p9R47p15j503P59R55p4l40j45M33n41J90P10j015K5K8
$$ 1141 -235 329 -459 61 -18 929 214 -1289 -530 425 351 11 -134 299 -242 -52 658 -357 -332 -304
4732c04j38k07K51m5m04J238j089O94j25KK91m78K30l96R46j2n00J055n91K12
$$ -304 -442 -649 -398 -443 -847 391 -698 -4 -129 -127 164 -314 -84 -480 466 454 -46 1009 418 630
4752F30l93Q3j063Q14O5j214O35Q79m69J170j115m8M86q55l75N08N90j193J195
$$ 630 237 320 -743 71 136 -1078 -443 436 -33 1137 22 -26 460 -395 -770 -262 328 -865 330
4771C30M76j771M71P84q7J45q27P80J56n20j58j47J380o27p92N02n84m26O21L29
$$ 330 806 -965 -494 290 203 348 -479 301 457 -63 -221 -368 1012 385 -407 95 -489 -915 -294 35
4791C5j97l80O31j59p35Q77o18J36M00J167j889R55k38M82j245M11N81l18P07
$$ 35 -162 -542 89 -70 -805 72 -546 -410 -10 1157 -732 223 -15 467 -778 -367 214 -104 603
4810F03o78J026j396Q78n45k2k28J73k09M57l68R60q68j049J767j50k04J01O98
$$ 603 -75 951 -445 433 -112 -134 -362 -189 -398 59 -309 651 -217 -1266 501 351 147 248 946
4829I46q70K24L0k67l16o68J110r08J393p20k35N44j249J092l82J68j6L61k7q79
$$ 946 76 300 330 63 -253 -921 189 -719 674 -46 -281 263 -986 106 -276 -108 -124 237 210 -669
4849f69M57K7j20J82P3m73M49j79j43M86p15L87r4L61N39l25l31J6L18n20O64
$$ -669 -212 -185 -305 -123 -50 -523 -74 -253 -396 90 -625 -238 -332 29 568 243 -88 -72 246 -274 390
4870C90k02n4K16p28n75N65J22P47j94j85M28r20J538o58j220J382o15L04j167
$$ 390 188 134 350 -378 -953 -388 -266 481 287 102 530 -390 1148 490 -730 652 37 341 -826
4889h26K69O38J04o50Q40m75P32n21l83K26O52j19j76o58N31P1J84q71P76j96
$$ -826 -557 81 185 -465 375 -100 632 111 -272 -46 606 487 311 -347 184 255 439 -432 344 148
4909A48j16M2P30m52j206M65l60R19k3k6j65pJ64K61p28P02n03l7L15k72L9Q12
$$ 148 32 74 804 352 -854 -389 -749 170 147 121 -44 -51 113 374 -354 348 -155 -192 123 -149 -110 702
4931G02k20j9n33P8k42M98p41J99N09K02m52j54j074K027j002M19Q46o71o52J96
$$ 702 482 463 -70 8 -234 264 -477 -278 231 433 -19 -173 -1247 780 -222 197 1043 372 -280 -84
4951h4n79J001j63q3r19Q44K89q50L89P17l13o46J32m39P85k39N81k40K60r0j069
$$ -84 -663 338 175 92 -827 17 306 -544 -155 562 249 -397 -265 -704 81 -158 423 183 443 353 -716
4972g16J204q82j61K09R7N14j89K63j144R21o33M71Q10n32m4j6j55P08j72k86
$$ -716 488 -394 -555 -346 -249 265 76 339 -805 116 -517 -46 764 232 188 172 17 725 553 267
4992B67l53j07o76L44R5P20j140P02o55J498J5j452J166q4R0j368Q52J18l92P3
$$ 267 -86 -193 -869 -525 -430 290 -850 -148 -803 695 710 -742 424 340 430 -938 -86 32 -360 -287
5012b87L70Q16j023n1N74l57q18O0J062j410O02R38k58j52k34n57K20P26p33L86
$$ -287 83 899 -124 -175 399 42 -776 -716 346 -1064 -462 476 218 66 -168 -725 -505 221 -512 -126
5032a26K46K58n29k29J8K72M02Q95p59k87k66p38J132lk32K49p81j63Q02m75P86
$$ -126 120 378 -151 -380 -362 -90 312 1207 448 161 -105 -843 289 286 54 303 -478 -641 161 -314 472
5053D72n84J25O9Q26q65Q7o32P58n05L12N63n4o64Q55Pl84p76k47R03p5J64q65
$$ 472 -112 13 82 908 43 130 -502 256 -249 63 626 572 -92 763 770 386 -390 -637 266 191 355 -510
5075e10P35j50m20J061nj164J014l19j259M76R90l57j5N36j052J202j090l87J633
$$ -510 225 75 -345 716 711 -453 561 242 -1017 -541 449 92 77 613 -439 763 -327 -714 919
5094I19j038r7J75j12K5m25J611q3q81R77j405L02L54l42Q94p14k03N53o44k63
$$ 919 -119 -216 -41 -153 -128 -553 1058 975 94 1071 -334 -32 322 -20 874 160 -43 510 -134 -397
5114c97J51Ll34L90Q12J022k042O59l22n97m49K8Q52J00R41j401J019j4o08L92
$$ -397 -246 -243 -577 -187 625 1647 -395 264 -58 -655 -1104 -1076 -224 -124 817 -584 435 421 -187 205
5134B05J94k38L65o41j37N90l36k81J090j213M27K09j64k26k75O66P74n64o39
$$ 205 399 161 526 -115 -252 338 2 -279 811 -402 25 234 70 -156 -431 235 1009 445 -194
5153a94l18J45M68j78k19j36J177k84L22o17J46r1o74L02O87r46P60o50J164k53
$$ -194 -512 -367 101 -77 -296 -432 745 461 783 166 312 221 -453 -151 536 -410 350 -300 864 611
5173F11o37O11n72p5j36O21m46q14J765qq80l64j3L4J088j533N23j99J97L86N72
$$ 611 -26 585 13 -62 -198 423 -23 -837 928 920 40 -324 -337 -303 785 -748 -225 -424 -227 159 731
5194G31j160L97j62L3q53J853j353O13k93L57n45l91K02M47n25K0O57m65J71l56
$$ 731 -429 -32 -194 -161 -1014 839 -514 99 -194 163 -382 -773 -571 -124 -649 -629 28 -437 -266 -622
5214f22J89K94R2m93J30P07m68k9l32K40j15K97L73m4R4q11R67n6j273R03j036
$$ -622 -433 -139 -47 -540 -410 297 -171 -200 -532 -292 -407 -110 263 219 313 -498 469 413 -860 43 -993
5235i93P60Q29p94J35k90O33L69k15k04K91k90J15p41j84M04N24k51K1L9L6j92
$$ -993 -233 596 -198 -63 -353 280 649 434 230 521 231 346 -395 -579 -175 349 98 119 158 194 2
5256BM83p14o94J928j351J77n03Q18p00M52N63j415K144j332M61q81N14m49P85
$$ 2 485 -229 -923 1005 -346 -169 -672 146 -554 -102 461 -954 1190 -142 319 -562 -48 -497 288
5275B88m78J320j066J29O86j263Q49l69L19j54o35N95m25K74L41n92lo85Q41p51
$$ 288 -190 1130 64 193 879 -384 465 96 415 261 -374 221 -204 70 411 -181 -184 -869 -28 -779
5295g79k87K48j07N56P71N41j526R33j99o2K85L8j69j236L87P99K14O96j669p76
$$ -779 -1066 -818 -925 -369 402 943 -583 350 151 89 374 412 243 -993 -606 193 407 1103 -566 -1342
5315a342J356L43J96l47n63L22p8j79j34P98j46q74P77q9j91M50j146J218j055
$$ -1342 14 357 553 206 -357 -35 -113 -292 -426 372 226 -648 129 40 -151 299 -847 371 -684
5334f84J011n2o61N52M01p86q4L52M82k0p32K69L08k39q40J179O4L85j028L03
$$ -684 327 275 -386 166 567 -219 -303 49 531 511 -221 48 356 117 -723 456 520 905 -123 180
5354A80l6R2L39p62l86L38K09L08N9j24l44m50O87p1r9P5l06j43k3R79n65o02
$$ 180 144 236 575 -187 -573 -235 -26 282 341 217 -127 -577 110 39 -60 15 -291 -434 -457 522 -43 -645
5376f45Q81j068J16M27l0J65P45k07m15J91l85N29J77k28n15n11K63p91Q42O19
$$ -645 236 -832 -716 -289 -319 -154 591 384 -31 160 -225 304 481 253 -262 -773 -510 -1301 -459 160
5396A60l77L64j32J7r03Q19m31P10o1n78J2O56n13j97J41m01Q56j46M49r46Q9
$$ 160 -217 147 15 32 -871 -52 -483 227 166 -412 -400 256 -257 -454 -313 -714 142 -4 445 -501 -412
5417d12j84L09R28n87l65R23o30K51J19r3l84J48j321Q62M63j46M10K88m03j208
$$ -412 -596 -287 641 54 -311 612 -18 233 352 259 -125 23 -1298 -436 27 -119 291 579 176 -1032
5437a032J491j997J149Q66r84M29Q4j54JP98l96k45Q4LK24o96k49M90O45n21M25
$$ -1032 459 -1538 -389 477 -507 -78 6 -148 -147 651 255 10 94 97 321 -375 -624 -134 511 -10 415
5458D15o3o90N90q08K46K26K79k95O94k28K61r27K49N25j08n00m73L5J573k30
$$ 415 352 -338 252 -556 -310 -84 195 -100 594 366 627 -300 -51 474 366 -134 -607 -572 1001 771
5478G71m36J94j564J449k85k16p37N47m3Q84j466J600j3j134Q84M23p77o82L74
$$ 771 335 529 -1035 414 129 -87 -824 -277 -320 564 -902 698 685 -449 435 858 81 -601 -227
5497b27M08j47q58L47K7M92j02p90P94j96j88M17L5J01m22R2o34M25K1N93L30
$$ -227 181 34 -824 -477 -450 42 -60 -850 -56 -252 -440 -23 12 113 -309 -217 -851 -426 -405 188 518
5518E18j57k22n09K51K76N76o41po72J067j251J750l29j405J365j386R73nn6M87
$$ 518 361 139 -370 -119 157 733 92 85 -587 480 -771 979 650 -755 610 -776 197 192 136 623
5538F23Q8j536P62J33L06j34M3o45N82p76l6M31l13N42j346J706M28n23q97N04
$$ 623 711 -825 -63 70 376 242 285 -360 222 -554 -590 -159 -472 70 -1276 430 858 335 -562 -58
5558e8M29l16j69n31L64j34l8l52O92N55j142L88K52j32L28R2o10J081r21R19
$$ -58 371 55 -114 -645 -281 -415 -453 -805 -113 442 -700 -312 -60 -192 136 228 -382 699 -222 697
5578F97j254N28O79j410L65L92j49M43o40N01j140K3J139Q1l11O7R90q16r0J150
$$ 697 -557 -29 650 -760 -395 -3 -152 291 -349 152 -988 -965 174 255 -56 11 1001 185 95 1245
5598A245j363N78n92M10q86K12L02j11J244j521J167r18O49j38k31J245j814R59
$$ 1245 -118 460 -132 278 -608 -396 -94 -205 1039 -482 685 -233 416 278 47 1292 -522 437
5616D37o2o30M59Q21j469M95J379j049N79p16j3L03k99O19l60m87R09j383J39
$$ 437 375 -255 204 1025 -444 51 1430 381 960 244 231 534 235 854 494 7 916 -467 -328
5635c28R02j002J231j945J028N81p63n10P62j6m47J105j546O05k11Q38p72O61
$$ -328 574 -428 803 -1142 -114 467 -296 -806 -44 -60 -507 598 -948 -343 -554 284 -488 173
5653A73m05M34p70P71J23L62M14j670J06M07K72m65L74j58N05q27R97o48p29J5
$$ 173 -232 202 -568 203 326 688 1102 -568 -462 -55 217 -248 126 -32 473 -354 643 -5 -734 -719
5673g19R89j01o69O71k67r01O11M53l31L94p82M09J92o92J430q40P50j060O7L40
$$ -719 270 169 -500 171 -96 -997 -386 67 -264 130 -652 -243 -51 -743 687 -153 597 -463 -396 -56
5693e6l3J22R65j163o84J620q16Q34n25m02m3j01K81N0N84m77p65J86J144o02
$$ -56 -89 33 998 -165 -849 771 -45 789 264 -138 -181 -282 -1 49 633 156 -609 -423 721 119
5713A19J62L03n46m11j12O48L89l71M22o04l9L44m82Nn71j47K27L03n90R40L40
$$ 119 281 584 38 -373 -485 163 552 181 603 -1 -40 304 -178 -173 -744 -891 -664 -361 -951 -11 329
5734C29L46j050n63Q72n24j91L97L40k10K72M47o91M57j030J531q62L69j056R11
$$ 329 675 -375 -938 -66 -590 -781 -384 -44 -254 18 465 -226 231 -799 732 -130 239 -817 94
5753I4J48nk46k47L63r86N46r3M38j49p33J541o36J091j427K6K64R0L0o69N63
$$ 94 242 237 -9 -256 107 -879 -333 -426 12 -137 -870 671 35 1126 -301 -275 -11 79 109 -560 3
5774CO7P08q38p86P37J44j142Q61O40q28O51l52p06Q99m3j48J94o18P29L71n78
$$ 3 70 778 -60 -846 -109 35 -1107 -246 394 -434 217 -135 -841 58 15 -133 61 -557 172 543 -35
5795c5r14J482k95q1o19P89R8l32K39j171P62j35J088n27m81n48J251p36j4l06
$$ -35 -949 533 238 157 -462 327 425 93 332 -839 -77 -212 876 349 -132 -680 571 -165 -179 -485
5815d85k22R19j65K03L16o99L88j037M26k03L90o9n02J431k24j194L71k83N55
$$ -485 -707 212 47 250 566 -133 255 -782 -356 -559 -169 -238 -740 691 467 -727 -356 -639 -84
5834h4O58q17p12O9Q00o19K55M07k08o28J99P95L7m95J08P66j482PJ37Q13n65
$$ -84 574 -243 -955 -886 -86 -705 -450 -43 -251 -879 -680 115 152 -343 -235 531 -951 -944 -807 6 -559
5855e59K59N34n52R98j077J172j104k9m02j92R12J01J95p12l13N32J14M59k83
$$ -559 -300 234 -318 680 -397 775 -329 -358 -760 -952 -40 61 256 -456 -769 -237 -123 336 53
5874E3M3k66Q86M7j077O0k24K28L48M85q39L95M00l5p31j88Q58j169J528j236
$$ 53 96 -170 716 763 -314 -254 -478 -250 98 583 -256 139 539 504 -227 -415 443 -726 802 -434
5894d34M19N72l85n00J68R48j151Q9R03j212J047o11R97j464j77K63R32j123M00
$$ -434 -15 557 172 -328 -160 788 -363 -274 629 -583 464 -147 850 -614 -791 -528 404 -719 -319
5913c19J7qR64q29P7J96p79p0J381k99K3OKJ16N2m20J75k04k41L38o13K59q4L95
$$ -319 -302 -310 654 -175 -98 98 -681 -751 630 331 354 360 362 478 530 110 285 81 -160 178 -435 -176 -260 135
5937A35K88J98o91q23M27k42L55o79O3Q40l4j05J291n67n30j51r8J089r75j79
$$ 135 423 621 -70 -893 -466 -708 -353 -1032 -969 -129 -163 -268 1023 456 -74 -225 -323 766 -209 -388
5957c88K27P8j62n19Q36r0kr9P13o8m95N26j004O78l3n87O75j24o8k9Q77n26p35
$$ -388 -161 -83 -245 -764 72 -18 -20 -119 594 526 31 557 -447 231 198 -389 286 162 94 65 942 416 -319
5980c19l33P86o16Q64o29P6L26M47j001J152j449K34jl58J057N0m4M78q34J001
$$ -319 -652 134 -482 382 -247 -171 155 602 -399 753 -696 -462 -463 -821 236 286 242 720 -114 887
6000H87n79j72J00m79J134j613L46m6N28j98P28q5m36q73O06L00q11M11j129J361
$$ 887 308 136 236 -243 891 -722 -376 -422 106 -92 636 551 115 -758 -152 148 -663 -252 -1381 -20
6020b0O44m00q17Q81j089R45k74K70n90J419j85m94j011R92q0l81o0M65j002J395
$$ -20 624 224 -593 288 -801 144 -130 140 -450 969 784 290 -721 271 191 -190 -250 215 -787 608
6040F08j677R98R21j683J112l52j33P29m78m71M7m5k10J38L88M89r51M79M62p24
$$ 608 -1069 -71 850 -833 279 -73 -206 523 45 -426 -379 -424 -634 -496 -108 381 -570 -91 371 -353
6060c53q69J312l09p0P12M40j265K0K60K88L61o78k75R90j023q1J063j071J548
$$ -353 -1222 90 -219 -289 423 863 -402 -382 -122 166 527 -151 -426 564 -459 -540 523 -548 1000
6079A000n72o07N47p97J34K31j40J5J496k121J742j000J99L75j102J028k12p52
$$ 1000 428 -179 368 -429 -295 -64 -204 -189 1307 -814 928 -72 127 502 -600 428 216 -536
6097e36P72m47K15J87l19k58l17J045O74j321O80j418P32N37J335j418j091R48
$$ -536 236 -211 4 191 -128 -386 -703 342 1016 -305 375 -1043 -311 226 1561 143 -948 0
6115@j94n88J507l86L88j135j90J339m23j9%j59l09k11j63K87K88j78k65j06L81
$$ 0 -194 -782 725 339 727 -408 -598 741 318 299 299 140 -169 -380 -543 -256 32 -146 -411 -517 -136
6136a36O96K79j030L23l04K28l56N06m71J086j27k62q76R68qn59q1RJ85j98L75
$$ -136 560 839 -191 132 -172 56 -300 206 -265 821 694 432 -444 524 516 -43 -124 -115 70 -128 247
6157B47N84m1r40N16r48L34O49j22m80Q70l38K58M11j018p45J686k297J336Q02
$$ 247 831 790 -150 366 -582 -248 401 279 -201 669 331 589 1000 -18 -763 923 -1374 -38 764
6176G64p90k48j122J223Q49k72o98J58J204m43j41j4p33N68o88N8P17j309Q59
$$ 764 -26 -274 -1396 -173 676 404 -294 -136 1068 625 484 470 -263 305 -383 -325 392 -917 -58
6195e8l29R4M96l38m35R32L71r85k63J77O56j012M42K63K74q13J148j61p76j17
$$ -58 -387 -293 203 -135 -570 362 733 -252 -515 -338 318 -694 -252 11 285 -528 620 459 -317 -434
6215d34R22m77j87k63l82J037n12O01K10pn02P94j235N34J19k57J279j758K67
$$ -434 488 11 -176 -439 -821 216 -296 305 515 508 6 800 -435 99 218 -39 1240 -518 -251
6234b51k9N63J49o36k38R77n23l25M00J00j67M40j091P84Q47r22l09M91N7J16
$$ -251 -280 283 432 -204 -442 535 12 -313 87 187 20 460 -631 153 1000 78 -231 260 317 433
6254D33o41m53J129O1k11L58k76j54L61j291J19P11N48L46j294j13R23r38m21
$$ 433 -208 -661 468 529 318 676 400 246 607 -684 -565 146 694 1040 -254 -367 556 -382 -803
6273h03J465o06J90r09Q02n08J09n77O89O68m15j4M37m58j63N7J293j491j52M86
$$ -803 662 56 246 -663 139 -369 -260 -837 -148 520 105 91 528 70 -93 -36 1257 -234 -386 100
6293A00r12J038l93k19n86O48J015j467L46J67M55p15J448r01m69R04n87k70M0
$$ 100 -812 226 -167 -386 -972 -324 691 -776 -430 -263 192 -523 925 24 -445 459 -128 -398 -358
6312c58K47R5m27K9O33N00r24o82J054j58j50n26N79M37r7o16K53R69L27p45k88
$$ -358 -111 -16 -443 -414 219 719 -205 -887 167 9 -141 -667 -88 349 252 -364 -111 858 1185 440 152
6333A52k76R2o80J055q09l80M57P70M13k94J15n10k37M36l04k42P39j350J262
$$ 152 -124 -32 -712 343 -466 -846 -389 381 794 500 615 105 -132 304 0 -242 497 -853 409
6352D09n26L63j60M67p08K53l5L12L22j086LK73R3N5j54L72k76N05n03m63m04
$$ 409 -117 246 86 553 -155 98 63 375 697 -389 -386 -113 -20 35 -119 253 -23 482 -21 -484 -888
6373h88Q03Mn00j90J45J039o09J064o19l83l28Q55l54J23m72L60q98J210q14l16
$$ -888 -85 -81 -581 -771 -626 413 -196 868 249 -134 -462 393 39 162 -310 50 -848 362 -452 -768
6393g68M79Nk87Q41n01nN09J6O09j184O40J73o51J46N0N04n31j091O63L66M45
$$ -768 -289 -284 -571 270 -231 -236 273 289 898 -286 354 527 -124 22 72 576 45 -1046 -383 -17 428
6414D28N44m13m95L83m28r12J193j10o71Q11p72K5M93R71j134k21K35J267j611
$$ 428 972 559 64 447 19 -893 300 190 -481 330 -442 -417 76 1047 -87 -308 -73 1194 -417
6433d17o94J592q19k54J386n18r29m17P16P46j295N09J274j147k23J41J201j304
$$ -417 -1111 481 -338 -592 794 276 -653 -1070 -354 392 -903 -394 880 -267 -490 -349 852 -452
6451d52N04k80m68J008j61n72M22k01o4j43N34M2p58M88M10Q4j27n83M53l07k61
$$ -452 52 -228 -696 312 151 -421 1 -200 -264 -407 127 169 -589 -101 309 393 266 -317 136 -171 -432
6472d32k83OK40r2Q84P58j448N76m28R55j403j66J75O68l96Q3J72o84L10J182
$$ -432 -715 -709 -469 -561 323 1081 -367 209 -219 736 -667 -833 -658 10 -386 -303 -131 -815 -505 677
6492F77q40R49j15r87R65m68m3R2j9N92q14J47P6o08K66m81M33m04P72K47o69
$$ 677 -163 786 671 -316 649 181 138 230 211 803 -11 136 212 -396 -130 -611 -178 -582 190 437 -232
6513b32M80o96l6J017j06R2j047P09k59r3P38n03j41p16Q47j04o75O85n43Q3k38
$$ -232 248 -448 -484 533 427 519 -528 181 -78 -171 567 64 -77 -793 54 -50 -725 -40 -583 -500 -738
6534g38L30O62r86K78j5j4K2P86p53M22n0m9K27n9P3j99n25J194k97k6k1l04k58
$$ -738 -408 254 -732 -454 -469 -483 -461 325 -428 -6 -56 -105 122 63 136 -63 -588 606 309 283 262 -42 -300
6557c00L78J78O89j280J15J33P9l54K46K69n14Q76r77J667n38j78o97r89J734
$$ -300 78 256 945 -335 -220 -87 -8 -362 -116 153 -361 515 -462 1205 667 489 -208 -1197 537
6576E37m92o55l21M43M49m10K55l30L59K18N28l52p64P84j067R40K37J28J7n04
$$ 537 45 -610 -931 -488 -39 -449 -194 -524 -165 53 581 229 -535 249 -818 122 359 487 504 0
6596@P7K08K41O01l62o91R2P68q36N08o56J316j574O01j48o05P94K10l94m86L38
$$ 0 77 285 526 1127 765 74 166 934 98 606 -50 1266 -308 293 145 -460 334 544 150 -336 2
6617Bp73J100p62l99O93n10J179Qk96p89J217j025K17L28l25P84l52k71L15j121
$$ 2 -771 329 -433 -832 -139 -649 530 538 242 -547 670 -355 -138 190 -135 649 297 26 341 -780
6637g80J107n18m07Q29l32M58r77L02K92k02n84J747j556L63m03O57P74j143N8
$$ -780 327 -191 -598 231 -101 357 -620 -318 -26 -228 -812 935 -621 -258 -661 -4 770 -373 -315
6656c15J52j75O9k87J40N11O00r62P47q13N87m23l19P89p32P27o82m36J238r71
$$ -315 -163 -338 -269 -556 -416 95 695 -267 480 -333 254 -169 -488 301 -431 296 -386 -822 416 -555
6676e55O96l15R99k139J327j90N40j19r77N42p19O55J63L30m88k57K59P4k98M75
$$ -555 141 -174 825 -1314 13 -177 363 244 -733 -191 -910 -255 -92 238 -250 -507 -248 -174 -472 3
6696CL29l3R5p09Q88j147N92l8R2L07m72Q95p17j341J360j160J129o8Q86j140
$$ 3 332 299 394 -315 573 -574 18 -20 72 379 -93 802 85 -1256 104 -1056 73 5 891 -249
6716b49L36L34o79L8m22rJ379n31O8K85m84J14m98Q09n13N3N39j029J045o66P6
$$ -249 87 421 -258 -220 -642 -651 728 197 265 550 66 180 -318 491 -22 31 570 -459 586 -80 -4
6737dj90r3J047j519M81L9L45j11j3L72r34n87J948j088q89J021K55J50j011J339
$$ -4 -194 -287 760 -759 -278 -239 106 -5 -18 354 -580 -1167 781 -307 -1196 -175 80 230 -781 558
6757E58o87n0K28J81j299J603o14R90j046r19J281j170J574p88n5N05q4n90J292
$$ 558 -129 -179 49 230 -1069 534 -80 910 -136 -1055 226 -944 630 -158 -213 292 208 -382 910
6776I10j379L77N31m42J011j622K07Q93r81N33J30O4m13k47M74j3K76p07L81l4
$$ 910 -469 -92 439 -3 1008 -614 -407 486 -495 38 168 232 -181 -428 46 33 309 -398 -17 -51
6796e1N45n40j66N65k11n32J75n12J432j094m8N27k17K81l98J025j459J067j087
$$ -51 494 -46 -212 353 142 -390 -215 -727 705 -389 -437 90 -127 154 -244 781 -678 389 -698
6815f98O29k48J35R6m48J241n85M54j167N91l21K67J5n65J026m64J369j001m15
$$ -698 -69 -317 -182 -86 -534 707 122 576 -591 0 -321 -54 -39 -604 422 -42 1327 326 -89
6834h9O50j765J325k01J207j457L21k30M77o82J363m10j743J113O1J650k706N78
$$ -89 561 -1204 121 -80 1127 -330 -9 -239 238 -444 919 509 -1234 -121 -60 1590 -1116 -538
6852e38l87K6J171l27O25n72k28Q49o61j13N10n49J94J140j045J075j478J79J03
$$ -538 -925 -899 272 -55 570 -2 -230 619 -42 -155 355 -194 0 1140 95 1170 -308 -129 -26
6871b6m64J801j753J205n73k50P68o18M58r71L4O09K4M99l45oq65Q6Q09m60l75
$$ -26 -490 1311 -442 763 190 -60 708 90 548 -423 -389 220 244 743 398 392 -473 -387 422 -38 -413
6892d13k42O54N09o85N14J44m36R14j198n42J584n86m71j54M53K32l61N1q13Q44
$$ -413 -655 -1 508 -177 337 481 45 959 -239 -781 803 217 -254 -408 45 277 -84 -33 -846 -2
6912bj31N5K47l48K60m61Q46m03m3N93l71n56J036n25m59K34p01O57L79j080O83
$$ -2 -133 -78 169 -179 81 -380 466 63 20 613 242 -314 722 197 -262 -28 -729 -72 307 -773 -90
6933i0m28k8J925j369M92M3m23Q3m42J0K89O43j482J353J43j102M54j59p96K097
$$ -90 -518 -546 1379 10 502 545 122 205 -237 -227 62 705 -777 576 719 -383 71 -88 -884 1213
6953A213j263N22l58N16p88j58k90R04k5l22j3n2L3O65l83p9M26o91M6j97K41
$$ 1213 -50 472 114 630 -158 -316 -606 298 273 -49 -62 -114 -81 584 201 122 548 -143 -97 -294 -53
6974e3K75p63O80R1P05l48j675J442l40N18q1M82p24o42N40o61L46Q0m50J890
$$ -53 222 -541 139 230 935 587 -1088 354 14 532 451 933 209 -433 107 -554 -208 -128 -578 1312
6994A312j368N1K34o46K4L66J6p86J432j076K97L80p95m28J257K80o30k058K185
$$ 1312 -56 -5 229 -417 -393 -27 -11 -797 635 -441 -144 236 -559 -987 270 550 -80 -2138 47
7013D7m80K99J14n77J179j493J175Q5l79N34j079J026N58j080N88j14O09k150
$$ 47 -433 -134 -20 -597 582 -911 264 349 -30 504 -575 451 1009 -71 517 403 1012 -1138
7031a138J467N3M39j083J031j796J265P66q91r90K05R28r7M88o85m68R25L15k81
$$ -1138 329 382 821 -262 769 -1027 238 1004 113 -877 -672 256 159 647 -38 -506 419 734 453
7050D53k28K92R5j835J329O7J96R5o71M50J34r2l99r7o3Q38l80j61P34j160P43
$$ 453 225 517 612 -1223 106 173 369 464 -207 243 377 285 -114 -211 -274 564 184 23 757 -403 340
7071C40q43Q25p94M4J21K55L72J9l19q99J400l43j283P09N58n99O47m90J99j10
$$ 340 -503 322 -472 -428 -307 -52 320 339 20 -879 521 178 -1105 -396 162 -437 210 -280 -81 -191
7091a91r4N34O0L7n97m76Q84K73j07L04L97j141R0m90K355j905K65J63n19R18
$$ -191 -285 249 309 346 -251 -727 157 430 323 627 1024 -117 -27 -517 1838 -67 198 361 -158 760
7111G60q93k66J0N93k69K58J071r41o11k33k08J189j24q16M68P9n01K13q18J068
$$ 760 -133 -399 -389 204 -65 193 1264 323 -288 -521 -729 460 336 -480 -12 67 -434 -221 -1039 29
7131B9L76k20K97M92j274O28k1o57M50r65Q02N3l54j22Q7J011l67l85k59J349
$$ 29 405 185 482 974 -300 328 307 -350 100 -865 -63 -10 -364 -486 -399 612 245 -140 -399 950
7151I50n99K38l80m49m2J52P15n49R0l5J27k92O47q18K37m0M1O68q02K18k70K57
$$ 950 351 589 209 -240 -282 -130 585 36 126 91 218 -74 573 -245 -8 -48 -7 661 -141 77 -193 64
7173F4j97J05n80O89l18l50Q77j03j06K41l05o41J175n6j288J461j177N92L00
$$ 64 -133 -28 -608 81 -237 -587 290 187 81 322 17 -624 551 495 -793 668 -509 83 383
7192C83j221J797l86p7n87L05j166J587j200L58K74l16N65K95j03p59p01J340
$$ 383 -838 959 573 496 -91 214 -952 635 -565 -207 67 -249 316 611 508 -251 -952 388
7210C88n65P29n98mm03R8Q6l9J458j81o41j168J146j734J839k32J51n36k57K95
$$ 388 -177 552 -46 -50 -453 -355 -269 -308 1150 969 328 -840 306 -1428 411 179 330 -206 -463 -168
7230a68O83j38j85J37l05p11K92J35O85p75J325p35j08r3J64l01r5J44K24k6K77
$$ -168 515 377 192 329 24 -687 -395 -260 425 -350 975 240 132 39 203 -98 -193 -49 175 149 426
7251D26j090J232o1q39J359j92p02K49l17N66n60k38P29m65k98m91P91M88m69
$$ 426 -664 568 507 -332 1027 835 133 382 65 631 71 -167 562 97 -201 -692 99 587 118
7270A18o04J246o31k42k05R1O67j82l64M92j046K9P1L49L46j47L8o32R67M4o77
$$ 118 -486 760 129 -113 -318 -227 440 258 -106 386 -660 -631 -560 -211 135 -12 26 -606 361 405 -272
7291b72q31J348Q79r96j48L14l50L91K2n54L99O4N8p8j507J601j67k46J03k72
$$ -272 -1103 245 1124 128 -20 294 -56 335 357 -197 202 266 324 246 -1261 340 173 -73 30 -242
7311b42K01m46J063k20j001J181J79j365R45K90o88N27j77j334J559k49l87j08
$$ -242 -41 -487 576 356 -645 536 715 -650 295 585 -103 424 247 -1087 472 223 -164 -272
7329b72J003o03J1J70l96p88M94J111j35n18j80K70m01N83k4m21N04n44K45j024
$$ -272 731 128 139 309 -87 -875 -381 730 595 77 -103 167 -234 349 325 -96 408 -136 109 -915
7349i15O72Q63k38j278Q31J124j136n15J434j111j63j4L77p69Q51J511o53p64
$$ -915 -243 620 382 -896 -65 1059 -77 -592 842 -269 -432 -446 -69 -838 13 1524 871 107
7367A07n95L89o12N00o68O06m98J378o54m61k93M62P39m90J68k3jq73J063N06
$$ 107 -488 -99 -711 -211 -879 -273 -771 607 -47 -508 -801 -339 400 -90 78 55 54 -819 244 750
7387G50o72k16R02m60p91M99J33j3m21J99J24n51L29j56P27J4j807J888j149R57
$$ 750 78 -138 764 304 -487 12 145 132 -289 -90 34 -517 -188 -344 383 397 -1410 478 -671 286
7407B86r36Q04n75J272q09n97M77j092R98L48o90J84J81N1L18%N86r59J71N21
$$ 286 -650 154 -421 851 42 -555 -78 -1170 -172 176 -514 -330 -149 -98 220 220 806 -153 18 539
7427E39r34j65K42N21l00Q28j550K51K33O16J3m68L3m12O02n96P83l96N15o24
$$ 539 -395 -560 -318 203 -97 731 -819 -568 -335 281 294 -174 -141 -553 49 -547 236 -160 355 -269
7447b69N27k58O84j017L56j95l61M73N04k2M47p73N98j158K45r7K47n12O5M80
$$ -269 258 0 684 -333 23 -172 -533 -60 444 422 869 96 694 -464 -219 -316 -69 -581 -516 -36
7467c6r1m56R72q74L11J863j160k50p78R33o47K92n98R60k94M21k14k49k25Q16
$$ -36 -127 -583 389 -485 -174 1689 529 279 -499 434 -213 79 -519 441 147 568 354 105 -120 696
7487F96q9j030N27K72k42k07M39o60O07j46k52j98N5M14m6o21J400n5l11k58j399
$$ 696 607 -423 104 376 134 -73 366 -294 313 167 -85 -283 -228 186 140 -481 919 864 553 295 -1104
7508a104J695j178Q36l84M22O3m93J187j180m90Q97q87n60J010k78J76O23o57
$$ -1104 591 -587 249 -135 287 350 -143 1044 -136 -626 271 -616 -1176 -166 -444 -268 355 -302
7526c02J97N0K63o32M0P55p39l04J031l03m2K68o96J108p83K00r78N57P6P66J69
$$ -302 -105 -55 208 -424 -384 371 -368 -672 359 56 14 282 -414 694 -89 111 -867 -310 -234 532 701
7547G01r40L24m10J501j364K22P1m86N60j61R05q42p4j36j1M22N38j261N80k84
$$ 701 -239 85 -325 1176 -188 34 105 -381 179 18 923 81 7 -129 -140 282 820 -441 139 -145
7567a45p60J291L32l98j221N46J027n08j34p66R50J17q86M07L74n69L61l11N64
$$ -145 -905 386 718 320 -901 -355 672 164 30 -736 214 331 -555 -148 226 -343 18 -293 271
7586B71j039J174L21k06p43O67j1j20k19k53O55n44N45l91l18L62j212K35P58
$$ 271 -768 406 727 521 -222 445 434 314 95 -158 497 -47 498 107 -211 151 -1061 -826 -68
7605f8N25q1p27o0N46L6N56l59J04m74P3R34j579O2R61r15J20J043j002K5K04
$$ -68 457 376 -351 -411 135 171 727 368 472 -2 71 1005 -574 -512 449 -466 -346 697 -305 -280 -76
7626g6k21J40L70J274k044O22J01K4n59J75N82m05OM41O66p20l58k10K77J95j078
$$ -76 -297 -157 213 1487 -557 65 166 190 -369 -194 388 -17 -11 430 1096 376 18 -192 85 280 -798
7647g98N1P90o87L68P85q52R86k28l28l19q42J021K29r55N15n05j28J665q3m26
$$ -798 -747 43 -644 -276 509 -343 643 415 87 -232 -1074 -53 176 -779 -264 -769 -897 768 685 259
7667B59j522J096K98q51M91Q51q66m33Q78l20N63K3o62Q06j33n50L42j645J629
$$ 259 -1263 -167 131 -720 -229 622 -244 -677 201 -119 444 467 -195 611 478 -72 270 -1375 254
7686B54o49J396q15n78R91l13j97m60Q90K20o08j410K73J114J23O72p56o58J65
$$ 254 -395 1001 186 -392 599 286 89 -371 519 739 131 -1279 -1006 108 231 903 147 -511 -346
7705c46Q26j84L02j32r82R76o94J236l86o57p79Q18J06J018q68k08P77M61j555
$$ -346 480 296 598 466 -516 460 -234 1002 616 -41 -820 -2 104 1122 254 46 823 1284 -271
7724b71J007j147j96J82l94O46j26P62j104R91o45J60L74p27N26j163J357o44
$$ -271 736 -411 -607 -425 -819 -173 -299 463 -641 350 -295 -135 239 -488 38 -1125 232 -412
7742d12p13J426O7j048j00M86m52K16m0N61L0n95M64M36j143N57K57K84R3p97
$$ -412 -1125 301 368 -680 -780 -294 -746 -530 -570 -9 21 -574 -110 326 -817 -260 -3 281 374 -423
7762d23J263j455O55n32k43j52R89o60m9Q22j40P65M98k181Q48L59k37Q8J41j74
$$ -423 840 -615 40 -492 -735 -887 102 -558 -607 215 75 840 1338 -843 5 364 127 215 356 182
7782A82R0P7j38P82j460O57n92n27O40M42m38J100j012j00K48l05Q75l47m87j4
$$ 182 272 349 211 993 -467 190 -402 -929 -289 153 -285 815 -197 -297 -49 -354 521 174 -313 -327
7802c27J285k84r90RK85j94o47l20N65M26Q81j108ol86J92J383j251O03p42J198
$$ -327 958 674 -316 -307 -22 -216 -863 -1183 -618 -192 689 -419 -425 -811 -619 764 -487 116 -626 572
7822E72j42J6n03l86L58r3K42J84p39J44m44K80K75q69J522j000J075L6k98n85
$$ 572 430 446 -57 -443 -85 -178 64 248 -491 -347 -791 -511 -236 -1105 417 -583 492 528 230 -355
7842c55L27J69K53o36M07o20N84l97N32j82Q4m78N66k44L64n17K73P3l58r09M82
$$ -355 -28 141 394 -242 165 -455 129 -268 264 82 166 -312 254 10 374 -143 130 203 -155 -1064 -582
7863e82M22M72k66L45R6l76n6k78N30l22p41P13l38O50o6j40o68P9J0k99K014
$$ -582 -160 312 46 391 487 111 55 -223 307 -15 -756 -43 -381 269 203 63 -605 -526 -516 -815 1199
7884A199k089J262l24m74J0M64K73r31M36j91j13O47m07l69k17O44K03j94J77
$$ 1199 -890 372 48 -426 -416 48 321 -610 -174 -365 -478 169 -238 -607 -824 -180 23 -171 6
7903FK47J75j185R83j472J576j329N76O52j58L12l57o27P59N12p6j586P51n64
$$ 6 253 428 -757 226 -1246 330 -999 -423 229 71 383 26 -601 158 670 594 -992 -241 -805
7922h05J500l53n36J043j203M88k94j62K88J223j769N64L79p00O60O10n69p72
$$ -805 695 342 -194 849 -354 134 -160 -322 -34 1189 -580 -16 363 -337 323 933 364 -408
7940d08N01j97o91L99R56r77R39l26l88J73j46K48k9O90j620j53R88L40J30q73
$$ -408 93 -104 -795 -396 560 -417 522 196 -192 -19 -165 83 54 744 -876 -1029 -41 299 429 -444
7960d44n94J352m04j16J24K51n52J115q06J41m60j15R98L0n83J422j610N72K72
$$ -444 -1038 314 -90 -206 -82 169 -383 732 -74 67 -393 -508 490 520 -63 1359 -251 321 593
7979E93K33k39j029O02l28K62Q51q56O6l41O39q7k01P89o13j63r37P88j087J127
$$ 593 826 587 -442 160 -168 94 945 89 155 -186 453 366 165 954 341 178 -759 29 -1058 69
7999F9j81L0L50p43P49q80N43J69L46k90n34M5M66mo83J722r20k30m51o84J500
$$ 69 -112 -82 268 -475 274 -606 -63 106 452 162 -372 -327 139 135 -548 1174 254 24 -427 -1111 389
8020C89l30p0Mo45Q13n27K11k79J5Q88j213k2M02Q07k15q08n9j74J073m76L33
$$ 389 59 -11 -7 -652 161 -366 -155 -434 -419 469 -744 -766 -364 443 228 -580 -639 -813 260 -216 117
8041A17l84R1L43k24Q48p38O53j399J063r84K12N04m22M21l99P04J66l28L36r0
$$ 117 -267 -176 167 -57 791 53 706 -693 370 -614 -402 102 -320 101 -298 406 572 244 580 490
8061D90o10J2n96R91L28p71O2K3q06J126q73N76J742k162K91K5n73K35M00M53
$$ 490 -120 -108 -704 287 615 -156 -94 -71 -877 249 -624 -48 1694 -468 -177 -152 -725 -490 -90 363
8081C63P5l34q50J028L45r06N00K28l21K81O59p56k83m69L6Q36J25k11M03k59
$$ 363 438 104 -746 282 627 -279 221 449 128 409 1068 312 29 -440 -404 432 557 346 749 490
8101D90p69P94m17K42M9p42O59k17k06o20L97N59p44N92P81j118K2r5L73J42n96
$$ 490 -279 515 98 340 389 -353 306 89 -117 -737 -340 219 -525 67 848 -270 -248 -343 30 172 -424
8122d24K44K49n45J102n96j89MOo57J556j082O65o20R2K00k15j16k18R68q37O0
$$ -424 -180 69 -476 626 30 -159 -155 -149 -806 750 -332 333 -287 -195 5 -210 -326 -544 424 -413 -353
8143c53J159n50J39m60N25K13K97j357P96R9m72o67m21J166l43M76r29R18l4p15
$$ -353 806 256 395 -65 460 673 970 -387 409 508 36 -631 -1052 114 -229 247 -682 236 202 -513
8163e13j1J11J154j204P63k12j74j77j55J136j179P93n79jk44k36Q24j10m09n37
$$ -513 -524 -413 741 -463 300 88 -86 -263 -418 718 -461 332 -247 -248 -492 -728 96 -14 -423 -960
8183i60K015j229N45m85N62k78J74M
$$ -960 1055 -174 371 -114 448 170 344 348
8191C48
$$ Imaginary data points
##PAGE= N=2
##DATA TABLE= (X++(I..I)), XYDATA
0@%%%%%%%%%%%%%%%%J08k16K16k16K16k19L27m32M32n39O47o93Q01r54J067j194
$$ 0 0 0 0 0 0 0 0 0 0 0 0 0 0 0 0 0 108 -108 108 -108 108 -111 216 -216 216 -323 324 -369 432 -522 545 -649
32f49J402j594J782k001K246k499K783l108L462l853M275m726N216n757O361p018
$$ -649 753 -841 941 -1060 1186 -1313 1470 -1638 1824 -2029 2246 -2480 2736 -3021 3340 -3678
48c678P727q510R381j0340J1393j2563J3887j5383J7077j9026K1298k3993K7228
$$ -3678 4049 -4461 4920 -5420 5973 -6590 7297 -8086 8991 -10035 11263 -12730 14498
61A4498l1190L6201m2759N1736o4804Q5673j24049K16658q37492p44576K291565
$$ 14498 -16692 19509 -23250 28486 -36318 49355 -74694 141964 -695528 -1440104 851461
72H51461J36243j482541J82995J006001l96003m01543J18832q5036M8029L88988
$$ 851461 987704 -494837 -311842 694159 298156 -103387 15445 -69591 -21562 367426
82C67426m32784n97077N77638P20907o52527o63775O90455O83734o43926o35586
$$ 367426 -65358 -662435 -84797 636110 -16417 -680192 10263 693997 50071 -585515
92e85515N03001O56663k83337o73662J779P02053J62920p51061k57867P53700
$$ -585515 -82514 574149 290812 -382850 -381071 320982 483902 -267159 -525026 228674
102B28674K35312o96535k26428N15433K33706k14496k57376o9812L38835L22318
$$ 228674 463986 -232549 -458977 56456 290162 75666 -181710 -251522 87313 409631
112D09631m49780m58779N87159N31798p10585n83071P40293N81594o97430n37143
$$ 409631 -40149 -498928 88231 620029 -90556 -673627 66666 648260 -49170 -586313
122e86313N78963M58193m16239l69493K29293L13747j20k76982k40918K45117
$$ -586313 -7350 450843 34604 -334889 -105596 208151 208031 -68951 -309869 -64752
132f4752M53972k25601n94659K18253O43883k24020o30286K04505N91561j31544
$$ -64752 389220 163619 -431040 -212787 431096 207076 -423210 -218705 372856 241312
142B41312n32279J1115M76712J29345m18731k46002L78159L28444l36320l82349
$$ 241312 -290967 -279852 196860 326205 -92526 -338528 39631 368075 31755 -350594
152c50594K64644M13891j57464m23393K0661M01704J14356l66853k30499L29239
$$ -350594 -85950 327941 170477 -252916 -232255 169449 283805 -83048 -313547 15692
162A5692L26300k94603m08818K63786M73735k23192n02553J68908M82225j10316
$$ 15692 341992 47389 -361429 -97643 376092 152900 -349653 -180745 301480 191164
172A91164m33126L1378L70397N9093l17313j69597K64070K78419j97737l63300
$$ 191164 -241962 -210584 159813 218906 -98407 -268004 -3934 274485 76748 -286552
182b86552J24964M17004m5035m35523k6917M32933R8471m18449j61480L84050
$$ -286552 -161588 255416 210381 -225142 -252059 180874 279345 -139104 -300584 83466
192H3466K11858l25636k43331K55637K61516j71428k74430Q8471K91944J66l11130
$$ 83466 295324 -30312 -273643 -18006 243510 72082 -202348 -113877 178067 178233 -132897
203a32897r0356L21731J70339l17447k28130K91884K64617k48111k84198J78338
$$ -132897 -223253 98478 268817 -48630 -276760 15124 279741 31630 -252568 -74230
213g4230L00248r2820l12983m647L16798R0134l10010j53073K90188J92778k59723
$$ -74230 226018 133198 -179785 -184432 132366 222500 -87510 -240583 49605 242383 -17340
224a7340k18178K15850K35218j60258k51632R1357K60546j1537k63514o5638K63624
$$ -17340 -235518 -19668 215550 55292 -196340 -104983 155563 144026 -119488 -185126 78498
235G8498J40314k59614k03156K45694K45233k15652k69954J69034K67743j02598
$$ 78498 218812 -40802 -243958 1736 246969 31317 -238637 -69603 198140 95542
245I5542k52688L0647K32577M4989k14480j15438K00459J73419j83128k14988
$$ 95542 -157146 -126499 106078 151067 -63413 -178851 21608 195027 11899 -203089
255b03089J63217K39605j33641k46352R7814K45192m9373k37348j0926K21218
$$ -203089 -39872 199733 66092 -180260 -82446 162746 113373 -123975 -134901 86317
265H6317P5749j97155j41972J71207J93759j37487k33006J07433K50461p4392
$$ 86317 162066 -35089 -177061 -5854 187905 50418 -182588 -75155 175306 100914
275A00914k48611L1529K30940J2539k01577o4689J69170J15005j39032j61019
$$ 100914 -147697 -116168 114772 127311 -74266 -138955 30215 145220 6188 -154831
285a54831J14115J98951r3416k24723O6910K34237l6791k24028j616K02178M8071
$$ -154831 -40716 158235 64819 -159904 -92994 141243 104452 -119576 -121192 80986 129057
296A29057j70892r6329J36232J43072j02489j80595O8784K05219l9735k08903
$$ 129057 -41835 -138164 -1932 141140 38651 -141944 -73160 132059 92324 -116579
306a16579J4496J96816J5046j77241m4208J50230P8629j22462j15607R5623J47719
$$ -116579 -102083 94733 109779 -67462 -111670 38560 117189 -5273 -120880 -25257 122462
317A22462o6181j76157M2648J91069j6354j91464j0873J77858M4048j55745p9855
$$ 122462 56281 -119876 -77228 113841 97487 -93977 -104850 73008 117056 -38689 -118544
328a18544J25384J10931r0982j37346N8307J56539l0907j65018N236J61026K0466
$$ -118544 6840 117771 26789 -110557 -52250 104289 73382 -91636 -86400 74626 95092
339I5092j51432m3436J32657O7933j10415r1672Q6136J15073o1949j36105L7796
$$ 95092 -56340 -99776 32881 100814 -9601 -101273 -15137 99936 37987 -98118 -60322
350f0322J46024j1615j48739j5384J40215M1584j21442o7072R7612R1884p1977
$$ -60322 85702 74087 -74652 -90036 50179 91763 -29679 -96751 861 92745 20768
361B0768j10558M8156J22653k6339j27792O052J26856J4166j17715l2832J06235
$$ 20768 -89790 -41634 81019 54680 -73112 -67060 59796 73962 -43753 -76585 29650
372B9650N2291r1110p3333P3020R2969n4391j05867L0477J16817p252j18500j6200
$$ 29650 81941 -9169 -82502 -9482 83487 29096 -76771 -46294 70523 63271 -55229 -71429
384g1429J13746L7635j02183n6739Q3802P2425o3078q4119M1328R2466k1798r7114
$$ -71429 42317 79952 -22231 -78970 4832 77257 14179 -69940 -28612 63854 42056 -55058
396e5058L726R9995J0386r8575k4384Q8340L8665p4831n2875N7663O7474l7176
$$ -55058 -51332 48663 59049 -39526 -63910 24430 63095 -11736 -64611 -6948 60526 23350
408B3350q1424J7903R1127n21r5028j5347Q9216L0065p9329m1411O4649N3457
$$ 23350 -58074 -40171 50956 50435 -44593 -59940 29276 59341 -19988 -61399 3250 56707
420E6707m9258n9743L3431O4657j5291p1112J93P2937J5927p4933k7570P4680
$$ 56707 7449 -52294 -18863 45794 30503 -40609 -40416 32521 48448 -26485 -54055 20625
432B0625L7879o8312m4459N5657M9714l7177n6390J6076O4026L870o9941j8396
$$ 20625 58504 -9808 -54267 1390 51104 13927 -42463 -26387 37639 41509 -28432 -46828
444d6828P0936K8363o8480l2401N6380L4642m0169m0381K4288M4459q730n1914
$$ -46828 24108 52471 -16009 -48410 7970 42612 2443 -37938 -13650 30809 22079 -29835
456b9835j9N5591R786n8111j6971N3977K8104n2071l3764M1143M0369l1086m3397
$$ -29835 -29854 25737 35523 -22588 -39559 14418 42522 -9549 -43313 -2170 38199 7113 -36284
469c6284J9043M5327m284m4117j0672M4132K2396m3552l1261M1813L3847l6971
$$ -36284 -17241 28086 23802 -20315 -30987 13145 35541 -8011 -39272 2541 36388 -583
481e83l2416K7495L2776j5431l3656K440L8612Q927m5306j3505M5056J9271m1305
$$ -583 -32999 -5504 27272 11841 -21815 -19375 19237 28164 -17142 -30647 14409 33680 -7625
494g625k3017L0888L1169k1505l6920J1534M0096k835m1065k521L5764J0629l0445
$$ -7625 -30642 246 31415 9910 -27010 -15476 24620 21785 -19280 -21801 13963 24592 -5853
507e853j7667K5364K4661k1630l0106J8207L1664j6233k9992J0209K9047l278
$$ -5853 -23520 1844 26505 4875 -25231 -7024 24640 8407 -21585 -11376 17671 14393
519A4393k4487r298K4566K0728k7388k4358K2969K5971j8820k5293J0891K3888
$$ 14393 -10094 -19392 5174 25902 -1486 -25844 -2875 23096 4276 -21017 -10126 13762
531A3762n37k1906r175K3330J3428k5348j4144K3886J3848j7926j6939J3971J9054
$$ 13762 13225 -8681 -17856 5474 18902 -6446 -20590 3296 17144 -782 -17721 -3750 15304
544A5304n920k4147L208K4417K33k2404l661J8349Q498j2299j5516R817K1520
$$ 15304 9384 -14763 -11555 12862 13095 -9309 -12970 5379 13877 1578 -13938 -4121 17399
557A7399q237k4827Q977K2294p914j6956K532J1765K290p358j0202R228J4084
$$ 17399 9162 -15665 -6688 15606 7692 -9264 -6732 5033 7323 -35 -10237 -1009 13075
570A3075j2648j3895J3641J2461j1878j0535M514J1635J817j3554p605J6568P839
$$ 13075 427 -13468 173 12634 756 -9779 -5265 6370 8187 -5367 -12972 3596 11435
583A1435j3564p762J1030N276m776q105M07J2107Q16j3640p60J5891m23j2723
$$ 11435 -2129 -9891 1139 6415 1639 -6466 -6059 6048 6864 -6776 -7536 8355 7932 -4791
597d791m09P341J713k232r000L083J2059l261j3370M746J2534m621p351j711P065
$$ -4791 -5200 2141 3854 1622 -7378 -4295 7764 4503 -8867 -4121 8413 3792 -3559 -5270 1795
612A795N965p128r208P722R669p808o737O001N161l282l031k526L647O092o986
$$ 1795 7760 632 -8576 -854 8815 1007 -5730 271 5432 2150 -881 -3407 240 6332 -654
627f54n669Q841L994q289j652M405K240j130n260k006Q525O57q050q44O347J444
$$ -654 -6323 2518 6512 -1777 -3429 976 3216 2086 -3174 -5180 3345 4002 -4048 -4892 1455 2899
643B899l257k464P8N152k55o401J529O431l778l760L831O01J02L99l620p7N733
$$ 2899 -358 -2822 -2744 2408 2153 -4248 -2719 3712 -66 -3826 5 606 708 1107 -2513 -2590 3143
660C143r01o843L933M021l483j605K368j0L53j91j974M11L822l621k326K761J419
$$ 3143 2242 -4601 -668 3353 -130 -1735 633 623 976 785 -1189 -778 3044 -577 -2903 -142 1277
677A277o43r28j089K680P02k493j8J961j491j504K193L2o18J070k027j132M245
$$ 1277 634 -294 -1383 1297 1999 -494 -512 1449 -42 -1546 647 679 61 1131 -896 -2028 2217
694B217m12n163K027L913l443j048K877j472q34K174j804m25K240N34k645K89
$$ 2217 1805 -3358 -1331 2582 -861 -1909 968 -504 -1338 836 -968 -1393 847 1381 -1264 -975
710i75K275q97j277R57Q20p36p33P59p83j46J926L22k005N41Q38j740j198K817
$$ -975 1300 403 -874 83 903 167 -566 193 -590 -736 1190 1512 -493 48 886 -854 -2052 765
728G65P70j869K4K350k195m15K571r11k782J854O52j118J259K89j248n82K358
$$ 765 1535 -334 -310 2040 -155 -570 2001 1090 -1692 162 814 -304 955 1244 -4 -586 1772
745A772k356o15J888K17k365P55J081k83j573J024N74o19M54J63p06k64P51r9
$$ 1772 -584 -1199 689 906 -1459 -704 377 94 -1479 -455 119 -500 -46 117 -589 -853 -102 -201
763b01j533J753J157k189k0J447n0r61J546j85k126J111J112j504j70J630R67
$$ -201 -1734 19 1176 -1013 -1033 414 364 -597 949 764 -1362 -251 861 -643 -813 817 1784
780A784k242J205O88r36m43O2n61K30Q94j130j451K775l84J46J33K49L38j178
$$ 1784 -458 747 1435 499 56 118 -443 -213 681 -449 -1900 875 491 637 770 1019 1357 179
798A79o39R79J56n66j57M04J069l39o17j021J572Q38k611r49K236O7j684J042
$$ 179 -460 519 675 109 -48 356 1425 1086 469 -552 1020 1858 -753 -1702 534 601 -1083 -41
816d1J06n41J013n25q51J055J44j026q34J364j23P8j326J998n22J79j72j218J887
$$ -41 65 -476 537 12 -839 216 360 -666 -1500 -136 -259 -181 -1507 491 -31 148 -24 -1242 645
835F45m72r67o07O13K147q34k076J151J741j340j419J016K44J870j952k07L30
$$ 645 173 -794 -1401 -788 1359 525 -1551 -400 1341 1 -1418 -402 -158 1712 -240 -447 -117
852a17J338j094j583K737k54k75j120q3J737n51j887o90K639M09k063o86J930
$$ -117 1221 127 -1456 1281 1027 752 -368 -451 1286 735 -1152 -1842 797 1206 -857 -1543 387
869C87K46p64j208k44K329j71j719M31J699J72k476j21J769O23j153q66J015P98
$$ 387 633 -131 -1339 -1583 746 575 -1144 -713 986 1158 -1318 -1439 330 953 -200 -1066 -51 747
887G47p26k120J681J685o58j189j58Q09J901j945k423K298K485l282j980L087
$$ 747 21 -2099 -418 1267 609 -580 -738 71 1972 27 -2396 -98 2387 -895 -2875 212
903B12J667p62q10j321J673N08k370j03J104K031k893M60M23N89P88k750O75K651
$$ 212 1879 1117 307 -1014 659 1167 -1203 -1306 -202 1829 -1064 -604 -181 408 1196 -1554 -879 1772
921A772P20l845Q8K760o57k093m73R90K810j323k864J402K597j379k957K046J226
$$ 1772 2492 -1353 -1265 1495 838 -1255 -1728 -738 2072 749 -2115 -713 1884 505 -2452 -406 820
938H20N96k696m22K869P33j890k656L972L71j643j934J227K390l15j523j672K750
$$ 820 1416 -1280 -1702 1167 1900 10 -2646 1326 1697 54 -1880 -653 1737 1422 -101 -1773 977
955I77R65k425j387K028J600k095j735J022J699M69k308m12L537j47l130M72K145
$$ 977 1942 -483 -1870 158 1758 -337 -2072 -1050 649 1118 -1190 -1602 1935 1788 -1342 -870 1275
972A275P84k309j178J038L103j392l860K200K780r46l722O08L166o73l89j492
$$ 1275 2059 -250 -1428 -390 2713 1321 -2539 -339 2441 1495 -2227 -1619 1547 874 485 -1007
988a007J107K254j422l779K653J903j717j961J080K814N79l464j172K735J829
$$ -1007 100 2354 932 -2847 -194 1709 -8 -1969 -889 1925 2504 -960 -2132 603 2432
1003B432l503p3J957J140j504k562R82K347r3k839k71M162o91j960j22J234N60
$$ 2432 -1071 -1144 813 1953 449 -2113 -1131 1216 1123 -1716 -1987 2175 1484 -476 -598 636 1196
1020A196n16k204K56L078j722k379R58K940j051k096J402J034J035j385k356J771
$$ 1196 680 -1524 -1268 1810 88 -2291 -1333 1607 556 -1540 -138 896 1931 546 -1810 -39
1036c9K797k027l031J973J923m60j280o26J343J653k792j653K917J333k955r24
$$ -39 2758 731 -2300 -327 1596 1136 -144 -770 573 2226 -566 -2219 698 2031 -924 -1848
1052a848J864J201o69j859O95J824J069l884j057M419l66k027j082J297J408M62
$$ -1848 16 1217 548 -1311 -616 1208 2277 -1607 -2664 1755 1389 -638 -1720 -423 985 1447
1068A447l190M30L528n39l733J532J540k04j736Q71J362J49j072j562J157J892
$$ 1447 -1743 -1313 2215 1676 -2057 -525 1015 811 -925 -54 1308 1457 385 -1177 -20 1872
1084A872j081k839J579J957j63j693j167K285J506l216j278K769J722j943k553
$$ 1872 791 -2048 -469 1488 1325 -368 -1535 750 2256 -960 -2238 531 2253 310 -2243
1099b243J323J298N11j187j608L046M94k856L43N45K099j442K3q07J548O03k998
$$ -2243 -920 378 889 -298 -1906 1140 1634 -1222 -879 -334 1765 323 346 -461 1087 1690 -1308
1116a308J80L063j297k553O54K185p9r52j301J190K072j844k160J200J939j82
$$ -1308 -1128 1935 638 -1915 -1261 924 845 -107 -1408 -218 1854 10 -2150 -950 989 807
1132H07k578P35N25J011k49j269J029J472l225pK150n4r02j113J160J436N02k359
$$ 807 -1771 -1036 -511 500 251 -1018 11 1483 -1742 -1749 401 347 -555 -1668 -508 928 1430 -929
1150i29k18J926O30j587L45N71M5j74n10j003J376J198k238j0J406L06j399n39
$$ -929 -1147 779 1409 -178 167 738 783 609 99 -904 472 1670 -568 -578 828 1134 -265 -804
1168h04J358m95j62j011J439K86m12j837J053J886o19p11m75j85J141l33j850
$$ -804 554 59 -103 -1114 325 611 199 -1638 -585 1301 682 -29 -504 -689 452 119 -1731
1185a731K074M65m31r24o6R57n99L04R1J431n15j123k06M11N37l40q28L7oO27
$$ -1731 343 808 377 -547 -613 344 -255 49 140 1571 1056 -67 -273 138 675 335 -493 -456 -462 165
1205A65m86M68N73q27l38m39J657o11p14J76l84J549p79n87k31J304j164R0k8
$$ 165 -321 147 720 -107 -445 -884 773 162 -552 -376 -760 789 10 -577 -808 496 -668 -578 -606
1224f06J505o10k4q00M4J129j482o8L09Q30Q1o23J71N72j08L72j474M41J346j690
$$ -606 899 289 265 -535 -491 638 -844 -912 -603 227 308 -315 -144 428 320 692 -782 -341 1005 -685
1244f85n69J877k85k17o22R94M0m74j615J670J95l70K30k98l57Q74o99L27n80
$$ -685 -1254 623 338 121 -501 493 533 59 -1556 114 309 -61 169 -129 -486 388 -311 16 -564
1263e64J042n51n16M72P23j360K15j29J59L46J15m4J97L85l48L14N45o77r10K82
$$ -564 478 -73 -589 -117 606 -754 -539 -668 -509 -163 -48 -92 105 490 142 456 1001 324 -586 -304
1283c04J73N06p92R68r27K38q2j25N79j188M51J437j626L20Q15q6r90L3R79n72
$$ -304 -131 375 -417 551 -376 -138 -220 -345 234 -954 -503 934 -692 -372 443 357 -633 -600 379 -193
1303a93M84p19N82p71o07R12m42J602r76j62Q22j61m58n09N05m74N51L57q90O2
$$ -193 291 -428 154 -617 -1224 -312 -754 848 -128 -290 532 371 -87 -596 -91 -565 -14 343 -547 -485
1323d85Q60j394J043k18N43j53n98m24M65J312j233k46N84K81n93J1Q6%J514r90
$$ -485 375 -1019 24 -194 349 196 -402 -826 -361 951 -282 -528 56 337 -256 -245 -159 -159 1355 365
1343C65j300K48O36j00j236J670m88M89k64j02M06M55l34M54o83k39M1N92l25
$$ 365 -935 -687 -51 -151 -1387 283 -205 284 20 -82 324 779 445 899 216 -23 18 610 285
1362B85o48J26l38m13J183j99K34P08j305Q30k18p65L17J05J54J28M04o04K45
$$ 285 -363 -237 -575 -988 195 -4 230 938 -367 463 245 -520 -203 -98 56 184 588 -16 229
1381B29k73r22J958j030l58P11R7k05K62r89j86Q69m03M13p27J60j60K22m88J054
$$ 229 -44 -966 992 -38 -396 315 412 207 469 -520 -706 163 -240 173 -554 -394 -554 -332 -820 234
1401B34n14J11K16R13J86j621m27R71Q81j383M80N05l24l35K71L34m73j13L9q19
$$ 234 -280 -169 47 960 1146 -475 -902 69 950 -433 47 552 228 -107 164 498 25 -88 -49 -868
1421h68J382p75M44j477J162K61k77k53N83N93j244N27q89J277j75o27J208j426
$$ -868 514 -261 183 -1294 -132 129 -148 -401 182 775 -469 58 -831 446 271 -356 852 -574
1439e74J481m80l88m00K22Q98j337r6J210j97j350J054l72J131o72o3P1P83o57
$$ -574 907 427 39 -361 -139 759 -578 -674 536 339 -1011 43 -329 802 130 67 138 921 264
1458B64j197K99P98L78k38k29M9Q41j449P83L28k61r72M50L45K88q02k30N60m
$$ 264 -933 -634 164 542 304 75 124 965 -484 299 627 366 -606 -156 189 477 -325 -555 5 1
1478Al02K5q4J223k9j204j014J471J384r11p41R8J142q48l88m43K767j759o23
$$ 1 -301 -276 -360 863 834 -370 -1384 87 1471 560 -181 -83 1059 211 -177 -620 2147 388 -235
1497b35o73J78J169M2j388J46J568j727j08J49K352l89j860P40P8o5p01P7M16
$$ -235 -908 -730 439 481 -907 -761 807 -920 -1028 -879 1473 1084 -776 -36 42 -23 -724 -647 -231
1516b31K71N30j385N89P03L01j858J826j19J34j351o79K341L73k126p65J647J050
$$ -231 40 570 -815 -226 477 778 -1080 746 627 761 -590 -1269 1072 1445 -681 -1446 201 1251
1534A251n59k212Q86J255j3j930m44K534j107M51j266P88Q86k65j166P16J020
$$ 1251 692 -1520 -634 621 608 -1322 -1766 768 -339 112 -1154 -366 520 255 -911 -195 825
1551H25j61j341m83J270J006j539O26q7P40j075j332J978M06M43j915J64J304
$$ 825 664 -677 -1160 110 1116 -423 203 116 856 -219 -1551 427 833 1276 -639 -475 829
1568H29m83j279L08O80J558k970r42L160N59j667m46Q57M58N18k425P24J589m53
$$ 829 346 -933 -625 55 1613 -1357 -2299 861 1420 -247 -693 164 622 1140 -1285 -561 1028 575
1586E75r73n39J237J43r03l1k77K286r10k123J074J786j145j664K42K494m06j689
$$ 575 -398 -937 300 443 -460 -491 -768 1518 608 -1515 -441 1345 200 -1464 -1222 1272 866 -823
1604h23m07J529P41r66j480J213J429j062j553k85J863K084k749q84K638J44j921
$$ -823 -1230 299 1040 74 -1406 -193 1236 174 -1379 -1664 199 2283 -466 -1350 1288 1432 -489
1621d89j415K245P45m53k244Q65K050M41l999J200J035J052q60j946J951M18j037
$$ -489 -1904 341 1086 633 -1611 -746 1304 1745 -2254 -1054 -19 1033 173 -1773 178 596 -441
1638d41k497K754J692j008k664P14K588K26k515l5J787R40j322k396J666K782
$$ -441 -2938 -184 1508 500 -2164 -1450 1138 1364 -1151 -1186 601 1541 219 -2177 -511 2271
1654B271k519j858J972J516m12k988J116L173q56k322q05J384J651j741j628K105
$$ 2271 -248 -2106 -134 1382 970 -2018 -902 2271 1415 -907 -1712 -328 1323 -418 -2046 59
1670E9K619j378k933J108J984P1l542m52L691N95k446j292J869J558o45k740J003
$$ 59 2678 1300 -1633 -525 1459 1530 -2012 -2464 1227 1822 -624 -1916 -47 1511 866 -1874 -871
1687h71K401l49k355j288L934L84k930j262K483J379j762j953J851K906j678k803
$$ -871 1530 1181 -1174 -2462 1472 1856 -1074 -2336 147 1526 -236 -2189 -338 2568 890 -1913
1703a913J27L581l50l993l99L454J749k824j427J824L057k480k788R44L286j128
$$ -1913 -1786 1795 1445 -2548 -2947 507 2256 -568 -1995 -171 2886 406 -2382 -1438 1848 720
1719G20k934R88K747q28j982l11K513J416k001k364J343L354k221k420Q22L066
$$ 720 -2214 -1226 1521 693 -1289 -1600 913 2329 328 -2036 -693 2661 440 -1980 -1158 1908
1735A908J50l244j451M429J75k668j608J943K664k237j803J214L096j908k484
$$ 1908 2058 -1186 -2637 1792 1967 -701 -2309 -366 2298 61 -1742 -528 2568 660 -1824
1750a824j66L907P13l406j093J561K433k592j730J921K049j519j289l52K878l55
$$ -1824 -1990 1917 2630 -776 -1869 -308 2125 -467 -2197 -276 1773 254 -1035 -1387 1491 1136
1766A136j732k0J748J147l078k827L106K697k936k008K499K781r35l583j290M508
$$ 1136 -596 -616 1132 2279 -799 -3626 -520 2177 -759 -2767 -268 2513 1578 -2005 -3295 1213
1782A213M12k551n02J599J973j811l487K383L021j111l373P76K909m44j729j406
$$ 1213 1625 -926 -1428 171 2144 333 -3154 -771 2250 1139 -2234 -1458 1451 1007 -722 -2128
1798b128L675J771m576j035K588K428k551l267K179L982k519k332O0M082n53k771
$$ -2128 1547 3318 -1258 -2293 295 2723 172 -3095 -916 3066 547 -1785 -1725 2357 1804 -967
1814i67o11R55K962l496j442K545K299j042l639K530K372j361k798j49K658J498
$$ -967 -1578 -623 2339 -1157 -2599 -54 2245 1203 -2436 94 2466 1105 -1693 -1842 816 2314
1830B314l318q79K165L149l306k201Q50L146k76m040J214K468M43k368j912L556
$$ 2314 -1004 -1883 282 3431 125 -2076 -1226 1920 1644 -2396 -1182 1286 1729 -639 -2551 1005
1846A005J027k834n96J191K743k414k453J363K513k46k910l33K894J189k658j427
$$ 1005 2032 -802 -1398 -207 2536 122 -2331 -968 1545 1299 -1611 -1944 950 2139 -519 -1946
1862a946K937K130k821l374J804K922o96k531O91K664K23l184q82L678R09l066
$$ -1946 991 3121 300 -3074 -1270 1652 956 -1575 -884 1780 2003 -1181 -2063 1615 2524 -542
1878e42j690K085K550q74l582J635K928j506k093p00K982J406l407j847K763K540
$$ -542 -2232 -147 2403 1529 -2053 -418 2510 1004 -1089 -1789 1193 2599 -808 -2655 108 2648
1894B648l043j850J811L074r54l482M40L684n92l547J22K876J73j734k120K351
$$ 2648 -395 -2245 -434 2640 1686 -1796 -1356 2328 1736 -1811 -1689 1187 1360 -374 -2494 -143
1910a43L016j219l636Q69L373p10l248K76K843Q57k733k793L197K263j203k969
$$ -143 2873 1654 -1982 -1113 2260 1550 -1698 -1422 1421 2278 -455 -3248 -51 2212 1009 -1960
1926a960K001K252j454k826R83K142j81k760j15K990J049k788j149K235J284j035
$$ -1960 41 2293 839 -1987 -1004 1138 957 -1803 -1918 1072 2121 -667 -1816 419 1703 668
1942F68k945J237L359q30l009j160L905J619l874j521K910K846l703j884J915
$$ 668 -2277 -1040 2319 1489 -1520 -2680 1225 2844 -1030 -2551 359 3205 -498 -2382 -467
1957d67K198n99k549L35K079O52k958k1L167l02k039j328J606K273q88k881j65
$$ -467 1731 1132 -1417 -1082 997 1649 -1309 -1330 1837 1535 -504 -1832 -226 2047 1159 -1722 -1887
1974a887L788j078k856J078L231P35m773p02L033J364j905j995J771K171j087
$$ -1887 1901 823 -2033 -955 2276 3011 -1762 -2464 569 1933 28 -1967 -196 1975 888
1989H88j817k33L623j404l107N46K234J111k376j572K326J745q76k797J275K367
$$ 888 -929 -1162 2461 1057 -2050 -1504 730 1841 -535 -2107 219 1964 1088 -1709 -434 1933
2005A933k109j576%K791J237l750l20J505K079j225k598K086Q83m73k241J79K783
$$ 1933 -176 -1752 -1752 1039 2276 -1474 -1794 -289 1790 565 -2033 53 936 463 -1778 -1599 1184
2022A184k02k371n14L450K47k463j600K695J868j790k343J155K394O9k820q26
$$ 1184 982 -1389 -1903 1547 1794 -669 -2269 426 2294 504 -1839 -684 1710 1779 -1041 -1867
2038a867K480J560k139j692J551K481j426k983J275K400j414k462J670J701J35
$$ -1867 613 2173 34 -1658 -107 2374 948 -2035 -760 1640 226 -2236 -566 1135 1270
2053A270k338k49J241J255j977j563K571K112k161j904J811J325j070j029p62
$$ 1270 -1068 -1317 -76 1179 -798 -2361 210 2322 161 -1743 68 1393 323 -706 -1468
2068a468K175K38j187j169J677O52j200j111O94K133j842j467N87J957J000k655
$$ -1468 707 945 -242 -1411 266 918 -282 -1393 -699 1434 -408 -1875 -1288 669 1669 -986
2084i86o89L280O26k762j124Q35J199M30k271J185J023J27k712J596J183m2r74
$$ -986 -1675 1605 2231 -531 -1655 -820 379 809 -1462 -277 746 873 -1839 -243 940 898 -76
2101g6j525K091J485j602q79P05P68o18j309Q60J152l3j526j129K083J351k601
$$ -76 -1601 490 1975 373 -506 199 967 349 -960 -100 1052 1019 -507 -1636 447 1798 -803
2118h03n69J630J673j520k393K372L03N67j508q19J491R46k446n47K534K61j533
$$ -803 -1372 258 1931 411 -1982 390 693 1260 -248 -1067 424 1370 -1076 -1623 911 1172 -361
2135c61j120J123J626k465l25L58K365l26j906m54K313m80j151p92J214J977j150
$$ -361 -1481 -358 1268 -1197 -1522 -1164 1201 875 -1031 -1485 828 348 -803 -1595 -381 1596 446
2152D46j124J87K89J500k271O12N90J156k328M13J704r5J47j929N70R81j252j352
$$ 446 -678 -491 -202 1298 -973 -361 229 1385 -943 -530 1174 1079 1226 -703 -133 848 -404 -1756
2170a756J715P77k17j410L2J938k90j363j64R29J540p54r40K68Q15n64j473J51
$$ -1756 -41 736 519 -891 -859 1079 789 -574 -738 191 1731 977 37 305 1120 556 -917 -766
2188g66J426P29k035N44P82j41l14r49N21J180j247o28M54J326J48k574J063M40
$$ -766 660 1389 -646 -102 680 539 225 -724 -203 977 -270 -898 -444 882 1030 -1544 -481 -41
2206d1M92o37p61R08J094q93o41K43P38l49j057M97K41L23j091K04P66J2p59O34
$$ -41 451 -186 -947 -39 1055 162 -479 -236 502 153 -904 -407 -166 157 -934 -730 36 48 -711 -77
2226g7L78j87l65m44J142L77j00r85m40N16J190p83q10M91M64k98K56l42J089
$$ -77 301 114 -251 -695 447 824 724 -261 -701 -185 1005 222 -588 -97 367 69 325 -17 1072
2245A072o73j440P32P49j66n21k83R69Q06j722p52J339J014j610j17M48Q21kj499
$$ 1072 399 -1041 -309 440 274 -247 -530 439 1245 -477 -1229 110 1124 -486 -603 -155 666 664 -835
2264h35O86O90m80N4J042l16R1j397j36Q02K9m53n90J6K041j282r81M39J199j110
$$ -835 -149 541 61 115 1157 841 932 -465 -601 201 230 -223 -813 -797 1244 -38 -1019 -580 619 -491
2284d91k97J247q21M62J73q69J28J467r19L77r44J68J704r54o83l85K60O38m23
$$ -491 -788 459 -362 100 273 -596 -468 999 80 457 -487 -319 1385 431 -252 -637 -377 261 -162
2303a62j26J011j384j3M47K34N85j076j78J045O65k080J24J729k54J33j292Q45
$$ -162 -288 723 -661 -674 -227 7 592 -484 -662 383 1048 -1032 -908 821 567 700 -592 253
2321B53pQ21j868L07Q27K9n09l06K59j87P30j442Q46M99k14j303N31R39M66j485
$$ 253 246 1067 -801 -494 333 362 -147 -453 -194 -381 349 -1093 -247 252 38 -1265 -734 205 671 -814
2341h14O17L48L61nJ91k66q70R52j165R9R29m62p56O88k76J60n0M20l00p66J340
$$ -814 -197 151 512 507 698 432 -438 514 -651 -552 377 -85 -841 -153 -429 -269 -319 101 -199 -965 375
2362C75l55J47N03n53L68N3M57p95K74p09M32M77q67p55N20J036m53j150N89m0
$$ 375 20 167 670 117 485 538 995 200 474 -235 197 674 -193 -948 -428 608 155 -995 -406 -446
2382d46Q96q0j341Q26k7J41J39J26l1k39k29L20N54j064O42J04K95n54j238J347
$$ -446 450 370 -971 -145 -172 -31 108 234 203 -36 -265 55 609 -455 187 291 586 32 -1206 141
2402A41J21n5q32K26N34J53m70r91J318l18L29r45J377j144K32J811j200j67k35
$$ 141 262 207 -625 -399 135 288 -182 -1173 145 -173 156 -789 588 -556 -324 1487 287 120 -115
2421a15N65m38j71Q33l53p10R77n88M52O14p22p20N58o19MO10n10N90n20O04k56
$$ -115 450 12 -159 674 321 -389 588 0 452 1066 344 -376 182 -437 -433 177 -333 257 -263 341 85
2442H5L04L0l18n38R34p50O68k16k19l71m79R97q1Q25j476M73k85M18o13k50P62
$$ 85 389 419 101 -437 497 -253 415 199 -20 -391 -870 127 46 871 -605 -132 -417 1 -612 -862 -100
2463a00R44K53j391l69J10N62l52M92Q48q22o52Q10L65p68J46J309j000L0m73
$$ -100 844 1097 -294 -663 -553 9 -343 149 997 175 -477 333 698 -70 76 1385 385 415 -58
2482e8L95l85O91j128J162m55M35r63J49l19R88o58N45k47k82l8O5o8L6O20j260
$$ -58 337 -48 643 -485 677 222 657 -306 -157 -476 512 -146 399 152 -130 -168 -103 -171 -135 485 -775
2503g75J631j344K9J29M58n22Q04k45P8J33l57K33p47Q77J40n51L53l80j33k52
$$ -775 856 -488 -459 -330 128 -394 410 165 243 376 19 252 -495 382 522 -29 324 -56 -189 -441
2523d41J077j085N19M56M03q98m88L64Q71j55j011M14Q0K67m85N86n12q2O78j5
$$ -441 636 -449 70 526 929 31 -457 -93 778 623 -388 26 106 373 -112 474 -38 -120 558 543
2543E43p77N75o80k1M50O69n73j20j89M87Ko79Q50m74n05J887r00j95M90p94L89
$$ 543 -234 341 -339 -360 90 759 186 66 -123 364 366 -313 537 63 -442 1445 545 350 840 46 435
2564D35r85N53l41K8j14n07J310p81q66O09N68P82l92n17L72q73J45M76j48J82
$$ 435 -550 3 -338 -310 -424 -931 379 -402 -1268 -659 -91 691 299 -218 154 -719 -574 -98 -246 -64
2584f4L3r52J196k13l30J99L54o83R71l10o85m41P00P44J51J67j005k93P62m93
$$ -64 -31 -983 213 0 -330 -131 223 -460 511 201 -484 -925 -225 519 670 837 -168 -461 301 -192
2604a92o0J237p53L52p89R38p17j20m34J191l92j9j49q01J092p40O33k80k43M58
$$ -192 -252 985 232 584 -205 733 16 -104 -538 653 261 242 93 -708 384 -356 277 -3 -246 212
2624B12L52r37O24q97P10l34j22N47k65K7M56o02R94l15o29M53q01R17O82j122
$$ 212 564 -373 251 -646 64 -270 -392 155 -110 -83 373 -229 765 450 -179 274 -527 390 1072 -50
2644e0k97J167j021j82P16o93M03L01k45Q1m30j42K88K4j81k27rL9q6L41j68K60
$$ -50 -347 820 -201 -383 333 -360 43 344 99 180 -250 -392 -104 -80 -261 -488 -497 -458 -544 -203 -371 -111
2666a11K63J29r12P38m97j28J500j139M53q02Q45k80q8j09l28P59j369J345J37
$$ -111 152 281 -631 107 -390 -518 982 -157 296 -506 339 59 -29 -138 -466 293 -1076 269 406
2685D06l30l64J13m07J021l21o9K56l86j47P78l33o12L17K2j32n72L61N21k61
$$ 406 76 -288 -175 -582 439 118 49 305 -81 -228 550 217 -395 -78 -56 -188 -760 -399 122 -139
2705a39O96q19L1j18R02o85pM15j022L26n41O73O05j70J4n46l6j166J295J62R7
$$ -139 557 -262 -231 -349 553 -132 -139 276 -746 -420 -961 -288 317 147 161 -385 -421 -1587 -292 -130 -33
2726c3N40o61Q55j282Q77N78o48K62l10J31o76J149l03j076J306o42k53K19j78
$$ -33 507 -154 701 -581 296 874 226 488 178 309 -367 782 479 -597 709 67 -186 33 -145
2745a45j15l55J283m42j61j89K57q4k33N75k21M17Q9j272J316o71M8j029Q58M50
$$ -145 -260 -615 668 226 65 -124 133 49 -184 391 170 587 676 -596 720 49 97 -932 -74 376
2765C76p33R39q58M14M99n61K25j30q6p04L09R55l26j009O46m4Q63j414J724p93
$$ 376 -357 582 -276 138 637 76 301 171 85 -619 -310 645 319 -690 -44 -88 775 -639 1085 292
2785B92j14P6n79R7o92N31Q76l80j2n2L2o84J003r9k82J09j42q48Q77O46j376
$$ 292 178 254 -325 -228 -920 -389 487 107 95 43 75 -609 394 295 13 122 -20 -868 9 655 -721
2806g21J623l48k59k99o33Q90n20L81L90j374R42m65r9M37Q0J73L06M61j241J38
$$ -721 902 554 295 -4 -637 253 -267 114 504 -870 72 -393 -492 -55 25 198 504 965 -276 -138
2826a38K75O89o59M34j239J061n85N41K76J50j265l8J015q02p6J129o49J57n24
$$ -138 137 826 167 601 -638 423 -162 379 655 805 -460 -498 517 -285 -361 768 119 276 -248
2845b48N99j81k20N38nq19P64n6j09q10R54j80K01r28O47p8k04K58k41l53M55
$$ -248 351 170 -50 488 483 -336 428 372 263 -547 407 227 428 -500 147 69 -135 123 -118 -471 -16
2866a6M83n76O40K47L38j665J32P06j385Q77L03k51R80j266Q57q14J33o22L33
$$ -16 467 -109 531 778 1116 -549 -417 289 -1096 -219 84 -167 813 -453 404 -410 -277 -899 -566
2885e66K98N44q25J109n36q38J577l00j33j72n12O73k23p60N05J3R65m67M8m7
$$ -566 -268 276 -549 560 24 -814 763 463 330 158 -354 319 96 -664 -159 -146 819 352 400 353
2905C53n20n62N76N25j62o91N8P02K88l01n20l7J69P40k85l40j220J357L07o40
$$ 353 -167 -729 -153 372 210 -481 -423 279 567 266 -254 -291 -122 618 333 -7 -1227 130 437 -203
2925b03j9J086q91n26J112m18n41M51L91l96m03J94k31K7Q76o73l40j77K39P75
$$ -203 -222 864 -27 -553 559 141 -400 51 442 46 -357 -163 -394 -367 509 -164 -504 -681 -442 333
2945C33q36Q25l60j324J079L62J4M01r96J83P40j546J248r0N99k65q17J32P3J36
$$ 333 -503 322 -38 -1362 -283 79 93 494 -502 -319 421 -1125 123 33 632 367 -450 -318 -245 -109
2965a09k18J59L10m42O40J37l51J56l16l44J42K70k21Rk05k06P67j10j088P71
$$ -109 -327 -168 142 -300 340 477 126 282 -34 -378 -236 34 -187 -178 -383 -589 178 68 -1020 -249
2985b49N50k32K61j086J259q45k83P43j43o55N56K79q40L72N30n78O01j06m13
$$ -249 301 69 330 -756 503 -342 -625 118 -25 -680 -124 155 -685 -313 217 -361 240 134 -279
3004b79J38K99l52K84l69N1J008j174m21P17N73K13j414K25J242k65p87Q05L4
$$ -279 -141 158 -194 90 -279 -228 780 -394 -815 -98 475 688 -726 -501 741 476 -311 494 528
3023E28o45j075J558p15J134j278N73o5J2j43r51J019k04R06J82j590K54Q16l72
$$ 528 -117 -1192 366 -349 785 -493 80 15 27 -116 -1067 -48 -252 654 836 -754 -500 316 -56
3042e6PO41k22j57r45J828p78p19M80k80j59m81K26M79P96k02q5Rm30q38M42J25
$$ -56 -49 592 370 213 -732 1096 318 -401 79 -201 -360 -841 -615 -136 660 458 373 382 -48 -886 -444 -319
3064c19N92k48L52M04o78p59N00P76l77l15K98p16q8K44P92n81L52l57j87m8M85
$$ -319 273 25 377 781 103 -656 -156 620 243 -72 226 -490 -578 -334 458 -123 229 -128 -315 -363 122
3085A22k31k48K55L83K74j43r6k61O24k17p30J480k90n17j81o94J192o73k84L59
$$ 122 -109 -357 -102 281 555 412 316 55 679 462 -268 1212 922 405 224 -470 722 49 -235 124
3105A24l50L13j6p81rJ380K6o62K65o67L11m9n02P22n05J315p99l54O58j013P77
$$ 124 -226 87 71 -710 -719 661 687 25 290 -377 -66 -115 -617 105 -400 915 116 -238 420 -593 184
3126A84K77J53m69O11r68m39J124m71L87Q4m26m63M17N23N89n40l79o34l9r6N72
$$ 184 461 614 145 756 -212 -651 473 2 389 473 47 -416 1 524 1113 573 194 -440 -479 -575 -3
3147cJ10O40j230J129p51M90j59m2j24M88R0m77N59o27L9K69m92K00n52O98j337
$$ -3 107 747 -483 646 -105 385 226 184 60 548 638 161 720 93 132 401 -91 109 -443 255 -1082
3168a082O38L44M59j26k48k67K39l02K19P18j027q19J508J2N51o39n10p09J116
$$ -1082 -444 -100 359 233 -15 -282 -43 -345 -126 592 -435 -1254 254 266 817 178 -332 -1041 75
3187G5l58K54L45p01O44m92J38P68j465P05k15j31K2Q52n78r82N13M56K37M74
$$ 75 -283 -29 316 -385 259 -233 -95 673 -792 -87 -302 -433 -411 441 -137 -1119 -606 -150 87 561
3207E61j082j50k71J125q06O49m49L73M02j97Q17r0Q9m72l95J04m29j73O70J79
$$ 561 -521 -671 -942 183 -623 26 -423 -50 352 155 972 882 971 499 104 208 -221 -394 276 455
3227D55k26m99L78L88j271M87r4K45R39k93n76l80J004l87J49l17m62N07j13j05
$$ 455 229 -270 108 496 -775 -288 -382 -137 802 509 -67 -447 557 170 319 2 -460 47 -66 -171
3247a71R40j700N63l09j79O07R7M30o59R66j70r22P16J42j16k07n52q8j38J031
$$ -171 769 -931 -368 -677 -856 -249 -152 278 -381 585 415 -507 209 351 235 28 -524 -612 -750 281
3267B81o0j398J024n1r51J156p40J210l59J46j99l44k41J133k76j72N56j799J270
$$ 281 221 -1177 -153 -204 -1155 1 -739 471 112 258 59 -285 -526 607 331 159 715 -1084 186
3286A86p89R06n78R87q61P28m25o4p35M28o25N76J02o8L98P73j160q89J092n15
$$ 186 -603 303 -275 712 -149 579 154 90 -645 -217 -842 -266 -164 -232 166 939 -221 -1110 -18 -533
3306e33r7L36J069o62j08M20J17o70J028r28L39p7j22m54L71m18O83J01r18P19
$$ -533 -630 -294 775 113 5 425 542 -128 900 -28 311 234 112 -342 29 -389 294 395 -523 196
3326A96N19l85j81q70R14N91r8j923J119L83M9p48K85M69o17k92o63J018P67j248
$$ 196 715 330 149 -721 193 784 686 -1237 -118 265 314 -434 -149 320 -297 -589 -1252 -234 533 -715
3346g15J113l73k89N77l16L88m67J003j99j83p6m15l82j86j90Q45n93M16O36k96
$$ -715 398 25 -264 313 -3 385 -82 921 722 539 463 48 -334 -520 -710 135 -458 -42 594 298
3366B98m6J67K87m77J01m11k03N56j453J558k5J47k2p88N87j051O10k76P77l52
$$ 298 252 419 706 229 330 -81 -284 272 -1181 377 352 499 477 -311 276 -775 -165 -441 336 -16
3386a6j243R87K35K14n78K31k22m83P59P1p51R56o9O60q02N72J60j378J00R99
$$ -16 -1259 -272 -37 177 -401 -170 -392 -875 -116 -45 -796 160 91 751 -51 521 681 -697 -597 402
3406D02k36L76k39Mm66l61J396r74M95M5n83N01o65J07n59J312r50L86m50n32
$$ 402 166 542 303 307 -159 -520 876 -98 397 442 -141 360 -305 -198 -757 555 -395 -9 -459 -991
3426i91J158j03N42j087M57m31N22L43r71J627j792M32J008m66r31N39O43n85
$$ -991 167 64 606 -481 -24 -455 67 410 -561 1066 -726 -294 714 248 -683 -144 499 -86
3444h6L03K1j109J167j487O43K0R32j34o24O44N96r57k48N15P1k20l0k11j03O15
$$ -86 217 238 -871 296 -1191 -548 -528 404 270 -354 290 886 -71 -319 196 267 47 17 -194 -297 318
3465C18R1R1l69k88j62JQ79o47k36Q38k29q40N48O15l3k49L0M13p86K32r21R80
$$ 318 409 500 131 -157 -319 -318 561 -86 -322 516 287 -553 -5 610 577 328 358 771 -15 217 -704 276
3487B76K06P2j333J317Kr30n6M02k5j91L76j02ok33M40r20J340j222K45N25k62
$$ 276 482 554 -779 538 540 -390 -446 -44 -69 -260 116 14 8 -225 215 -705 635 -587 -342 183 -79
3508g9j294P38K99J00j62p6M50q90K327j368K53k91o46J9P21m93O37k50j5O63
$$ -79 -1373 -635 -336 -236 -398 -474 -24 -914 1413 45 298 7 -639 -620 101 -392 245 -5 -20 643
3528F43j334Q30j18L42ml21L75o32m39N06j25L99m15N64L64o09l22P9L89q95K55
$$ 643 -691 139 21 363 359 38 413 -219 -658 -152 -277 122 -293 271 635 26 -296 -217 172 -723 -468
3549d68J713k133N82o3n10P87O39o87l21L44m27K81N67K43n70k16M73j27m05O82
$$ -468 1245 -888 -306 -369 -879 -92 547 -140 -461 -117 -544 -263 304 547 -23 -239 234 107 -298 384
3569C84j70k53j19J65q9J44r6k82k32J095j149N98j14p48J381R0n66L08l57m61
$$ 384 214 -39 -158 7 -82 62 -34 -316 -548 547 -602 -4 -118 -866 515 605 39 347 -10 -471
3589d71M46k25L49r16R55K8j45p8M18k56O07j184o4L54J44p0J53O92j124O44Q6
$$ -471 -25 -250 99 -817 138 166 21 -57 361 105 712 -472 -536 -182 -38 -108 45 737 -387 257 343
3610C43M2l70J50m55N30J22k42J24K44j105J073N07l6q63N43p06J64L25K58j147
$$ 343 385 15 165 -290 240 362 120 244 488 -617 456 963 927 64 607 -99 65 390 648 -499
3630d99KR26n08K47M72n33m98L71O42p83m23K4Q32r55k23J609M43l41p54n5k91
$$ -499 -497 429 -79 168 640 107 -391 -20 622 -161 -584 -560 272 -683 -906 703 1146 805 51 -4 -295
3651b95k02O51L1r09P44o57J153n88J96n67k47j99J281Kq58L62K53K05q34K90
$$ -295 -497 154 185 -724 20 -637 516 -72 124 -443 -690 -889 392 394 -464 -102 151 356 -478 -188
3671a88P7J5Q6j89L95J5k26J29M53K0p58O49o44P1N87l91J50n18L01J16L54p54
$$ -188 -111 -96 -10 -199 196 211 -15 114 567 587 -171 478 -166 -95 492 101 251 -267 34 150 504 -250
3693b50J50J273r47j23L11o14P14q30L91p9M5k03j615R79N88L31r82J908n17p25
$$ -250 -100 1173 226 103 414 -200 514 -316 75 -4 41 -162 -1777 -798 -210 121 -861 1047 530 -195
3713a95J25J049j683P86o31J278j910K50P42M5k99J12K06O44o36P51m67J89q10
$$ -195 -70 979 -704 82 -549 729 -1181 -931 -189 -144 -443 -331 -125 519 -117 634 167 356 -454
3732d54o55J019j98O65j7J2K40q1P0q23R5L59n66P48j230J015k07j45Mj22O77
$$ -454 -1109 -90 -288 377 360 372 612 531 601 -222 -127 232 -334 414 -816 199 -8 -153 -149 -271 406
3753D06n67L14j21J93nm45K42j7j74qj34M10K62l31o30J382o31K51o62N21k91
$$ 406 -161 153 32 225 220 -225 17 0 -174 -182 -316 94 356 25 -605 777 146 397 -265 256 -35
3774c5m99P23m73J115n84q64K51J397o67p33J246p01N36O35j171J9N89j439m4
$$ -35 -534 189 -284 831 247 -617 -366 1031 364 -369 877 176 712 1347 176 195 784 -655 -699
3793f99O51l62M25j00Q78j176P99j311J171q0n72L18n84K28O97l4M66j469O15
$$ -699 -48 -410 15 -85 793 -383 416 -895 276 196 -376 -58 -642 -414 283 249 715 -754 -139
3812a39J286j243Q56K06j293J093K85j149j19Q33q89K18J76q90J153k07M50j246
$$ -139 1147 -96 760 966 -327 766 1051 -98 -217 616 -273 -55 121 -769 384 177 627 -619
3830f19J434m33k59J53k15j51R02j097P28j710M80J713j954J569q69n58P35l88
$$ -619 815 382 123 276 61 -90 812 -285 443 -1267 -787 926 -1028 541 -328 -886 -151 -539
3848e39L21Q13J5q81j450Q72J387r90n2O93j66N28m38J44n86R35o35q02Q42K89
$$ -539 -218 595 610 -271 -1721 -849 538 -452 -504 189 23 551 113 257 -329 606 -29 -831 11 300
3868C00j81J53n72P58q43k90J698j442j8O17J67k41M35j009M10J72p7k66P9k80
$$ 300 119 272 -300 458 -385 -675 1023 -419 -437 180 347 106 541 -468 -58 114 37 -229 -150 -430
3888d30j79R48l60O03j223J46j18L16J512k83n87p55p36J996p46J22q41J008q53
$$ -430 -609 339 -21 582 -641 -495 -613 -297 1215 932 345 -410 -1146 850 104 226 -615 393 -460
3907d60L19O76r05K07j097P03O02M30m69m79L76M0K10q36O0R78q29M0M37j695
$$ -460 -141 535 -370 -163 -1260 -557 45 475 6 -473 -97 -57 153 -683 -623 355 -474 -434 3 -1692
3927a692K382j587P07L52l46K80l33J94l72r8o82R71N31k38m11M40j3J374r60
$$ -1692 690 -897 -190 162 -184 96 -237 -43 -415 -513 -1195 -224 307 69 -342 98 85 1459 499
3946D99j057R48j036J024n56k15L14M81q66O71M37r41J112o41m76O3P24j282J14
$$ 499 -558 390 -646 378 -178 -393 -79 402 -464 207 644 -297 815 174 -302 -239 485 -797 -683
3965f83J055k28j07l72K56O85r35N89m34R8l41k92k14R2J101q71P38n18J69p3
$$ -683 372 144 37 -335 -79 606 -329 260 -174 -76 -417 -709 -923 -831 270 -601 137 -381 -212 -285
3985b85M01q23J034j449N45j41Q9R29q29O87o92L15R31o6j628J490q80p67J304
$$ -285 116 -707 327 -1122 -577 -718 -629 300 -529 158 -534 -219 712 646 -982 508 -372 -1139 165
4004A65J13m61n3m12J174r02O9L92p9l7k33M72n92K79L72j141N23l04J019O86
$$ 165 278 -183 -236 -648 526 -376 -307 85 6 -31 -264 208 -384 -105 267 -874 -351 -655 364 1050
4024A050r68J01J12n14P01o25O70o37J486j717L46k07J75p57J022N87j434M96
$$ 1050 82 183 295 -219 482 -143 527 -110 1376 -341 5 -202 -27 -784 238 825 -609 -113
4042a13j77J021q34j8%o41J49O45p67Q59l00K64k9J030m45j410M55N80r20P87
$$ -113 -290 731 -103 -121 -121 -762 -613 32 -735 124 -176 88 59 1089 644 -766 -311 269 -651 136
4062A36m71m05J672l61p16n57Q17j65J120m76L13o00n41m8P82n72j43Q49p66M38
$$ 136 -335 -740 932 571 -145 -702 115 -50 1070 594 907 307 -234 -282 500 -72 -215 634 -132 306
4082C06j87M6K21j14m14l50P03j071Q19N90j438J052J03R38j399j8J148m51r4
$$ 306 119 165 386 272 -142 -492 211 -860 -41 549 -889 163 266 1204 -195 -213 935 484 390
4101C90k73J3p75K23M69j01J53j82m3K06J40K7q84k11R93o04R46o31j67M40l65
$$ 390 117 130 -645 -422 47 -54 99 -83 -126 80 220 247 -637 -848 145 -459 487 -144 -311 129 -236
4122b36L13j046M44J73n94O18K19N13p23O00p48L59J40O96j050Q3R51r54M91j49
$$ -236 77 -969 -525 -352 -946 -328 -109 404 -319 281 -467 -108 32 728 -322 -239 712 -242 249 100
4142A00l13O56n57L53j017J614j152P38M71o21j18J50N25r11k94Q41R1L13j90
$$ 100 -213 443 -114 239 -778 836 -316 422 893 272 154 304 829 -82 -376 465 556 869 679
4161F79J91o05l12M31M1j095M61J08O39j122R18J05K02k04o27Q62j107R20Kp26
$$ 679 870 265 -47 384 425 -670 -209 -101 538 -584 334 439 641 437 -190 672 -435 485 487 -239
4181b39k52K76l64M29J136j599L60j24o4M8k99L45K94N6K70q50R67o63K2L73L61
$$ -239 -491 -215 -579 -150 986 -613 -253 -377 -441 -393 -692 -347 -53 3 273 -577 390 -273 -251 122 483
4202D83o60O97k28o37P91K30p24L74J16j25n57M17J236j598P24r28k64J060n64
$$ 483 -177 520 292 -345 446 676 -48 326 442 317 -240 177 1413 -185 539 -389 -653 407 -157
4221a57k11O31l49N96p0j192L20K91r38Q35N49m68r70J316q15M97L87L20n60n59
$$ -157 -368 263 -86 510 440 -752 -432 -141 -1079 -244 305 -163 -1133 183 -632 -135 252 572 12 -547
4241e47Q05k7n1j1l45j34o70J242J34K45m78M0K51j499O48N13n75k44P27n27R75
$$ -547 258 231 180 169 -176 -310 -980 262 396 641 163 203 454 -1045 -397 116 -459 -703 24 -503 472
4262D72j40J84q34N67M42k28m85Ll0m23m69K483k061n58R79O40M0r75R95P4p38
$$ 472 332 516 -318 249 691 463 -22 -19 -49 -472 -941 1542 -519 -1077 -98 542 582 -393 602 676 -62
4283f2j68R07m84m81J208o50M99j652J034J0Q2q46N63o25j54Q07o4L56m05r14
$$ -62 -230 677 193 -288 920 270 769 -883 151 161 243 -603 -40 -665 -819 -12 -76 280 -125 -1039
4303a039L29M64M12n50P9K09n63P72N06m28l41l25J358p68k63P25k81n81K31k96
$$ -1039 -710 -246 166 -384 -305 -96 -659 113 619 191 -150 -475 883 115 -148 577 296 -285 -54 -350
4323c50M67j77J9K59N99m97k92m26J19Q57k45P47j037n48P21JK46n16J72K64M54
$$ -350 117 -60 -41 218 817 320 28 -398 -279 578 333 1080 43 -505 216 217 463 -53 119 383 837
4344H37r85J013j123Q02l45k36J0j8J112j144O7l72k91K87K5R18l6q77j00K46
$$ 837 -148 865 -258 544 199 -37 -27 -45 1067 -77 -10 -382 -673 -386 -361 557 521 -356 -456 -210
4364b10N66q89Q78M80j803J013q02R92n45J340j318R3K46J29j07m37L73j74M30
$$ -210 356 -533 345 825 -978 35 -767 225 -320 1020 -298 -205 41 170 63 -374 -1 -175 255
4383B55m12p53K019r78k25n18Q76r22P00l93R11M4p04q0k83j139J445l10q29J478
$$ 255 -157 -910 1109 131 -94 -612 264 -658 42 -351 560 604 -100 -180 -463 -1602 -157 -467 -1296 182
4403A82j69M09l04M49o17O82p87Qn63L16P54k81l33o88J519m15n34n64J002l40
$$ 182 13 422 118 567 -50 632 -155 -147 -710 -394 360 79 -254 -942 577 162 -372 -936 66 -274
4423b74N83K96p59o5k05Q16l06k73Q33p3n16L40o11J94M36K06l91k40n76j28K3
$$ -274 309 605 -154 -219 -424 392 86 -187 646 573 57 397 -214 -20 416 622 231 -9 -585 -713 -690
4444f90R00j140J581o91K47M15j277Q12m35N56N61m93k25O54q56P60j100m59J241
$$ -690 210 -930 651 -40 207 622 -655 157 -278 278 839 346 121 775 -81 679 -421 -880 361
4463C61k30P20j121l6O26J14k31m36l32J265k86q14R30p25N21j7J03L1mk72k99
$$ 361 131 851 -270 -306 320 434 203 -233 -565 700 414 -400 530 -195 326 309 412 443 439 167 -132
4484a32q7P6M90j3o62l31J368j716J372j181J014M68n39j19P71j836K99R85r38
$$ -132 -219 -143 347 334 -328 -659 709 -1007 365 -816 198 666 127 8 779 -1057 -758 227 -711
4503g11L49N19K29N5L99j435K88L53Q41j058j71O2M34K50k97J228j060q25J163
$$ -711 -362 157 386 441 840 -595 -307 46 887 -171 -342 -280 154 404 107 1335 275 -550 613
4522F13j600J354l23k22R45j294N83J52p49QP12j95j54J75P33o86j44M37pJ36
$$ 613 -987 367 44 -178 767 -527 56 208 -541 -533 179 -16 -170 5 738 52 -92 345 338 474
4542D74j319J324j43q63r8m7K26L31M46P48j710M29j08J91L09R3m56p77J047L97
$$ 474 -845 479 336 -527 -625 -672 -446 -115 331 1079 -631 -202 -310 -119 190 283 -173 -950 97 494
4562D94p2J56j65j23J03n13P2K42J00k22N79r05P08l74m52J01J59M39J2J55j092
$$ 494 422 578 413 290 393 -120 -48 194 294 72 651 -254 454 80 -372 -271 -112 327 339 494 -598
4583e98O78q4k00L84n58L60L72j96K74J44k61Q2p59O3M32k6k23K99J61K45j84
$$ -598 80 -4 -204 180 -378 -18 354 158 432 576 315 397 -362 -299 133 107 -116 183 344 589 405
4604D05p75J129j179k94o22J197P99l42n0j019M82N93K70K55j137L92l60R21q08
$$ 405 -370 759 -420 -714 -1336 -139 660 318 268 -751 -269 324 594 849 -288 104 -256 665 -143
4623a43M34j59k64m53J70J349j194N05k84L39M45j142M61j45K01l85p9k74Q16
$$ -143 291 132 -132 -585 -415 934 -260 245 -39 300 745 -397 64 -81 120 -265 -344 -618 198
4642A98L7L63K94r37P98p26O55j139K46N0j17K91Q5r41J456m75r79J140n58Q81
$$ 198 235 598 892 -45 753 27 682 -457 -211 -161 -278 13 98 -843 613 138 -841 299 -259 622
4662F22j048M39N31j58o18L7L89o29J073j30L0L28p03K79P7j70L75r96O71l95
$$ 622 -426 13 544 386 -232 -195 194 -435 638 508 538 866 163 442 519 349 724 -272 399 4
4682DL38r40Q31m21j11l53N10P55j446J300j166Q7N48m74M80K99K78l06j2p24
$$ 4 342 -598 233 -188 -299 -652 -142 613 -833 467 -699 -612 -64 -538 -58 241 519 213 201 -523
4702e23L65M61j176J653j057R2K62J41j48j12l42L75K9p81J177j47K57j452R95
$$ -523 -158 303 -873 780 -277 -185 77 218 70 -42 -384 -9 20 -761 416 269 526 -926 69
4721F9l5J06o02k05M71R96m26q67P66j369R15mL92K42J28j88o65L01k06k72L88
$$ 69 34 140 -462 -667 -196 800 374 -493 273 -1096 -181 -185 207 449 577 389 -276 25 -181 -453 -65
4742f5K96m38M09p17O95o6o74J138j252R85M87n63n25N55n83m44L06M29o37P58
$$ -65 231 -207 202 -515 180 114 -560 578 -674 311 798 235 -290 265 -318 -762 -456 -27 -664 94
4762I4O28K42o77P1q61l27J012o35N85l91M79k64m22Q30l91M45n14K94r20K17
$$ 94 722 964 287 358 -503 -830 182 -453 132 -259 220 -44 -466 364 -27 418 -96 198 -722 -505
4782e05j8j73J287p72M68o58M02j458J547o87P09j81q30L72J056m26m66P52K84
$$ -505 -523 -696 591 -181 287 -371 31 -1427 120 -567 142 -39 -869 -497 559 133 -333 419 703
4801G03o60j41J107j008N52O36j916O23p48R60j68N35j73o64o29J757m47n4n43
$$ 703 43 -98 1009 1 553 1189 -727 -104 -852 108 -60 475 302 -362 -991 766 319 265 -278
4820b78L25n72P55O7m67K97p33J471j391N71K8m08m85N68J379j092l41O80j528
$$ -278 47 -525 230 297 -170 127 -606 865 -526 45 73 -335 -820 -252 1127 35 -306 374 -1154
4839a154O97j89j47M53Q94j037J054m03j75k98m00R06l22m35J87J53J65K2j16
$$ -1154 -457 -646 -793 -340 554 -483 571 168 -7 -305 -705 201 -121 -556 -369 -216 -51 -29 -145
4858a45M80p74n54J029l75K96L8n75Q77k12L60O67l38k80o45Q40j118L30J19n50
$$ -145 335 -439 -993 36 -339 -43 -5 -580 297 85 445 1112 774 494 -151 689 -429 -99 20 -530
4878e30O19j48O36p74j45j7p09O65K15K72km81m06p15J279J2Q9Oo04N34L37m5
$$ -530 89 -59 577 -197 -342 -359 -1068 -403 -188 84 82 -399 -805 -1520 -241 -229 -140 -134 -738 -204 133 88
4900H8j04m62r83J261o70P97j043J779j679J434k46q45O25M52p57K48N95o22R2
$$ 88 -16 -478 -1461 -200 -870 -73 -1116 663 -1016 418 172 -673 -48 404 -353 -105 490 -132 -40
4919d0K34q00M40K91J89K25N59j674N55L2k92J744r95M5k76j046J119l44k76M08
$$ -40 194 -606 -166 125 314 539 1098 -576 -21 11 -281 1463 468 513 237 -809 310 -34 -310 98
4939I8p64L49P68J55l58K31K51j877J008k47Q09k43n04L07o86m98J384p47M58
$$ 98 -666 -317 451 606 248 479 730 -1147 -139 -386 423 180 -324 -17 -703 -1201 183 -564 -106
4958a06N88k56n04m35J610p02j042N93q1J80O42n54M96J29o25j97O43r68N05J08
$$ -106 482 226 -278 -713 897 195 -847 -254 -335 -155 487 -67 429 558 -67 -264 379 -589 -84 24
4978B4p7Q14m97K45o8r55N93p91O60K76q53J59Q49n66O51o28P43l61m5n92J44
$$ 24 -53 761 264 509 441 -514 79 -712 -52 224 -629 -470 379 -187 464 -164 579 218 173 -419 -275
4999b75k52M54l5N77m71Q39o16O8L88j015N31j038k82J425J56p93n4K63j90R87
$$ -275 -527 -73 -108 469 -2 837 221 289 677 -338 193 -845 -1127 298 454 -339 -393 -130 -320 667
5019F67o26j47J01m26J140m06l89k09j34R39n32K05J58j109J937j037J4l02k56
$$ 667 41 -106 -5 -431 709 303 -86 -295 -429 510 -22 183 341 -768 1169 132 146 -156 -412
5038d12l21O71k14j68J046q03k35K84j14N5J192p04J72j241J241p32o58J281R01
$$ -412 -733 -62 -276 -444 602 -201 -436 -152 -266 -211 981 277 449 -792 449 -283 -941 340 1241
5057A241j002r7O75m13J22p45M28J25j12J87r99J009j75N63p75J17p26L09L90
$$ 1241 239 142 817 404 526 -219 209 334 222 409 -590 419 244 807 32 149 -577 -268 122
5076A22m98j26R04p29K11L83J082j061L58j281K8P19Q65q01p42L50n6M72m6N48
$$ 122 -376 -502 402 -327 -116 267 1349 288 646 -635 -607 112 977 176 -566 -216 -272 200 154 702
5096G02j309N97k22L20n67J139j591J023j79K68K19j143J121J16m20l86Q2m26
$$ 702 -607 -10 -232 88 -479 660 -931 92 -87 181 400 -743 378 494 74 -312 -230 -656
5114f56Q99p34M29M87P1K8L50j453J132K88o83q74J774j433P0P70j462J021J11
$$ -656 243 -491 -62 425 496 524 874 -579 553 841 158 -716 1058 -375 -305 465 -997 24 135
5133A35o66O14j035K73P25j94L60O51r57K45j39l0k6J71M28k87l0L40o66J9M85
$$ 135 -531 83 -952 -679 46 -148 212 863 -94 151 12 -18 -44 127 555 268 238 578 -88 -69 416
5154D16p74O24qj6o71K79K28o68J145r3j67l30N78k051J343N61r4j002N07n4J232
$$ 416 -358 266 258 242 -429 -150 78 -590 555 462 295 -35 543 -1508 -165 396 302 -700 -193 -247 985
5175I85n78p41K86o18Q37j011N20K86M23o82K95J65J75j072Q87L75k98p5q0m69
$$ 985 407 -334 -48 -666 171 -840 -320 -34 389 -293 2 167 342 -730 157 532 234 159 79 -390
$$ [...]
8191G0
##END NTUPLES=NMR FID
##END=
