##TITLE=1H_AT-24
 CD3OD/CD3ONa, 72 sc, 
 25.10.2019
##JCAMPDX= 6.0         $$ Bruker NMR JCAMP-DX V2.0
##DATA TYPE= NMR FID
##DATA CLASS= NTUPLES
##ORIGIN= UXNMR, Bruker Analytische Messtechnik GmbH
##OWNER= root
$$ XWIN-NMR		Version 3.5
$$ Fri Oct 25 15:40:34 2019 Russian Standard Time (UT+4h)  she@DPX200
##.OBSERVE FREQUENCY= 200.1315
##.OBSERVE NUCLEUS= ^1H
##.DELAY= (6, 6)
##.ACQUISITION MODE= SIMULTANEOUS
##.ACQUISITION SCHEME= undefined
##.AVERAGES= 72
##.DIGITISER RES= 18
##SPECTROMETER/DATA SYSTEM= spect
##.PULSE SEQUENCE= zg30
##.SOLVENT NAME= D2O
##.SHIFT REFERENCE= (INTERNAL, D2O, 0, 15.7039)
##AUDIT TRAIL= $$ (NUMBER, WHEN, WHO, WHERE, WHAT)
$$ ##TITLE= Audit trail, XWIN-NMR		Version 3.5
$$ ##JCAMPDX= 5.01
$$ ##ORIGIN= Bruker BioSpin GmbH
$$ ##OWNER= she
$$ F:/spectra/data/she/nmr/H-F/1/audita.txt
$$ ##AUDIT TRAIL=  $$ (NUMBER, WHEN, WHO, WHERE, WHAT)
(   1,<2019-10-25 15:39:30.14 +0400>,<she>,<DPX200>,
      <continue with go, POWCHK disabled, PULCHK disabled
       configuration hash MD5:
       00 E9 B6 7A A2 85 ED C7 34 08 36 98 17 FE 4E 26
       data hash MD5: 16K
       9B 94 E6 2E 4C 76 97 40 59 78 5C F0 35 20 4E 89>)
$$ ##END=
$$ 
$$ hash MD5
$$ 45 F9 56 9F B7 5C 65 38 9A 7F 7A 20 62 5C DC 48
##$RELAX= 
##$RELAX= 
##$RELAX= 
##$RELAX= 
##$RELAX= 
##$RELAX= 
$$ Bruker specific parameters
$$ --------------------------
##$DU= <F:/spectra>
##$EXPNO= 1
##$NAME= <H-F>
##$PROCNO= 1
##$TYPE= <nmr>
##$USER= <she>
##$AMP= (0..31)
100 100 100 100 100 100 100 100 100 100 100 100 100 100 100 100 100 100 
100 100 100 100 100 100 100 100 100 100 100 100 100 100 
##$AQSEQ= 0
##$AQ_mod= 1
##$AUNM= <au_zg>
##$AUTOPOS= <>
##$BF1= 200.13
##$BF2= 200.13
##$BF3= 200.13
##$BF4= 200.13
##$BF5= 200.13
##$BF6= 200.13
##$BF7= 200.13
##$BF8= 200.13
##$BYTORDA= 1
##$CFDGTYP= 0
##$CFRGTYP= 5
##$CHEMSTR= <none>
##$CNST= (0..31)
1 1 145 1 1 1 1 1 1 1 1 1 1 1 1 1 1 1 1 1 1 1 1 1 1 1 1 1 1 1 1 1 
##$CPDPRG= <>
##$CPDPRG1= <>
##$CPDPRG2= <>
##$CPDPRG3= <>
##$CPDPRG4= <mlev>
##$CPDPRG5= <mlev>
##$CPDPRG6= <mlev>
##$CPDPRG7= <mlev>
##$CPDPRG8= <mlev>
##$CPDPRGB= <>
##$CPDPRGT= <>
##$D= (0..31)
0 1.2 0 0 0 0 0 0 0 0.06 0 0.03 0 0 0 0 0.0002 0 0 0 0 0 0 0 0 0 0 0 0 
0 0 0 
##$DATE= 1572003310
##$DBL= (0..7)
120 120 120 120 120 120 120 120 
##$DBP= (0..7)
150 150 150 150 150 150 150 150 
##$DBP07= 0
##$DBPNAM0= <>
##$DBPNAM1= <>
##$DBPNAM2= <>
##$DBPNAM3= <>
##$DBPNAM4= <>
##$DBPNAM5= <>
##$DBPNAM6= <>
##$DBPNAM7= <>
##$DBPOAL= (0..7)
0.5 0.5 0.5 0.5 0.5 0.5 0.5 0.5 
##$DBPOFFS= (0..7)
0 0 0 0 0 0 0 0 
##$DE= 6
##$DECBNUC= <off>
##$DECIM= 24
##$DECNUC= <off>
##$DECSTAT= 4
##$DIGMOD= 1
##$DIGTYP= 9
##$DL= (0..7)
0 120 120 120 120 120 120 120 
##$DP= (0..7)
150 150 150 150 150 150 150 150 
##$DP07= 0
##$DPNAME0= <>
##$DPNAME1= <>
##$DPNAME2= <>
##$DPNAME3= <>
##$DPNAME4= <>
##$DPNAME5= <>
##$DPNAME6= <>
##$DPNAME7= <>
##$DPOAL= (0..7)
0.5 0.5 0.5 0.5 0.5 0.5 0.5 0.5 
##$DPOFFS= (0..7)
0 0 0 0 0 0 0 0 
##$DQDMODE= 0
##$DR= 18
##$DS= 0
##$DSLIST= <SSSSSSSSSSSSSSS>
$$ [...]
##$SUBNAM2= <"">
##$SUBNAM3= <"">
##$SUBNAM4= <"">
##$SUBNAM5= <"">
##$SUBNAM6= <"">
##$SUBNAM7= <"">
##$SUBNAM8= <"">
##$SUBNAM9= <"">
##$SW= 24.0689530833862
##$SWIBOX= (0..15)
0 0 2 0 0 0 0 0 0 0 0 0 0 0 0 0 
##$SW_h= 4816.95568400771
##$TD= 16384
##$TD0= 1
##$TE= 0
##$TE2= 300
##$TE3= 300
##$TEG= 300
##$TL= (0..7)
0 120 120 120 120 120 120 120 
##$TP= (0..7)
150 150 150 150 150 150 150 150 
##$TP07= 0
##$TPNAME0= <>
##$TPNAME1= <>
##$TPNAME2= <>
##$TPNAME3= <>
##$TPNAME4= <>
##$TPNAME5= <>
##$TPNAME6= <>
##$TPNAME7= <>
##$TPOAL= (0..7)
0.5 0.5 0.5 0.5 0.5 0.5 0.5 0.5 
##$TPOFFS= (0..7)
0 0 0 0 0 0 0 0 
##$TUNHIN= 0
##$TUNHOUT= 0
##$TUNXOUT= 0
##$USERA1= <user>
##$USERA2= <user>
##$USERA3= <user>
##$USERA4= <user>
##$USERA5= <user>
##$V9= 5
##$VALIST= <valist>
##$VCLIST= <CCCCCCCCCCCCCCC>
##$VD= 0
##$VDLIST= <DDDDDDDDDDDDDDD>
##$VPLIST= <PPPPPPPPPPPPPPP>
##$VTLIST= <TTTTTTTTTTTTTTT>
##$WBST= 1024
##$WBSW= 4
##$XGAIN= (0..3)
0 0 0 0 
##$XL= 0
##$YL= 0
##$YMAX_a= 2320716
##$YMIN_a= -2106215
##$ZGOPTNS= <>
##$ZL1= 120
##$ZL2= 120
##$ZL3= 120
##$ZL4= 120
##$ABSF1= 10
##$ABSF2= 0
##$ABSG= 5
##$ABSL= 3
##$ALPHA= 0
##$AQORDER= 0
##$ASSFAC= 0
##$ASSFACI= 0
##$ASSFACX= 0
##$ASSWID= 0
##$AUNMP= <proc_1d>
##$AZFE= 0.1
##$AZFW= 0.1
##$BCFW= 1
##$BC_mod= 2
##$BYTORDP= 1
##$COROFFS= 0
##$CY= 11.3945322036743
##$DATMOD= 1
##$DC= 2
##$DFILT= <>
##$DTYPP= 0
##$F1P= 19.5091578491511
##$F2P= -0.509923556040331
##$FCOR= 0.5
##$FTSIZE= 0
##$FT_mod= 4
##$GAMMA= 1
##$GB= 0.15
##$INTBC= 1
##$INTSCL= 1
##$ISEN= 128
##$LB= 0.24
##$LEV0= 0
##$LPBIN= 0
##$MAXI= 10000
##$MC2= 0
##$MEAN= 0
##$ME_mod= 0
##$MI= 1.114404
##$NCOEF= 0
##$NC_proc= 0
##$NLEV= 6
##$NOISF1= 3.799351
##$NOISF2= 2.8
##$NSP= 1
##$NTH_PI= 0
##$NZP= 0
##$OFFSET= 15.70392
##$PC= 1
##$PHC0= -9570.005
##$PHC1= 6.000824
##$PH_mod= 1
##$PKNL= yes
##$PPARMOD= 0
##$PSCAL= 0
##$PSIGN= 0
##$REVERSE= no
##$SF= 200.130013532006
##$SI= 16384
##$SIGF1= 3
##$SIGF2= 2
##$SINO= 400
##$SIOLD= 16384
##$SREGLST= <1H.CDCl3>
##$SSB= 0
##$STSI= 0
##$STSR= 0
##$SW_p= 3612.71676300578
##$SYMM= 0
##$S_DEV= 0
##$TDeff= 0
##$TDoff= 0
##$TI= <>
##$TILT= no
##$TM1= 0
##$TM2= 0
##$TOPLEV= 0
##$USERP1= <user>
##$USERP2= <user>
##$USERP3= <user>
##$USERP4= <user>
##$USERP5= <user>
##$WDW= 1
##$XDIM= 8192
##$YMAX_p= 0
##$YMIN_p= 0
$$ End of Bruker specific parameters
$$ ---------------------------------
##NTUPLES= NMR FID
##VAR_NAME=  TIME,          FID/REAL,        FID/IMAG
##SYMBOL=    X,             R,               I
##VAR_TYPE=  INDEPENDENT,   DEPENDENT,       DEPENDENT
##VAR_FORM=  AFFN,          ASDF,            ASDF
##VAR_DIM=   8192,          8192,            8192
##UNITS=     SECONDS,       ARBITRARY UNITS, ARBITRARY UNITS
##FACTOR=    0.0002076,     1,               1
##FIRST=     0,             0,               0
##LAST=      1.7004516,     0,               0
##MIN=       0,             -2106215,        0
##MAX=       1.7004516,     2320716,         0
$$ Real data points
##PAGE= N=1
##DATA TABLE= (X++(R..R)), XYDATA
0 0 0 0 0 0 0 0 72 -72 72 -72 144 -144 180 -216 288 -360 432 -498 578 -655 794 -934 1076 -1232
24 -1232 1412 -1632 1851 -2102 2389 -2689 3044 -3410 3831 -4286 4779 -5329 5919 -6592 7308
39 7308 -8102 8970 -9929 10999 -12170 13499 -14958 16632 -18526 20692 -23228 26200
51 26200 -29783 34180 -39721 46978 -56899 71442 -94844 139000 -252491 1206532 2228425
62 2228425 650486 -115898 -1079152 -1508419 -1792941 -1431109 -864950 139064 1187404
71 1187404 2116410 2320716 1964793 1192557 373932 -539391 -1310532 -1868150 -1988946 -1673542
81 -1673542 -835580 243272 1215994 1711556 1763400 1458289 923905 157152 -704884 -1492961
91 -1492961 -1936925 -1884595 -1302800 -400433 512981 1174117 1545775 1657869 1482202 936555
101 936555 103985 -775033 -1411977 -1623241 -1359229 -755804 -48964 593971 1151063 1569100
111 1569100 1673537 1321633 604160 -241724 -974993 -1400012 -1428715 -1148667 -715070 -164487
121 -164487 506440 1145863 1480197 1367558 880895 191629 -502693 -1015466 -1268193 -1308973
131 -1308973 -1155225 -731467 -49593 672727 1159735 1282372 1065348 615056 79853 -411176
141 -411176 -814533 -1104644 -1175993 -911443 -337548 336973 869549 1132600 1128777 915989
151 915989 559139 109886 -387158 -849834 -1116506 -1040776 -635687 -89025 395365 725257
161 725257 900399 916799 753676 406770 -86655 -614884 -988102 -1046475 -810626 -435166
171 -435166 -53374 305532 615287 809806 818416 602098 173059 -340593 -735842 -878216
181 -878216 -796407 -597968 -320200 38050 425122 745715 895940 798012 454917 1554
191 1554 -377713 -596103 -681857 -664256 -515213 -217760 179427 567506 809909 808265 573449
202 573449 229552 -96309 -361706 -576929 -710478 -684664 -459081 -84577 318724 606487
212 606487 693365 590628 382984 134957 -143277 -442974 -690109 -764987 -616552 -296209
222 -296209 77690 388051 563023 598270 538293 393840 139347 -204725 -521614 -676895
232 -676895 -619318 -397894 -102070 183332 401027 543917 611133 560666 338657 -10879
242 -10879 -352822 -561210 -598439 -489352 -289124 -55649 182056 412247 590767 623162
252 623162 454645 142262 -183764 -424164 -544997 -548520 -458073 -291544 -53232 239271
262 239271 501323 612259 523223 290950 20097 -217130 -393077 -499283 -520457 -429104
272 -429104 -208161 104393 404164 570604 559429 421527 225999 8209 -214497 -414871
282 -414871 -539082 -530303 -356569 -63471 237351 439472 512307 486141 386441 209293 -34386
293 -34386 -296794 -502318 -573716 -473007 -238687 25759 236921 381430 464291 466329 352575
304 352575 127771 -155424 -405991 -537842 -508046 -356075 -154799 46729 247585 426319
314 426319 521248 478616 294510 25654 -242286 -419831 -471961 -423478 -311902 -142739 83895
325 83895 324973 494760 525399 407398 185253 -60110 -257961 -379947 -436136 -421107 -305652
336 -305652 -81801 183805 398664 491364 447415 297752 102808 -92534 -270788 -417027
346 -417027 -488645 -430915 -238304 22814 258627 404899 444857 391014 269500 98553 -108722
357 -108722 -321469 -468613 -476844 -342261 -127708 93274 271632 383490 422694 383318 258556
368 258556 50674 -195679 -391227 -459160 -396905 -250398 -69516 116654 283356 403038
378 403038 445641 376808 189816 -59002 -275308 -396116 -414521 -356090 -234952 -61633 138417
389 138417 324448 439295 434167 297316 84687 -120766 -274152 -366345 -393769 -342895 -206265
400 -206265 -2021 217218 383324 436521 363137 210945 36717 -131166 -283895 -391674
410 -391674 -411878 -323297 -139514 87184 281970 385822 387231 314094 192138 27838 -163954
421 -163954 -333843 -421643 -392392 -257068 -58184 136838 277016 349282 361372 304436 165377
432 165377 -34451 -235680 -373481 -404398 -329253 -179915 -9193 148454 279132 366084
442 366084 374603 278326 93224 -113901 -281465 -367730 -361242 -280807 -153530 639 170966
453 170966 321638 390974 345406 202510 18680 -152745 -278417 -339381 -331585 -262285 -128792
464 -128792 55796 240085 354666 363092 276573 136274 -22823 -169988 -283698 -347059 -336949
475 -336949 -236133 -59947 136172 282250 341169 320365 238699 112801 -40578 -194163
485 -194163 -316393 -364891 -310386 -166086 11675 166225 269146 316562 301582 220995 82547
496 82547 -86093 -245642 -342595 -338183 -244157 -103128 40527 173833 277783 326394 299017
507 299017 191026 27469 -145932 -276719 -324148 -290604 -205501 -86798 56840 201205
517 201205 304123 332101 271967 137915 -27757 -170329 -257547 -288799 -267354 -189265 -55392
528 -55392 103544 241414 315070 301650 212863 78349 -57876 -172163 -256732 -294510 -261562
539 -261562 -151358 2617 156721 262824 297758 260666 171653 56655 -70893 -195055
549 -195055 -284773 -298872 -225477 -94153 52315 177806 255025 273873 238882 158909 34286
560 34286 -112233 -234378 -288115 -260808 -170703 -46449 81637 189648 256627 275757 234850
571 234850 129041 -20853 -160409 -249357 -271874 -231076 -142000 -27539 93639 201979 273273
582 273273 277854 204415 74231 -64055 -174746 -239722 -254260 -214814 -127178 -9189 122081
593 122081 230539 276094 241884 150521 32499 -82785 -178039 -238410 -249908 -200528 -96939
604 -96939 37542 163594 241280 252340 205348 123135 16582 -98611 -195985 -250132 -242937
615 -242937 -170939 -51996 76477 174425 224499 227467 186942 103734 -12238 -129927 -217570
626 -217570 -248141 -212564 -124208 -12370 93206 173832 221142 223776 168826 64662 -57153
637 -57153 -165276 -228408 -232192 -179607 -93938 5584 107214 194120 235702 215196 137950 26880
649 26880 -86949 -175165 -216735 -209552 -161561 -79397 28519 136809 211792 228963 185470 99083
661 99083 -6016 -104831 -178039 -213206 -205404 -149182 -50026 65883 163322 211329 208835 157990
673 157990 74157 -24122 -115299 -187326 -220866 -196684 -119829 -11721 89626 164163 199911
684 199911 191011 139255 56641 -40051 -133943 -197959 -209746 -161756 -78429 16052 102173 166765
696 166765 194659 177710 119389 29521 -73762 -158926 -197671 -185289 -132718 -55852 32195 117728
708 117728 177688 194762 164964 92364 -4759 -97632 -161133 -184259 -166912 -116804 -36093 55901
720 55901 135503 184332 186564 139569 57401 -31468 -107922 -158784 -178995 -158025 -95069 -6699
732 -6699 83870 154321 186120 170163 112478 37101 -44745 -117750 -171145 -181836 -143319 -70159
744 -70159 18087 102625 158785 174407 150751 97640 23484 -62670 -135987 -173254 -166245 -120098
756 -120098 -44105 41505 111830 154882 165331 140512 81226 -3986 -87075 -145564 -167063 -150247
768 -150247 -96593 -21742 54126 118189 159673 164769 125373 53841 -28231 -99659 -146110 -157474
780 -157474 -132133 -77349 -5523 68918 130541 160660 147947 97932 27071 -46307 -109453 -146508
792 -146508 -148298 -116949 -57910 16473 90207 140900 153357 128386 75719 8338 -62602 -119585
804 -119585 -148829 -143483 -103264 -36308 41755 104836 138252 142268 115878 61087 -9736 -77694
816 -77694 -126958 -147296 -132324 -81301 -11324 56248 107669 137012 134417 100690 39647 -28167
828 -28167 -92078 -133387 -142053 -112453 -58669 3912 66570 115523 138319 125986 83408 21009
840 21009 -46328 -103600 -132876 -129275 -96967 -46346 17252 79474 121759 132716 111824 65468
852 65468 3089 -60824 -106680 -125477 -118694 -84141 -27678 35998 90989 121919 124427 96919
864 96919 45007 -15286 -70431 -108140 -123204 -110712 -66740 -7175 52159 97797 120421 114734
876 114734 82286 29605 -27575 -78872 -114651 -120172 -95704 -48339 7593 61639 102341 117651
888 117651 103821 66338 15300 -41777 -89389 -113292 -109891 -79943 -33106 22854 73794 106657
900 106657 112022 94082 53144 -2304 -56804 -95093 -110245 -101117 -67867 -19514 35339 79815
912 79815 105643 107417 81604 36984 -17319 -64417 -96125 -106275 -91345 -53003 -2130 47195
924 47195 86175 105610 99360 66586 19918 -28557 -71916 -99356 -101007 -78638 -38399 10103
936 10103 57306 93048 103117 86322 53648 8955 -39500 -79989 -99974 -93320 -67716 -26005
948 -26005 24248 67603 91633 95108 78667 41322 -6064 -51730 -83086 -95758 -86968 -55850
960 -55850 -9870 36968 74048 93321 92171 68416 26549 -17416 -58554 -85969 -93717 -77328
972 -77328 -40962 1949 43230 76789 93314 84320 54948 14451 -28483 -65546 -87717 -88256 -64673
985 -64673 -28507 13170 53426 81157 86871 72304 43303 3104 -40196 -72998 -86255 -79042
997 -79042 -54630 -18050 26466 61646 81877 85162 66006 32726 -9729 -48302 -72942 -82203
1009 -82203 -72237 -43094 -3090 36068 66364 81877 78048 55726 18346 -20867 -54779 -76596
1021 -76596 -79157 -63248 -30531 6890 44395 70146 81282 70812 43404 7006 -30153 -61537
1033 -61537 -78564 -74914 -54138 -21643 16435 51922 74069 75810 62303 34136 -2572 -39235
1045 -39235 -65754 -74434 -66984 -44661 -9901 27813 57904 73270 72037 54693 23846 -13134
1057 -13134 -46311 -65706 -72450 -61555 -33286 2074 34265 59432 71514 66777 45246 12121
1069 12121 -21998 -50785 -68660 -69567 -52842 -24611 9627 40172 62775 68683 57253 33148
1081 33148 2074 -30273 -57468 -67788 -62134 -42379 -14124 20116 48742 64103 65043 50185
1093 50185 24060 -8160 -37503 -58198 -64343 -56824 -35315 -3461 28222 52741 64214 60842
1105 60842 43645 15174 -16921 -44208 -60820 -63642 -51794 -26644 5342 33866 54607 63080
1117 63080 56000 34149 5054 -23513 -48693 -63284 -61045 -44048 -17615 11760 39070 57134
1129 57134 60909 48717 26749 -879 -30364 -52200 -59404 -53526 -36284 -10140 19416 45601
1141 45601 57649 56846 43731 19964 -8912 -35879 -53056 -57938 -48674 -28718 -368 26643 46152
1154 46152 54753 51641 36372 9001 -17494 -40551 -54146 -54885 -41993 -19974 6324 31255 48853
1167 48853 55076 46753 26540 1430 -24215 -44583 -54964 -50935 -34897 -11722 13985 37940
1179 37940 52138 52925 41349 20851 -5542 -30698 -47413 -52410 -45864 -29402 -5716 22456 43187
1192 43187 51932 49798 35815 13697 -12353 -33915 -49729 -52466 -43187 -23157 2738 27518 43382
1205 43382 50270 45584 29645 6189 -18472 -37164 -49767 -50880 -36920 -14217 9084 30869
1217 30869 44924 48767 41812 23556 877 -21629 -41656 -49206 -43431 -29403 -8425 14329 35257
1230 35257 46400 47749 36927 17847 -5898 -28264 -42229 -45115 -38772 -23778 -2524 19847
1242 19847 37963 46430 43401 30403 9686 -13703 -32837 -42387 -43616 -35775 -17682 4184 25635
1255 25635 41154 45931 39695 23428 1726 -18912 -35152 -44628 -43725 -31064 -10748 10596 30754
1268 30754 43856 44132 34808 17750 -2068 -22519 -38986 -45301 -40076 -26865 -5597 17023 34464
1281 34464 42307 40802 30702 14690 -6385 -28140 -42293 -43178 -36483 -19596 -51 21583 34794
1294 34794 42222 40530 28516 9753 -14003 -32085 -40470 -39981 -31242 -15113 4921 23839 37538
1307 37538 42633 36775 21382 944 -18690 -32794 -39545 -37674 -25599 -10050 9879 28277 39892
1320 39892 42105 31931 14634 -4532 -21783 -34282 -39142 -35439 -22800 -4513 16768 33559
1332 33559 39541 36112 25538 10166 -8353 -26075 -36895 -40385 -32945 -17105 3977 22855 34276
1345 34276 38546 34426 22530 6169 -13538 -30129 -39782 -39760 -27851 -9320 8857 24283 34842
1358 34842 38413 33835 19388 1159 -19635 -34396 -39959 -35253 -22219 -5951 11058 26379 37941
1371 37941 38541 29888 13238 -6519 -24145 -35214 -37718 -31443 -19753 -2908 15794 30846 38771
1384 38771 36033 24063 7412 -11283 -26064 -33782 -35048 -28923 -16130 2902 21451 35056 38054
1397 38054 30931 18039 1303 -13759 -26381 -35214 -35896 -26071 -8345 10335 25105 33176 35530
1410 35530 27004 14316 -1057 -18408 -31933 -38058 -33031 -20537 -2845 12953 26652 33565 32518
1423 32518 24164 11421 -6363 -24668 -34815 -35161 -27932 -14932 1516 16641 28636 35002 32605
1436 32605 22352 4845 -13737 -27608 -33191 -33168 -23874 -12476 5088 19732 31381 36465 29719
1449 29719 15613 -1230 -15183 -25971 -32805 -31401 -22198 -7972 9531 24481 34294 34194 24420
1462 24420 10471 -3522 -17847 -28538 -33570 -29865 -18994 -2318 15949 28190 32853 30156 21547
1475 21547 9413 -5925 -22026 -31383 -32951 -26847 -13365 3647 18632 27347 31847 29428 20138
1488 20138 4981 -12214 -25298 -32342 -30372 -21792 -6530 7432 20561 29284 32035 27577 15148
1501 15148 -1291 -17230 -27626 -31538 -27047 -18174 -5535 9052 22821 32278 31975 23438 8172
1514 8172 -6081 -20543 -27947 -29666 -26209 -16503 -2467 14203 26988 31617 27442 18480 4920
1527 4920 -9330 -21279 -28338 -30697 -23383 -12043 5293 20331 29265 29468 25643 15693 2739 -11444
1541 -11444 -23932 -30885 -29701 -20629 -4651 9171 20646 26827 29178 23185 12275 -2175 -16863
1554 -16863 -27919 -32447 -26317 -15677 -2615 11781 22370 28592 27725 21185 8369 -7236 -20671
1567 -20671 -29093 -28234 -22323 -12488 -37 14175 25405 30017 27377 17369 2459 -11610 -21815
1580 -21815 -26269 -26826 -20954 -11272 4257 18391 26941 28641 22567 10808 -2579 -13868 -23752 -28399
1594 -28399 -27555 -20801 -6183 8203 20251 27173 26012 18245 6927 -4394 -16063 -26040 -30990
1607 -30990 -25781 -14638 -822 12278 22824 27061 23069 17666 6478 -6347 -20034 -27393 -27124
1620 -27124 -20444 -9785 4000 15487 22844 26848 24436 15697 1855 -12246 -24148 -28060 -25972
1633 -25972 -17973 -6425 5783 15817 25008 28340 21801 10400 -4446 -16760 -24161 -26841 -25077
1646 -25077 -16580 -5215 7938 19853 27258 26236 17704 5623 -6529 -17281 -24326 -26899 -22700
1659 -22700 -13285 358 13184 23835 27097 23692 14868 4589 -7428 -20416 -26250 -26469 -20706
1672 -20706 -9278 5376 16273 23436 25074 20255 12564 1210 -12765 -22267 -27673 -24815 -16214
1685 -16214 -4317 7735 17096 22584 24791 19205 8905 -4199 -17489 -24692 -27079 -22322 -12857
1698 -12857 -1618 10469 19393 26033 24454 17641 6250 -7140 -19203 -24311 -24537 -18596 -10167 1517
1712 1517 14195 24013 27161 22651 12572 244 -11940 -21142 -24982 -24729 -18523 -8128 6278 18075
1726 18075 24018 24588 18068 9233 -3018 -15252 -24291 -27019 -24971 -16546 -2798 9617 20218 23196
1740 23196 23435 16765 6933 -5307 -16223 -24715 -26770 -21161 -9620 2582 13570 21487 25210 22963
1754 22963 15205 4842 -7490 -18742 -23960 -22970 -16241 -5736 5384 15920 24097 24957 21005 11667
1768 11667 -1116 -13086 -21974 -24580 -22670 -15124 -5100 7075 18308 23867 24143 18109 6612
1781 6612 -5867 -15103 -22097 -23403 -20166 -12373 54 11752 21083 25397 23026 15330 3996 -7723
1795 -7723 -16556 -22739 -24193 -19269 -8185 4883 16416 24227 25299 20125 11882 2071 -9501 -19669
1809 -19669 -24347 -22697 -15671 -4005 7784 18108 23826 23471 18000 10059 -1037 -13354 -22241 -24921
1823 -24921 -20458 -11738 -357 10508 19667 24363 24216 17787 7368 -6031 -15242 -21040 -22887 -16531
1837 -16531 -8054 3467 14142 21725 26400 22550 14083 2056 -8229 -17631 -22070 -21578 -14240 -4616
1851 -4616 5884 16568 23557 24931 19490 9373 -1883 -12000 -20385 -22821 -21994 -13183 -2703 9812
1865 9812 19822 23467 22235 16431 6400 -5560 -15433 -22551 -24202 -19187 -9986 2278 14296 21525
1879 21525 24676 22547 15038 4760 -8074 -16984 -22567 -22875 -16538 -5829 6662 16418 22076 23990
1893 23990 20707 10957 -106 -11395 -21162 -23702 -21747 -14845 -3808 7945 16811 23751 22847 17464
1907 17464 6699 -4877 -15796 -22372 -23575 -19886 -11227 -774 11258 19573 24118 21889 14881
1920 14881 4325 -8818 -18100 -22328 -22522 -17939 -7931 3306 14404 21477 23896 20096 12177 339
1934 339 -11768 -19508 -23599 -22395 -15907 -4390 6544 16137 22375 23608 18063 8357 -2968 -14151
1948 -14151 -21403 -24059 -20810 -11693 -1484 10181 19219 22671 21450 15417 5525 -7455 -17025 -24101
1962 -24101 -24568 -18496 -9249 2125 13819 20817 24321 20967 12894 1896 -10099 -18374 -23439 -21188
1976 -21188 -16355 -5433 6637 16594 22042 23002 18768 9972 -1928 -13148 -21420 -23479 -21921 -13148
1990 -13148 -2581 9167 17663 23387 23011 16392 6218 -5624 -15640 -23272 -23813 -19600 -10692 1939
2004 1939 11377 20687 24559 21201 13631 4066 -8156 -18334 -22934 -23137 -16426 -6776 4311 15521
2018 15521 23391 23983 19730 11240 222 -12057 -20397 -23847 -22358 -14541 -3555 8630 18688 23379
2032 23379 24321 18573 8617 -3728 -14922 -21512 -23248 -19569 -10851 1339 11107 20818 24775 23546
2046 23546 14636 3981 -7505 -17935 -22578 -23114 -16818 -7519 4632 15675 23197 25061 21351 13486
2060 13486 1296 -11039 -19297 -24593 -21994 -16278 -5559 7171 17689 24556 23805 19465 9349
2073 9349 -2365 -13585 -22075 -24280 -21452 -12963 -1269 10915 20663 25057 22672 16813 6332 -6057
2087 -6057 -16281 -23200 -23537 -18915 -8973 2965 13461 21764 25270 22425 14123 2492 -8954 -18783
2101 -18783 -24200 -23201 -16978 -5769 5765 16762 22854 24739 20537 11122 -1169 -12730 -22337 -24812
2115 -24812 -21483 -15142 -3565 9403 19939 24232 23923 18172 7877 -4719 -14753 -22469 -24446
2128 -24446 -21055 -12424 780 11837 20920 25661 22502 14733 4169 -8354 -18042 -25368 -25154 -19317
2142 -19317 -9047 3147 15220 22796 25006 20190 12689 359 -12285 -21146 -25902 -23704 -16051
2155 -16051 -4384 7431 17667 23913 23992 19691 9561 -2891 -16285 -23445 -24897 -21593 -12783 -635
2169 -635 10913 20506 25232 24038 17842 5597 -8036 -18408 -23570 -24138 -19473 -11355 1985 14085
2183 14085 22144 25557 22494 13491 1094 -11079 -19911 -25069 -24589 -18266 -7966 4292 16954 24681
2197 24681 24456 19392 9904 -1666 -12481 -22339 -26160 -23691 -15420 -3422 9350 19990 25073 24043
2211 24043 17567 8796 -4433 -15753 -23576 -27063 -21885 -11973 311 12524 20388 23984 22513 15679
2225 15679 4493 -9014 -20442 -25815 -25347 -18797 -7583 3383 14460 22771 25251 22519 12915
2238 12915 519 -12334 -21651 -25711 -23050 -16051 -5746 5690 16950 24885 26133 19874 9248
2251 9248 -3472 -15040 -24124 -26061 -22421 -14322 -2781 10623 21750 26782 24919 16867 5798
2264 5798 -6686 -17393 -24326 -26229 -22032 -11640 3178 14827 24405 26532 22273 14444 3473
2277 3473 -8778 -18950 -26467 -26198 -18569 -6561 6575 17412 24117 25139 21894 12972 -47 -12844
2291 -12844 -23094 -26509 -23191 -14275 -3223 9796 18108 25171 25758 21837 8160 -5152 -16937
2304 -16937 -24125 -25419 -20723 -11040 20 11869 21966 28475 26384 17910 4120 -10119 -19527
2317 -19527 -23338 -23997 -20009 -10644 2494 16614 26352 28142 24054 13367 315 -10149 -18468 -25497
2331 -25497 -24811 -18662 -6320 7478 20003 26748 26220 19027 11342 -126 -13181 -22741 -27398 -24594
2345 -24594 -14276 -490 13010 21542 25963 24797 19501 10077 -4137 -18111 -26239 -27399 -20942
2358 -20942 -9589 2286 14279 20505 26036 26185 18006 4984 -9572 -22558 -26843 -24391 -17633
2371 -17633 -7041 4084 14503 23677 28509 24633 13763 -1675 -14545 -21546 -24827 -22330 -16753
2384 -16753 -7314 6015 20127 29208 27726 20751 7468 -4837 -14143 -22374 -26144 -24675 -16857 -2626
2398 -2626 12993 24207 27625 22867 15152 5933 -5442 -17328 -25559 -28584 -24357 -11394 3701
2411 3701 15858 24197 24335 21445 16250 4697 -8548 -22236 -29125 -27310 -18008 -4966 7513 16309
2425 16309 21913 25662 24120 14761 -354 -15778 -25873 -27910 -22107 -14107 -3798 6176 17094
2438 17094 26317 28411 21693 7832 -7234 -19373 -25084 -24771 -20739 -13927 -3622 8930 22667
2451 22667 29583 26311 15362 2234 -10080 -17768 -23257 -25249 -23164 -13453 1047 17673 25691
2464 25691 27386 21243 10540 1360 -9696 -18223 -27162 -29159 -21778 -6849 9075 20934 24801
2477 24801 22948 19497 12161 1170 -11869 -25057 -30591 -26053 -14467 -511 11516 18323 23639
2490 23639 24640 22393 10914 -4894 -20558 -29267 -27669 -19585 -9412 361 9464 19996 27478
2503 27478 27750 19389 3726 -11634 -22679 -25263 -21725 -18098 -11002 1051 13962 25718 31178
2516 31178 25646 11783 -3267 -13288 -18377 -22989 -23949 -21223 -9365 6184 21380 29359 27462
2529 27462 17875 6640 -3179 -11388 -19986 -27106 -27740 -17523 -1615 14921 24234 26285 22398 17570
2543 17570 10516 -1686 -14915 -27255 -30545 -23375 -9172 5371 15622 20295 23385 23234 19692
2556 19692 8318 -8893 -23740 -29824 -25663 -16875 -3748 4562 12701 21693 28047 27786 15525 -639
2570 -639 -16059 -23999 -24051 -20369 -15656 -7303 4264 17407 29008 31448 22126 7104 -7528 -16013
2584 -16013 -19917 -22971 -21922 -18573 -6295 10219 25648 31159 25871 13566 3078 -5722 -13701
2597 -13701 -22055 -28344 -25373 -14927 3096 19022 25666 24847 20047 14715 6257 -5352 -18475 -29548
2611 -29548 -30651 -21260 -4660 9387 17714 20994 21394 22002 16833 4997 -12694 -26694 -31234 -24393
2625 -24393 -12596 -759 6726 13544 22032 27535 26008 12700 -5055 -21013 -27219 -23817 -18404
2638 -18404 -11931 -4945 5853 20745 29707 31292 19334 2431 -11963 -18386 -20985 -22601 -21465
2651 -21465 -15416 -2132 15067 28213 30508 23620 10169 -354 -7787 -14849 -22727 -28195 -23901
2664 -23901 -10396 8244 22503 27188 22562 16396 10895 4346 -7535 -20929 -31600 -29557 -17449
2677 -17449 133 13061 19546 20762 20913 21169 14430 776 -16946 -29127 -30911 -21226 -7730 2208
2691 2208 9635 15807 23246 28388 22915 8774 -10005 -23768 -27026 -22844 -15582 -9636 -2019 9562
2705 9562 22425 31065 28799 15211 -1418 -14268 -19536 -20149 -20963 -19603 -12343 860 18850 30303
2719 30303 31155 20504 6690 -2640 -10394 -16286 -24018 -27275 -22215 -6105 11899 24399 27811 21860
2733 21860 14440 9018 1893 -10937 -22759 -31448 -27950 -12845 3572 16304 20014 20670 20645 19870
2747 19870 11571 -2777 -20249 -30951 -29097 -18889 -5420 4886 11052 16502 24084 27630 21388
2760 21388 4163 -14262 -25890 -27354 -20613 -12370 -7104 -625 11514 24331 32190 26842 11668
2773 11668 -6562 -16040 -20522 -20099 -20010 -18421 -10144 4324 22546 32298 28307 16385 3423 -6686
2787 -6686 -12160 -17902 -22948 -26989 -19384 -2462 16292 27147 27135 19839 12812 6442 -1050 -12932
2801 -12932 -25421 -31431 -24668 -8378 8216 18266 20312 20045 19996 16815 9332 -7786 -23413 -31370
2815 -31370 -28093 -15491 -1791 7552 11938 17999 24733 26538 16335 844 -16678 -28217 -25484
2828 -25484 -18453 -11223 -4303 2491 14689 26597 31315 23659 7162 -9973 -18770 -20648 -19092 -18402
2842 -18402 -16587 -6339 8976 24512 32558 26460 12348 403 -7871 -13226 -18478 -24773 -25298 -15514
2856 -15514 1870 19477 28549 25269 18401 9489 4369 -3490 -16043 -26552 -30777 -22396 -4427
2869 -4427 12147 20763 21634 19481 18726 14536 5632 -10770 -25572 -32887 -24757 -11051 2107 10047
2883 10047 14899 18627 24235 23975 13800 -4462 -21459 -28445 -23872 -15854 -7285 -2605 5048 17234
2897 17234 28088 30563 19771 2429 -14383 -21339 -21017 -18638 -17597 -13656 -3897 12009 27922
2910 27922 31292 23155 10087 -2933 -9847 -14920 -18787 -23566 -23592 -12824 6437 22857 28635 24283
2924 24283 15086 7585 2118 -5558 -17641 -28279 -29217 -18619 24 15357 20629 21566 18032 18175
2938 18175 12633 2665 -14196 -27879 -31015 -22525 -6891 5152 11023 13640 19627 23949 21855 9846
2952 9846 -8012 -24818 -28368 -23541 -13918 -5646 115 6461 19291 28952 28252 16943 -2078 -16732
2966 -16732 -21572 -20060 -18256 -16620 -11448 -588 15643 28666 31156 21467 6397 -5727 -12400
2979 -12400 -15259 -19899 -24010 -21923 -8075 10321 24341 27879 21146 11846 5327 -603 -9177 -19775
2993 -19775 -29427 -28004 -15276 4350 17076 21956 19681 17630 15205 10763 -1521 -17659 -29587
3006 -29587 -30211 -19763 -4635 7076 12923 16128 21118 23526 20609 6888 -12495 -25257 -28231
3019 -28231 -19673 -11001 -4467 2365 11051 20351 28558 26046 13073 -4685 -18792 -21704 -19969 -17540
3033 -17540 -15534 -9299 2704 19035 29058 29467 17743 2404 -8648 -13784 -16366 -20360 -23224
3046 -23224 -19433 -4303 13482 26987 27926 19599 9558 2433 -2227 -10837 -22298 -28886 -25156 -11440
3060 -11440 7425 19542 21991 18521 16659 14373 8992 -4359 -20444 -30045 -28627 -16271 -1232
3073 -1232 9163 13332 16752 20240 23038 17378 3306 -15153 -25758 -27437 -18854 -8456 -1766 4490
3087 4490 11831 22724 28699 23986 9834 -8957 -20635 -21668 -18650 -15913 -13102 -6671 6565 20899
3101 20899 29529 27427 13634 -681 -10419 -13915 -17292 -20825 -21401 -16391 -1323 16694 26771 26347
3115 26347 16899 7636 699 -5770 -13492 -22641 -27907 -22530 -7267 10254 20258 21573 19110 14162
3129 14162 11516 4199 -8483 -22930 -29638 -25883 -12018 2092 11152 15075 17410 20418 20721 13398
3143 13398 -1589 -17619 -27731 -25971 -16232 -6590 338 6274 14192 23293 27140 20289 5378 -11538
3157 -11538 -21025 -21791 -18769 -14097 -11667 -3419 9772 22559 29642 23969 10440 -3080 -11501 -15715
3171 -15715 -18356 -20882 -19001 -11936 3589 19920 27697 24983 15386 5756 -1005 -7395 -14794 -23786
3185 -23786 -25883 -18127 -2944 12423 21204 22605 18447 14130 9059 1866 -10506 -22792 -28675 -22202
3199 -22202 -9382 4683 11924 16557 18161 19683 18874 10150 -4363 -19968 -27093 -23601 -13530 -5903
3213 -5903 2745 7703 16165 24682 25222 16868 1666 -14175 -21084 -21183 -16736 -13136 -9043 246 12852
3228 12852 24152 28252 20780 7367 -4699 -14131 -17210 -18703 -19833 -17705 -7195 7258 20672
3241 20672 26619 22553 12808 4200 -2764 -9459 -16219 -23570 -24225 -14395 -260 15577 21860 21801 17193
3256 17193 12550 7250 -2239 -13585 -24199 -26695 -19381 -6378 6569 13826 16841 18782 19336 16638
3270 16638 6289 -7873 -21791 -26081 -22180 -12055 -2081 3798 10298 18289 25054 22908 13366 -2244
3284 -2244 -15610 -21526 -20801 -15738 -11385 -5755 2346 15450 24725 26068 17616 3780 -7781 -14715
3298 -14715 -17251 -18224 -18764 -14279 -3990 10477 21640 25850 19439 10993 2219 -5179 -11123 -18820
3312 -18820 -24034 -21631 -11230 4603 16798 22288 20490 15277 10929 4652 -5187 -16540 -25130 -25578
3326 -25578 -16834 -1863 8986 15776 18435 18628 17756 12845 1698 -11197 -23417 -24559 -19121 -9911
3340 -9911 -867 5327 12524 19221 22715 19403 9252 -5687 -17278 -22004 -20433 -15435 -9569 -3417
3354 -3417 5564 17793 23987 23544 14142 1854 -9359 -16162 -18317 -18541 -16985 -11460 -469 12356
3368 12356 23135 24287 18384 8212 -763 -7149 -14276 -19791 -22610 -18500 -6356 7823 17375 21258
3382 21258 19519 14875 7509 1126 -7353 -17793 -24493 -21615 -13319 -572 9593 15960 18559 17925
3396 17925 16462 9186 -1502 -14671 -22521 -23817 -16805 -7033 1067 9004 14982 19454 21635 16940
3410 16940 5617 -8740 -18941 -21997 -18441 -13731 -7603 318 8801 17627 23293 21081 10519 -1678
3424 -1678 -10819 -15792 -18295 -18677 -15417 -7804 2364 14627 21465 22721 14465 6171 -2446 -10021 -14874
3439 -14874 -19847 -20610 -14838 -4605 8899 18655 21383 17289 12586 5847 -583 -10255 -19049 -22891
3453 -22891 -19737 -10287 2185 11071 15538 18012 17153 14310 6674 -4080 -15558 -21943 -21164 -15066
3467 -15066 -4987 4110 10384 16279 20028 20431 13569 2233 -9618 -18756 -20753 -17078 -11934 -4469
3481 -4469 2398 11203 19353 21632 17917 8332 -3652 -12186 -16553 -18400 -16767 -11917 -4313 5706
3495 5706 16530 22038 19840 13941 5182 -4038 -11583 -15567 -18907 -19147 -11369 -69 10580 18518
3509 18518 19713 17292 11054 3619 -4019 -12342 -20346 -21708 -16596 -7932 4795 13196 16553 17395 15788
3524 15788 10883 2561 -6553 -16701 -21663 -19063 -11751 -2724 5441 12515 16772 19367 17018 10328
3538 10328 -926 -12095 -18423 -19568 -14436 -10178 -2761 4293 13465 19325 20120 15011 5024 -5534
3552 -5534 -12631 -16723 -17680 -15057 -10540 -1719 8287 16371 20348 17991 10821 1842 -5817 -11820 -16863
3567 -16863 -18704 -15665 -8845 2548 12670 18167 18733 14802 7856 1107 -6821 -14375 -19097 -18719 -12819
3582 -12819 -3855 5592 12265 17669 16774 13935 8201 61 -9189 -16428 -19283 -16701 -9862 -1267 5911
3597 5911 12639 17383 17344 13221 6627 -3955 -12275 -17328 -18274 -14757 -8516 -430 6906 14519 17894
3612 17894 17918 12039 3499 -6786 -13087 -16768 -16323 -12576 -7606 667 10036 16808 19053 15582 7322
3627 7322 -147 -7290 -13573 -16374 -16393 -12270 -4903 4491 12405 17779 17210 12655 7135 -925 -8854 -15254
3643 -15254 -17970 -16492 -10383 -1425 7396 13850 16553 16800 12197 6016 -3018 -11539 -16989 -18105 -13946
3658 -13946 -7239 1018 8187 13652 17001 16423 12102 3281 -5780 -12608 -16517 -15761 -11376 -5398 1971
3673 1971 9321 15091 17463 15826 8954 341 -8076 -14169 -15927 -15197 -10652 -4588 3358 11833 16370
3688 16370 16938 13167 5330 -1686 -8581 -14076 -16535 -14862 -9988 -2268 5508 13659 15920 16149 11175
3703 11175 5453 -2932 -9815 -14155 -16546 -13326 -7071 717 7814 13327 14985 13994 9450 3664 -4433
3718 -4433 -11393 -15965 -15356 -11251 -5292 3100 9323 14048 15362 13375 8413 759 -7540 -13590 -15808
3733 -15808 -13664 -9644 -2493 3271 9863 14592 15706 13357 6260 -1420 -9261 -13297 -14656 -12605 -8927
3748 -8927 -2574 5228 11787 15886 15597 10392 3267 -2577 -9970 -14194 -13433 -12809 -7155 36 7323 14198
3764 14198 15386 13064 9091 2853 -4494 -10415 -13691 -15312 -10849 -4953 2794 9079 13381 14230 12165
3779 12165 7581 -74 -6823 -10998 -14680 -14223 -9101 -3083 4742 9862 13497 13964 11269 6217 -1351
3794 -1351 -7918 -13217 -14726 -12060 -7740 -1972 5877 11271 12746 14062 10382 3877 -2861 -9558 -13060
3809 -13060 -13366 -10835 -7286 334 6905 12872 14657 13048 7792 2087 -4841 -10845 -13838 -12947 -10190
3824 -10190 -4307 1915 8448 12964 13067 11548 6399 46 -6185 -11831 -13133 -13144 -8957 -2961 3727
3839 3727 9798 12523 13239 10686 4271 -1415 -7345 -11779 -13123 -11189 -7200 -996 6094 10690 12323
3854 12323 12925 9007 3052 -2996 -8635 -12391 -13353 -10115 -5609 1383 6761 10676 12890 11436 7303
3869 7303 1246 -4221 -9589 -12260 -12803 -8798 -4008 2785 8239 11874 12912 11047 5538 -563 -5434
3884 -5434 -10828 -12023 -11082 -7472 -2954 4651 9008 12545 12670 8733 4351 -2001 -8031 -11074 -13076
3899 -13076 -10705 -6364 -584 4871 9823 12354 10934 7724 2889 -3833 -8597 -11022 -11611 -9601 -5964
3914 -5964 505 5613 10124 11906 10733 6091 2205 -5082 -9737 -10997 -11050 -7865 -2927 3083 7602
3929 7602 11073 10899 9557 5252 -344 -5406 -9238 -11827 -9957 -7805 -1627 4094 8326 10930 10976 8008
3945 8008 3165 -2087 -6447 -10667 -11010 -9345 -6130 -391 5158 9755 10849 9719 7311 2514 -3148
3960 -3148 -8214 -9973 -11202 -8170 -4357 824 5736 9545 10681 10269 6194 60 -4239 -9377 -10517
3975 -10517 -9601 -7285 -2452 3341 7565 10568 10396 8618 5281 -242 -5387 -8552 -10240 -9010 -5724
3990 -5724 -771 4097 8547 11143 9861 7743 2430 -1907 -6378 -9532 -10564 -8174 -4972 234 5151
4005 5151 9045 10114 9201 6090 869 -3482 -7465 -9939 -9970 -7776 -4304 1310 5830 9554 10302 8118
4021 8118 5379 235 -5135 -8498 -10093 -9237 -6840 -2122 3014 6379 10148 9610 8037 4380 -562
4036 -562 -5838 -8737 -8775 -8665 -4523 -1326 3957 7519 9197 8749 6548 2013 -2583 -6539 -9009 -8571
4052 -8571 -8146 -3629 920 4074 8313 8418 8051 5319 365 -3461 -7973 -9204 -9489 -7182 -3205 1437
4068 1437 5937 8293 8807 6563 4157 12 -4672 -7621 -10242 -8553 -5155 -1440 2109 6169 8350
4083 8350 8543 6019 2971 -1209 -5062 -8142 -9360 -7307 -3537 -221 4086 7865 8129 8250 5989 1802
4099 1802 -1929 -6299 -8644 -8516 -6770 -3565 726 4796 7680 8613 6639 4455 910 -4318 -7655
4114 -7655 -8483 -8396 -4949 -1777 1647 5320 7331 7954 6919 3208 -989 -4886 -7905 -7884 -7102 -4607 -1690
4131 -1690 2812 5970 8108 8326 5760 1682 -1482 -5520 -7052 -7537 -6162 -3862 244 3821 7042
4146 7042 7826 7082 3945 697 -3482 -5468 -7275 -7760 -6109 -2714 1888 4716 7744 7902 7160 3352
4162 3352 228 -3630 -6115 -8683 -7784 -4763 -1597 3885 4582 8017 6651 6582 2373 -855 -4779 -6744
4178 -6744 -7990 -6866 -3790 1048 4070 6027 7394 6636 5205 2459 -2217 -5548 -7277 -7715 -5472
4193 -5472 -3499 392 3621 7306 8572 5988 3874 538 -3887 -5237 -7486 -6925 -5695 -1737 1390
4208 1390 4334 7024 7993 5561 3552 -481 -4561 -6459 -6278 -6461 -3976 -999 3866 6314 7218 5783
4224 5783 5308 1015 -2023 -4945 -6210 -7624 -5497 -2403 172 3993 6199 7160 6701 4517 598 -2583
4240 -2583 -4870 -7105 -6865 -4782 -1908 1188 4193 6077 6484 5630 2739 -637 -3754 -6358 -7619 -5701
4256 -5701 -3924 -469 1387 5092 6573 5821 6128 1953 -2350 -5338 -5904 -7303 -5826 -4037 21 3250
4272 3250 5635 7244 6638 4961 1221 -2529 -4954 -6164 -7496 -5160 -2516 900 3903 5955 7026
4287 7026 5322 2645 61 -2357 -4304 -6525 -6391 -4697 -1626 1979 5130 6496 5800 4292 1812
4302 1812 -579 -3203 -5507 -6805 -6201 -4056 -304 2469 5569 6025 6222 3647 902 -1540 -4984 -6386
4318 -6386 -6409 -5004 -2044 1187 3798 5947 6157 5418 4471 698 -3076 -5526 -7012 -6280 -5090 -1557
4334 -1557 572 4460 5881 5916 6251 2061 -799 -4570 -5512 -6536 -4737 -3802 -1205 1761 5212 6384
4350 6384 6738 4026 933 -2574 -3818 -6603 -5871 -5829 -2907 -525 3613 6248 5771 5525 3200 592
4366 592 -2065 -4418 -6884 -6743 -5585 -1941 2445 4224 5848 5683 5089 2762 -704 -2331 -4934 -7300
4382 -7300 -6682 -3734 526 1918 4207 6338 5039 4461 1761 -1452 -4465 -6063 -6260 -4776 -2674 -666
4398 -666 2012 5155 6493 5887 3492 1683 -2227 -5299 -5945 -4973 -3977 -1349 -406 3903 6090 6676 5325
4415 5325 2704 50 -3537 -4747 -6374 -5719 -4008 -1406 1299 5816 6439 6417 4508 2494 -1260 -2849
4431 -2849 -5643 -5857 -5800 -3218 508 2838 5617 5572 6315 3744 1697 -1462 -4038 -6367 -7242 -4782 -2526
4448 -2526 1094 3653 5441 6210 4973 3545 968 -1561 -5583 -5474 -5687 -3703 -472 1835 4385 6242
4464 6242 6628 5595 3370 -1026 -4005 -5623 -5256 -5627 -3226 -676 2581 5529 6125 5936 4374 1827
4480 1827 -1536 -3625 -5763 -6190 -4664 -2570 -245 3233 5249 6884 5807 3440 75 -2463 -4732
4495 -4732 -5567 -6065 -5822 -1845 2161 3827 6379 6329 5645 1909 -243 -2894 -5531 -6126 -6545 -3054 -247
4512 -247 3276 5063 6684 5870 3776 2685 -753 -3832 -5502 -6883 -5079 -2255 82 1944 4893
4527 4893 6059 6447 4393 1229 -2054 -4684 -5552 -5743 -3978 -1743 619 3200 4600 7217 5889 3197
4543 3197 395 -3363 -4972 -5895 -4953 -4483 -553 1602 4139 6579 6818 5245 3192 -431 -2310 -5397
4559 -5397 -6177 -5580 -3331 -901 2801 6070 6227 5703 4740 2160 -1881 -3046 -5066 -6387 -5762 -2704
4575 -2704 1402 3395 6674 6068 5563 3802 54 -2098 -5088 -7192 -6325 -4364 -2221 1292 4148 6019
4591 6019 5926 4749 3458 -116 -3166 -5829 -6999 -5644 -2577 -691 2427 4654 5669 6837 4792
4606 4792 1924 -1836 -3891 -5250 -5865 -5382 -3231 -8 2308 5944 6866 5894 4234 864 -2285 -5034
4622 -5034 -6249 -6849 -4789 -2007 1250 4345 6264 6966 4904 3092 -75 -2537 -4609 -5962 -6310 -3868
4638 -3868 -850 2391 5172 6624 5884 5462 2677 -159 -3527 -5795 -6084 -5685 -3237 246 3004 5044
4654 5044 6260 6227 4822 2336 -896 -4024 -6901 -6116 -5206 -3006 788 3230 4881 6437 6145 3743
4670 3743 451 -2125 -5194 -6226 -6502 -4454 -2124 1188 4701 5036 7316 5975 3407 56 -3464
4685 -3464 -4544 -6936 -5418 -4446 -995 2150 4956 6367 5876 4492 2160 -1296 -3638 -4995 -6896
4700 -6896 -5853 -3700 266 2669 5179 7134 5727 4454 1558 -1782 -4305 -6248 -5860 -5296 -2114
4715 -2114 622 4162 5586 6051 6072 2852 928 -2605 -5567 -7140 -5920 -3986 -2093 1855 3465 5539
4731 5539 6389 5353 3227 79 -3232 -5639 -6612 -6036 -4378 -838 2425 4446 5718 6003 4543 2118
4747 2118 -1086 -3876 -6012 -6485 -4828 -3882 276 3353 5855 6197 6140 4413 484 -2588 -4480 -6479
4763 -6479 -5397 -5013 -2282 1222 3744 5069 6694 5451 3141 1283 -2889 -4980 -6047 -6031 -4727 -1214
4779 -1214 1253 4349 5094 6247 5447 4145 -712 -3837 -5039 -7076 -6209 -3472 -1389 3054 4775 5833
4795 5833 6574 4682 964 -1327 -3447 -6368 -6185 -5690 -3107 335 2518 4924 6687 5566 3745 853
4811 853 -1948 -5312 -6291 -5343 -4707 -2040 1079 4414 5588 6013 5646 3423 -187 -3887 -5201 -6363
4827 -6363 -5646 -3606 -1339 1038 3697 5748 5605 5033 2803 -819 -3300 -5980 -6897 -5569 -3692 -1259
4843 -1259 2670 5247 6704 5862 5174 1604 -2102 -3523 -6206 -6812 -5593 -2365 704 4173 6251 7610
4859 7610 5783 3345 685 -2074 -3602 -5254 -6025 -4591 -2532 -81 3820 5481 6014 4735 2660
4874 2660 -560 -3026 -5114 -6608 -6010 -3317 -757 1363 4563 6136 5811 3929 2747 -1675 -3582
4889 -3582 -4776 -6213 -4729 -3665 -246 2799 4907 6487 6426 4407 1874 -1872 -4220 -5792 -6536 -4625
4905 -4625 -2903 206 3351 5695 6305 4927 4143 1172 -2237 -4379 -7210 -6334 -4740 -953 1112 3935
4921 3935 6126 5950 5694 3620 -1047 -3347 -5825 -5895 -5397 -4451 -296 2235 4284 7090 5757 4584
4937 4584 1647 -857 -4333 -6128 -5431 -5632 -3200 -32 3286 4776 6469 6159 3754 1197 -1690 -3782
4953 -3782 -5602 -6479 -5165 -2917 743 3638 5057 5927 5502 3585 522 -2673 -5549 -5904 -6200 -3804
4969 -3804 -1539 1144 3421 5812 5883 4534 3018 137 -2785 -5155 -5893 -6165 -3724 -1004 2621 4040
4985 4040 5591 5733 4153 1968 -840 -3097 -5796 -6663 -5279 -2867 -177 2830 5365 5665 6280 3580
5001 3580 824 -1325 -4619 -5231 -5961 -4830 -2066 702 3626 6131 6179 5104 3621 211 -1986 -4253
5017 -4253 -5096 -5635 -3672 -2294 2343 4263 5659 5785 4714 2226 799 -3292 -4761 -5479 -6127 -3803
5033 -3803 -657 2106 5292 5773 4688 4620 2576 -1675 -2975 -5252 -6084 -4686 -2749 -290 2505 4497
5049 4497 5924 5573 4000 337 -1459 -4037 -5350 -5880 -4887 -2470 1482 3811 5164 5709 4651 2531
5065 2531 364 -2543 -4805 -5650 -5386 -4003 -2212 150 3517 5629 4677 4774 2725 213 -2458 -5179
5081 -5179 -5089 -4549 -2858 -384 2664 4258 5613 4844 3610 2038 -754 -3587 -5437 -5178 -4750 -2798
5097 -2798 902 2724 4497 5058 4531 3049 175 -1527 -4711 -4971 -5521 -4653 -1337 1869 3006 5063
5113 5063 5462 4338 2846 498 -2386 -4309 -5989 -5383 -2527 -736 1055 3872 5081 5407 4140 2452
5129 2452 -53 -3468 -5210 -5541 -4707 -2710 -1245 2602 4705 6010 4606 3449 1384 -541 -3665
5144 -3665 -4829 -5237 -4259 -2438 399 2813 5015 5829 3931 3534 83 -1385 -4110 -5272 -4924 -4477
5160 -4477 -1737 513 3144 4895 5485 4059 2325 205 -2002 -4088 -5930 -5466 -3417 -92 2525
5175 2525 3591 4858 5053 3794 2450 -280 -3398 -4635 -4790 -4458 -2388 330 2107 3355 4708 4965
5191 4965 3808 779 -2623 -2944 -4104 -4561 -2644 -2664 688 2549 4091 5860 5091 2575 359 -2488
5207 -2488 -3787 -4386 -4640 -4050 -1172 938 3060 5124 5302 3314 2446 117 -1842 -4098 -4308 -4708 -2887
5224 -2887 -663 1859 3600 4825 4756 2580 959 -1278 -2986 -4835 -5104 -4285 -1247 469 1902 4091
5240 4091 3930 4085 3978 1371 -25 -3933 -6238 -5504 -2868 -1664 1654 3164 2733 4838 4418 2522
5256 2522 913 -2562 -3710 -4850 -4218 -3133 -955 1067 3205 4399 4790 3551 2432 -552 -3251
5271 -3251 -4229 -4851 -4003 -3139 -1129 1733 3513 3941 4245 2736 209 -1047 -2874 -3383 -4151 -4207 -3466 500
5289 500 1758 3905 4522 3346 2206 1214 -875 -2600 -5331 -5225 -4608 -1359 1212 2574 3731 4186
5305 4186 2897 2490 359 -1895 -3165 -4798 -4209 -2494 188 1092 2752 3248 4575 4089 2341 -705
5321 -705 -3076 -4712 -4137 -3469 -1186 -1456 1043 3383 4526 5478 2888 668 -1300 -3055 -3705 -3981 -3364
5338 -3364 -2154 -244 1744 4562 4873 4356 1570 -851 -1525 -1830 -4235 -4125 -2404 -2204 1092 3364
5354 3364 4336 3851 3051 1974 980 -1383 -3347 -3895 -4639 -2243 -123 2040 2449 4030 3138 2584 1792
5371 1792 488 -1668 -4237 -5867 -4063 -1540 857 1971 2374 2973 4771 3442 1963 -1169 -4510
5386 -4510 -4020 -3418 -2315 -359 1064 1434 2328 4124 4846 2901 -717 -3002 -4169 -3933 -3032 -2509 -1862
5403 -1862 -398 2308 4502 5280 3151 -104 -1007 -1904 -2616 -3255 -3629 -3038 -1040 2390 4343 4138 3477
5420 3477 1382 -110 -629 -626 -2061 -4159 -4600 -2036 686 3227 3545 2060 1731 1173 1032 -557 -3120
5437 -3120 -4948 -3758 -2559 -139 1499 2274 2129 2695 2597 2797 680 -1949 -3679 -4236 -2755 -1429 -463
5454 -463 -121 1062 2811 4542 4524 1871 -1316 -3426 -3875 -3025 -2465 -1042 -1064 643 2556 4193 4054
5471 4054 1458 -526 -2401 -1900 -2480 -2586 -3180 -2118 -494 2643 5022 4179 2509 326 -1019 -1427
5487 -1427 -1152 -2416 -4350 -4119 -1075 2086 4005 3891 2557 437 1156 988 -817 -3005 -5071 -4100
5503 -4100 -2090 1125 2805 2503 1942 2404 2962 1973 560 -3036 -4573 -5100 -1405 305 1419 853 2139
5520 2139 3862 3917 2907 275 -2717 -3936 -3792 -3015 -1649 -1327 46 1825 2943 4692 3898 1068
5536 1068 -1542 -3358 -2333 -800 -2227 -3764 -2462 -345 3344 4516 3616 1591 24 -696 -1010 -1367
5552 -1367 -2922 -4085 -2544 341 2955 4755 3258 2062 948 1520 1395 -1483 -4474 -4554 -4472 -343
5568 -343 2866 2726 2501 1801 1881 2100 1606 -1380 -4237 -4846 -3989 -1321 1031 745 1093 1427 2868 3698
5586 3698 2602 -58 -3238 -3978 -3502 -1281 -237 76 613 1888 3617 4948 3174 -210 -1890 -2960
5602 -2960 -2197 -2009 -2258 -1816 -1029 1123 4664 5060 3005 281 -1623 -2462 -1111 -2094 -3164 -4314 -2483
5619 -2483 632 3617 3196 2840 896 542 -62 -412 -1825 -3745 -4123 -3216 -421 3310 3691 1925 1683
5636 1683 1447 2406 1933 -868 -3639 -6009 -2853 -7 2178 2204 1099 1639 3318 2745 1475 -1496 -4134
5653 -4134 -3841 -2433 -833 -34 21 656 2459 4119 4101 2067 -1308 -3997 -3785 -2153 -819 -676 -2302
5670 -2302 -738 1496 3773 5584 2400 -729 -2509 -1144 -737 -1364 -3001 -3767 -1196 1982 4612 4172
5686 4172 3140 1068 -384 130 -686 -3015 -3377 -3248 -2424 1925 3637 3942 1299 1539 1025 2266 884
5703 884 -1883 -5131 -4467 -2270 994 2417 2221 821 2166 3688 3197 1486 -2845 -4937 -5153 -2494
5719 -2494 -357 1235 -373 381 2115 4065 4932 1321 -1820 -4588 -2890 -1777 -125 -943 -629 -136
5735 -136 2376 5400 5017 1872 -1575 -2567 -2220 -1673 -2346 -2841 -2552 -106 3087 5055 3387 1749 -124
5752 -124 -1323 -1151 -219 -2294 -4406 -3802 -499 2734 4492 4092 1269 1071 503 1102 -916 -2658 -4857
5769 -4857 -4759 -1494 1887 2962 1903 743 1349 2180 2262 722 -3140 -5468 -3755 -834 623 911 539
5786 539 1024 2309 3872 3501 625 -2818 -5584 -2907 -1038 170 -393 244 201 3415 5238 3689 994
5803 994 -1820 -3570 -2939 -2373 -1781 -3196 -2576 351 4293 5796 3734 1290 -1311 -1390 -509 -1647 -3672
5820 -3672 -4475 -3135 -159 3663 4749 2898 164 461 837 948 -1042 -4040 -5046 -3887 -357 2963
5836 2963 3120 1726 727 584 2935 1725 -763 -3717 -4616 -3177 -1152 1010 1215 1095 858 3039 4597
5853 4597 2546 -780 -4386 -4636 -2812 -661 -433 -1124 -374 716 3868 5068 3620 -285 -3085 -3832
5869 -3832 -2666 -777 -2235 -2972 -1571 392 4333 5725 3063 -138 -1868 -974 -1496 -1106 -3443 -4626
5885 -4626 -2950 652 4272 5055 2680 919 -513 608 84 -1669 -4740 -5501 -2844 840 2931 3851
5901 3851 1982 1144 1668 2280 2375 -2200 -4655 -6022 -4484 -320 1752 688 480 1676 2620 4459 2017
5918 2017 -1247 -3929 -6063 -3001 -759 -158 -872 228 1906 4048 5095 3196 -424 -3813 -3689 -1837
5934 -1837 -2035 -2132 -1478 -807 2041 5106 5623 3515 -681 -2876 -2169 -1491 -2517 -4065 -4023 -2571 1799
5951 1799 4802 4618 3009 1368 -158 663 -241 -2387 -5010 -4744 -1401 1811 2997 3857 1423 1945
5967 1945 1820 2391 577 -2473 -5343 -5704 -3733 1096 1444 881 1923 1772 3000 2571 905 -2056 -4388
5984 -4388 -5028 -3285 -250 -251 -840 279 1629 5457 5108 1767 -1296 -4067 -3531 -2207 -1097 -1625 -2426
6001 -2426 -1008 2425 5626 5125 2067 -1354 -2123 -2292 -907 -1530 -3721 -3371 -1625 2706 4958 4382
6017 4382 1612 21 -1570 -165 -1125 -2713 -4372 -5144 -1843 1434 4161 3545 1713 1375 1898 1691
6033 1691 -258 -3196 -5288 -5157 -2344 1207 2668 2214 1253 1913 3301 3761 1261 -2572 -4838 -4355
6049 -4355 -1548 -219 43 -262 15 3220 4733 3941 840 -2434 -5673 -3446 -1577 -1082 -1613 -1273 781
6066 781 3222 5476 4473 1435 -1764 -1957 -1669 -1744 -2215 -3433 -3566 -365 3371 5278 4345 2015 -374
6083 -374 -949 -110 -2174 -2907 -5116 -4087 -1098 2754 3446 3432 1740 1134 1907 1588 -870 -4088 -5560
6100 -5560 -3519 -1422 1400 2832 1551 2085 2656 3119 1397 -272 -3650 -5159 -4095 -1867 30 460
6116 460 392 923 3538 5268 3033 158 -2697 -4220 -3433 -1373 -1727 -1862 -950 406 3259 5249 4301
6133 4301 1552 -1770 -1891 -2020 -1936 -2047 -3090 -1986 402 3762 4661 3903 1852 -629 -605 -672 -2018 -4184
6151 -4184 -5268 -4975 486 1974 3760 3148 1846 2169 1037 1520 -1380 -4260 -4685 -3334 -790 1497
6167 1497 2463 2537 2553 2325 3417 2603 -748 -3734 -4844 -2647 -1483 18 864 808 1871 3405 4228 2844
6185 2844 -178 -2444 -4162 -3152 -1976 -1942 -1997 -402 1624 4732 4982 3574 648 -2146 -3502 -2114
6201 -2114 -850 -2664 -3079 -1265 819 3194 4516 3725 940 19 -964 -1052 -1977 -3654 -5305 -2648 536
6218 536 4018 3493 2954 1861 767 846 1384 -1459 -4430 -5045 -3625 -564 1869 1958 2328 2532 2586 2475
6236 2475 1626 -1223 -4152 -5127 -3376 -830 -633 195 1981 2027 3776 4261 2209 -315 -3803 -3621 -2868
6253 -2868 -2123 -2022 -580 195 1840 4478 4931 3080 218 -2698 -2110 -2804 -2626 -2739 -2620 -716 1765
6270 1765 4596 5107 3031 456 -522 -982 -1926 -2532 -4367 -3846 -3090 1199 3852 3385 3010 2135 1400 1015
6288 1015 -884 -2882 -4216 -4328 -2493 -337 1752 2386 2979 2569 2272 2216 912 -1838 -4637 -5405 -2531
6305 -2531 -425 357 717 2249 2276 4249 3822 1669 -952 -3133 -3310 -2723 -985 -831 -1034 1447 2673
6322 2673 3412 4811 2178 -512 -2388 -3018 -2438 -2260 -3036 -3071 -54 1942 3729 3787 2823 1210 -729
6339 -729 -1125 -1965 -3093 -3730 -3049 -942 1565 3941 3283 3189 1838 885 991 -909 -3072 -3682 -4168 -1742
6357 -1742 236 2247 2570 2924 3593 2788 2496 -220 -2700 -3458 -4241 -2446 -178 1009 1766 2006 3822
6374 3822 3121 3374 1186 -869 -3141 -2598 -2893 -1450 -697 -640 716 3020 4035 3493 1887 -1786 -2404
6391 -2404 -2051 -2919 -1883 -2483 -831 845 2183 3845 3834 1659 116 -726 -579 -2753 -2702 -2899 -3193 -962
6409 -962 1397 3603 3998 3014 1820 1242 -456 -1168 -3480 -4051 -3820 -1671 1071 1761 2533 1866 1813 2012
6427 2012 1428 -1108 -3296 -3742 -2884 -1451 -785 1353 1861 2154 3105 3109 1772 163 -2618 -3134 -3534 -2483
6445 -2483 -1081 -565 310 1962 3100 3847 2958 1109 -839 -2023 -2583 -1964 -1852 -1990 -969 713 2682
6462 2682 3594 3201 2487 -109 -2110 -1225 -3123 -2801 -2908 -2578 -698 1607 4047 2278 2634 1593 1261
6479 1261 3 -711 -2914 -3913 -2828 -1273 640 2388 2864 2174 2208 2074 1111 -1843 -2678 -3880 -3230
6496 -3230 -1972 -433 1392 1099 1375 3089 2925 2081 -140 -2031 -3921 -2810 -2329 -1403 -6 787 2525
6513 2525 3313 4284 2633 1317 -1613 -2260 -2309 -2973 -2349 -1887 -914 1544 3307 3636 2200 1717 584 313
6531 313 -2753 -2566 -3169 -2444 -1841 361 2241 3658 2803 2419 748 596 -1650 -1984 -3179 -3793 -2431
6548 -2431 87 1435 1753 2755 3201 3404 686 -182 -1764 -2793 -4544 -2867 -1175 -211 985 1744
6564 1744 2563 3514 2239 1489 -1935 -2526 -2781 -2642 -3460 -1036 103 490 2637 2833 3506 1710 242
6581 242 -1749 -2720 -2150 -2748 -2588 -1190 -70 2027 2909 2625 2822 816 -294 -1534 -2411 -2393 -3143 -2521
6599 -2521 -531 135 2750 3949 2948 2770 871 -350 -533 -2110 -2948 -2523 -1769 581 1389 2215 3575
6616 3575 2204 2584 1177 151 -2077 -2879 -3407 -2806 -976 159 1571 2345 1837 2475 2536 560 -676
6633 -676 -2310 -1894 -2642 -1890 -1850 221 2305 1907 2221 2699 726 -734 -1093 -2942 -2323 -2428 -1340 -611
6651 -611 295 2407 2871 3288 2605 1223 -108 -1701 -2067 -2256 -3556 -2168 144 977 2162 2585 2718
6668 2718 1404 624 -1464 -1751 -2907 -2224 -2092 -920 -444 1736 2275 2839 2105 2234 208 -320 -1259 -2539
6686 -2539 -2450 -2170 -317 341 1878 2879 2817 2639 2385 1014 -1475 -2596 -2024 -2332 -2346 -798 878 1454
6704 1454 2529 2541 2652 389 -180 -1413 -1989 -2546 -2391 -1396 443 1440 1855 2397 1997 971 -35 -812
6722 -812 -2434 -1586 -1949 -1588 -1520 -25 934 2262 2680 1712 1732 1217 -564 -2212 -2604 -2779 -1364 54
6740 54 901 1816 2756 2738 2305 142 567 -780 -2424 -3329 -2231 -1580 -235 1837 1378 2043 2462 2619 1328
6759 1328 -208 -1748 -2336 -1998 -2203 -1904 -648 590 1643 2604 3204 2134 612 -460 -1934 -2469 -2324
6776 -2324 -1629 -1961 167 1111 2186 2314 2230 663 578 -1569 -1674 -2622 -2237 -1962 -1098 226 1946 2584
6794 2584 2597 1922 2084 -21 -800 -2399 -2807 -2269 -1315 -31 693 2081 1616 2510 2398 1116 274 -1183
6812 -1183 -2420 -2582 -2598 -771 341 448 1859 2570 2282 1663 303 -230 -1220 -2284 -3638 -1857 -1472
6829 -1472 -2 1839 1823 2634 2381 2248 403 -821 -1349 -1999 -1544 -1554 -428 1173 1167 2087 2043 2178 1746
6848 1746 32 -552 -1754 -2274 -2240 -1538 173 -147 848 2422 2778 2399 703 -16 -717 -2245 -3116 -1358
6866 -1358 -1470 158 316 1049 1796 2599 924 629 10 -1803 -3007 -2416 -2693 -390 792 1020 2700
6883 2700 1919 2666 1578 -147 -1116 -1701 -2436 -2709 -1316 -410 267 931 2992 2229 2440 1250 -736 -1278
6901 -1278 -1885 -1772 -1680 -1422 -115 488 1562 1753 2028 1753 766 -563 -605 -2092 -1842 -1776 -301 50 1083
6920 1083 2212 1796 2568 1230 1240 -229 -1633 -1445 -1905 -2311 -884 566 1650 1547 2078 1575 1829 -629
6938 -629 -578 -1490 -2982 -2834 -1923 -898 387 1977 2037 1711 1239 1063 -63 -1538 -1521 -1882 -1223 -300 -167
6957 -167 246 1545 2750 1697 918 -15 -534 -1995 -1969 -2061 -1588 -866 -368 812 1561 2744 2345 1421 -215
6976 -215 -1232 -1748 -2082 -1332 -1095 -257 460 343 1417 2714 2291 1054 757 -1321 -2230 -1537 -1208 -2278
6994 -2278 98 534 1291 2634 1572 708 126 -925 -596 -1668 -1683 -2331 -1230 -356 1861 1248 1764 1428
7012 1428 1520 -203 -537 -1742 -2357 -871 -2329 -412 942 1067 1498 2748 1319 2052 267 -972 -2374
7029 -2374 -2162 -1889 -1602 -1168 -53 1339 2065 2088 2721 1399 187 -1749 -1602 -1986 -1640 -462 -866 404
7047 404 698 852 1683 1018 818 -216 -1170 -2163 -1189 -2313 -741 929 185 1041 2410 2727 2038 106
7065 106 -937 -1137 -2292 -2260 -1392 -570 -297 963 842 1418 1501 1103 125 -877 -648 -1248 -1849 -2013 -180
7084 -180 853 669 2142 2021 2157 773 -307 -892 -1517 -2076 -2046 -1659 213 165 719 1607 924 778 -200
7103 -200 -722 -1373 -1488 -2350 -1587 -609 601 1010 2245 2195 1330 821 -426 -870 -1117 -1986 -1825 -1348 217
7122 217 -314 1510 1893 1865 938 570 -753 -981 -1185 -103 -2388 -1354 -716 -231 1406 1815 994 2282
7140 2282 415 15 -576 -2475 -1848 -1686 224 51 506 1809 1146 1245 755 56 -542 -1356 -1899 -1966 -1944
7159 -1944 -693 201 437 1460 1338 1557 908 285 -1412 -1175 -1629 -1893 -1204 -644 318 1206 2121 2255 1990
7178 1990 1090 -245 -1513 -1526 -1919 -1865 -1502 -304 1001 411 1322 1426 1071 -74 -275 -1428 -1979 -2507
7196 -2507 -2392 -558 174 1091 1587 1863 1396 1140 -34 -529 -1549 -1167 -2030 -1626 -643 722 1189 2094
7214 2094 1349 1959 583 71 -336 -1387 -1658 -1359 -683 -802 446 1206 1282 1082 725 712 -863 -1090 -1100
7233 -1100 -1897 -1085 -673 453 873 1002 1824 1430 850 273 140 -1248 -1071 -1451 -1155 -409 241 447 1582
7252 1582 1354 2227 1133 764 -919 -1663 -1759 -596 -1246 -619 966 1331 1283 1154 1536 1362 240 -401 -988
7271 -988 -1897 -1928 -1539 -583 -9 1792 1526 1817 1664 746 194 -1170 -1262 -1045 -1156 -585 -65 1164 1649 1686
7291 1686 1870 1304 538 -861 -1687 -991 -1937 -1127 -340 417 458 1479 1370 489 988 86 -710 -813 -1674
7310 -1674 -1399 -1222 -597 21 2007 1435 1378 1139 505 84 -1491 -1891 -1348 -636 -1223 210 763 1638 1499
7329 1499 777 1111 798 -504 -689 -1442 -1524 -1257 -1540 -988 189 1014 1819 1411 1497 536 -717 -1551 -1319
7348 -1319 -780 -1890 -557 486 1352 950 1409 1838 693 -123 -726 -579 -1700 -2124 -983 637 438
7365 438 219 1885 1019 794 1638 -84 -1616 -1324 -1458 -1301 -1772 -59 263 1906 2626 1740 973 198
7383 198 45 -765 -1270 -1883 -1415 -878 180 163 1081 977 1337 1123 -743 -49 -1278 -2070 -1768 -892 -662
7402 -662 386 723 2059 2047 971 817 177 -813 -1288 -771 -1161 -715 446 486 1095 1135 2207 338 789
7421 789 -363 -985 -1091 267 -531 -513 261 758 1179 958 1293 738 333 -1533 -1139 -1139 -1497 -606 -160 -251
7441 -251 972 1181 1702 1882 1076 -380 -898 -866 -1889 -2071 172 154 18 1082 1810 882 825 611 -891
7460 -891 -1436 -522 -880 -643 -655 21 692 1755 1208 1260 1266 314 -888 -903 -1906 -1547 -1537 -142 -265 1160
7480 1160 1676 1326 921 321 198 -877 -1010 -1890 -669 -415 -1198 316 1451 2193 1949 1955 -62 -555 -1415
7499 -1415 -1966 -2062 -1764 -966 -637 23 1037 825 2131 379 520 627 -786 -1120 -1552 -1185 -745 -852 746
7518 746 341 2150 1562 775 548 -196 -1181 -1846 -1462 -1421 -723 545 769 1161 2264 771 423 -678 -580
7537 -580 -1071 -1370 -1105 -222 -736 434 1579 388 1124 946 417 -622 -1740 -1369 -1502 -872 -190 -193 372
7556 372 516 1430 1353 990 1124 65 -767 -1048 -1353 -1172 -694 803 824 1195 1701 1281 1316 362 -731 -868
7576 -868 -1674 -814 -1835 -217 -1031 1321 1458 957 1429 760 115 -1453 -651 -683 -1028 -1579 -420 32 881
7595 881 1366 799 613 321 -440 -854 -1301 -1095 -1311 -865 126 966 1564 984 1702 1316 -748 -195 -2709
7614 -2709 -959 -1083 -1452 127 -364 1128 1844 1046 1162 284 262 -732 -1290 -1223 -725 -249 4 381 1502
7633 1502 1760 1223 667 1310 -262 -902 -1268 -1199 -1166 -1919 -503 -253 591 1059 1874 1072 201 -207 -198 -953
7653 -953 -2105 -428 291 130 1045 807 1277 1221 854 119 560 -778 -1057 -1520 -786 284 254 1518 1268
7672 1268 1488 633 366 130 -520 -1697 -1535 -1846 -1557 -690 59 626 205 1664 940 -545 -859 -955 -402
7691 -402 -1070 -1449 -648 100 123 1439 401 1551 1453 592 -1003 -614 -2118 -1852 -1149 -64 -461 503 1324
7710 1324 1836 1107 945 751 -867 -125 -982 -507 -1083 -846 985 723 1008 1969 437 1633 583 -1154
7728 -1154 -1712 -722 -1646 -997 -341 566 832 483 1284 1094 880 -887 -311 -596 -177 -2002 -734 42 501
7747 501 1174 1335 1486 2010 415 -1035 -167 -1141 -1738 -1824 -454 -234 1350 1715 1702 784 1160 552 -544
7766 -544 -1341 -1522 -2026 -1487 -540 208 866 1951 1025 394 546 434 -704 -1000 -1109 -1316 -692 441 209
7785 209 1284 1265 1220 1040 574 -121 -1267 -918 -1084 -1066 291 -234 50 851 2024 1404 1109 68 -170
7804 -170 -724 -1597 -799 -1816 -367 176 90 985 1053 -3 1085 -694 -1384 -661 -1783 -517 -554 134 980
7823 980 830 848 1749 988 784 799 -757 -1467 -1198 -1220 -357 408 176 1658 2280 1955 1298 436 -511 -426 -1162
7844 -1162 -1287 -1661 -1067 -295 1533 1396 1556 1444 553 288 -38 -1424 -1521 -1359 -713 -334 472 1362 1427 1697
7864 1697 678 527 513 -323 -714 -1366 -1365 -14 397 431 838 2272 1271 1340 470 261 20 -492 -1432 -1432 -428
7885 -428 -640 36 806 876 2099 1196 35 -341 -261 -638 -1584 -884 -344 1090 1160 1773 1530 1173 1671 773
7905 773 -454 -1126 -1303 -1459 -984 -291 297 95 2172 1458 485 512 -1187 -576 -1430 -1821 -648 -1414 289
7924 289 639 1275 1190 1568 1447 64 375 -1251 -1215 -2103 -957 -706 -223 856 1477 1898 281 1250 390
7943 390 34 -857 -2528 -1071 -1294 -667 351 1075 879 1361 1579 -105 421 -1167 -1271 -1352 -932 -1618 -265
7962 -265 -36 1515 1528 1287 1909 148 292 -26 -840 -858 -1048 -797 22 163 614 1022 1413 667 107 58
7982 58 -1188 -1047 -963 -1091 -309 -326 1149 762 1486 2423 545 169 -744 -704 -1290 -1307 -1567 -668 881 1422
8002 1422 1554 1312 1925 1122 -749 -1187 -1914 -1186 -924 -1192 -189 -347 66 1653 1408 713 1389 512 -730
8021 -730 -1782 -1739 -1658 -86 -276 202 705 881 1274 663 555 -508 -1097 -1163 -1235 -1287 -1497 312 551 1742
8041 1742 827 914 156 663 -614 -1161 -1232 -1356 -533 -1048 1232 762 1725 608 1598 1323 -51 -1142 -574
8060 -574 -1661 -1513 -758 -796 937 1321 1137 1345 1378 -119 -142 -79 -1291 -1495 -1707 -955 -538 -142 1079 899
8080 899 941 927 549 -316 -526 -1295 -603 -1076 -521 0 598 984 820 1520 1055 247 -804 -869 -1432 -1383 -1415
8101 -1415 -1099 472 329 1369 1169 1371 456 -228 -24 -403 -1662 -1244 -239 -302 615 1062 1859 1094 1572
8120 1572 373 -940 92 -935 -2005 -1233 -1156 70 150 744 902 437 610 682 708 -920 -1296 -1305 -1453
8139 -1453 -867 -105 523 1640 397 918 879 308 455 -945 -882 -2262 -56 -936 -1405 1050 405 2225
8157 2225 1291 495 -542 -605 -1702 -1122 -1464 -613 -366 535 1416 910 1680 718 -111 -441 -226 -1524 -1182
8176 -1182 -1557 -1470 -282 1085 1666 1105 1424 741 132 623 -583 -1288 -1392 -230 -1065
8191 -1065
$$ Imaginary data points
##PAGE= N=2
##DATA TABLE= (X++(I..I)), XYDATA
0 0 0 0 0 0 0 0 0 0 -72 30 -72 72 -72 102 -140 144 -151 216 -251 288 -359 386 -465 524 -610 708 -792
27 -792 907 -1024 1165 -1306 1463 -1641 1831 -2055 2279 -2535 2812 -3118 3468 -3829 4248 -4691
43 -4691 5206 -5769 6393 -7117 7921 -8864 9960 -11254 12827 -14741 17201 -20418 24899
56 24899 -31551 42501 -63827 121464 -610300 -2102060 -2106215 -1862259 -1227387 -521667 405140
67 405140 1179433 1796609 2049302 1863016 1049665 -22718 -949550 -1449833 -1633037 -1498361
77 -1498361 -1069633 -355548 481186 1323119 1898074 1963551 1445772 627092 -197946 -864572
87 -864572 -1368806 -1640429 -1589711 -1141787 -373107 522654 1249188 1565457 1409049 941591
97 941591 358390 -261737 -912986 -1465251 -1703276 -1491277 -884127 -69081 699733 1200498
107 1200498 1362760 1278482 1015264 529563 -171368 -879400 -1325502 -1378100 -1053647 -464656
117 -464656 179350 691074 1040491 1263584 1279532 946928 303039 -411406 -960132 -1214399
127 -1214399 -1140345 -811358 -373872 76981 551388 998454 1217441 1055196 565091 -51410
137 -51410 -604392 -968671 -1094043 -1019311 -797517 -422109 114190 683362 1060638 1090094
147 1090094 806720 363375 -94676 -483721 -763610 -913806 -893393 -639278 -150954 430796
157 430796 873075 1028698 922043 666022 331756 -49530 -440399 -763447 -920996 -808418
167 -808418 -419463 100482 529396 762943 832858 775869 581237 243730 -183837 -612266
177 -612266 -900925 -920142 -657416 -261910 103831 391355 614468 738379 700525 468921
187 468921 78854 -367368 -711470 -810550 -678596 -432448 -155428 149286 466844 718571
197 718571 809254 676554 341726 -81695 -431931 -606974 -622358 -539139 -370221 -92550
207 -92550 265367 599336 780604 738065 489397 139705 -182270 -412925 -557665 -624263
217 -624263 -568197 -343313 15999 380185 616931 659854 522920 278993 13077 -234827
227 -234827 -468105 -649827 -684395 -507479 -171692 191426 465018 593140 575576 452354
237 452354 265376 16698 -287242 -562554 -678090 -574875 -313309 -312 278233 471699
247 471699 563973 565939 467775 237143 -98408 -423521 -603102 -589586 -430732 -196245 53195
258 53195 280297 464857 578849 565490 374507 45981 -287809 -510826 -583063 -531693 -392154
269 -392154 -190028 56391 320625 535119 607180 484021 212893 -86108 -320209 -464631
279 -464631 -524012 -494938 -359238 -120824 178093 451325 588171 541042 355763 121008
289 121008 -103578 -303810 -463873 -533376 -470569 -267395 27574 323003 508091 537920
299 537920 448481 295337 96663 -141164 -378423 -539668 -559096 -418404 -157020 124528
309 124528 336231 442797 467225 415807 270129 28962 -247042 -466620 -555220 -484046 -291068
320 -291068 -55186 157096 329562 453597 497223 413134 197955 -82324 -334978 -481861
330 -481861 -490368 -387213 -221785 -28789 182895 391911 522387 506817 342933 93680
340 93680 -159752 -346663 -436021 -436363 -363038 -215360 8497 262815 452692 502834 411077
351 411077 224611 7079 -192569 -344004 -437160 -452310 -355825 -144640 121443 344371
361 344371 454850 445184 340873 178373 -13063 -207895 -379857 -478158 -447730 -277854 -34378
372 -34378 192834 348479 419386 409343 321169 165014 -45780 -269661 -431124 -464250 -357855
383 -357855 -170115 28504 202919 340660 417255 406735 295832 95248 -146566 -346986
393 -346986 -436078 -404402 -293797 -139676 38988 223098 373588 442143 392802 228594 1190
404 1190 -208533 -340652 -387885 -367453 -276930 -120193 83255 281333 410674 424052 316941
415 316941 134373 -55671 -209839 -324240 -384338 -364572 -244997 -46886 169430 337497
425 337497 406976 366471 248463 96253 -66881 -232131 -363614 -410600 -342848 -177405 29873
436 29873 216033 333439 364521 324601 229974 80761 -108805 -290435 -391649 -381928 -270344
447 -270344 -98814 79513 225005 317981 357454 327064 207224 13307 -188246 -329429
457 -329429 -375276 -328263 -213424 -62940 95345 240529 347778 380108 304367 137609 -58579
468 -58579 -221774 -319057 -341714 -295694 -193606 -46454 125010 282965 371205 347955 229275
479 229275 66425 -92398 -221771 -305573 -329589 -282876 -163854 13005 195615 320666
489 320666 349174 289721 179323 40417 -107065 -239621 -325620 -335318 -255912 -99652 82097
500 82097 228023 303201 310745 262784 159825 16166 -143186 -273878 -337207 -306500 -189973
511 -189973 -31991 113239 222483 290311 304164 247334 122875 -41517 -199305 -302914
521 -302914 -319172 -253289 -138593 -8175 123746 242110 313607 307370 217845 68239 -95232
532 -95232 -226168 -290883 -284851 -226385 -127246 8294 157839 274926 317906 274161 159848
543 159848 14896 -124565 -223410 -275271 -277229 -220119 -98864 59211 203043 285496 290033
554 290033 226270 115320 -12968 -133782 -234705 -293689 -280989 -187841 -42334 104934 215485
565 215485 269794 262368 199640 97348 -28464 -158378 -260437 -293490 -242593 -129785 2522
576 2522 124947 214615 257123 244796 180685 68249 -74648 -202173 -271414 -262310 -194683 -90437
588 -90437 26826 139932 225575 263235 240146 149701 12552 -123495 -219072 -256220 -237917
599 -237917 -173986 -72611 48020 165547 246115 262924 208488 97263 -29747 -138799 -212459
610 -212459 -244686 -227221 -154336 -39380 89920 199599 256671 240811 166634 61864 -46962
621 -46962 -148820 -224373 -252346 -216860 -122975 2340 126151 212494 240844 211992 147019
632 147019 51163 -63269 -171011 -237370 -242354 -184999 -81365 37645 139403 201808 223315
643 223315 200631 129513 19409 -99688 -191612 -233110 -213807 -143333 -43691 58537 147264
654 147264 207717 227691 187964 95622 -20201 -126795 -197187 -217585 -187268 -117957 -25874
665 -25874 75033 167189 221507 216705 153897 55041 -49245 -136741 -191186 -201714 -168239 -97520
677 -97520 1638 107839 189379 215394 185336 117393 25147 -70333 -149868 -195258 -201101 -156717
689 -156717 -68823 40227 136498 192364 201517 168289 99007 8679 -84616 -161484 -202217 -191491
701 -191491 -127416 -31892 65084 140081 184249 190139 153021 79177 -16132 -108630 -176325 -196738
713 -196738 -164942 -94375 -7942 77115 148260 187774 183042 135897 53068 -43253 -129245 -178527
725 -178527 -181020 -143026 -78838 4185 90512 157334 187143 169533 110453 23356 -66408 -133975
737 -133975 -165299 -164704 -128773 -58627 30040 112092 165889 177873 146024 78062 -4095 -80666
749 -80666 -137960 -169257 -161117 -110263 -30166 55340 125976 166702 163832 121105 55844 -19556
761 -19556 -94033 -152091 -172631 -146681 -85259 -5852 73520 133274 158515 148146 106603 39745
773 39745 -40820 -115018 -157797 -160270 -124629 -61911 15583 87265 138069 156843 141461 91147
785 91147 15016 -64290 -126104 -156115 -150174 -108110 -43171 31131 96700 142248 155830 128373
797 128373 67335 -8891 -79077 -128732 -149739 -136864 -92625 -27076 45728 109316 146828 144920
809 144920 105389 42884 -24063 -86711 -132388 -145412 -123528 -73648 -5520 65705 121745 143548
821 143548 128777 87843 29585 -38959 -98906 -134898 -137540 -109277 -53294 18307 80227 121817
833 121817 132474 116479 73517 9550 -56454 -109186 -134616 -128548 -90392 -29571 34723 87898
845 87898 122041 129854 106451 53206 -10665 -71044 -115898 -132303 -116546 -71558 -12626 47119
857 47119 97864 126081 124413 90723 36548 -25212 -81882 -118069 -123306 -101085 -57054 99
869 99 60618 106894 124708 112138 73202 19313 -40794 -89944 -116033 -115583 -91040 -41303 20272
882 20272 74391 108295 118088 100930 58538 2345 -53010 -93823 -115638 -109983 -76604 -22470
894 -22470 34530 79395 108678 112214 87384 41722 -11572 -62567 -99965 -113794 -97545 -58127
906 -58127 -7082 44541 86551 108365 102893 73491 27049 -26323 -74080 -103904 -106043 -83724
918 -83724 -44031 6347 57007 93652 105845 93994 61079 13211 -39916 -80904 -101388 -98483
930 -98483 -73956 -31883 20622 65687 93568 101378 84490 46995 -3583 -49895 -83486 -99633
942 -99633 -91517 -61183 -14485 33054 72151 96113 96036 72312 30674 -15093 -58244 -88033 -97610
955 -97610 -80226 -46717 -2231 42647 78976 95199 86889 59893 19409 -25694 -65728 -88774
967 -88774 -89655 -69112 -34163 10561 54311 82597 90920 78464 48785 6607 -38457 -72477 -87831
980 -87831 -83330 -59761 -20703 23903 62200 83702 88083 70829 36326 -6980 -46589 -74939
992 -74939 -87086 -77546 -47361 -7416 32166 65065 84415 82188 58682 23802 -17193 -53697
1004 -53697 -78577 -83409 -66407 -35243 1998 41170 71791 83427 74237 49469 14393 -26765
1016 -26765 -59498 -77488 -76031 -57843 -26533 13903 49995 72324 78606 67646 39772 2076
1028 2076 -36382 -62477 -74894 -69655 -48249 -13515 24248 54270 73506 73874 57870 26143 -10884
1041 -10884 -42938 -66582 -75117 -64451 -37010 -2863 31043 59871 74571 69098 47279 16256
1053 16256 -17937 -50201 -68487 -70053 -54448 -26192 6417 40734 64769 72712 62511 40334
1065 40334 8104 -26239 -54740 -68591 -64305 -47432 -18245 17224 46789 65941 68313 57081
1077 57081 31548 -2689 -34669 -57518 -66196 -61731 -41031 -9668 23444 49065 64930 65134 48389
1090 48389 21363 -11245 -40821 -59996 -66155 -54783 -29531 219 29093 53556 65609 60127
1102 60127 40106 13107 -17415 -45314 -60534 -60708 -46310 -21716 7497 37442 56582 63026
1114 63026 53371 33218 4660 -26224 -49335 -59671 -55605 -40030 -14273 16841 42680 57312
1126 57312 58202 47079 22586 -7236 -34507 -52803 -59199 -53314 -32280 -3689 23932 45952 58413
1139 58413 56960 39900 13516 -14052 -38545 -55602 -59105 -47029 -24162 4359 30942 50590
1151 50590 59201 51474 33135 8076 -21199 -44188 -56037 -55471 -40377 -17687 10663 36416 52178
1164 52178 56750 46207 26562 -1262 -27733 -48971 -56280 -51116 -36165 -10112 18167 39621
1176 39621 51282 52731 41375 19359 -8874 -33800 -49397 -53964 -45858 -27319 -1394 22904
1188 22904 43169 52817 50483 33954 9950 -15960 -36428 -49719 -50506 -39178 -19155 4925 28552
1201 28552 47457 52208 42874 25643 2592 -21343 -41398 -50896 -47736 -34008 -13041 13343 35062
1214 35062 47558 47601 37165 19401 -5832 -28646 -44468 -50703 -44992 -29553 -4028 20672 37720
1227 37720 47883 45264 34125 13015 -10701 -33179 -47343 -50034 -40107 -19919 3469 25237
1239 25237 41036 48787 44863 29312 6511 -15954 -36232 -48526 -45842 -32997 -14868 7707
1251 7707 28827 44088 47133 40038 22565 -410 -22988 -39019 -45410 -41531 -29730 -9211 12196
1264 12196 32015 43970 44826 33889 15098 -7668 -25824 -39504 -44607 -39260 -24328 -2211 19511
1277 19511 37264 43979 40261 27882 7798 -12771 -29724 -41086 -43775 -35004 -16775 5138 25190
1290 25190 37723 43318 36118 23531 3460 -15597 -33990 -43766 -42224 -27513 -9532 10183 29194
1303 29194 40978 42268 33977 18514 -2269 -22687 -37795 -42494 -36332 -23205 -5025 16455 32402
1316 32402 40039 41296 31478 14118 -8847 -27889 -37755 -40758 -33928 -18851 381 19703 34444
1329 34444 41774 39974 25905 6746 -13887 -29130 -38208 -39211 -31078 -13708 4635 24548 36728
1342 36728 41874 33837 19380 1692 -15928 -30363 -38034 -37379 -27037 -8740 12002 29222 37527
1355 37527 36752 28807 15512 -2854 -20418 -34074 -39759 -33574 -21177 -895 17037 29439 35632
1368 35632 34341 26508 10949 -8261 -26520 -36515 -38871 -29669 -14844 3229 18516 30713 36279
1381 36279 33541 21908 3225 -15410 -30574 -38067 -35652 -24893 -10012 5876 22452 34172
1393 34172 38441 32256 16237 -1982 -18516 -31245 -35359 -32256 -22973 -7705 11018 27312 36323
1406 36323 34615 25080 11236 -6039 -20971 -30929 -34956 -31957 -20220 -1750 17197 29667 34008
1419 34008 31752 22013 7088 -9779 -24196 -33371 -37112 -29278 -13428 4882 19707 29882 33368
1432 33368 29280 18821 4016 -13196 -28205 -36639 -33289 -22400 -7229 6476 21500 31179 33372
1445 33372 28111 16466 -2014 -19579 -32094 -34766 -29093 -18257 -5311 11106 25366 33402 32842
1458 32842 25351 10341 -8807 -23013 -29311 -32365 -26133 -17413 -1405 15380 27764 34668 29370
1471 29370 18730 3567 -11588 -23088 -31216 -33424 -26027 -12510 4374 20383 30864 33772 26364
1484 26364 14429 1171 -12729 -26083 -33657 -30807 -21681 -6216 10488 24270 30595 30634 24230
1497 24230 14863 -336 -15727 -29337 -32228 -27968 -15527 -432 14258 25221 29925 30033 23732
1510 23732 8283 -8371 -22061 -31019 -30684 -24212 -12371 2237 15647 25229 32139 29391 18688
1523 18688 2327 -13011 -24396 -30384 -28347 -21134 -9857 5021 19012 30794 32296 26118 13347
1536 13347 -1644 -15063 -24941 -29545 -27417 -19805 -5706 11166 25141 31048 29816 21657 9281
1549 9281 -4030 -16409 -26539 -30758 -25486 -14935 510 15502 25606 29516 26509 18895 6556
1562 6556 -7980 -20149 -29543 -30411 -22780 -9118 5908 17614 25171 28910 26733 16866 2579 -12230
1576 -12230 -24029 -29110 -26187 -16559 -4994 8669 19816 29403 30897 25176 12094 -2546 -16227
1589 -16227 -24452 -27027 -23235 -14427 -2919 11924 23849 30546 27990 21377 6621 -7958 -18920
1602 -18920 -25923 -27322 -23160 -14796 798 15590 26021 28828 24519 16000 2855 -9819 -20748
1615 -20748 -26780 -28158 -22100 -8029 6977 19962 26716 28209 23222 13361 751 -11762 -23374
1628 -23374 -28638 -25392 -15919 -2332 10173 21715 28022 27222 21526 11188 -2874 -16806 -26063
1641 -26063 -27859 -21871 -11765 -390 12140 22127 26869 25995 18703 5713 -10542 -21786 -26086
1654 -26086 -26684 -21129 -10711 1294 14297 24672 27762 23211 14186 -1059 -13255 -21431 -26130
1667 -26130 -25176 -18916 -7319 7157 19597 27217 27042 19935 8849 -3072 -13377 -23610 -27536
1680 -27536 -25019 -15898 -2029 10897 21419 26297 24485 16232 5971 -5818 -19682 -26891 -28597
1693 -28597 -23781 -11956 647 12609 20722 23530 21558 13855 2706 -11023 -23313 -27801 -25632
1706 -25632 -19192 -7361 4665 15063 22805 24673 21276 12247 -1335 -14441 -22604 -25954 -23343
1719 -23343 -15270 -3592 7814 18352 25129 25922 18357 6902 -5718 -16202 -22985 -25758 -21940
1732 -21940 -14094 -1213 9835 20343 24743 21003 12992 1293 -9841 -19871 -25386 -25895 -20317
1745 -20317 -10291 2922 15043 22282 23438 20099 10331 -932 -11392 -20918 -25415 -24660 -16648 -3937
1759 -3937 7818 18328 23175 24161 19259 9415 -2975 -13499 -22490 -25864 -21095 -12319 -523 10485
1773 10485 20309 24684 22900 16334 5242 -7535 -18772 -24949 -23837 -18099 -10058 653 12320
1786 12320 20581 24585 20824 13127 924 -11261 -19905 -23914 -23020 -17100 -6845 5495 15871 23596
1800 23596 24851 20027 10437 -1490 -13500 -19638 -23037 -21295 -13722 -2498 10189 19859 25312 23682
1814 23682 17492 6277 -4886 -14675 -21125 -23850 -19975 -10093 2046 13100 20005 23776 20182 12682
1828 12682 3357 -8263 -19040 -23587 -23935 -16285 -6488 4532 15458 21964 23220 20028 11562 90
1842 90 -12239 -21059 -23759 -21343 -13603 -3331 9020 18199 24334 24355 18882 9547 -3239 -14590 -20353
1857 -20353 -22897 -19510 -11487 441 10567 19738 24635 22977 14953 3954 -7048 -16806 -23543 -24334
1871 -24334 -18976 -9736 2693 13432 20946 24240 19376 10492 3 -9999 -19558 -24312 -22224 -16422
1885 -16422 -5919 6039 16351 22550 22367 17833 8687 -1785 -13450 -21277 -24432 -19560 -12019 -1191
1899 -1191 11489 19010 22604 22903 16805 6021 -6427 -17017 -22643 -23526 -18850 -9661 3112 12361
1913 12361 20651 23977 21669 12373 532 -10500 -18723 -24540 -22694 -16425 -6746 4599 14231 22549
1927 22549 23124 18389 9022 -1850 -13455 -20721 -24237 -20825 -13555 -2952 8413 18813 23578 22283
1941 22283 16305 6888 -5230 -16547 -21979 -24468 -20687 -11153 724 12053 19331 22658 20197 13189
1955 13189 2869 -9321 -18356 -23643 -23744 -18634 -8078 3938 13736 22142 22896 19635 10101 -466
1969 -466 -12135 -21415 -23882 -21033 -14937 -3969 6486 17455 23595 22858 16970 7590 -3456 -14463
1983 -14463 -20604 -24081 -19963 -10917 -205 10295 19064 24782 21485 14403 4186 -7849 -17695 -23017
1997 -23017 -23112 -17748 -8591 1978 14652 21759 22665 20675 12166 388 -11540 -19211 -24682 -23278
2011 -23278 -16793 -5921 5622 15367 23253 23606 18717 8431 -3115 -13030 -21118 -23692 -20791 -12921
2025 -12921 -1742 10141 20662 24260 21397 16489 6315 -6054 -16479 -23856 -23660 -19565 -8874
2038 -8874 1476 13787 21088 24635 21487 13310 2406 -9135 -18839 -23359 -22207 -16093 -6301 6335
2052 6335 16464 22874 24220 19655 11040 -922 -13053 -20432 -25038 -21316 -13760 -2293 9266 19632
2066 19632 24926 23930 17644 7905 -4386 -15867 -22076 -24542 -20339 -10701 557 12281 21356 25045
2080 25045 22453 15412 4622 -7242 -17557 -24746 -23670 -16363 -6788 5058 15937 23714 24861
2093 24861 20635 12543 922 -10334 -20485 -23733 -22469 -14847 -4140 8463 18615 24839 24905 19196
2107 19196 9765 -2682 -13093 -22220 -24364 -21073 -13598 -367 11156 20688 25649 23586 16685 5527
2121 5527 -6486 -16805 -23453 -24210 -19198 -7835 3117 14609 23920 25332 23378 14472 2418 -9954
2135 -9954 -19891 -23901 -22121 -15939 -5270 6610 18025 24000 25546 20389 10460 -1756 -13140 -21294
2149 -21294 -24301 -21869 -14430 -2737 9317 19880 24280 24577 18218 7219 -5273 -17073 -23841
2162 -23841 -25019 -21272 -11009 1024 13146 21667 24930 22132 14978 3681 -8656 -18865 -24883
2175 -24883 -24688 -17542 -7777 4174 15178 23808 24799 21211 12459 879 -12444 -22069 -25335 -22833
2189 -22833 -15654 -3415 7601 18330 25369 25673 19061 8266 -4860 -17071 -23117 -25088 -21481
2202 -21481 -14567 -1825 11722 20534 25507 23821 15252 4544 -8337 -19166 -24618 -26621 -21707
2215 -21707 -10874 2444 14986 22918 24638 20732 13662 854 -10319 -20144 -26202 -26139 -17533 -7243
2229 -7243 6775 17501 23407 25410 19163 10194 -1488 -14324 -24437 -27902 -24400 -15688 -3136
2242 -3136 8969 17830 23949 24453 18897 7018 -6532 -18132 -26509 -26470 -21148 -11817 -738 11838
2256 11838 20672 25256 24440 15799 3385 -9843 -20848 -25721 -24816 -18979 -8919 2613 15302 23824
2270 23824 26677 22403 11893 -1255 -11977 -21419 -25596 -24510 -17744 -6036 7250 19215 25025
2283 25025 24947 18591 9069 -2978 -14850 -23129 -26953 -23554 -14936 -792 12961 20882 24654 23487
2297 23487 17967 7053 -6338 -17620 -25935 -28535 -21582 -9578 3188 14019 21533 25460 23512
2310 23512 16456 4165 -10615 -21931 -26963 -24739 -16388 -5785 4802 15412 24687 27281 23601
2323 23601 11451 -1916 -14995 -23200 -25789 -22497 -14564 -5019 6466 19329 26467 27080 19358 6955
2337 6955 -6037 -16885 -21957 -24618 -22391 -14490 -1352 13411 23502 27788 23618 14444 3309
2350 3309 -6676 -17012 -23924 -27091 -21650 -9637 5359 17598 24382 26403 22048 13991 2363 -9494
2364 -9494 -21154 -27936 -26369 -16740 -4242 8517 19465 23076 25190 21356 13001 -367 -15517
2377 -15517 -24938 -27871 -22389 -12868 -985 8996 18061 24855 26380 21705 8457 -7600 -20706 -24678
2391 -24678 -24911 -20109 -12024 -835 12535 22472 28419 26073 15340 1617 -10876 -19038 -23632 -23695
2405 -23695 -20470 -11147 3565 17790 26939 28719 22086 10001 -771 -10762 -20121 -26081 -25858 -19539
2419 -19539 -5921 10076 21976 25688 24018 17272 10962 -911 -13253 -25153 -29573 -26005 -14222
2432 -14222 826 13868 20447 23414 23187 18742 9817 -5901 -18950 -28159 -28077 -19512 -8502 3601
2446 3601 12968 19559 26543 26176 18490 3389 -12867 -24898 -26593 -23379 -16511 -7440 1837 15002
2460 15002 25021 29698 24149 10752 -4706 -15755 -22693 -24288 -22439 -18236 -8223 7732 21512
2473 21512 29651 27705 17098 5138 -5428 -14427 -21461 -26222 -25875 -17317 -940 13582 24763
2486 24763 27263 22089 14210 5725 -4373 -16905 -27333 -29820 -23832 -9086 5754 16560 21080
2499 21080 22484 21330 15846 5088 -9272 -22837 -30004 -26841 -15561 -3562 6562 15350 21481
2512 21481 25554 24406 15547 -719 -17230 -27028 -26623 -19882 -13147 -4596 5599 18029 27866 29553
2526 29553 21821 5736 -8856 -19106 -22987 -22537 -20702 -14985 -3200 10961 25036 30395 25085
2539 25085 12746 1627 -8194 -16823 -22386 -26093 -24105 -12846 3140 18011 26816 26804 18440 10698
2553 10698 2206 -7489 -18426 -28439 -30823 -20481 -4738 11471 20268 23333 22428 19147 13865 2938
2567 2938 -14104 -27395 -32101 -25556 -11382 1206 10695 16540 23176 25982 22542 10845 -6259
2580 -6259 -20987 -27746 -25791 -17810 -9258 -2016 8928 20727 28703 30061 20003 2134 -12967
2593 -12967 -21803 -23467 -22028 -19533 -12340 -526 14372 28634 30601 23989 10440 -2541 -12272
2606 -12272 -17779 -23154 -26693 -21568 -9475 8659 22941 28854 24308 16344 7782 -805 -10065 -20558
2620 -20558 -29596 -28398 -17726 -1 16189 23293 23236 21141 18684 10971 -1190 -16402 -28640 -30924
2634 -30924 -22423 -8180 4974 12742 17691 23573 25981 20774 8105 -10782 -25472 -28882 -24412
2647 -24412 -14668 -6418 1933 11495 22527 29623 27112 15702 -1975 -16838 -24116 -23104 -19446 -16319
2661 -16319 -9918 2642 18189 30452 30582 20727 5398 -6975 -13989 -18236 -23396 -25410 -20449 -5065
2675 -5065 12003 26842 29017 22164 13533 5255 -2055 -12232 -22754 -29530 -27256 -14102 4537
2688 4537 18056 23214 22064 18841 16056 8750 -4981 -20598 -31059 -30553 -19634 -3491 8492
2701 8492 14047 18818 23012 23600 18041 3940 -15372 -28262 -29362 -21449 -11732 -3871 3128 13751
2715 13751 24037 29756 26109 11398 -7057 -20289 -24630 -22669 -18004 -14349 -7602 6372 21557
2728 21557 31653 29447 18062 237 -11431 -15589 -20010 -22627 -23490 -16747 -1968 16133 28826
2741 28826 28981 20352 8974 1693 -4455 -14058 -24675 -30552 -25283 -9195 9064 20027 23572 20730
2755 20730 17341 13223 6171 -7450 -23433 -32131 -28660 -15082 -55 11228 16707 19328 21781
2768 21781 24165 16330 -320 -18850 -28980 -28161 -19584 -8976 -1216 6767 15631 24442 30807 23409
2782 23409 6193 -11343 -22593 -24358 -20650 -16638 -11492 -4501 8521 24457 32782 27954 13694
2795 13694 -2266 -12283 -16359 -19162 -20920 -21957 -13441 3147 20493 30395 28814 17830 7531
2808 7531 -1290 -7716 -15014 -25025 -29305 -21233 -4500 13190 24508 24170 19405 16302 11793 3256
2822 3256 -10495 -24850 -31478 -26373 -11103 5071 14298 16910 20286 22393 21831 12629 -4901 -20981
2836 -20981 -31646 -27093 -15634 -5183 2283 7715 17015 26806 29343 20145 3086 -15165 -23958
2849 -23958 -23373 -18789 -14273 -10707 -1348 13095 26834 33097 25139 9921 -6332 -14215 -18353 -19050
2863 -19050 -22332 -20782 -10438 6929 23534 30908 26480 13656 4230 -3491 -8515 -17086 -26054 -28251
2877 -28251 -18876 -169 17251 25186 24145 18182 12776 8398 996 -13148 -27428 -32643 -23576 -6302
2891 -6302 7659 16715 18217 19845 21484 20147 8613 -8321 -24488 -30576 -25236 -13302 -2529
2904 -2529 4551 10257 18348 27208 28288 16029 -1530 -17676 -24285 -22417 -16418 -12029 -7622 1075
2918 1075 15589 28553 31575 22317 5291 -9638 -16194 -18347 -18965 -20920 -17975 -7807 10089 25669
2932 25669 29581 23657 11722 942 -4947 -11073 -19166 -26224 -26987 -14318 3909 20359 25022 22850
2946 22850 16877 12164 7274 -2967 -16560 -28253 -30089 -19485 -3155 10352 17269 18102 19493
2959 19493 20837 17415 5066 -12762 -26947 -30261 -22314 -10013 78 5688 11639 19735 27575
2972 27575 25636 12576 -5420 -21382 -25237 -22014 -15216 -10978 -5837 4709 18872 29808 29744 18437
2986 18437 979 -10916 -17281 -18851 -18769 -20336 -16285 -3806 13991 28131 30387 21587 8369 -1203
3000 -1203 -5864 -11690 -20782 -26931 -24263 -11462 8138 22478 26450 21096 16162 10059 4948 -5405
3014 -5405 -18925 -29313 -27911 -16269 934 13316 18010 18571 18920 19852 15191 2400 -15351 -28663
3028 -28663 -29023 -19563 -7047 2517 7890 14079 20721 26311 22310 9216 -9627 -22859 -25994 -20155
3042 -20155 -13688 -8253 -3046 7007 20636 30437 27655 14258 -3144 -13978 -18262 -18506 -19231 -18960
3056 -18960 -12624 -513 16457 28262 27777 19110 5336 -4343 -9233 -13985 -21841 -26140 -20400 -7298
3070 -7298 10904 23282 25439 19612 13185 8525 2288 -8409 -21254 -30150 -27018 -12599 3579
3083 3579 14460 18389 18783 18508 18389 12835 -2467 -18696 -28901 -27543 -17327 -4458 4786 9970
3097 9970 15397 23198 25314 20179 4942 -12924 -25274 -25533 -19697 -12932 -7846 -815 10048 22203
3111 22203 29141 25159 10443 -5186 -16218 -19318 -18987 -18390 -17123 -10692 3093 19491 29408 27296
3125 27296 14698 3326 -5026 -10481 -15797 -23412 -25286 -18382 -2433 14485 24919 25521 17782 10735
3139 10735 6167 -750 -11354 -23029 -29271 -23037 -9255 6710 16850 18703 17891 18814 15990 8023
3153 8023 -6531 -21169 -29023 -25693 -13794 -2466 6407 10203 16943 22212 24020 15796 406 -16050
3167 -16050 -25168 -24174 -17262 -10746 -4915 2755 12575 23887 28288 21369 6589 -7733 -16844 -19311
3181 -19311 -19054 -17448 -14939 -6217 7789 21554 29315 24803 12309 381 -7525 -12309 -17130 -22633
3195 -22633 -22654 -14617 1269 16826 24879 22996 16000 9584 3460 -4418 -14163 -24897 -28196 -19901
3209 -19901 -5455 9108 17574 19619 19197 16549 13792 4574 -8367 -22742 -28576 -22753 -10558 589
3223 589 7802 13932 18177 22913 22254 12171 -3286 -18002 -24340 -23103 -15110 -8306 -2004 5334 15404
3238 15404 24206 26449 17996 3258 -10614 -18015 -19289 -18592 -15639 -12533 -3639 10621 23048 27376
3252 27376 21988 9794 -1120 -8647 -13139 -18860 -21600 -20471 -10533 4284 18683 25728 21777 14662
3266 14662 7089 772 -6150 -15943 -24724 -25861 -16244 -2166 10946 19802 20345 17711 15964 11189
3280 11189 903 -12082 -23425 -26914 -19827 -8204 2238 10473 15009 18752 22452 19754 8996
3293 8996 -7567 -18324 -24269 -21437 -13891 -6837 -190 8526 17921 24753 24421 15282 -44 -11283
3307 -11283 -17955 -19071 -17491 -15903 -10413 1143 14217 23246 26007 19389 8129 -4003 -10197 -14332
3321 -14332 -18112 -21108 -16908 -5667 8231 19874 24160 20419 13249 5830 -420 -9082 -18230 -24164
3335 -24164 -23145 -13877 2391 13661 19395 18878 17215 14803 8105 -2251 -15171 -23673 -25257 -17183
3349 -17183 -4956 4457 12350 16911 19244 20931 15930 4862 -9330 -19646 -23398 -19465 -12031 -4617
3363 -4617 2994 10612 19256 23768 21496 10898 -2439 -13630 -19283 -19562 -16566 -13467 -6870 3039
3377 3039 15275 24452 23777 16075 4578 -5010 -11844 -17069 -18774 -19681 -13847 -2731 10286 20295
3391 20295 23041 18638 12094 2707 -4047 -11645 -18967 -22922 -20224 -9109 3085 14501 18775 18684
3405 18684 16733 12036 5105 -4723 -17058 -23623 -23352 -14073 -3318 6343 12247 17025 19493 18522 13333
3420 13333 633 -12440 -20951 -22756 -17266 -10982 -2107 4573 12385 19203 22339 18248 6982 -5361
3434 -5361 -14995 -19202 -18868 -15957 -10730 -4542 6460 16758 22891 21704 12322 1863 -7679 -13116
3448 -13116 -17416 -19106 -17710 -10505 814 12294 20019 21376 15821 9387 2239 -6719 -13813 -19965
3462 -19965 -21497 -17219 -5343 5266 15676 20053 17809 14567 10110 2114 -8332 -18522 -22349
3475 -22349 -20112 -12451 -1395 7919 13104 16151 18251 16602 9684 -2567 -14052 -20515 -20897 -15841
3489 -15841 -7767 -10 6469 14020 19337 20266 14423 3390 -6611 -15724 -19140 -17573 -14046 -8424
3503 -8424 -593 8743 18536 22626 19019 9674 704 -8175 -14830 -17395 -17664 -15226 -7511 3906 13549
3518 13549 19558 20124 14416 7218 -420 -7438 -15062 -19798 -19281 -13471 -3210 8103 15523 18246 16893
3533 16893 12806 6477 -2090 -10309 -18473 -21436 -16974 -8648 1698 8837 16015 18114 17614 14287 5103
3548 5103 -5202 -14086 -20668 -19560 -13250 -5129 1766 9297 15619 19009 17574 11381 1324 -8997
3562 -8997 -16509 -18651 -16449 -11998 -5899 2878 11126 18477 19937 15818 7669 -2091 -10285 -14603 -16470
3577 -16470 -16048 -12411 -4323 5585 14282 19553 18388 11919 5040 -3252 -10736 -15528 -18544 -17644 -10133
3592 -10133 -81 9718 15731 17684 15804 11314 5296 -3789 -11513 -18183 -19078 -15466 -5668 2479 10218
3607 10218 14944 17230 15938 11471 2021 -7689 -15411 -18751 -16841 -10650 -4344 3788 9511 15302 18231
3622 18231 15666 9186 -767 -10672 -16236 -17494 -14268 -10012 -2941 5106 11808 17214 18085 13416 4849
3637 4849 -3693 -11696 -14810 -16074 -15417 -9670 -1486 7821 14419 17387 16065 9926 3003 -4870 -11107
3652 -11107 -15812 -17381 -14344 -7499 1737 10146 15353 16911 14307 8728 1959 -6302 -13645 -17892 -17113
3667 -17113 -12023 -3307 3800 11500 14862 16247 13874 8855 -54 -8368 -15152 -16691 -15199 -9401 -2023
3682 -2023 4499 11511 16119 16384 12614 5965 -4208 -10665 -16919 -16446 -12979 -8430 -965 6065 12851
3697 12851 17763 15755 10127 1608 -5472 -11517 -15490 -16008 -13084 -6881 1472 9045 15283 16521 12707
3712 12707 7611 512 -6431 -11699 -15814 -15798 -10621 -4001 3913 10084 15508 15465 11898 6784 -104 -8309
3728 -8309 -13453 -16450 -14511 -9998 -1906 5456 11801 14620 14819 11199 5360 -2644 -9476 -14929 -16434
3743 -16434 -12275 -7164 -43 6633 12191 15392 14324 11206 2403 -4605 -10962 -14548 -14711 -10490 -6044
3758 -6044 1284 8235 12851 15593 13895 7724 25 -6554 -11297 -14176 -13913 -10200 -4941 2906 10110
3773 10110 13915 15038 12735 6054 -1116 -7568 -12252 -14321 -13586 -9439 -1744 5304 11550 14412 14294
3788 14294 10559 4111 -2184 -8579 -13311 -14535 -12626 -6469 -19 7517 12891 13497 13064 8556 3517
3803 3517 -4712 -10769 -13971 -14429 -11080 -4743 1722 8125 12688 13708 12895 7825 1481 -6405 -10877
3818 -10877 -13853 -12620 -9745 -3329 3591 8847 12764 13324 11360 5032 -653 -7257 -11764 -13943 -11644
3833 -11644 -7682 -2605 4764 10303 13990 13003 9404 3186 -2560 -7894 -12256 -13167 -10574 -6294 -566
3848 -566 6800 11007 12937 12979 8056 1530 -4336 -8897 -11556 -12426 -10113 -4342 2464 7545 11931 11983
3864 11983 10897 6767 1448 -6071 -10718 -13256 -11817 -8999 -2604 3204 8577 13065 12578 9929 5675
3879 5675 -1713 -6532 -10780 -12596 -10769 -7308 -1767 5170 9466 13069 12119 8673 3489 -3081 -7765
3894 -7765 -12066 -11282 -9506 -5478 824 5742 10542 12631 10686 7160 1828 -4517 -8888 -12531 -12226
3909 -12226 -8127 -4078 1335 7711 10301 11949 10709 5506 -160 -5407 -9652 -11496 -10466 -7720 -2776
3924 -2776 4040 8522 11607 11657 8634 3905 -1644 -6781 -11401 -11230 -8573 -5601 -999 4402 8487 11306
3940 11306 11250 7541 2680 -2004 -7139 -10047 -10854 -9163 -4615 -60 5948 9499 10282 10401 6200 1199
3956 1199 -4108 -8936 -10830 -11073 -7883 -3453 1551 6863 10328 10647 8694 4873 -144 -4777 -8743
3971 -8743 -10596 -10244 -6520 -1993 2706 7154 10533 11181 7959 3476 -927 -5871 -10093 -11010 -8874 -5622
3987 -5622 351 4680 8656 10953 10416 6876 2298 -2283 -6914 -10175 -10523 -7689 -3750 1547 4658
4002 4658 9331 9964 8340 5629 22 -5051 -7358 -9908 -10491 -7718 -2602 1551 6911 8942 10351
4017 10351 7781 4165 -380 -5737 -8522 -9697 -9293 -5705 -1479 3875 7781 8709 9960 6251 2714
4032 2714 -1623 -6222 -9069 -10204 -8552 -4242 472 4311 7868 9783 9210 5605 1357 -3287 -6498
4047 -6498 -8303 -8744 -6551 -3709 1483 5982 7911 9173 7812 4882 526 -4355 -7012 -9244 -8145
4062 -8145 -6502 -1529 3081 5952 8493 9016 7855 3785 -1241 -4769 -8500 -9275 -8200 -4626 31
4077 31 3534 7311 8835 9194 5290 2505 -2115 -6251 -7903 -9670 -7437 -2882 876 5056 7580 8796
4093 8796 7753 4917 665 -3557 -6842 -8296 -8051 -5560 -2268 2189 6166 8200 8474 6723 4331
4108 4331 -610 -4297 -7026 -9221 -9002 -5496 -1812 2642 6354 8345 7891 6061 3358 -1904 -5413
4123 -5413 -7490 -7913 -6895 -4490 -5 4502 6163 8117 7819 5353 1657 -2768 -5559 -8176 -8290 -5243
4139 -5243 -2702 727 4911 8802 7345 6565 4592 -467 -4088 -6932 -7897 -7217 -5169 -2004 1476 5922
4155 5922 8351 7457 5895 2988 -1211 -3788 -7066 -7499 -7597 -3872 -1348 2943 5842 7137 8007 5482
4171 5482 1869 -1733 -4894 -7648 -7767 -6165 -3393 466 4548 7820 6893 6263 3565 299 -3093 -6582
4187 -6582 -8355 -7695 -4535 -909 1284 4375 6793 7642 6166 3575 -380 -4097 -5721 -7600 -6805 -3860
4203 -3860 -1464 2221 5410 7118 6834 6385 2595 -1501 -4883 -5914 -8082 -6386 -3338 -303 2389
4218 2389 5827 7702 6962 3713 1179 -2523 -5957 -6694 -6052 -5868 -2595 679 4942 6655 7608 6042
4234 6042 3319 -299 -2708 -5813 -6721 -6691 -4434 -511 2477 5756 6737 6238 5548 2376 -926 -3512
4250 -3512 -7159 -7273 -6139 -3481 -133 3379 6031 6779 6596 3367 1305 -1325 -4948 -6442 -7202 -5193
4266 -5193 -1450 1716 3484 6294 6717 5764 4278 789 -2667 -5235 -6736 -5815 -4278 -1418 1605 4214
4282 4214 6842 6416 5556 2231 -939 -4304 -6788 -6692 -5511 -3936 -1487 1955 5910 6289 5775 4280
4298 4280 1106 -2357 -4187 -5245 -7100 -4641 -3012 242 4584 6736 6995 5692 3686 1479 -2028
4313 -2028 -4283 -6097 -6269 -4779 -2500 919 4002 6233 6236 4854 3570 522 -3351 -5085 -7505 -6286
4329 -6286 -3962 -548 2451 4297 6437 6844 5367 2193 -630 -4464 -5522 -6498 -4231 -2522 563
4344 563 3040 5892 6873 6795 3969 855 -2216 -5193 -5621 -5494 -4485 -2444 675 4058 5758 6580 5816
4361 5816 2901 175 -3481 -4956 -5482 -5482 -3682 -1323 1662 5100 7102 6068 4733 2226 -510 -3717
4377 -3717 -5303 -6383 -5409 -4312 -411 3377 5639 6393 5309 3695 1461 -1226 -4261 -7122 -7035 -5459
4393 -5459 -3219 880 4170 5187 5912 4430 3287 259 -3528 -5653 -6786 -6589 -4316 -1265 2499
4408 2499 3782 4870 6551 5204 3055 -1101 -3773 -5769 -6085 -5785 -3286 -697 1607 4514 6345
4423 6345 5762 5184 1094 -1724 -3854 -6943 -6289 -4963 -2724 49 2360 4873 6251 4614 3116 571
4439 571 -2465 -4526 -6684 -6013 -3987 -2501 1955 4439 6318 5635 3891 3051 -335 -3246 -5821 -6346
4455 -6346 -6168 -4197 -1384 2247 4993 5465 5232 4310 1879 -1832 -3859 -6606 -6031 -5818 -3498 74
4471 74 2872 3928 5597 5475 3839 534 -2072 -5546 -6818 -5909 -4339 -1622 198 2519 4972 6229
4487 6229 5079 3846 221 -3393 -4752 -5785 -4650 -3370 -1413 2342 5105 6661 6263 5149 2635
4502 2635 -288 -3223 -5136 -6150 -5959 -3664 -576 1763 5547 6128 5831 4118 818 -1882 -4399 -6061
4518 -6061 -6174 -5500 -3939 277 2942 5629 5710 5866 4505 826 -2065 -5149 -7164 -5989 -4073 -1370
4534 -1370 1242 3604 6061 5743 4073 2087 -1381 -3138 -5311 -5812 -4257 -3292 50 1814 5022 6144
4550 6144 5882 4767 2757 -1228 -3617 -5884 -5879 -4957 -2798 -151 3018 4857 6076 5094 4340 1245 -2438
4567 -2438 -5155 -6408 -6075 -4837 -2947 335 4001 6439 6916 5296 3566 143 -3182 -4521 -6127
4582 -6127 -5884 -4623 -1441 2111 5011 6046 5986 4357 2460 -1351 -4505 -5553 -6489 -6001 -3138 -520
4598 -520 2561 5078 5609 6133 3898 2053 -1653 -5022 -6288 -6410 -5280 -2121 508 2771 5194 5827
4614 5827 5365 3335 611 -2259 -5206 -6715 -5647 -4669 -2283 2018 4291 6584 6138 6253 2402 -224
4630 -224 -3487 -5027 -6279 -5818 -3721 -1370 2705 4730 6004 6516 4978 2054 -1957 -4606 -5853 -5342
4646 -5342 -5722 -2745 232 1920 5332 6418 6040 3935 1013 -2083 -3921 -6069 -6573 -4747 -2091 211
4662 211 4956 5895 5631 6452 4106 -113 -3253 -4568 -6033 -6686 -4156 -992 2368 4093 5601 6212
4678 6212 4789 3268 -885 -3699 -6327 -6769 -5478 -3354 -192 2063 4960 6495 5232 3417 2050
4693 2050 -2017 -4270 -6075 -6192 -5983 -3076 -212 2996 5059 5614 5872 3421 562 -2034 -5077 -6147
4709 -6147 -6437 -4324 -2135 1316 4817 6142 6870 5162 3205 989 -2671 -5189 -5705 -6480 -3980 -1200
4725 -1200 1459 4716 5919 6420 4551 1453 -1146 -4402 -5905 -6928 -5549 -3385 -569 2911 4965
4740 4965 6585 6016 3901 1773 -2245 -4792 -6024 -5751 -5325 -2698 287 3138 5752 7156 5905 3463
4756 3463 1226 -2479 -5035 -6524 -6268 -4846 -2288 1307 3809 6723 6381 5604 3497 -314 -3638 -5592
4772 -5592 -6695 -5329 -4058 -516 1819 4722 6199 6387 4587 1904 -1418 -3972 -5702 -5937 -6275 -2839
4788 -2839 145 2683 5050 6132 5690 3753 1103 -1622 -4886 -6466 -5785 -5225 -2450 1880 3960 5523
4804 5523 6743 6121 2372 487 -3049 -4492 -5618 -6491 -3724 -1681 1875 4330 5963 6379 4702 3130
4820 3130 -930 -2973 -4921 -6873 -6478 -3834 -319 3215 5060 6028 5513 4882 2528 -820 -4515 -6365
4836 -6365 -6428 -6418 -2983 -219 3921 6209 6128 5208 3365 342 -2299 -4458 -6497 -7348 -5625 -1144 1310
4853 1310 3490 5823 6942 5521 3462 708 -3388 -5071 -5913 -6135 -3274 -966 2489 3789 6293
4868 6293 7052 5429 2910 -332 -3511 -5134 -6836 -6005 -3439 -297 2986 5664 7286 6672 4589 1606
4884 1606 -2263 -4270 -6331 -6098 -4638 -2884 407 1370 5382 6060 5736 3673 1501 -2242 -4939 -6764
4900 -6764 -5008 -5723 -1447 700 4633 6323 7247 5120 3226 190 -2861 -4924 -5971 -5427 -3992 -1351
4916 -1351 1444 4212 6609 5591 4130 2179 -1979 -3648 -6039 -6135 -4835 -3405 -411 2133 4715
4931 4715 6893 5865 4902 1679 -1093 -4614 -5456 -6354 -5079 -2311 184 3099 5381 6517 5484 4157
4947 4157 825 -3180 -4570 -5876 -6966 -3982 -2215 385 3365 6964 5598 5169 2193 -34 -2231
4962 -2231 -4457 -6121 -5826 -4213 -825 2299 3061 6399 5063 4467 2360 -1310 -3393 -6288 -6127 -5035
4978 -5035 -3261 60 2624 4459 6188 5536 4405 1419 -1794 -5073 -6229 -6447 -4806 -2922 454
4993 454 3164 5544 5809 5211 3749 361 -2937 -4964 -6435 -5123 -3880 -1714 244 4169 5555 5866
5009 5866 5407 1781 -295 -2887 -5059 -6002 -5439 -3313 -308 2052 5170 5568 6582 3807 1808 -693
5025 -693 -3259 -6111 -5606 -5111 -3260 -37 2789 4520 5972 5834 3266 454 -1761 -4965 -5959 -5062
5041 -5062 -4648 -1849 692 2854 5025 5756 5197 3456 1191 -2946 -4899 -5587 -5351 -4017 -1371 1097
5057 1097 4214 6547 6014 4114 3563 -803 -2917 -5229 -5882 -5506 -3980 -1093 2261 3474 5137 5767
5073 5767 3160 2434 -876 -4213 -5327 -6044 -4713 -2793 -3 3483 4323 6069 5395 4342 645 -1603
5089 -1603 -3682 -5112 -5280 -4791 -1731 821 3123 4940 5732 4798 2986 128 -1973 -3792 -4616 -5481
5105 -5481 -3822 -1648 1474 3543 5975 4930 4751 1881 498 -2572 -5269 -4949 -5211 -2460 -568 2785
5121 2785 3961 5971 5166 3445 1880 -953 -3528 -5193 -6556 -5059 -3202 1382 2581 3681 4718
5136 4718 4705 3107 474 -2230 -4069 -5089 -5005 -3918 -2240 610 2474 5505 5001 4199 2834 -227
5152 -227 -2700 -4057 -5506 -3917 -3416 -949 1807 4212 5276 5446 4291 2693 -1005 -3346 -3612 -4661
5168 -4661 -4271 -4111 -642 2418 3720 6299 4771 3244 1606 -126 -3102 -4820 -5178 -4759 -2286 1124
5184 1124 3346 4988 4672 4163 2506 406 -1726 -4280 -5915 -4465 -2738 -1526 1850 3529 4130 4678
5200 4678 4794 2546 515 -2072 -4732 -5375 -4666 -4380 -1158 1001 2803 5063 5624 4879 1312 -249
5216 -249 -3229 -4335 -4646 -2992 -2337 -331 2196 3372 5414 5062 3364 1187 -1863 -3059 -4146 -4233
5232 -4233 -3646 -3045 568 3159 5580 4750 3629 2023 764 -1561 -3927 -3911 -5378 -3324 -1047 2390
5248 2390 3569 4395 4123 3425 1791 -104 -3154 -5056 -5070 -4848 -2974 -648 2219 2969 3664 4060 3813
5265 3813 1687 -536 -3271 -4704 -5341 -2748 -394 -44 910 3486 4983 4294 3120 320 -1803 -3494
5281 -3494 -4838 -4948 -3317 -1672 -735 2479 4287 5080 3875 1569 -655 -2372 -2720 -4032 -3958 -3469 -1530
5298 -1530 522 3888 4294 4641 3527 1530 81 -2043 -3157 -4651 -4814 -2612 -159 2709 4310 4804
5314 4804 3975 3485 1265 -92 -2989 -5262 -5264 -3504 -1078 730 2841 3483 3296 3295 3604 1248 -1799 -4241
5332 -4241 -4741 -3759 -2826 -943 1122 1079 3579 4381 3069 2618 -653 -2737 -3646 -3888 -3933 -2820 -926 285
5350 285 2271 4621 4018 3809 449 -2044 -2533 -3295 -3582 -3375 -3268 -201 2320 3578 4894 2439 1125
5367 1125 10 -557 -1396 -3532 -4443 -3673 -2078 289 2207 4032 3201 3226 1798 162 -499 -2790 -5143
5384 -5143 -5398 -3443 -132 2246 2685 3942 3023 3101 2401 728 -2617 -3690 -4712 -3135 -1285 -130
5400 -130 1263 3005 3101 4066 3341 1582 -1107 -4104 -4411 -2694 -1805 -1733 -483 314 3339 4034 4158 2216
5418 2216 -444 -2232 -2941 -2033 -2673 -2614 -2701 -632 2960 4613 5521 2413 -28 -214 -847 -2687 -3126 -4719
5436 -4719 -3883 -720 1947 3432 4125 3150 1199 717 -420 -1262 -2720 -4544 -5651 -2743 1330 2802
5452 2802 2946 2441 2939 2821 1912 -134 -2308 -4756 -4251 -2005 441 2090 2545 1133 3959 4327 3827
5469 3827 1132 -2130 -4327 -3856 -2437 -358 -630 -62 966 2891 4649 4313 2170 -1169 -3006 -3159
5485 -3159 -2162 -2139 -2149 -1696 544 3736 4877 4345 2063 -60 -1274 -1940 -1512 -3089 -3313 -2687 -417 2536
5503 2536 4988 3872 1248 912 -215 -474 -1031 -2831 -5134 -3952 -1665 2360 3692 2809 1963 2167
5519 2167 2783 1942 -816 -3254 -4719 -3774 -1674 1309 2227 1538 1910 2098 4040 2389 407 -3373 -4227
5536 -4227 -3693 -1166 157 459 1325 2136 3474 4556 2937 1043 -1898 -3950 -3508 -2249 -1516 -1724 -1282
5553 -1282 1218 3697 4483 3510 962 -1668 -2366 -1987 -984 -2799 -4426 -2578 867 3731 4920 3565
5569 3565 1123 -537 -357 -864 -1563 -3558 -3885 -2861 -168 2933 4068 2860 2215 1185 1823 466
5585 466 -975 -4298 -4999 -3344 -170 2506 1875 1675 1750 2980 2474 1136 -603 -4639 -5375 -3228 -1058
5602 -1058 518 864 660 1713 2708 4063 2509 -1573 -3447 -3542 -3450 -892 -1041 -1979 -757 1745 4852
5619 4852 5143 3664 -469 -3059 -1850 -1603 -1785 -2961 -2865 -1117 401 3945 4915 3776 -452 -932 -969
5636 -969 -556 -1157 -3888 -4375 -2844 1054 3457 4449 2421 -135 482 824 189 -1147 -4199 -5775 -2660
5653 -2660 617 2616 2174 1940 1475 2583 3173 1309 -1619 -4858 -4858 -3220 -135 1544 1163 1179 2321
5670 2321 4177 4207 1303 -1182 -4579 -3566 -2182 -815 -704 -952 162 1854 4126 4359 2718 -1323
5686 -1323 -3157 -3073 -2166 -1150 -2152 -2889 -1480 2537 4606 4552 2099 -316 -1091 -1344 -695 -1996 -4570
5703 -4570 -4476 -2780 2190 4792 3840 2842 358 30 1066 -520 -2875 -4965 -4231 -1588 2156 2553 2983
5720 2983 1692 1077 1944 1920 637 -3486 -4584 -4478 -1998 964 2400 957 1628 2300 3730 3004 1800
5737 1800 -2326 -4663 -3275 -1652 -619 -1083 -1288 380 2851 4413 4776 1012 -2010 -3173 -3390 -2206
5753 -2206 -421 -1234 -1905 -478 3665 4674 4613 2294 -1688 -1129 -1131 -867 -1809 -3523 -3299 170 3154 4651
5771 4651 4385 1472 -160 508 -440 -576 -2491 -4353 -4376 -575 1792 4152 2673 680 1465 2401 2555
5788 2555 -387 -3105 -4655 -3582 -1516 2757 2499 2027 1530 2088 3216 2812 368 -3402 -5206 -3496
5804 -3496 -781 331 572 -570 717 3405 5214 4256 1430 -2258 -3791 -2478 -962 -1515 -1207 -1924
5820 -1924 700 3890 6577 4126 175 -2145 -2013 -1074 -1519 -2665 -3828 -2936 548 3634 4871 3286
5836 3286 803 442 -391 -405 -1298 -3439 -4764 -3443 372 2707 3434 2407 1170 1146 1015 2440 -1172
5853 -1172 -4726 -5894 -3255 -43 1184 2361 1879 1094 2462 3734 2768 -1311 -3945 -5698 -3543 -1006
5869 -1006 732 822 756 557 3463 5550 3506 -447 -3573 -3963 -1883 -1004 -1182 -1990 -861 1718 3861
5886 3861 5467 3573 -252 -3213 -1914 -2498 -1621 -2978 -2856 -2614 350 4583 5259 2731 1081 -296
$$ [...]
##END NTUPLES=NMR FID
##END=
