##TITLE=1H_AT-22
 CD3OD+Na, 108 sc, 
 5.7.2019
##JCAMPDX= 6.0         $$ Bruker NMR JCAMP-DX V2.0
##DATA TYPE= NMR FID
##DATA CLASS= NTUPLES
##ORIGIN= UXNMR, Bruker Analytische Messtechnik GmbH
##OWNER= root
$$ XWIN-NMR		Version 3.5
$$ Fri Jul  5 15:36:57 2019 Russian Standard Time (UT+4h)  she@DPX200
##.OBSERVE FREQUENCY= 200.13155
##.OBSERVE NUCLEUS= ^1H
##.DELAY= (6, 6)
##.ACQUISITION MODE= SIMULTANEOUS
##.ACQUISITION SCHEME= undefined
##.AVERAGES= 108
##.DIGITISER RES= 18
##SPECTROMETER/DATA SYSTEM= spect
##.PULSE SEQUENCE= zg30
##.SOLVENT NAME= MeOD
##.SHIFT REFERENCE= (INTERNAL, MeOD, 0, 15.7039)
##AUDIT TRAIL= $$ (NUMBER, WHEN, WHO, WHERE, WHAT)
$$ ##TITLE= Audit trail, XWIN-NMR		Version 3.5
$$ ##JCAMPDX= 5.01
$$ ##ORIGIN= Bruker BioSpin GmbH
$$ ##OWNER= she
$$ F:/spectra/data/she/nmr/H-F/1/audita.txt
$$ ##AUDIT TRAIL=  $$ (NUMBER, WHEN, WHO, WHERE, WHAT)
(   1,<2019-07-05 15:36:03.34 +0400>,<she>,<DPX200>,
      <continue with go, POWCHK disabled, PULCHK disabled
       configuration hash MD5:
       00 E9 B6 7A A2 85 ED C7 34 08 36 98 17 FE 4E 26
       data hash MD5: 16K
       04 D7 7D 6A E6 44 3C 49 32 5A 8F 78 74 51 44 18>)
$$ ##END=
$$ 
$$ hash MD5
$$ C1 D6 5E 25 41 4B B6 E5 EC 50 3B F9 CC FF B2 3D
##$RELAX= 
##$RELAX= 
##$RELAX= 
##$RELAX= 
##$RELAX= 
##$RELAX= 
$$ Bruker specific parameters
$$ --------------------------
##$DU= <F:/spectra>
##$EXPNO= 1
##$NAME= <H-F>
##$PROCNO= 1
##$TYPE= <nmr>
##$USER= <she>
##$AMP= (0..31)
100 100 100 100 100 100 100 100 100 100 100 100 100 100 100 100 100 100 
100 100 100 100 100 100 100 100 100 100 100 100 100 100 
##$AQSEQ= 0
##$AQ_mod= 1
##$AUNM= <au_zg>
##$AUTOPOS= <>
##$BF1= 200.13
##$BF2= 200.13
##$BF3= 200.13
##$BF4= 200.13
##$BF5= 200.13
##$BF6= 200.13
##$BF7= 200.13
##$BF8= 200.13
##$BYTORDA= 1
##$CFDGTYP= 0
##$CFRGTYP= 5
##$CHEMSTR= <none>
##$CNST= (0..31)
1 1 145 1 1 1 1 1 1 1 1 1 1 1 1 1 1 1 1 1 1 1 1 1 1 1 1 1 1 1 1 1 
##$CPDPRG= <>
##$CPDPRG1= <>
##$CPDPRG2= <>
##$CPDPRG3= <>
##$CPDPRG4= <mlev>
##$CPDPRG5= <mlev>
##$CPDPRG6= <mlev>
##$CPDPRG7= <mlev>
##$CPDPRG8= <mlev>
##$CPDPRGB= <>
##$CPDPRGT= <>
##$D= (0..31)
0 1.2 0 0 0 0 0 0 0 0 0 0.03 0 0 0 0 0 0 0 0 0 0 0 0 0 0 0 0 0 0 0 0 
##$DATE= 1562326212
##$DBL= (0..7)
120 120 120 120 120 120 120 120 
##$DBP= (0..7)
150 150 150 150 150 150 150 150 
##$DBP07= 0
##$DBPNAM0= <>
##$DBPNAM1= <>
##$DBPNAM2= <>
##$DBPNAM3= <>
##$DBPNAM4= <>
##$DBPNAM5= <>
##$DBPNAM6= <>
##$DBPNAM7= <>
##$DBPOAL= (0..7)
0.5 0.5 0.5 0.5 0.5 0.5 0.5 0.5 
##$DBPOFFS= (0..7)
0 0 0 0 0 0 0 0 
##$DE= 6
##$DECBNUC= <off>
##$DECIM= 24
##$DECNUC= <off>
##$DECSTAT= 4
##$DIGMOD= 1
##$DIGTYP= 9
##$DL= (0..7)
0 120 120 120 120 120 120 120 
##$DP= (0..7)
150 150 150 150 150 150 150 150 
##$DP07= 0
##$DPNAME0= <>
##$DPNAME1= <>
##$DPNAME2= <>
##$DPNAME3= <>
##$DPNAME4= <>
##$DPNAME5= <>
##$DPNAME6= <>
##$DPNAME7= <>
##$DPOAL= (0..7)
0.5 0.5 0.5 0.5 0.5 0.5 0.5 0.5 
##$DPOFFS= (0..7)
0 0 0 0 0 0 0 0 
##$DQDMODE= 0
##$DR= 18
##$DS= 0
##$DSLIST= <SSSSSSSSSSSSSSS>
##$DSPFIRM= 0
$$ [...]
##$SUBNAM2= <"">
##$SUBNAM3= <"">
##$SUBNAM4= <"">
##$SUBNAM5= <"">
##$SUBNAM6= <"">
##$SUBNAM7= <"">
##$SUBNAM8= <"">
##$SUBNAM9= <"">
##$SW= 24.9336996594482
##$SWIBOX= (0..15)
0 0 2 0 0 0 0 0 0 0 0 0 0 0 0 0 
##$SW_h= 4990.01996007984
##$TD= 16384
##$TD0= 1
##$TE= 0
##$TE2= 300
##$TE3= 300
##$TEG= 300
##$TL= (0..7)
0 120 120 120 120 120 120 120 
##$TP= (0..7)
150 150 150 150 150 150 150 150 
##$TP07= 0
##$TPNAME0= <>
##$TPNAME1= <>
##$TPNAME2= <>
##$TPNAME3= <>
##$TPNAME4= <>
##$TPNAME5= <>
##$TPNAME6= <>
##$TPNAME7= <>
##$TPOAL= (0..7)
0.5 0.5 0.5 0.5 0.5 0.5 0.5 0.5 
##$TPOFFS= (0..7)
0 0 0 0 0 0 0 0 
##$TUNHIN= 0
##$TUNHOUT= 0
##$TUNXOUT= 0
##$USERA1= <user>
##$USERA2= <user>
##$USERA3= <user>
##$USERA4= <user>
##$USERA5= <user>
##$V9= 5
##$VALIST= <valist>
##$VCLIST= <CCCCCCCCCCCCCCC>
##$VD= 0
##$VDLIST= <DDDDDDDDDDDDDDD>
##$VPLIST= <PPPPPPPPPPPPPPP>
##$VTLIST= <TTTTTTTTTTTTTTT>
##$WBST= 1024
##$WBSW= 4
##$XGAIN= (0..3)
0 0 0 0 
##$XL= 0
##$YL= 0
##$YMAX_a= 1938459
##$YMIN_a= -2226141
##$ZGOPTNS= <>
##$ZL1= 120
##$ZL2= 120
##$ZL3= 120
##$ZL4= 120
##$ABSF1= 10
##$ABSF2= 0
##$ABSG= 5
##$ABSL= 3
##$ALPHA= 0
##$AQORDER= 0
##$ASSFAC= 0
##$ASSFACI= 0
##$ASSFACX= 0
##$ASSWID= 0
##$AUNMP= <proc_1d>
##$AZFE= 0.1
##$AZFW= 0.1
##$BCFW= 1
##$BC_mod= 2
##$BYTORDP= 1
##$COROFFS= 0
##$CY= 11.3945322036743
##$DATMOD= 1
##$DC= 2
##$DFILT= <>
##$DTYPP= 0
##$F1P= 18.9103706918063
##$F2P= -1.10871071338519
##$FCOR= 0.5
##$FTSIZE= 0
##$FT_mod= 4
##$GAMMA= 1
##$GB= 0.15
##$INTBC= 1
##$INTSCL= 1
##$ISEN= 128
##$LB= 0.24
##$LEV0= 0
##$LPBIN= 0
##$MAXI= 10000
##$MC2= 0
##$MEAN= 0
##$ME_mod= 0
##$MI= 1.114404
##$NCOEF= 0
##$NC_proc= 0
##$NLEV= 6
##$NOISF1= 3.799351
##$NOISF2= 2.8
##$NSP= 1
##$NTH_PI= 0
##$NZP= 0
##$OFFSET= 15.70392
##$PC= 1
##$PHC0= -8864.19
##$PHC1= 20.60096
##$PH_mod= 1
##$PKNL= yes
##$PPARMOD= 0
##$PSCAL= 0
##$PSIGN= 0
##$REVERSE= no
##$SF= 200.130013532006
##$SI= 16384
##$SIGF1= 3
##$SIGF2= 2
##$SINO= 400
##$SIOLD= 16384
##$SREGLST= <1H.CDCl3>
##$SSB= 0
##$STSI= 0
##$STSR= 0
##$SW_p= 3612.71676300578
##$SYMM= 0
##$S_DEV= 0
##$TDeff= 0
##$TDoff= 0
##$TI= <>
##$TILT= no
##$TM1= 0
##$TM2= 0
##$TOPLEV= 0
##$USERP1= <user>
##$USERP2= <user>
##$USERP3= <user>
##$USERP4= <user>
##$USERP5= <user>
##$WDW= 1
##$XDIM= 8192
##$YMAX_p= 0
##$YMIN_p= 0
$$ End of Bruker specific parameters
$$ ---------------------------------
##NTUPLES= NMR FID
##VAR_NAME=  TIME,          FID/REAL,        FID/IMAG
##SYMBOL=    X,             R,               I
##VAR_TYPE=  INDEPENDENT,   DEPENDENT,       DEPENDENT
##VAR_FORM=  AFFN,          ASDF,            ASDF
##VAR_DIM=   8192,          8192,            8192
##UNITS=     SECONDS,       ARBITRARY UNITS, ARBITRARY UNITS
##FACTOR=    0.0002004,     1,               1
##FIRST=     0,             0,               0
##LAST=      1.6414764,     0,               0
##MIN=       0,             -2226141,        0
##MAX=       1.6414764,     1938459,         0
$$ Real data points
##PAGE= N=1
##DATA TABLE= (X++(R..R)), XYDATA
0 0 0 0 0 0 0 0 0 -1 108 -108 108 -109 216 -216 224 -324 417 -434 541 -649 758 -866 1008 -1183 1342
25 1342 -1528 1753 -1998 2270 -2569 2884 -3248 3632 -4072 4535 -5065 5628 -6250 6937 -7684
40 -7684 8520 -9425 10444 -11559 12814 -14213 15780 -17594 19646 -22050 24866 -28271
52 -28271 32424 -37674 44528 -53916 67634 -89679 131133 -237188 1138672 1938459 612149
63 612149 475721 134632 -159792 -807141 -1095060 -1241702 -908581 -431248 83507 242560
73 242560 465069 885395 1474643 1740789 1686299 1332008 876160 367727 8662 -340895
83 -340895 -802180 -1326086 -1519398 -1294008 -871673 -548663 -268553 85658 552982 999725
93 999725 1329606 1421541 1219150 783217 317305 -75100 -444689 -869463 -1269145 -1504452
103 -1504452 -1467120 -1154263 -701250 -357852 -204086 -18097 421776 930791 1115269 902177
113 902177 582645 369244 193908 -83880 -508546 -1004929 -1353093 -1332307 -1012789 -700813
123 -700813 -536196 -351882 -8502 424273 800624 1003920 939052 661703 426112 356436
133 356436 228487 -179479 -701332 -976543 -912696 -692567 -495191 -380024 -287166 -86138
143 -86138 271637 622436 752621 666143 554581 524365 509744 390507 114498 -267466 -601852
154 -601852 -718338 -593802 -404429 -313227 -269554 -96067 250690 591706 716881 604781
164 604781 439687 384652 423797 391151 166538 -169751 -418030 -455843 -378987 -343951 -367020
175 -367020 -347423 -221640 -4027 237375 392616 377221 262960 233791 334703 405386 288634
186 288634 28944 -201260 -281991 -238502 -200263 -255442 -337291 -279436 -43693 199198 284735
197 284735 226200 133088 84712 116128 185828 183685 45157 -118555 -149571 -52410 13307 -68323
209 -68323 -237401 -322950 -204509 36275 171765 86079 -66939 -51662 133933 264238 188207
220 188207 1033 -99297 -38368 81252 105517 -19273 -183352 -226805 -110749 40630
230 40630 80251 -14109 -124115 -118139 6040 110363 80938 -39914 -83022 43018 216555
241 216555 244868 96478 -70278 -116867 -75947 -66537 -119746 -177156 -184485 -140765 -64633 13205
253 13205 47380 24333 -2645 31939 134964 243834 259691 149817 5356 -31126 39402
264 39402 57507 -71524 -243852 -282667 -167442 -32757 -898 -57137 -95951 -9565 184348
275 184348 340811 326071 176859 50328 39603 78847 49485 -101691 -281174 -322292 -170952
286 -170952 17484 40093 -88286 -151486 -11674 216265 315735 241059 140550 144646 218157
297 218157 228224 99856 -102103 -247921 -270540 -217510 -167748 -154226 -156931 -130927 -38793
308 -38793 106209 230549 254730 186149 132469 156252 191274 127077 -41333 -206916 -268170
319 -268170 -225715 -156729 -131170 -151292 -153053 -80366 51942 164181 196702 168630 144009 171373
331 171373 228422 227891 96074 -119195 -269383 -262755 -185161 -172963 -240661 -259880 -143659 47441
343 47441 174823 169832 98849 78741 147682 220878 196890 78021 -58400 -133086 -142451 -122411
355 -122411 -123713 -169622 -211223 -161894 -10879 135394 164446 95375 59976 127830 232189
366 232189 247778 126286 -39520 -126617 -113258 -89748 -141802 -236514 -263701 -166483 -7248
377 -7248 109538 126747 82743 55795 103175 183824 199388 108726 -13316 -60272 -18873 18247
389 18247 -36915 -154640 -221484 -157919 -16914 78714 66805 21358 39829 121259 172710 134755
401 134755 48672 -18983 -46840 -50006 -59147 -92301 -145146 -185031 -161300 -71532 31610 80920
413 80920 66309 40501 58548 113232 131652 68158 -29006 -66352 -23492 28018 11755 -62601
425 -62601 -131237 -138549 -78231 3724 42610 18509 -13749 19827 101227 138268 66342 -62227
437 -62227 -132245 -84998 8036 26955 -62652 -145239 -106574 24970 108892 69942 -11679 -9567
449 -9567 81368 150846 116369 8397 -71420 -67886 -14998 16836 -5558 -49377 -63927 -30927
461 -30927 22462 47716 30312 -6324 -4457 53184 112736 106574 31279 -44759 -66148 -45805
473 -45805 -40713 -54574 -60812 -40332 -3883 29441 60167 76195 59538 20279 -460 25760
485 25760 68253 59097 -20694 -101581 -100637 -28102 15779 -26109 -88600 -72807 26258 103633 84492
498 84492 2999 -44642 -8147 57904 71746 10452 -68484 -100132 -74923 -39262 -41490 -76505
510 -76505 -98838 -58373 40829 124874 124807 52006 -778 19910 70067 63894 -8458 -74844 -70227
523 -70227 -19962 4612 -29578 -74331 -79966 -39521 13772 51608 64507 54789 36436 30046 45396
536 45396 58661 31954 -30489 -69974 -45817 7316 12410 -40223 -82150 -53930 27658 86596
548 86596 81961 44456 26811 45387 58004 35963 -17096 -59569 -62756 -35211 -4795 5853
560 5853 -15148 -46333 -52583 -18252 31345 47919 27913 10911 29701 62493 66477 20770 -40016
573 -40016 -66737 -46441 -15767 -12019 -33321 -50013 -45877 -25658 4273 24964 19728 -1880 -9029
586 -9029 23796 60442 49770 -16305 -65715 -45327 25469 56183 14496 -44136 -48439 118
598 118 31111 -791 -58962 -73305 -23761 37548 51254 14808 -25604 -30229 -5411 17128 14871
611 14871 -4358 -17120 987 35977 48832 16552 -31172 -47807 -21131 13349 19668 -2359
623 -2359 -16732 53 30761 37623 17376 -496 9758 24138 15752 -9605 -24646 -29692 -42925
636 -42925 -64157 -61510 -21587 22313 29758 6834 2291 34797 66571 59338 19063 -4976 15573
649 15573 46290 39625 -10750 -68495 -86214 -64732 -33636 -21620 -25822 -22612 9049 65806 102241
662 102241 84808 31912 1210 26113 59298 38064 -32959 -94335 -90381 -48706 -29348 -58106
674 -58106 -81755 -51456 26909 82409 75074 38690 33013 58873 74172 50973 10445 -14745
686 -14745 -26544 -41640 -64444 -81789 -83204 -73186 -49369 -13841 30105 65642 72762 60249
698 60249 45978 37817 25712 -2951 -34815 -52959 -62268 -72330 -81720 -77786 -65182 -54705 -36649
711 -36649 5754 64576 99959 88758 63582 60667 79452 67652 10469 -53019 -73953 -56506
723 -56506 -49601 -76339 -114165 -105814 -48975 10435 38236 46567 62766 84336 94281 76876 46446
736 46446 13674 -15894 -33977 -38449 -36267 -38815 -54244 -63129 -43549 -1782 34153 46066 49502
749 49502 68029 97519 105049 71419 18499 -20523 -31732 -39254 -55468 -69537 -71600 -63985 -47851
762 -47851 -22994 10638 37216 45323 54394 77239 98484 81779 29234 -17878 -28926 -23208 -36395
775 -36395 -66117 -81328 -61392 -27695 -15185 -21608 -17392 18337 56684 71349 62751 54120 53397
788 53397 34960 -5033 -47198 -62803 -61064 -58688 -63729 -59666 -37449 -6465 14269 20486 19632
801 19632 31186 50810 65759 55418 28486 834 -16271 -23665 -26852 -35979 -49788 -53038 -28867
814 -28867 9995 27564 9944 -5516 17308 59025 74508 44108 5171 -2269 11002 7127
826 7127 -31725 -71352 -68868 -28080 8671 9064 -2177 5390 32582 48973 40722 25125 19945
839 19945 27438 28818 19599 439 -21527 -35129 -34246 -28103 -25187 -20477 -11440 3158 15844 18628
853 18628 11559 3991 8207 18435 20549 4106 -14920 -14975 -5259 -8550 -29604 -39854 -16264 16487
867 16487 24817 3491 -13384 -4219 13752 8673 -20030 -36170 -18304 12815 17761 -6659 -29540
880 -29540 -22005 -2442 3470 -4093 -10558 -3599 5675 13211 10734 -3396 -22261 -29311 -16065 2806
894 2806 8397 -5370 -12082 1701 20241 20748 -2125 -14819 -4558 16635 14062 -13873 -37626
907 -37626 -33540 -14715 -9141 -19214 -17930 6744 35647 38431 22206 12702 20291 22428 10757
920 10757 -4861 -9453 -5231 -8723 -23518 -37628 -34539 -23219 -12883 -3327 15229 36276 45670
933 45670 41133 34850 32583 26023 5237 -16159 -22105 -18180 -24169 -37524 -44587 -30465 -5617 6791
947 6791 15612 31217 56554 67190 58127 38691 26100 18402 2248 -20326 -33718 -35351 -35161
960 -35161 -42278 -47886 -35710 -10649 11334 23243 33247 59301 80712 71424 35860 8231 -668
973 -668 -5418 -25864 -57922 -66490 -49242 -27512 -21242 -27632 -15509 17844 50604 60331 53222 49278
987 49278 47545 36277 8780 -21033 -44151 -58649 -63870 -61715 -52106 -46753 -41269 -23842 8998
1000 8998 39188 49279 47498 54326 65756 59241 22744 -22654 -45101 -43559 -45256 -63245 -76941
1013 -76941 -61777 -21227 6653 6039 1962 21509 58257 75471 59127 30371 15818 10802 -3089
1026 -3089 -36591 -70517 -80054 -64688 -44392 -35268 -28325 -11827 18513 43424 55443 54914 52058
1039 52058 47526 42378 29389 2587 -34606 -60835 -62930 -49563 -42121 -47550 -43658 -14455 23633
1052 23633 38630 27211 16860 30985 51830 47466 13884 -18868 -29444 -24301 -36791 -63057
1064 -63057 -75247 -56272 -20362 2901 8633 13972 28709 48315 52646 42502 26240 13433
1076 13433 4352 -4868 -21980 -41234 -55126 -56314 -46722 -29634 -16695 -6905 4347 23521 42004
1089 42004 45391 32756 19411 20880 29144 21184 -4575 -26754 -29002 -18032 -16304 -26856 -27273
1102 -27273 -4012 26194 36809 29853 25564 33890 34572 22991 5264 -565 550 -479 -10650
1115 -10650 -19677 -18944 -12154 -7893 -1582 9163 22737 29382 27709 25675 25883 23197 10758 -985
1129 -985 -2345 2117 414 -11358 -19387 -18515 -7363 -4215 -4979 -1680 10208 21538 19607 6730
1143 6730 -2339 -855 -1495 -7319 -12851 -9528 -373 637 -7111 -10455 -6779 -1123 -6011 -10336 -5199
1158 -5199 7621 9167 -3563 -14427 -9282 2638 890 -11030 -11883 6139 20016 13809 -3777
1171 -3777 -7563 2572 10600 1843 -11747 -12973 -4442 -363 -6379 -13709 -10866 -1285 9008 17966
1185 17966 24481 22980 20307 17305 17537 16025 5316 -7580 -8199 1906 10458 -894 -14740 -12726
1199 -12726 6692 21849 17777 6730 11420 33099 43794 23807 -5416 -15651 -1453 8519
1211 8519 -5226 -26964 -25344 -3325 13622 10088 1002 7851 26409 43106 40838 25070 15275
1224 15275 10773 4702 -8400 -21592 -32993 -37417 -29793 -18383 -12274 -15722 -15335 -706 21305
1237 21305 30321 25533 15121 21382 32336 22798 -6886 -32856 -33666 -20248 -20729 -35068 -39884 -21724
1251 -21724 6341 17832 9063 4027 16389 35198 36723 18386 -2500 -10175 -11244 -18176 -33433
1264 -33433 -42751 -38220 -24591 -9653 81 5408 12096 22592 33084 39058 36180 28945 16252
1277 16252 8908 3507 -10195 -31322 -46292 -40712 -22401 -10705 -10968 -6494 13265 34848 42445
1290 42445 33856 25336 30034 32385 23317 47 -15536 -20541 -23178 -32208 -37576 -31414 -15346 1569
1304 1569 11584 18475 27697 36169 38735 31503 24832 18103 8951 -4986 -17137 -26300 -33004 -38757
1318 -38757 -36954 -25446 -10282 4044 11510 18214 26046 33254 31589 17367 4684 2650 3616 -7049
1332 -7049 -27244 -40059 -36179 -26249 -21800 -20222 -10481 8906 24332 30983 29994 30110 27115 16991
1346 16991 5777 -3977 -8831 -18103 -33430 -41656 -35980 -23858 -18819 -20508 -9622 13713 34637
1359 34637 34819 24408 17419 22886 25499 12390 -6054 -16199 -16144 -14742 -18372 -23483 -24861 -17251
1373 -17251 -4955 8767 16109 23602 23590 23413 22109 18892 11465 -3848 -15715 -15463 -8641 -11575 -21490
1388 -21490 -23270 -10485 6757 11009 7613 10202 27017 38524 31154 11382 1890 7324 9485
1401 9485 -5093 -24487 -23947 -9642 -2331 -10726 -20506 -13911 6522 21776 20658 12798 14284 20490
1415 20490 22939 12616 117 -11984 -13501 -8125 -1937 -3113 -13925 -19614 -9998 6615 11078
1428 11078 1408 -4844 5263 21245 25277 6012 -14414 -14683 2222 5467 -10786 -25656 -21301
1441 -21301 -2951 5728 -5486 -17955 -12851 6001 14085 6952 -1754 -388 7583 7555 -2820 -10965
1455 -10965 -9676 -4396 -4102 -7820 -9940 -8375 -6017 -6615 -5647 -3796 -3404 -2363 4854 11209 7223 -3879
1471 -3879 -7099 -346 5577 176 -11565 -13031 -2148 6689 1763 -12674 -16556 112 15305 13778
1485 13778 2803 -2003 9373 18637 13520 733 -6634 -4270 714 1531 -3800 -11650 -13094 -9517
1499 -9517 -3704 -3077 1039 4566 7033 11314 15550 19045 13301 2068 -2444 3387 6015 2038 -9791
1514 -9791 -12559 -5030 -383 -3619 -5443 -1771 8350 14913 16712 12568 10695 8969 3483 -2091 -6326
1529 -6326 -6858 -9403 -14506 -15750 -9613 -2746 -2951 -3834 2498 17240 25028 22110 15552 13770 13012 8256
1545 8256 -631 -9928 -11277 -9944 -10782 -15197 -15632 -7682 -253 2695 2235 8402 18714 24638 15642
1560 15642 4303 295 1557 -1415 -13670 -21713 -20664 -13351 -7305 -5498 -4930 -450 7585 12986
1574 12986 20730 23932 17705 7779 370 922 152 -11379 -29415 -33117 -22300 -6760 -7879 -17642
1588 -17642 -17401 1984 20166 19724 10388 7182 14234 19295 9896 -7870 -19787 -20312 -15308 -15589 -19674
1603 -19674 -16378 -6765 1912 9801 12099 15349 15923 16491 17023 13169 5676 -5037 -12789 -15050 -17402
1618 -17402 -19933 -23248 -18024 -2390 8437 9300 5659 14826 28201 32354 20750 6064 4707 12144
1632 12144 9925 -10753 -30245 -27000 -9034 -1216 -7825 -13296 585 21351 29114 20896 11567
1645 11567 11118 15618 16733 6426 -6568 -18739 -21186 -17029 -12816 -14426 -17607 -13274 628 18919
1659 18919 24647 17568 9777 12162 19777 17472 -433 -16323 -19489 -12423 -12327 -22918 -29205 -20373
1673 -20373 -4323 4806 7022 7270 17237 21530 21077 9785 1254 427 -820 -10729 -21062 -23168 -18062
1688 -18062 -13877 -13949 -11830 -2018 11793 19370 22834 24504 23967 19742 15058 7246 -36 -8778 -16556
1703 -16556 -18607 -15854 -12096 -11594 -12338 -6026 8095 22976 24364 21496 19937 21887 23438 13735 -694
1718 -694 -9168 -12076 -11550 -13094 -15442 -13942 -10764 -2042 4394 11809 18656 19046 19832 15532 14214 10651
1734 10651 1640 -14439 -23522 -22284 -16714 -16940 -23297 -22299 -9804 4921 9945 8705 7828 14392 20149
1749 20149 17098 5667 -5257 -11755 -15024 -21741 -28821 -30196 -27428 -22426 -16193 -8884 -1991 235
1763 235 3363 9311 15245 13188 4331 -3934 -7140 -8946 -16817 -25708 -27981 -23356 -13579 -9707 -9828
1778 -9828 -5451 5341 14320 13637 7379 6344 10815 11724 1674 -13873 -21121 -17304 -12344 -16168 -21638
1793 -21638 -18939 -4395 7642 10360 8969 8892 13927 19325 18847 11309 3327 -3264 -5074 -5104 -7348
1808 -7348 -13526 -17953 -13512 658 10917 9578 2877 4784 18793 25830 15957 1224 -2948 4683
1822 4683 8067 -2413 -16559 -19532 -9562 -2337 -3587 -5020 -926 10286 15222 14279 7842 7483 10585
1837 10585 9741 5687 -1297 -5369 -4149 -4941 -6642 -6277 -7775 -4689 336 6445 8678 4111 3173 4737
1853 4737 7051 4960 -3076 -8015 -6228 1645 743 -7496 -14072 -5017 6969 9875 2001 -2418 6718
1868 6718 17524 16203 3977 -3153 -43 7434 6630 -614 -6198 -3722 798 275 -1558 -1335 -819
1883 -819 1021 3009 6114 5531 1671 -997 1173 4951 6052 1278 -476 2375 6341 7954 2737
1898 2737 -1240 1264 5023 4499 15 -1576 -297 696 -215 -4215 -5578 -1184 1525 992 -1599 -1201
1914 -1201 2462 2620 -1197 -5541 -4008 -1353 -3200 -6082 -6614 -1929 -1049 -2938 -5045 -1860 3583 4223
1930 4223 -819 -2816 965 2562 -3348 -9880 -12524 -6839 -4479 -8801 -10203 -9012 -4289 627 1249
1945 1249 -816 221 3609 5611 4660 1940 -2263 -6818 -8063 -6869 -5430 -7659 -9026 -5401 2076
1960 2076 5542 4885 2394 2950 10685 14376 10395 2464 -3348 -2363 2275 -3518 -12794 -14948 -6712 1318
1976 1318 3701 -636 -2238 6821 15764 13719 8566 4670 8017 9590 5257 -1989 -7279 -7271 -5681 -4656
1992 -4656 -3177 -2406 -412 4867 10160 11927 9717 3810 5321 8980 7891 -938 -10929 -11785 -7497
2007 -7497 -4554 -9602 -14748 -10075 3464 11091 9402 4481 6922 14089 17184 8784 -1136 -5106 -1614
2022 -1614 -422 -6754 -15210 -18220 -11462 -2228 -2037 -3144 -842 8125 12240 12852 9961 4278 2273
2037 2273 926 983 -2233 -9747 -12686 -12156 -5041 -1286 -3895 -4913 1776 12248 17898 11711 5055
2052 5055 3523 10281 9279 -2188 -12929 -13201 -5181 -2975 -10179 -13984 -6600 2133 7844 8461 7015
2067 7015 9664 13399 14604 7597 251 -1501 -3989 -5091 -7318 -9428 -9515 -8274 -5114 114 2294
2082 2294 2931 4590 8506 12082 12387 5962 -2071 -3999 -923 -4744 -10870 -12779 -10924 -3749 -1165
2097 -1165 -3881 -1408 4109 11128 11821 6944 7397 8877 8448 1064 -5772 -7843 -7938 -9813 -12505 -9969
2113 -9969 -6012 -1742 -1976 -377 3796 8507 10159 7212 4604 4444 2948 -1362 -7659 -9921 -9118 -6993
2129 -6993 -6464 -8096 -4541 -202 4572 6673 6879 8084 8496 8437 5943 2446 -357 -5378 -9261 -9571
2145 -9571 -8985 -8833 -8774 -7026 -2220 4236 6500 4757 5149 8368 12050 11357 2951 -2108 216 2825
2161 2825 -3069 -10823 -12832 -5486 1196 681 -1481 235 6669 12977 11333 5818 3748 3574 4772
2176 4772 4007 -4338 -8744 -9636 -6927 -6454 -6384 -6784 -5184 1785 7207 10690 7425 5044 7109 8835
2192 8835 8826 2502 -4531 -5082 -2549 -1472 -7280 -13021 -11176 -3600 3909 3731 -2576 -303 6205 11690
2208 11690 6658 -1045 -2785 332 2037 -3524 -9925 -12864 -8512 -4445 -3318 -5452 -4178 1062 7664
2223 7664 9109 7384 5631 4352 5767 5462 1973 -4373 -8630 -7212 -5854 -6475 -10687 -12744 -5838
2238 -5838 3236 7230 4486 696 4960 12485 12502 5677 -967 -1240 2466 3140 -2832 -9737 -8498 -2563
2254 -2563 2196 2139 -1946 1994 7923 12485 9627 7067 5579 4579 4676 1692 -1534 -5789 -7938 -8556
2270 -8556 -5816 -3770 -4104 -4508 240 5731 10565 9992 6577 7311 9601 9127 3938 -2378 -3236 -2728 -4833
2287 -4833 -9450 -11238 -7929 -3436 -1697 -2806 97 6142 9765 7373 4521 4532 3530 2856 -2578 -6602
2303 -6602 -8253 -7482 -8219 -8869 -8719 -5920 -2455 813 5737 9796 10792 9210 7184 5246 5847 2781
2319 2781 -3648 -10183 -10770 -8103 -7242 -9301 -12648 -8711 -78 3857 5395 5858 8269 9860 8001 6660
2335 6660 3226 -705 -5581 -9607 -10012 -7894 -9402 -12199 -10941 -3580 4661 7537 4839 5710 10155
2350 10155 16251 12769 2618 -4525 -4713 -4413 -7027 -14525 -19110 -15085 -9077 -4218 -4267 -901 4185
2365 4185 8637 14230 13948 12426 8382 3546 1729 -2166 -6452 -11039 -14534 -12561 -9852 -8497 -6034
2380 -6034 -2277 3747 9244 11312 11889 11073 11957 9210 2952 -4535 -6934 -5672 -6762 -13856 -17068 -12030
2396 -12030 -487 4218 3110 1593 7499 18380 21907 17270 8040 2635 3852 3160 -3773 -13298
2410 -13298 -17904 -16862 -9639 -3278 -2022 -3711 -844 8881 18038 21258 15606 8101 7924 10348 8008
2425 8008 -1678 -11491 -13243 -11879 -7202 -6639 -8483 -5215 3296 10068 13843 12342 12073 12851 10481 8643
2441 8643 1876 -3325 -6025 -10713 -14488 -14730 -11343 -6643 -3157 -2754 1260 9128 15243 15622 12118 9597
2457 9597 8741 8283 4022 -3232 -10273 -14165 -12548 -8179 -7228 -7347 -9172 -2643 6292 14947 13266 5893
2473 5893 3303 6351 12560 7283 -3321 -13189 -13999 -8421 -5809 -9849 -14070 -11691 -1616 6963 9790
2488 9790 7579 5471 6713 9286 11008 6880 -631 -8696 -11345 -8344 -7246 -9322 -14310 -15608 -7533
2503 -7533 2359 6442 3383 -450 2858 8884 10774 5433 -1563 -4880 -4968 -3930 -5185 -7422 -9763
2518 -9763 -10538 -7490 114 4708 4315 1611 679 5486 9797 9678 1089 -5113 -4587 -2043 -2470 -6880
2534 -6880 -11014 -10967 -7230 -2426 -1213 1936 2191 1743 3479 7981 10678 8061 -168 -2466 150 4414
2550 4414 4001 -4672 -11102 -9018 1189 4976 2146 -4549 -5955 1267 9955 9650 3397 -2381 -3482
2565 -3482 2523 7867 4963 -3572 -9617 -6750 3116 6731 2063 -7861 -8070 2975 11703 10552 -570
2580 -570 -4363 109 9729 9754 2678 -5478 -4325 -12 1845 78 -3627 -7090 -4594 -818 2817 4945
2596 4945 1343 -760 728 5491 9113 7964 2741 -2234 -1556 1424 2372 1591 -5736 -6332 -5111 1962
2612 1962 5204 3261 -1117 -3279 2411 10182 12275 5668 -3830 -5302 1711 7157 2050 -8535 -14867
2627 -14867 -9181 2662 6430 -2134 -9217 -6920 7197 14850 10790 1490 -2902 540 8835 8583
2641 8583 1046 -10800 -12731 -6381 304 1221 -5919 -9969 -6613 4503 10839 9175 199 -4240 1455
2656 1455 7535 6726 -531 -9842 -10490 -6396 -1684 -2160 -6954 -9965 -5347 1159 8895 9502 5065 -48
2672 -48 -153 6396 9153 3564 -5246 -13364 -10408 -3070 -830 -6494 -13277 -10167 1018 9760 9834 3080
2688 3080 1 1754 8685 11274 5844 -3308 -9018 -8019 -2062 1143 -4554 -12914 -10739 -1366 11032
2703 11032 10517 2527 -3329 1744 12067 15629 7281 -6235 -10545 -6550 636 60 -6562 -13357 -10873
2718 -10873 -1224 8913 10894 3592 -1724 2556 11365 16716 9905 -3023 -10283 -5626 3083 3822
2732 3822 -6822 -17367 -13855 -620 9560 7015 -1658 -2894 4510 12311 14430 7667 -1945 -7369
2746 -7369 -3243 604 1342 -4982 -10713 -13539 -2597 7085 8302 1664 -2921 2199 11849 15437 9099
2761 9099 11 -6065 -3372 1125 912 -4507 -11242 -12544 -6624 4260 9031 2990 -3363 -3007 7662
2776 7662 17973 12943 95 -8989 -4554 5545 7115 -2017 -15770 -14528 -3413 9424 7399
2789 7399 -741 -7419 207 11430 16432 8772 -4384 -9897 -4331 4364 3735 -5439 -16817 -14979
2803 -14979 -2380 7873 5702 -4517 -8838 408 13290 16647 5710 -3200 -5907 -23 4317
2816 4317 1376 -5887 -12120 -12081 -5615 1923 4898 -265 -5973 -2292 6404 12584 8969 -1994 -7585
2831 -7585 -4502 2158 3761 -4054 -12601 -14134 -4946 5710 6668 301 -5665 -1873 8262 16042 12880
2846 12880 255 -9064 -5406 3591 7750 -1619 -13666 -17184 -6112 7705 9218 -1126 -9850
2859 -9850 -3090 9424 16087 9140 -3851 -9782 -1264 7720 6935 -3251 -12686 -13269 -3376 7707
2873 7707 7731 278 -6803 -1881 10774 15929 10472 -2721 -9063 -3860 5772 6315 -4966 -15526 -13862
2888 -13862 -3983 5301 4700 -2443 -6443 -2194 7318 14337 9642 -787 -6559 -3648 4644 6196 -1548
2903 -1548 -12277 -14314 -6238 4628 7397 -376 -8028 -3770 8090 16044 8834 -1814 -9228 -2887
2917 -2887 3535 4719 -3325 -12775 -13924 -6747 4603 8286 1160 -6422 -4374 7707 18238 14471
2931 14471 1684 -7787 -4260 6796 9857 -67 -14036 -15710 -5729 5690 6198 -2493 -8426 -5161
2945 -5161 7939 16012 11366 -1164 -8102 -3372 7885 9451 -532 -13015 -15383 -5138 7455
2958 7455 7965 -1826 -9028 -3524 11234 16708 10104 -1653 -7313 -880 9212 6943 -3158 -11333
2972 -11333 -12242 -5473 2955 4233 -2295 -7419 -5734 4524 13408 11697 392 -7343 -3858 5795
2986 5795 9331 -303 -12138 -13464 -4119 4300 4542 -1208 -8099 -4963 4150 12532 11970 1126 -7942
3001 -7942 -5757 6158 11757 2454 -12256 -16982 -7407 6323 7771 -2261 -12369 -7825 6008
3014 6008 15622 12495 -940 -8265 -1615 9941 11454 1761 -8985 -12759 -2944 6923 8213 -1351
3028 -1351 -10381 -7594 4430 12613 10443 -2224 -8799 -2250 9008 11108 -4 -10509 -11184 -1784
3042 -1784 6320 4099 -2933 -8589 -6498 3554 9763 9988 -331 -7662 -2833 5928 11128 4528 -7409
3057 -7409 -11506 -3983 6831 5994 -1388 -12891 -10143 1610 10489 6704 -3272 -9428 -6272 5777
3071 5777 9953 4303 -7226 -10801 -3218 6764 8584 320 -10131 -9954 530 10980 8740 -4749
3085 -4749 -11874 -6191 7172 12512 2932 -9348 -13174 -1916 6869 8428 -2324 -10802 -9932 1482
3099 1482 9406 5891 -3327 -10251 -5179 6481 11670 5101 -6005 -9793 -1120 10975 10320 -1684
3113 -1684 -10072 -7863 3322 9308 5266 -5015 -9639 -4045 5826 9463 2585 -6020 -9633 -1720
3127 -1720 7414 8420 -5 -7420 -8302 1460 9120 7642 -3152 -8952 -5266 5777 10823 3998 -5554
3142 -5554 -8207 -1017 8447 9979 2661 -7277 -7082 993 8288 6754 -2645 -8720 -7373 3106 10591
3157 10591 6316 -5568 -10826 -3094 8814 10857 1306 -8703 -8579 2955 12226 8078 -2625 -9689
3171 -9689 -5106 5606 10279 3104 -5591 -9097 -2641 7931 8650 -225 -9718 -9748 571 10493 7162
3186 7162 -4853 -10543 -5744 6773 10201 2686 -6187 -7958 -450 7108 6788 127 -7638 -5794 2345
3201 2345 8814 6590 -868 -7408 -5467 4501 10293 4202 -5049 -10334 -4278 5209 6494 -898 -10855
3216 -10855 -8699 824 8952 7478 -1462 -6899 -2726 5483 9775 6408 -3765 -8566 -4168 5009
3230 5009 8961 603 -9589 -11038 -1381 9600 8996 -1558 -9481 -4136 7660 12624 5350 -6295
3244 -6295 -9206 -2421 6781 6589 -1956 -8879 -8533 -265 7975 7085 -74 -6751 -2394 7252 12141 7795
3260 7795 -4092 -7458 -2564 6616 6321 -2686 -11437 -9636 -944 5957 4336 -2444 -7148 -2211 5461
3275 5461 10322 5490 -522 -4979 -2287 4421 5973 241 -8893 -10761 -2842 4410 5171 -3399 -8110
3290 -8110 -3667 4991 11448 6920 -763 -5335 -2141 5409 5313 -910 -9644 -11535 -5648 3123 4447
3305 4447 -3154 -9206 -5496 4325 12329 9737 -91 -5373 -20 8098 9972 -20 -9989 -10181 -3409
3320 -3409 4159 2651 -4415 -9193 -4217 4484 10884 8171 -343 -5735 -326 7153 8916 657 -10494
3335 -10494 -12969 -4694 2793 1935 -5172 -11531 -5177 5925 11129 8118 -657 -3014 2568 8009 8033
3350 8033 969 -6553 -8143 -3467 725 434 -4883 -9285 -7405 1988 7791 6198 647 -2505 -75
3365 -75 6781 9857 1627 -5569 -8528 -3391 2386 2483 -3544 -9252 -6921 1245 7139 7176 154 -2208
3381 -2208 -71 7063 11551 4794 -5094 -10254 -4400 3257 4313 -3695 -13220 -8754 601 8462 4982
3396 4982 -1744 -4378 1578 9497 9362 4325 -2353 -5387 -1920 4342 2218 -4404 -10902 -7932 54
3411 54 6628 3509 -1616 -4658 882 8046 10399 2896 -5863 -5708 178 3617 48 -5507 -9928 -7159
3427 -7159 -1323 3522 2237 -265 -2793 919 5428 8641 6061 -585 -3843 -625 5041 3819 -3387
3442 -3387 -9987 -9153 -461 2987 2614 -2782 -5102 -876 4815 7856 3794 -1353 -3473 -1097 4008
3457 4008 5072 -412 -6258 -6529 -339 5168 3948 -3039 -7337 -1110 6056 9023 3259 -3317 -4345
3472 -4345 1349 6140 5146 -73 -6128 -4038 963 4338 2784 -3318 -7337 -3802 4659 6699 2419
3487 2419 -1937 -3841 1070 5739 5794 676 -4168 -2847 3367 5484 2835 -1745 -4995 -1970 3361
3502 3361 3200 577 -1913 -3640 -1049 3479 4025 2393 -1435 -2436 878 4818 4489 -1699 -5360 -3661
3518 -3661 1885 3992 415 -4436 -4743 -450 3196 4473 2140 -611 -1457 1207 5932 5140 -885 -5909
3534 -5909 -3714 -201 2999 -225 -6880 -8473 -2487 3614 4880 1791 -2372 -1234 4142 7506 4835
3549 4835 -926 -4067 -2712 1331 2236 -2030 -6783 -7346 -3655 1358 3386 1358 -2953 -605 4045
3564 4045 8183 5971 140 -3939 -2061 2584 1436 -3609 -8104 -8537 -3468 -382 969 -1096 -679
3579 -679 638 5881 7120 6269 3604 -1283 -2107 604 709 -2832 -7081 -9179 -6505 -601 1397 -1012
3595 -1012 -2872 -602 4498 7562 7771 3401 -1197 -808 1692 1261 -2115 -7277 -8443 -6130 -1658 793
3611 793 -1152 -1855 -1452 4236 10512 10008 4662 907 1471 4401 4316 -757 -7650 -10006 -6652 -3214 -3672
3628 -3672 -3878 -5009 -1314 5178 8677 8418 6347 3745 2478 5391 5512 74 -5799 -9828 -6937 -3355
3644 -3355 -2081 -5292 -5125 -2036 4027 7055 7282 5376 4328 5315 5500 3499 7 -4591 -7367 -6751
3660 -6751 -6344 -3476 -5229 -5586 -4060 859 6903 8130 6480 4693 5473 7550 6031 2943 -2425 -6897
3676 -6897 -5983 -5616 -4963 -6452 -6321 -5474 -1247 3259 4876 7312 5815 3070 7189 7855 6145 -1571
3692 -1571 -7163 -7036 -2920 -3634 -6865 -8930 -6924 -127 4732 5807 4227 4681 7615 9200 8117 5008
3708 5008 -226 -2703 -4874 -4797 -4017 -7516 -9522 -7800 -3332 1807 4356 3658 3835 6950 10584 10282
3724 10282 5207 1337 -1395 -1670 -2953 -6699 -7877 -8005 -7515 -5420 -1440 1483 3572 4376 5290 7484
3740 7484 9593 8428 3270 -1776 -2557 -2942 -4222 -7422 -10521 -9123 -5591 -2894 267 1312 1851 5766
3756 5766 7915 9341 7356 6080 2301 -1061 -1940 -2311 -4877 -8898 -10087 -5814 -3724 35 -751 -101
3772 -101 3814 7036 8532 7663 4523 2773 828 -132 -2129 -7369 -8473 -8187 -6507 -4785 -2235 486
3788 486 1446 4195 6592 9314 9500 6130 4004 2277 1836 92 -5344 -7537 -7703 -7170 -4255 -4669 -3289
3805 -3289 -2034 2220 6454 6971 7427 7536 5222 3755 1311 -375 -2529 -5291 -7264 -7255 -5072 -3581
3821 -3581 -3438 -2194 1606 4534 7560 7042 5644 5696 4233 3559 1046 -1136 -5463 -6149 -7855 -7141 -4536
3838 -4536 -3738 -2124 -847 2333 5591 7759 6753 3753 4829 4302 4155 -413 -5191 -5068 -4873 -4017
3854 -4017 -4269 -5563 -4655 -1338 1589 3543 4467 3971 5551 4701 3723 1947 2170 -2265 -5867 -3950 -4405
3871 -4405 -2641 -5570 -5915 -1347 528 3154 3639 2649 4181 6594 5585 2204 -139 -874 -1805 -2843
3887 -2843 -4754 -4932 -5008 -5464 -4166 -2765 -462 1499 3279 2355 2924 2785 2256 2417 -67 -487 -2381
3904 -2381 -2512 -3612 -3248 -3211 -3427 -1897 -1114 1181 2952 2524 1707 2988 4633 3495 446 -2224 -1672
3921 -1672 -899 -1666 -3369 -5064 -4728 -1084 213 -1886 -28 1814 2493 5327 1921 2278 3485 1829
3937 1829 866 -214 -274 -2472 -3489 -3234 -2383 -727 -1112 -1305 425 587 2268 3027 863 851 227 583
3955 583 1041 -1601 -1268 -1505 -1565 -1444 -2722 -1211 193 202 -135 -14 3295 3535 1963 887 1454 2039 1048
3974 1048 -723 -1182 -1116 -1277 -3444 -3240 -1944 -2820 67 -283 -1178 1710 1887 3441 1785 1616 1996 2550
3992 2550 -148 -1626 -1334 -1300 -1041 -2613 -3635 -2275 57 291 485 562 1962 3014 2920 1731 1157 788
4010 788 -59 -880 -2263 -2105 -1810 -2789 -3828 -1623 351 106 1221 1579 2824 3922 3598 2696 1700 1512
4028 1512 1468 -79 -1839 -3998 -3098 -1979 -2077 -3320 -3119 399 2233 2552 870 2760 5012 2598 1636
4045 1636 713 316 152 -738 -3476 -3135 -2330 -1823 -1882 832 1632 3438 4270 3965 5026 3894 4527 2058
4063 2058 507 -398 -1149 -4234 -4209 -4906 -2979 -2237 -2073 -1918 -345 2363 4610 4724 3585 2965 3151 2994
4081 2994 28 -1155 -1889 -3016 -3607 -2961 -3652 -2032 -1124 659 943 2923 3457 3686 4364 3752 3600 1927
4099 1927 -719 -2356 -3749 -3563 -4013 -5294 -4451 -2771 -520 -263 1306 2735 5785 5390 4939 2123
4115 2123 497 2073 878 -2365 -5723 -5301 -4612 -2838 -4488 -2461 -2190 1397 1863 2463 2652 4161
4131 4161 3938 1971 443 -868 -1893 -3190 -4708 -5077 -4046 -4752 -3894 -3052 492 2029 2298 2839 3816
4148 3816 4246 4580 2054 -106 -1800 -1944 -3976 -4845 -6287 -5376 -3550 -1757 -1728 38 2300 3473 4353
4165 4353 3786 3147 2468 2253 184 -1108 -2287 -1946 -3682 -4523 -5268 -3283 -1502 321 767 1484 4314
4182 4314 5528 3435 3332 2256 3271 -236 -2460 -4776 -3412 -4289 -4616 -4575 -2445 -71 884 1883 2875
4199 2875 3953 5091 4499 3522 3299 1702 -885 -1294 -2737 -2936 -2985 -2845 -4336 -2521 1030 1636 1569 2539
4217 2539 4068 4948 4614 2538 211 897 -856 -1702 -3063 -4829 -3405 -2702 -2031 -2346 -807 1977 3830
4234 3830 4660 3144 4551 3345 4169 2463 973 -1592 -1507 -2925 -3935 -3570 -2821 -2246 -2549 36 740
4251 740 3256 3038 2528 3657 4171 3366 1131 61 -873 -1110 -2131 -4884 -4435 -2735 -474 -188 348
4268 348 643 3311 3581 3492 1321 2764 1902 758 -823 -2098 -2481 -4171 -3033 -3900 -3177 -1807 -535
4285 -535 1614 926 2964 2546 1566 2517 2314 3445 1029 -225 -2117 -1453 -1964 -3058 -3255 -4336 -889
4302 -889 102 890 -308 1542 2781 1997 1690 1005 -45 770 302 -2370 -3564 -2037 -2735 -1407 -2181
4319 -2181 -1452 20 876 960 1664 1845 2850 2470 761 -378 778 32 -1790 -3912 -3046 -2459 -3172 -2347
4337 -2347 -1868 -393 2024 1101 -648 2327 2254 2144 1174 513 285 895 -910 -2890 -2791 -1539 -702 -1355
4355 -1355 -1074 -284 221 2528 2555 65 622 1112 1216 1107 -150 -1695 -852 -1554 -2185 -3535 -2223 -893
4373 -893 -2223 -807 980 2227 1852 2842 2476 2210 2296 983 212 -531 -759 -1159 -3114 -2705 -1594 -2482
4391 -2482 -1192 179 1375 853 1467 2269 1140 1261 1407 581 -480 -1855 -1 99 -2580 -4826 -3597
4408 -3597 -411 1319 556 -843 536 3567 3528 2342 1207 1604 844 -182 -150 -2301 -1899 -1882 -2248 -2818
4426 -2818 -1256 -47 1199 1053 532 2102 2162 1865 1154 824 591 -629 -1010 -463 -1022 -1587 -771 -1153
4444 -1153 -640 -609 1565 1589 1721 2451 2433 1719 -712 -1128 722 -299 -1699 -2459 -3019 150 608 -1778
4462 -1778 214 656 1441 2763 2232 1869 2558 3278 1247 -238 766 -1797 -1221 -2072 -1341 -1115 -1716 -1409
4480 -1409 -586 196 2786 1554 15 738 145 836 664 -671 -1046 -1377 -274 -1161 -2563 -748 273
4497 273 218 -589 654 1091 2474 1738 384 9 275 1427 -33 -2136 -3014 -2470 -670 -1661 -2307 -1800
4515 -1800 -423 1032 1019 1217 970 1295 793 374 627 -1210 -150 -498 -1993 4 -249 -427 -544 -1843
4533 -1843 936 1962 390 652 804 1175 1384 634 -1094 -563 -384 -518 -1410 -1596 -1389 -1021 -949 -651 99
4552 99 82 264 243 -852 517 386 1637 456 -1048 -234 -255 -1456 -1063 -378 93 -423 -953 892 341
4571 341 375 -125 551 -380 681 -364 -643 -1028 -1019 787 -1372 -1854 -1446 62 807 836 469 1173 867 1664
4591 1664 449 412 894 6 -862 -250 -356 -1446 -410 -1250 -101 -319 689 435 264 -419 918 1516
4609 1516 1901 -865 -1463 258 1536 1178 -1106 -1290 -192 -440 -328 -329 -232 479 -338 261 1509 1056 382
4628 382 -967 -1147 458 153 -994 -2621 -1354 -604 -377 -629 -1090 -151 1092 1793 377 -350 1895
4645 1895 2497 758 -340 -332 -446 425 -1516 -1142 -1150 -881 -220 -843 -853 -4 2040 1849 224 -800 242
4664 242 946 1248 -1018 -1293 -793 -774 -1476 -268 -81 -757 683 298 447 2496 1044 710 550 685 557
4683 557 149 -392 -1611 68 -772 -1196 -1846 -2004 -310 -316 134 -1189 862 1124 -101 1219 1028 1546
4701 1546 211 -60 -948 105 -331 -594 -1371 -1950 -736 1058 283 642 245 1488 1796 1794 457 996
4719 996 95 -246 -1044 -2105 -2206 -1226 -1038 -2343 -338 303 883 835 1177 2083 3169 2715 35 -1571
4737 -1571 418 337 -230 -1624 -3631 -946 -855 -976 -1651 333 1730 1009 724 -97 2644 701 -351
4754 -351 -801 -1699 -452 -2231 -2042 -2368 -1466 -1152 -819 111 -504 1506 2275 1595 916 1876 2110 -352 -1124
4773 -1124 -379 -2044 -1389 -1820 -2849 -2198 -507 126 -979 670 883 2997 2557 1363 1069 1117 991 658
4791 658 -1004 -2614 -1434 -1615 -1639 -1124 -1364 434 1901 1104 1338 2758 2942 1390 508 146 318 -1286
4809 -1286 -2456 -2413 -2071 -1791 -1440 -1655 -1136 1606 1166 748 561 2821 2357 2013 115 948 1315 -151
4827 -151 -1152 -1077 -1342 -180 -56 -1469 -1463 1241 1829 2640 1496 653 1601 1250 992 -390 -2409 -1017
4845 -1017 -500 -1108 -2325 -1526 -915 811 -897 908 1203 753 1987 685 1682 1117 -549 -99 -490
4862 -490 -966 -826 -1587 -2045 -1335 -736 -524 -348 -535 949 2019 1123 14 -27 644 1236 -942 -1149 -493
4881 -493 1535 -328 -689 -1428 246 1385 1801 -387 822 1287 1659 1440 -1602 -456 -83 72 -664
4898 -664 -1489 -1059 571 -716 -459 -597 -647 175 1231 -794 380 69 -109 852 51 609 681 -367 477
4917 477 -276 157 1433 -156 -1625 -539 101 108 -1537 -460 -1034 1563 -341 94 159 172 1786 -451
4935 -451 -443 374 652 620 -568 -554 -349 10 -951 -1221 -708 -939 1168 557 815 794 1320 1807 799 -16 -827
4956 -827 -92 -290 -2142 -2050 -1068 -118 -1052 -959 733 1335 972 683 277 2102 1784 469 -86 -349 188
4975 188 -699 -2667 -1091 -983 -1663 -66 -1098 -154 701 793 1501 1532 1758 873 1248 140 -1766 -1327 -2039
4994 -2039 -2257 -1810 -2390 -458 76 708 1170 2534 2868 2581 2059 917 2194 598 -168 -1978 -439
5011 -439 -1954 -2356 -2108 -2924 -955 45 475 174 593 1437 2906 2159 1782 281 -33 1274 -1603 -2346
5029 -2346 -2595 -1551 -1663 -2128 -1730 -519 2584 1402 1327 2181 2213 2276 968 841 685 -609 -1519 -2596
5047 -2596 -2691 -2419 -1599 -983 -316 293 1406 1540 2862 2891 1248 2052 1150 280 202 451 -639 -3068 -2878
5066 -2878 -577 -989 -985 -1632 315 1639 2284 2783 828 925 1822 2472 -509 -1687 -804 -971 -1240 -2865
5084 -2865 -1874 -2187 355 465 -344 923 2318 2163 2292 2218 1826 905 666 -473 -1165 -1874 -2606 -2898 -1826
5103 -1826 -700 -588 -147 73 -6 3247 1932 2323 892 1429 1380 302 -1529 -1511 -1267 -1054 -1319 -2554
5121 -2554 -882 -187 1670 293 925 1333 1698 2288 2575 -44 920 -408 -62 -955 -2833 -1908 -1325 -2253
5139 -2253 -1282 -1989 309 925 1394 1309 641 1605 1553 1800 -175 664 477 -1007 -7 -925 -1052 -702 -871
5158 -871 -680 761 -80 37 -176 411 1602 1962 -157 -705 -521 250 -670 -455 -1731 -703 -66 -1040
5176 -1040 -475 334 -7 370 1571 932 1383 1521 1071 15 -368 221 -632 -325 -1612 -1705 -1334 -535 -1930
5195 -1930 -257 -742 288 542 1458 1178 679 1560 790 106 140 1224 -353 -46 -1808 -763 -70 -1115
5213 -1115 -1694 -1407 22 -366 -293 188 500 836 1982 268 460 891 -68 -956 -2240 -2175 -1103 14
5231 14 -1549 -667 323 368 -175 1324 1646 2658 2861 1331 713 -66 988 -951 -1874 -1939 -1541 -934 -1192
5250 -1192 -1904 -575 -556 1962 1235 1406 2840 1337 2859 227 -357 413 -1465 -1398 -3329 -3472 -1297
5267 -1297 -1687 -1516 -778 107 1512 2334 2588 1567 3365 2342 1560 245 -1675 -1996 -2332 -2824 -2974 -3661
5285 -3661 -2175 -1318 -464 657 2379 3105 1786 3328 3186 2187 534 -1418 -1712 -1702 -3320 -3156 -4233
5302 -4233 -2627 -1464 -277 -275 53 2429 3310 2877 3046 2631 1233 362 -1816 -2296 -3298 -2783 -1997 -2912
5320 -2912 -4200 -1184 1009 2726 2660 2337 2821 4233 3747 1445 -34 -1268 -2165 -1826 -4262 -3298 -4114
5337 -4114 -3004 -2245 265 540 805 1427 2046 3991 4280 2671 645 -391 -940 -955 -1277 -3369 -4196 -2962
5355 -2962 -1157 -1623 -1877 1614 3120 3434 2274 2302 2622 3500 2047 -466 -2087 -2042 -2272 -3553 -4375 -2845
5373 -2845 -627 452 47 885 984 2808 4339 2935 1471 795 -17 -1151 -914 -2107 -3010 -4260 -3056
5390 -3056 -1526 1120 861 329 311 3586 3237 4322 1577 782 368 292 -510 -3038 -2077 -3030 -1893 -2810
5408 -2810 -1539 -741 -451 2711 3277 2131 1742 2944 2100 -96 26 -343 -1076 -3111 -3005 -2199 -2041 -2058
5426 -2058 -1661 -1469 1102 686 1842 1820 2168 2171 1055 149 -449 776 -1539 -1928 -2934 -1981 223 -515
5444 -515 -1170 -944 1207 2267 2168 2643 222 2635 2291 1187 -485 -2062 -2528 -852 -1475 -1838 -2639 -2365
5462 -2365 112 1202 946 2335 2316 1425 573 -361 1376 833 -1054 -1916 -1546 -254 -450 -2158 -1344 107
5480 107 626 1068 1450 727 735 1717 983 712 1068 -844 -1038 -2383 -1046 -846 -369 -1942 -1642 506 2140
5499 2140 1956 680 205 1580 1935 2173 489 -368 -586 -294 -244 -1904 -1945 -1419 -1198 589 875 574 647
5518 647 112 1672 978 930 -8 -390 -673 283 -9 -418 -1908 -625 -864 480 -33 830 832 -273 693
5537 693 30 953 521 502 -931 -701 201 971 -154 -1561 -1676 -1491 2045 1647 -712 -1609 265 2933
5555 2933 1591 -327 -1980 -660 172 122 -503 -927 -1561 -352 816 361 164 -665 821 43 873 1994
5573 1994 929 -859 -657 -157 312 -869 -2894 -1228 -682 -70 426 -658 -391 558 246 310 464 1295
5591 1295 1581 -171 -1238 117 1785 1336 -877 -2181 -374 273 408 -307 -828 -104 1205 1864 -831
5608 -831 27 -794 568 403 126 -500 -1094 -1847 926 603 333 -774 458 955 1437 1582 1206 -861
5626 -861 -1132 789 1648 369 -319 -2744 -776 -77 55 -509 -40 -423 712 987 1672 1069 -110 -405
5644 -405 1096 376 1496 -780 -1255 -1470 -410 1496 1820 -480 -1277 338 2646 2320 339 -446 722
5661 722 705 177 451 -796 -2526 -3302 -1008 79 -6 -279 -595 -1398 308 2774 529 374 -1368 -75
5679 -75 1718 1448 -511 -1681 -693 -684 431 -400 -992 -1228 692 54 779 797 764 -485 -608 2421 643
5698 643 497 -1603 -1816 -1467 -30 -340 -1557 -786 -1801 1562 1500 1484 75 -219 584 1734 1100 987
5716 987 -975 -1681 -927 214 757 -2049 -2202 -1702 1192 2264 3136 749 -435 1011 2809 1856 -510
5733 -510 -1639 -1716 -417 394 -1847 -1825 -2076 -582 860 1149 1065 331 -20 873 2292 1892 1200 -664 -2190
5752 -2190 -1477 323 -572 -334 -2864 -2209 -15 1287 945 -235 -1030 1251 2820 2515 2324 583 -501
5769 -501 -448 322 1215 -2105 -3453 -4595 -1044 1508 132 -260 -1067 593 2728 3132 -294 -1185 -1590
5786 -1590 -154 1987 -1515 -1786 -2545 -954 -1627 -87 -463 -166 -168 934 3424 2741 2841 1932 -1066 59
5804 59 -128 13 -1854 -2981 -2498 -637 -215 493 -1500 -449 125 2145 1454 2780 2 -530 768
5821 768 943 -15 115 -2865 -3104 -1510 543 -184 -1144 -1249 -80 2150 2976 1250 23 1084 1240
5838 1240 1074 361 -1060 -2447 -2325 -1932 -1031 -1050 -2455 -1262 -1596 1700 2807 2969 1634 -687 2217
5855 2217 2492 1344 -1422 -1998 -1641 -1178 645 -779 -1115 -322 -551 785 2475 2042 627 562 396 1304
5873 1304 2022 281 -2721 -2296 -693 231 345 -1987 -2436 -1340 1293 2691 1233 -979 -259 1843
5889 1843 2306 1383 -1459 -2064 -1882 43 789 -722 -1604 -2426 -538 -254 1131 901 -914 -788 1035
5906 1035 2555 1822 -91 -1766 -2694 601 1246 -667 -1844 -2607 -912 -480 264 1262 -739 -683 181
5923 181 2317 3051 2159 -720 -2249 909 662 1120 -1192 -3775 -1991 237 1501 104 -2427 -1317
5939 -1317 1727 2802 2494 227 -607 -972 938 2178 657 -1352 -2487 -1793 -77 -31 403 -1628 -2193
5956 -2193 -129 2056 2692 612 -1113 579 1186 2495 350 -514 -1956 -854 1098 -1033 -611 -1065
5972 -1065 -500 -1402 1538 1546 447 -287 -310 1146 3490 3486 912 -2678 -879 780 1775 -1548 -3237 -2748
5990 -2748 -491 463 1034 -264 -1803 -558 2020 3439 2045 441 -566 -643 1451 -119 -756 -1562
6006 -1562 -3099 -1774 1261 2237 777 -1116 -48 1163 2457 1601 436 -1132 501 262 948 -295
6022 -295 -2539 -2713 -2678 57 -335 -246 -849 -1363 1015 3422 3102 1566 -932 -977 2335 1909 -264 -2829
6040 -2829 -2888 -591 -360 -699 -262 -2201 -817 671 2738 2897 2110 -410 194 1646 2151 885 -2612
6057 -2612 -3406 -1294 -1364 -704 -370 -1967 -1314 1174 2849 1727 786 286 601 1494 1848 759 -705 -2683
6075 -2683 -2074 -18 95 -734 -2025 -2170 147 2654 1852 1118 -185 418 2317 3396 992 -1255 -3392
6092 -3392 -1390 -21 -222 -1522 -2996 -2596 -175 1978 2648 1275 301 633 2052 3023 1521 -1067
6108 -1067 -2608 -1854 175 1199 -2999 -3245 -1759 472 1205 1351 140 715 1981 2827 3871 1970
6124 1970 -290 -1997 -1458 -389 399 -915 -3190 -3244 -1394 344 1756 726 -782 -344 2238 3020
6140 3020 2122 -476 -1654 -1812 937 1235 -1951 -2347 -3409 -704 778 1932 742 150 840 1671 3868
6157 3868 2504 -1008 -1993 -495 1047 1306 -2444 -4115 -2904 -616 859 976 -104 -1519 1023 1457
6173 1457 2404 1614 -706 -1727 250 511 -108 -1165 -2494 -2620 -373 1334 1426 -43 -1227 -1203 1639
6190 1639 1754 1914 -592 -988 -597 785 340 -817 -1238 -2911 -1022 256 823 -571 -1444 -1512 145
6207 145 3106 2266 1722 -1775 20 747 1368 211 -3130 -2131 -1694 1525 1467 -203 -1371 -819 2085
6224 2085 2462 995 -559 -863 -180 513 1262 -1198 -1959 -1611 -1518 941 522 -1092 -1578 100 1153 2650
6242 2650 618 -549 -415 984 1840 2285 245 -1261 -2107 -836 773 1514 -872 -731 -1413 289 1886
6259 1886 2284 -152 -2207 -75 1578 1579 460 -2084 -1491 432 1126 -10 -2142 -1288 -741 1395 1522
6276 1522 864 -656 -270 738 613 1157 258 -769 -841 -1095 1976 702 -2131 -1949 -1570 167 1841
6293 1841 1970 -594 -1875 -192 1558 1702 1592 -1315 -1582 22 632 52 834 -596 -1714 -187 1364
6310 1364 1186 -72 -2440 243 440 874 -316 -706 -1370 -93 1694 1536 -815 -1580 -676 9 1268
6327 1268 1006 -1473 -1396 -287 1080 570 428 -818 -1448 256 1411 630 -306 -2219 -1302 28 896
6344 896 553 -1752 -1065 480 688 313 1045 -529 -786 93 -128 -314 600 -854 -1199 -826 1229 1883
6362 1883 -143 -640 -381 730 2964 713 -790 -836 222 1484 922 -116 -592 -1423 566 1275 506
6379 506 -1119 -537 -701 1220 1437 1029 -247 -418 1346 1675 1101 -833 -2639 -628 -675 1262 -563
6396 -563 -1365 -1522 -416 805 1509 699 -412 51 362 1630 1491 -576 -910 -2222 -1866 918 597 -2040
6414 -2040 -1910 -1162 359 1731 1225 775 -332 1064 1774 1158 395 -1223 -101 114 264 -721 -983 -1098
6432 -1098 -1535 163 1106 862 -61 -741 479 1833 1622 -301 -698 -189 -426 879 -213 -1614 -2127
6449 -2127 -210 746 399 1468 -505 299 1229 176 2837 -240 -167 -1347 -1126 137 221 -947 -3058
6466 -3058 -1609 625 1516 994 -356 502 1274 1405 2073 774 -32 -1221 331 680 453 -1768 -1236
6483 -1236 -1838 184 671 -80 178 -64 446 2000 2786 830 -348 -851 -627 577 -365 -2633 -2289 -1206
6501 -1206 383 354 296 430 -689 832 1455 1133 1430 -2 94 -360 1580 271 -1726 -1922 -1246 -34
6519 -34 138 578 -393 273 218 1232 2020 1813 118 -222 665 222 -374 -823 -2440 -2701 -1978 396 -320
6538 -320 -1674 -604 1223 1510 2786 523 -1043 596 1285 1281 -74 -1653 -2133 -1590 -717 -1470 -1248 -1135
6556 -1135 -1228 700 1014 1029 381 986 486 1061 1076 1696 -445 -2254 -1655 -941 36 -160 -1345 -1172 -338
6575 -338 1136 1247 2034 543 710 239 942 1480 1075 -545 -1029 341 -224 788 -281 -899 -46 333
6593 333 2393 463 436 -402 837 2734 699 0 -645 -1134 500 -958 -554 -1355 -1276 -136 -274 404
6611 404 1014 -773 48 452 1787 815 -51 -334 -929 410 -578 -1156 -415 -1466 -279 72 374 1513
6629 1513 -458 112 776 1305 1072 276 -444 420 626 436 481 -2097 -1623 -749 -55 832 -612 -152 -992
6648 -992 1074 1660 2087 -873 37 62 1393 788 163 -890 -231 -410 -535 -961 -976 293 -764 438
6666 438 909 952 302 122 1809 13 1480 631 -394 -948 -818 -1071 -1020 -1366 -588 -149 -875 857 1519
6685 1519 1124 805 109 638 1042 901 35 -1442 -656 -1089 685 -1186 -1287 -1610 -31 289 -300 -229 -419
6704 -419 -337 1599 1513 1115 -63 -217 -9 -206 -77 -1588 -279 -1135 -112 252 -804 -529 -3 -328 1258
6723 1258 1367 530 451 584 457 -142 241 -749 -1272 -282 -861 -849 -953 -21 -926 -174 1254 1640 1478 1138
6743 1138 -490 -670 1594 416 298 -754 -1968 -688 -597 12 -711 -374 -391 903 57 -395 766 231
6761 231 1213 532 -118 -193 -224 -1410 -1132 -364 -649 -174 -142 -396 658 916 818 1538 1325 1207 1355 938 -90
6782 -90 570 -517 -350 -1250 -380 -642 -1252 -865 -134 581 399 957 466 813 524 1276 606 -16 -393 -1181
6802 -1181 -12 -545 -738 -1554 54 -747 -188 518 447 1018 2002 1262 1432 886 77 13 -556 -1394 616
6821 616 -1078 -1423 -470 -496 852 -198 -722 436 1240 1830 976 -21 1060 302 160 -463 -1168 221
6839 221 -404 -1227 -783 -1 753 -355 509 131 1197 1154 -247 220 -812 29 -539 -278 -262 -400 -867
6858 -867 -630 99 246 -397 -637 -673 31 778 1462 212 104 1070 177 1072 -755 -698 -97 -576 252 -1384
6878 -1384 -184 453 339 1495 159 -900 681 -602 183 120 -786 832 73 -893 -191 -1074 -36
6895 -36 388 -1122 -995 -181 573 59 341 246 844 -46 952 -15 398 952 -738 -209 -1006 -878 -1195 231
6915 231 306 220 1124 795 -649 -1208 945 840 1657 158 -351 835 87 656 -1815 518 -723 -228
6933 -228 -1057 -322 -362 425 939 -604 894 566 1100 -305 84 -362 478 -510 -451 874 -488 -1118 -1244
6952 -1244 -1312 852 52 593 1413 504 -135 1050 169 567 98 517 -66 -1224 -1208 -1365 -191 -288 -1636
6971 -1636 -425 660 264 132 602 448 -138 1121 1240 358 7 -343 113 -536 -348 -813 65 -191 160
6990 160 -206 1173 735 -32 1518 1737 332 940 712 -424 -367 155 -850 -834 141 101 -287 397 1985
7009 1985 668 -155 757 -769 1182 1333 -18 425 -734 -73 -69 196 -2145 -361 -928 480 395 837
7027 837 -393 491 1884 1458 1022 689 -239 -906 129 -1481 -757 -277 -1361 -1444 200 -246 1020 269
7045 269 218 333 1292 1119 -63 650 767 -38 -225 -1037 -1371 -194 70 -557 -119 -505 -15 502 808 -124
7065 -124 1758 -3 84 -109 29 1113 -317 -680 -1060 -1661 -1379 -1346 -565 305 -122 762 33 138 688
7084 688 184 -17 929 -1398 620 -1127 -1261 -1715 -516 -434 50 315 626 1362 589 760 -23 867 4
7103 4 1219 -213 -921 -192 -1735 -1361 -891 -981 -277 -756 -567 -31 571 607 946 -442 54 -1358 -8
7122 -8 507 -276 -734 -1506 -146 -1350 -1167 -942 -976 941 356 782 1051 476 -168 90 -291 323 -2174 -964
7142 -964 -242 195 -330 -679 -1049 -90 476 -461 160 589 -152 1481 1833 -824 421 -253 -24 24 -988
7161 -988 -775 307 -436 532 -563 -1286 -22 1137 1476 609 289 741 368 992 195 -1012 -1042 335
7179 335 197 -699 -458 -404 372 -43 -36 -18 -563 -599 -462 -198 -1088 737 518 -74 -286 -392 -200 -151 -292 837
7201 837 526 -804 -77 -21 -217 531 -735 -701 987 -10 357 502 -111 -537 -530 -538 -175 -89 -1191 -1097 148
7222 148 155 -830 473 46 -823 -214 -1425 602 155 148 591 -65 -874 162 -187 282 353 -1169 1066 -409
7242 -409 -87 -605 1269 266 820 302 448 -818 -933 146 -845 -1245 -758 63 1329 -364 -524 -485
7260 -485 234 475 296 -358 100 199 -765 250 -718 -825 -336 737 578 329 -102 136 -147 698 33 894
7280 894 875 823 1052 -315 444 581 309 -1001 -1115 183 -632 -374 -57 507 -913 97 319 1407 -47
7299 -47 550 1763 92 1020 -325 -1845 -1224 -449 31 -950 -937 -816 -337 496 1000 -61 -843 1557 1020
7318 1020 596 993 -578 -258 -223 -1071 -52 -1511 -436 303 -945 1008 -341 -14 1699 1667 116
7335 116 751 527 633 -82 -308 -276 -433 -394 405 -1033 -511 734 539 758 1953 721 -972 619 139
7354 139 1148 -535 -652 -683 -330 -1077 -603 -2100 -818 1209 570 218 -233 545 657 789 268 721 -778
7373 -778 -646 -1165 -790 -1272 -699 -119 -830 222 -590 698 275 1836 964 730 749 -97 239 -563 -428
7392 -428 -432 -334 -173 -501 211 -1426 -154 302 875 657 1095 418 77 -735 567 -695 -561 -1023 -1620 525
7412 525 -996 143 779 -440 1155 507 -9 1527 546 1524 154 14 81 554 -1347 -1317 -1637 -1057
7430 -1057 -1464 420 -980 811 802 646 1772 507 990 1061 546 142 -72 -1188 -1222 -1183 -722 -926 -947 373
7450 373 1048 1484 591 169 2454 2011 647 839 -67 -60 -307 286 -222 -1367 -385 -25 -155 943 887 540
7470 540 1933 1176 477 1394 1034 -280 -1010 -1213 -813 -1085 -914 -359 -1493 -85 -308 -1018 1049 762
7488 762 952 1867 199 1952 1277 -1198 164 -541 -709 -1176 -401 -1314 -897 -457 220 568 30 559 1752
7507 1752 1612 407 890 470 -130 -41 -1157 -1583 -370 69 -384 130 -119 477 -352 765 1649 749 519
7526 519 761 -644 135 -190 53 -1239 -1459 365 -1973 -70 977 686 374 423 -1525 -205 -129 677
7544 677 -34 793 75 582 -463 574 -867 185 468 424 -380 -1109 -1584 625 284 131 278 471 233
7563 233 -459 -99 -983 571 251 -1263 -1183 -631 -434 191 357 -215 -182 901 39 267 1023 481 1085 995
7583 995 387 1452 1414 1280 -390 -633 -792 50 -573 -781 -1072 200 630 1636 274 995 34 1038
7601 1038 -146 -112 388 -590 -747 -722 -1205 459 129 896 -541 -195 1511 -740 687 -294 720 599
7619 599 1225 906 -90 -589 -523 460 -80 -1282 -33 -148 582 -160 -468 649 134 459 475 446 451 -235 -604
7640 -604 966 -612 -376 -1241 -780 -1119 -517 -663 -191 441 233 903 1033 360 2162 394 -617 -1249
7658 -1249 223 -1514 146 -669 -255 -910 -541 -107 211 397 1742 527 877 1968 -143 -643 -181
7675 -181 199 -754 70 -1185 -974 -1866 -809 -1083 -128 866 232 -178 571 1182 465 676 1265 -60 -146
7694 -146 -843 -393 -1402 -267 -402 -1860 -587 710 726 773 1081 1169 -576 1059 1048 341 629 -1118 -746
7713 -746 -467 -484 -820 -332 -553 -1142 310 -108 1091 868 1095 1577 349 384 -628 -77 -1094 -1158 -836
7732 -836 -1499 -65 -983 -1261 -1132 522 1086 554 551 746 612 1178 1390 756 -484 -170 -447 -1417 -390
7751 -390 -476 23 685 -139 1548 927 -994 1109 760 357 317 867 1083 -904 -1458 -438 -551 -1141 -100
7770 -100 -1441 351 41 -26 341 212 148 621 303 929 546 301 342 -290 -1553 -904 242 -575 20 -509
7790 -509 -332 1037 854 662 940 1402 -350 -516 -164 1051 -54 -645 -1004 -158 -149 -398 307 1094 261
7809 261 1413 78 147 831 670 798 -273 481 235 -1022 -562 -2032 -918 -99 -496 -879 -1179 951
7827 951 224 88 -498 441 -159 -47 676 839 174 -483 117 -584 -1607 -31 -219 -377 -470 -336 99 377
7847 377 -95 -2006 -628 549 431 28 602 220 91 327 -1116 -991 -350 -478 760 408 1180 1065
7865 1065 82 -554 1669 1760 564 -365 -617 -364 -788 -266 -642 -280 -872 526 736 -722 -631 981 539
7884 539 -856 152 415 466 173 650 -60 378 -1125 -72 -733 -487 344 400 -137 -332 -630 158 -311
7903 -311 -297 -621 180 308 -876 -547 -149 -450 -527 -352 -694 -707 -656 -483 -80 -224 681 738 453 -93 -135 320
7925 320 -877 -512 671 -957 247 -315 -1631 -604 -291 -611 -2 -58 -359 -907 541 1320 749 1280
7943 1280 236 795 572 180 663 -436 -1167 -390 -344 386 -90 370 1335 915 -172 113 871 849 -722
7962 -722 -406 484 91 411 657 -1554 -699 33 -4 1006 548 515 458 -816 819 511 -405 -472 -360 -241
7982 -241 685 160 -18 -605 -429 -336 -102 274 -162 99 1647 370 712 531 11 990 215 -723 -843 -972
8002 -972 -452 670 -910 -536 1123 410 119 281 -1035 -709 398 909 -620 161 171 17 -828 -1434
8020 -1434 -771 -604 608 -915 89 1088 243 -432 22 707 1017 293 -183 189 -509 -485 -36 -734 170
8039 170 -1466 230 702 -423 -417 303 652 -689 638 -553 33 38 1092 326 419 -810 258 -283 -492
8058 -492 -604 328 -81 344 -989 280 -62 -508 -288 492 252 -7 229 -386 329 409 -157 -241 -406 -711
8078 -711 -169 -945 -1253 91 1195 -1317 68 483 71 310 204 1152 229 -440 618 -627 246 -141
8096 -141 -368 -580 -805 1058 -132 323 -108 627 138 1177 -536 127 218 -613 -377 -688 -143 -24 93
8115 93 308 147 -1627 -43 -1 -677 -1105 733 107 64 657 -333 -663 450 67 -224 -507 -884 -347 -111
8135 -111 -232 303 -303 -440 -583 1407 -256 126 227 305 -244 -207 -132 -129 152 99 -941 -979 -1073 545 -911
8156 -911 -62 1161 389 452 -1 182 -213 -214 435 -944 -1116 221 -89 -1212 -1164 209 711 1465 73
8175 73 925 -275 -77 486 -246 625 -178 -627 -1128 463 -309 -74 -871 -341 496 1264
8191 1264
$$ Imaginary data points
##PAGE= N=2
##DATA TABLE= (X++(I..I)), XYDATA
0 0 0 0 0 0 0 0 0 0 0 1 -108 108 -108 108 -121 216 -216 315 -324 419 -434 540 -628 685 -800 909 -1064
27 -1064 1192 -1351 1523 -1719 1930 -2155 2418 -2696 3013 -3340 3711 -4120 4564 -5052 5592
42 5592 -6198 6857 -7604 8429 -9378 10449 -11681 13125 -14822 16877 -19393 22602
54 22602 -26810 32631 -41251 55357 -82572 155086 -773315 -2226141 -1752276 -1384060 -1106906
65 -1106906 -1103054 -731490 -230633 429085 925765 1171244 980291 784443 755031 777135 438350
76 438350 -149042 -752184 -1149667 -1346884 -1285141 -1126605 -1001356 -863234 -432723 239792
86 239792 825643 1064745 1098368 1122106 1156605 1064835 793741 350311 -188727 -696930 -985193
97 -985193 -1021868 -933649 -829892 -652454 -314072 178618 705663 1094929 1197584 1049317
107 1049317 906056 936167 926883 574173 -44899 -533125 -713926 -750395 -823761 -927308 -940113
118 -940113 -724847 -231442 346242 691683 739926 730259 811986 868143 746390 431018 -25357
129 -25357 -490774 -751229 -763499 -768352 -945518 -1077899 -868335 -375458 87646 334081 403827
140 403827 419041 484507 596278 593576 347437 -34633 -319311 -431483 -492203 -621997 -808266
151 -808266 -944610 -906593 -635186 -228784 98600 229089 268978 388395 576102 642638
161 642638 456338 121653 -133291 -188947 -146797 -183829 -350700 -515048 -496466 -271948 -14706
172 -14706 117639 148110 207162 340070 477824 540415 475313 285967 89716 33663 104763
183 104763 115944 -34850 -236435 -302049 -182626 5481 124237 131565 125402 236614 443207
194 443207 553550 460535 262231 122153 90065 132472 175139 132404 -1264 -105743 -63613
205 -63613 63565 101034 -5261 -135096 -126144 50211 246658 268703 99699 -52620 991
216 991 183463 242124 90758 -100757 -136962 -26777 68230 22909 -138728 -264950 -231206
227 -231206 -75668 39984 9940 -112781 -177998 -98121 60523 144330 86395 -16161 -12174
238 -12174 116599 212509 120375 -104203 -265518 -255797 -167219 -137668 -175935 -189553 -133986 -37775
250 -37775 52951 111639 118292 84036 66628 106570 173956 190823 104624 -56655 -185043 -176672
262 -176672 -83436 -62491 -157871 -233236 -141876 63784 214116 218437 154339 141563 233615 355282
274 355282 364078 196761 -36027 -163581 -146487 -97523 -131322 -239630 -296266 -192503 39730
285 39730 214777 190063 60505 45398 212109 376557 345813 155892 2970 -11925 25515
296 25515 -22508 -174537 -318949 -331470 -209546 -56232 40255 73348 93916 139410 220172
307 220172 296123 303329 201886 51054 -44780 -53037 -60621 -151925 -293655 -358198 -285479 -133999
319 -133999 -15463 26334 24116 48894 133874 228297 257146 191145 91075 27556 19557 19422
331 19422 -44049 -190155 -329189 -338454 -195357 -32108 21682 -4548 26647 160444 294126
342 294126 301399 176756 35090 -10912 26888 36719 -50463 -189814 -273179 -252735 -168925 -86981
354 -86981 -44218 -37565 -14079 79764 217715 288252 219072 89871 33009 77737 120847 54413
366 54413 -106214 -232839 -232319 -133678 -59327 -66354 -95243 -41839 98643 226466 247956 163594
378 163594 53156 1735 24557 55280 9639 -108177 -199403 -181425 -90134 -35678 -69942
389 -69942 -128571 -101738 32561 175766 216933 142428 60920 59935 107247 98046 6134 -97519
401 -97519 -140674 -123578 -91243 -77923 -83113 -93297 -73582 -5778 86302 146234 127223 52338
413 52338 -2084 -3335 21069 2113 -75307 -141710 -125668 -42287 17020 -3721 -58793 -73570
425 -73570 -16950 74309 140510 135864 76776 30785 45036 82829 59598 -48696 -157050 -162733
437 -162733 -64063 31760 25968 -58602 -99126 -13931 113751 147596 59918 -30508 -16770 65337
449 65337 92593 12037 -95437 -127961 -66945 14759 42614 10670 -21364 -11083 38910 79538
461 79538 77733 37932 788 8087 49461 67634 17350 -71336 -123727 -96872 -41259 -13550
473 -13550 -14521 -6433 27142 59005 72437 68083 48330 10537 -31784 -39592 -13132 14148 -13058
486 -13058 -85053 -120809 -68288 24923 61462 14470 -28458 11026 103541 137059 67550 -28002
498 -28002 -54062 82 52906 31133 -50889 -111618 -101856 -43433 986 -2234 -29568 -24715 32529
511 32529 108075 128826 67165 -28696 -67849 -28698 20276 3117 -62368 -93558 -48843 21610
523 21610 38321 670 -33516 -12341 41754 79925 80100 51696 15096 -14386 -25997 -17306 -16386
536 -16386 -49173 -91707 -96302 -42481 12098 10494 -34386 -48961 6502 84681 106787 59118
548 59118 1171 -15921 1271 8698 -19815 -60083 -72954 -43174 -784 24941 16748 -13499
560 -13499 -36283 -23666 18572 54256 49371 16327 -1279 17726 42635 29558 -19080 -57659
572 -57659 -46507 810 36960 30715 2667 -10637 2312 22955 35585 33387 12695 -11294
584 -11294 -12071 15965 36803 10641 -42620 -58131 -1844 68341 73015 14100 -37119 -19655 34187
597 34187 49266 5532 -41471 -28261 31802 74286 52704 -5389 -41968 -31412 364 14500
609 14500 -1953 -27540 -35127 -15460 8047 26 -40478 -70633 -57219 -7304 30719 30312 6592
622 6592 -175 21553 44535 37669 5636 -15673 -9811 -3020 -19396 -49104 -59254 -52708 -47910
635 -47910 -46256 -24704 20561 51121 39425 7306 3462 28406 44093 19649 -24473 -38518
647 -38518 -12539 11783 -7386 -56521 -82621 -59145 -5784 34999 45330 37713 39862 63502
659 63502 88120 82209 30150 -30344 -47757 -14235 13102 -16046 -75226 -91741 -43786 22071
671 22071 43051 16964 4729 42759 99947 107174 52640 -11202 -26908 -7439 -7237 -42427 -76278
684 -76278 -80810 -64495 -49470 -41301 -25584 3218 36120 66703 89715 103273 94405 59436 14025
697 14025 -20270 -39997 -55312 -76987 -91802 -87722 -69915 -54284 -39941 -17375 8295 27479
709 27479 44335 68468 89351 78168 28787 -18899 -28410 -19478 -34259 -78178 -105138 -77000
721 -77000 -22075 7041 -20 -8753 26943 86289 118563 103918 66270 40779 25645 1066
733 1066 -39638 -78127 -94634 -92627 -76241 -49011 -19666 -197 7913 24025 59531 98406 112495
746 112495 93396 68219 57657 51779 22974 -31864 -82281 -94662 -73678 -50737 -39214 -26863
758 -26863 -4834 23889 49421 69352 85368 84810 63585 42701 34583 21050 -21368 -76483 -101256
771 -101256 -82032 -50661 -39950 -45480 -31355 10291 50063 57248 41993 40286 61615 71937
783 71937 52698 11738 -18308 -34010 -54601 -81755 -93916 -76740 -42205 -16799 -5288 11718
795 11718 36843 58703 59184 42526 24257 18399 17629 5834 -23940 -58640 -75628 -72900 -58826
808 -58826 -45613 -34625 -24936 -5781 28549 59570 61726 33928 15129 30963 55796 41973
820 41973 -8883 -49145 -49225 -30772 -32573 -58424 -71597 -39908 14961 44455 30619 10391 15271
833 15271 35376 36481 13616 -5616 -9076 -1801 -532 -12306 -27989 -35965 -29972 -13203 3363
846 3363 11574 15280 21270 28762 28611 19779 3993 -4483 -2581 1888 -1783 -18991 -30752 -25134 -7139
861 -7139 -4895 -16973 -14756 13718 41111 33411 4199 -12674 775 16269 6990 -15508 -19533
874 -19533 5475 29681 21218 -8986 -26313 -10562 11761 10239 -3235 -9296 -1065 7683 7947
887 7947 -1055 -13417 -19095 -12316 10210 28587 27406 11775 4840 16983 26814 16883 -9307 -20649
901 -20649 -7359 7072 -1759 -27329 -39646 -18113 9688 16275 9128 13930 34182 48460 34383
914 34383 6779 -6656 -2759 -985 -14389 -25500 -22603 -13250 -11387 -18571 -18866 -3133 19131 31686
928 31686 37153 43338 47277 37098 15597 -1722 -11896 -20605 -38401 -48813 -42028 -26831 -20273
941 -20273 -21437 -14025 11556 35275 44239 39663 40117 44788 33332 7214 -21489 -32317 -34436 -42237
955 -42237 -51634 -47451 -31556 -17252 -12165 -4667 13931 38487 49319 44410 37664 36553 29935 -1802
969 -1802 -45152 -66559 -59600 -51152 -55862 -60349 -44454 -7927 21247 25101 19875 31312 55770
982 55770 66502 50128 20465 -125 -11323 -29309 -51738 -66065 -66365 -53539 -34318 -16065
994 -16065 2806 15177 22941 39302 57930 64160 47988 24721 11665 5371 -15005 -52781 -80921
1007 -80921 -75845 -47604 -26064 -24780 -20550 10542 52120 65131 47552 31318 39937 55257 44267
1020 44267 4312 -32925 -45187 -40693 -48105 -62449 -68958 -48619 -9838 17026 24828 26469 35521
1033 35521 48303 51536 38105 16291 -2252 -16173 -27689 -39830 -58981 -72110 -67612 -40065
1045 -40065 -6239 9982 12719 21139 45433 64093 55469 25270 3827 8513 15180 -3362 -42064
1058 -42064 -65299 -57592 -38342 -35776 -43161 -32091 2855 38788 48907 39816 32242 34899 38082
1071 38082 26845 5062 -13857 -22199 -21576 -23158 -28287 -32120 -24826 -8241 11663 29377 35872
1084 35872 34946 34513 36656 34369 21312 -2528 -17199 -13962 -7860 -15303 -32207 -38771 -23271 491
1098 491 8940 8179 13301 35527 52716 46157 23133 9359 8757 5539 -8222 -23811 -24965 -16367
1112 -16367 -12342 -18906 -20019 -11347 390 5366 9388 15608 20280 17674 7442 -1210 -2456 -6233
1126 -6233 -15334 -20308 -16019 -6401 -5596 -12795 -15210 -7320 4345 8213 5017 4040 10415 12670 2240
1141 2240 -11985 -19308 -11726 -7079 -7532 -9891 -2802 5418 5686 -4353 -6166 1626 5058 1428 -5327
1156 -5327 60 8270 5393 -8538 -15483 -6748 6555 6609 -4038 -3480 12145 20622 8414 -10396
1170 -10396 -10116 4607 9219 -1905 -12507 -9242 1911 5249 -2945 -6430 -1438 7272 13412 12913
1184 12913 8236 -486 -7872 -11466 -11942 -11331 -18201 -20455 -12436 3108 11649 3527 -7209 755 21603
1199 21603 29204 15658 -130 1797 13363 11115 -15834 -41253 -38671 -16297 -3838 -16289 -28556
1212 -28556 -16309 12204 25627 15223 3730 8932 25737 30094 13262 -5823 -14844 -14181 -13401
1225 -13401 -17041 -20506 -17364 -8832 6890 18464 20643 13253 9686 19487 30468 25306 4763 -10317
1239 -10317 -8373 -2257 -12672 -36381 -44007 -23282 2818 10104 3554 6433 27472 47311 42966
1252 42966 22572 9419 14074 20991 8474 -17913 -36144 -35031 -26343 -24019 -26812 -24906 -8046
1265 -8046 11458 23302 26068 20748 19008 21006 18376 11592 -713 -15657 -25848 -29224 -30341 -32229
1279 -32229 -38733 -33861 -13443 11612 21629 17706 16490 24381 33105 22391 501 -12526 -11564
1292 -11564 -11455 -21580 -38330 -41271 -32208 -20591 -14882 -9279 5845 23196 33058 30831 25751 22133
1306 22133 18706 8461 -5635 -14151 -18919 -21894 -27531 -27967 -21632 -13294 -3398 9486 24177 37003
1320 37003 41794 38919 30735 28054 20792 9366 -8222 -19030 -16753 -11432 -17152 -27224 -24375 -8483
1334 -8483 10378 17601 19654 26337 38172 43597 34681 20175 12227 4392 -4384 -14250 -17108 -13934
1348 -13934 -14808 -19751 -15896 -645 13647 16794 13707 17563 30594 34000 17532 -4232 -14232
1361 -14232 -9677 -10151 -20264 -31805 -30435 -17669 -6834 -3908 -5882 403 11471 21419 26565 23295
1375 23295 16020 6883 -1730 -8769 -15197 -21695 -31257 -33800 -23464 -11606 -11316 -15694 -11264 3752
1389 3752 17916 16985 8184 6039 14480 17439 1624 -19211 -23866 -12011 -5320 -15684 -24598 -15809
1403 -15809 3472 11556 756 -6117 3090 20563 25218 10907 -2285 -2896 1086 -2401 -12608
1416 -12608 -19901 -21490 -13243 -1318 5434 4684 -1099 -1506 10830 22286 19498 6893 -973 8843
1430 8843 18577 12796 -8674 -24013 -14074 5667 7055 -7767 -16347 -2627 16024 18998 3030
1443 3030 -6836 2529 17851 20048 6451 -6082 -3643 5227 1131 -7336 -10538 -4838 3428 4895
1457 4895 1222 -928 4242 6124 6300 4895 5971 7511 5865 8817 8650 555 -9560 -10812 -3001
1472 -3001 2072 -4758 -12726 -11003 1087 7345 498 -11064 -9030 7437 18945 11762 -4259 -7463
1486 -7463 4176 9983 1170 -12150 -15055 -6858 822 1178 -6250 -10360 -6865 532 5001 6771 5983
1501 5983 4979 3477 2431 1344 -1075 -8055 -17352 -16696 -7466 -1480 -4824 -11289 -6846 4750 10078
1516 10078 8221 5356 11162 18248 17926 11894 4489 385 -2578 -6140 -9511 -8806 -5597 -3905 -4597
1531 -4597 -3275 6099 12776 10720 7587 11499 21353 19718 9832 -1034 -3659 -2230 -4845 -8995 -10378
1546 -10378 -4021 3596 5810 4593 9144 14536 19572 18659 13313 14141 15439 11877 -2870 -14189 -15278
1561 -15278 -11407 -10852 -16878 -16952 -8391 3679 8343 8066 6877 9708 12079 12359 11072 5121 -4224 -14492
1577 -14492 -15926 -12526 -9890 -17426 -23146 -16232 2480 14992 9354 -1908 -620 14769 21413 8473
1591 8473 -10035 -14178 -8555 -5923 -17438 -30306 -30709 -18687 -6963 -680 -9 4915 13542 19998
1605 19998 19078 14714 10264 6329 2890 -203 -5059 -11831 -18263 -17154 -12018 -5354 -1795 761 9726
1620 9726 22472 26783 20125 11842 13149 18862 13357 -3150 -16478 -12842 -1529 -1917 -16609 -21554
1634 -21554 -3319 18762 25978 16371 11880 24324 34050 30038 11646 -3048 -4467 -801 -1136 -12117
1648 -12117 -20922 -20794 -12403 -17 6762 6947 6963 12494 25143 31545 23576 6996 -5091 -3502 -1336
1663 -1336 -7175 -22623 -28620 -20486 -7223 -3059 -8420 -5825 7394 22651 25053 18279 11994 11884
1677 11884 10823 1125 -13197 -20482 -19079 -16893 -20894 -24037 -16178 -4625 1319 2803 5590 14771
1691 14771 21645 19622 12468 5872 86 -6323 -12466 -18264 -20114 -21147 -20109 -14158 -5443 2740 5286
1706 5286 4919 10342 19377 24032 16355 3958 -2490 -4049 -6801 -16684 -25920 -27226 -19372 -11355 -7143
1721 -7143 -4726 491 7015 15772 18855 20763 17731 11528 4950 -527 -5792 -11668 -18936 -26259 -26291
1736 -26291 -17161 -5308 -3746 -6600 -2534 10504 19708 16984 7636 3542 7132 7281 -1424 -13409
1750 -13409 -20329 -20199 -16093 -14297 -12761 -7531 143 6137 10311 14667 14964 11625 8675 8555 5471
1765 5471 -998 -12981 -18869 -17648 -14610 -15508 -17343 -12384 415 10734 11762 9015 12832 20293
1779 20293 19823 12338 2243 -356 1680 -234 -9277 -20890 -17786 -7793 603 -779 -3411 2601
1793 2601 16091 23671 18323 10117 6206 8133 9339 3885 -4845 -10738 -11225 -7338 -3252 -2267 -3077
1808 -3077 -2002 7062 19960 24271 16047 7363 7148 15697 16253 2328 -11560 -9675 -809 4347 -6345
1823 -6345 -15530 -8404 4975 11704 9280 4300 7867 15328 14339 5676 -634 -3651 -1496 -1853 -7487
1838 -7487 -10333 -8629 -4988 -2167 -1674 -120 1166 5641 9666 11187 9785 2332 -1247 670 2489
1853 2489 -2519 -10304 -13521 -7994 -1931 -3408 -11731 -14470 -4126 8126 6857 -4649 -7564 1373
1867 1373 10322 5171 -5975 -11004 -3843 4432 2084 -4838 -8667 -3230 1933 1436 -2508 -3972 -2122
1882 -2122 316 120 1068 -1211 -5119 -7320 -5572 -1881 -2008 -6660 -6572 -3571 1212 -521 -5114 -6694
1898 -6694 -3479 1818 1477 -949 -2644 2295 4389 1755 -1451 -310 2278 3867 983 -3935 -4080
1913 -4080 -1795 -2984 -9157 -10323 -6180 -2434 -1043 -2643 -1066 2485 4789 2111 941 4065 5158
1928 5158 3747 -1343 -4942 -2412 -1535 -5618 -9391 -7047 249 2908 2282 1121 3646 9124 8995 6916
1944 6916 2294 609 886 -805 -2801 -7037 -9949 -10156 -7867 -3923 -576 606 730 6185 11837 11864
1960 11864 7314 3305 3227 7405 5562 -811 -8710 -11893 -5440 -1660 -4538 -9085 -4272 6465 14379
1975 14379 12524 4483 3493 9398 12614 4671 -5135 -8601 -5558 -5303 -9550 -12395 -11174 -5054 152
1990 152 4095 7221 8528 11220 13332 14534 10629 2982 -1587 -1604 -507 -3082 -10889 -16230 -11560 -3522
2006 -3522 450 -1907 -4023 5034 14207 17411 10192 -484 912 4939 4238 -4529 -14120 -12402 -6183
2021 -6183 -1826 -4606 -10043 -5264 6839 13252 11103 6984 7775 10177 9746 3332 -5507 -8890 -10848
2036 -10848 -9702 -7800 -8887 -11460 -11018 -3198 5139 8165 6220 4629 10968 16546 13409 2744 -6900
2051 -6900 -6203 -1898 -3585 -13009 -18548 -10537 -82 2327 -1685 -2755 5036 13311 12970 7559 3306
2066 3306 2451 3943 -929 -8687 -13560 -12317 -9516 -7494 -5476 -4045 -1198 4198 8549 11502 11567 10039
2082 10039 7519 7453 5795 1277 -6987 -13335 -10895 -7449 -7823 -9872 -9502 -740 5792 6997 4907 5870
2098 5870 9266 11455 7649 1089 -1927 -1104 -3005 -9150 -12097 -10457 -5168 -3623 -2144 814 6848
2113 6848 8167 7367 5945 7811 8693 4515 -1518 -3623 -4578 -6352 -9879 -13166 -11923 -6641 -1228 544
2129 544 934 2252 8464 10163 7857 4903 4477 2588 1489 -1281 -4817 -7148 -9834 -7607 -5500 -2100
2145 -2100 27 267 3932 7284 10022 9176 3957 1540 2287 3811 -865 -8404 -10630 -5989 -2642 -5684
2161 -5684 -9909 -5865 4121 9662 6690 4172 6082 11474 13223 6041 6 -3475 -1261 1 -4557
2176 -4557 -9218 -10007 -7398 -2782 -135 113 462 2605 7825 9488 6961 -125 -3549 -671 673 -770
2192 -770 -7418 -10908 -8217 -1534 -252 -3302 -4459 956 9713 13086 8273 1413 1940 6879 8341
2207 8341 -717 -8774 -8854 -2816 -1751 -7692 -11471 -9463 -694 2904 2474 1802 4719 7600 8580 7630
2223 7630 4421 503 -1234 -629 -781 -2780 -6698 -6703 -1623 681 910 -764 834 5789 11658 10236
2239 10236 3733 -1250 2151 4982 965 -7785 -11389 -9265 -2042 -1524 -6707 -8914 -4742 5206 7979
2254 7979 7105 3455 5218 9504 10880 4436 -1211 -4734 -2564 -3002 -5522 -7141 -9821 -8820 -4252
2269 -4252 -1119 1246 1256 1273 3987 7271 8107 2940 -2270 -2783 -1042 -4352 -8207 -11099 -8474 -3506
2285 -3506 -3735 -4590 -4886 2591 7886 7902 5685 8492 10916 9662 3931 -2098 -4167 -4471 -6874 -10546
2301 -10546 -10329 -8541 -4178 -1116 -259 2210 6074 9819 10147 10853 9545 6680 1982 -1883 -3202 -4073
2317 -4073 -6497 -11025 -11827 -7499 -2717 -912 -626 262 7386 13083 14660 10926 5677 5094 2189 -640
2333 -640 -6319 -9480 -12495 -13777 -14310 -8910 -4650 -2864 -2870 203 9716 16288 13078 6410 5076 7072
2349 7072 6914 -269 -11816 -15757 -11750 -7733 -8217 -12172 -8812 -1486 6409 9376 9246 8877 10567 11887
2365 11887 10552 5178 -304 -6006 -9281 -8823 -10963 -10425 -9434 -7240 -741 4493 9155 11663 13555
2380 13555 16150 16922 13752 10517 5754 2007 -4272 -9524 -14239 -12492 -7705 -5736 -7393 -4597 2510
2395 2510 15559 17153 13098 9094 12662 18281 15904 4319 -6972 -11307 -7498 -4769 -8812 -14579
2409 -14579 -13455 -5254 4806 10233 8730 7434 8735 14205 16607 11677 -537 -7724 -8800 -6349
2423 -6349 -10036 -15387 -19923 -14849 -4365 3373 4123 2798 5908 12160 16604 13184 8173 2366 227
2438 227 -2227 -9126 -13775 -14755 -13667 -13919 -13286 -7195 -1537 4592 5551 4983 8879 12670 12142 6645 -426
2455 -426 -5472 -6289 -7297 -9541 -16164 -16663 -13321 -7031 680 3028 2870 3311 7157 13717 16025 8141
2471 8141 -1339 -5028 -2301 476 -7789 -16102 -19464 -12961 -3951 -543 -3623 -5566 667 9149 14208
2486 14208 12014 4545 1947 1747 1378 657 -5402 -10737 -14382 -10053 -3624 -933 -1315 -3768 -848 6842
2502 6842 14237 13414 5614 731 2474 5032 3149 -5155 -11436 -11421 -7569 -4961 -4213 -4028 -2879 261
2518 261 5048 10083 13332 10114 3706 3371 7218 8596 2852 -3932 -8432 -6360 635 -523 -3550
2533 -3550 -6675 -2248 2547 7265 7952 5284 4416 1768 4102 5363 4466 498 -5915 -7896 -1695 2839
2549 2839 1493 -5988 -9774 -636 7413 10704 5889 -406 294 9248 11397 6449 -1882 -8032 -3774
2564 -3774 1175 3910 -1287 -8639 -11183 -4007 5553 7628 717 -4944 -2536 7814 12978 6698 -3487
2579 -3487 -6090 767 7785 4869 -5135 -9190 -5586 373 3603 -89 -4134 -3244 -765 5135 5594
2594 5594 4544 404 -1908 -1203 2104 3524 -677 -5082 -7869 -5139 -866 838 -3544 -6580 -5946
2609 -5946 1690 5556 7171 2841 -1831 -286 3751 7710 4818 -2949 -9119 -8028 495 3863 -2841
2624 -2841 -12326 -12075 -1195 9716 7663 -1324 -8847 -967 10066 11056 2677 -8467 -9424 -2121 3626
2639 3626 331 -7189 -14258 -10600 548 7282 5228 -2154 -4768 2914 11104 11880 5001 -5637 -5980
2654 -5980 -694 4152 -886 -9455 -14825 -10773 -1000 2652 762 -2249 -3042 3756 9605 11073 6513
2669 6513 1683 -3370 -983 3149 4309 -1796 -10262 -12169 -3682 3707 5660 -175 -5747 -158 11655
2684 11655 14419 7524 -1380 -3418 -4 4549 2466 -5049 -10808 -13438 -4570 4318 5334 -2570 -5246
2699 -5246 -1019 11153 16754 12287 1531 -4912 1297 9031 5815 -4858 -14272 -13548 -3452 3288
2713 3288 1071 -5983 -7969 -139 8693 14642 9884 544 -3101 1369 7649 7252 -2928 -13121 -14695
2728 -14695 -3960 5274 2298 -6802 -10986 -1038 12325 16542 7554 -763 -1225 4948 9394 5869
2742 5869 -4583 -11156 -10815 -4919 231 -6 -5068 -9136 -3050 7003 13846 9662 1895 -1585 3813
2757 3813 10466 6963 -858 -9785 -9396 -4453 1724 1363 -3510 -6799 -3594 3896 12297 11032 3753
2772 3753 -3239 -858 8334 11234 1595 -12520 -16129 -6639 5673 3367 -6924 -14015 -6896 7994
2786 7994 16034 9446 -3031 -5403 2966 12772 10474 -1046 -12362 -11617 -3408 4752 1644 -7444
2800 -7444 -14759 -7261 7303 13925 7325 -5720 -6717 3903 13015 7058 -3922 -13989 -9245 -1024
2814 -1024 1847 -1719 -8506 -9823 -4110 5218 10877 7034 1735 -2905 584 8362 8891 2018 -9637
2829 -9637 -12082 -5549 1616 2873 -5951 -12607 -6832 4934 12189 7766 -843 -4239 -1157 8176 11777
2844 11777 2925 -9106 -12107 -5678 5203 5190 -3791 -12033 -6548 6907 15516 12540 -135 -5879
2858 -5879 2027 13779 13823 -347 -13588 -13367 -1501 5897 3672 -7985 -12031 -5799 5479 12991
2872 12991 9569 -559 -5931 2657 11428 12924 678 -10766 -11040 -1969 7013 3162 -6190 -11889
2886 -11889 -5667 6035 11557 7399 -2310 -6305 599 9808 9153 84 -10510 -12723 -4747 2314
2900 2314 1766 -6195 -12746 -8014 4107 12193 9034 -480 -5691 976 11431 12718 1296 -10635
2914 -10635 -12392 -4254 4217 844 -6909 -13687 -7486 3421 11179 8778 284 -4778 -756 10148
2928 10148 14116 3016 -9392 -13838 -5461 6234 5112 -6565 -14519 -8426 5187 14904 9165
2941 9165 -295 -4734 2360 12358 14210 4011 -9363 -12088 -4251 5176 3976 -6759 -15466 -9398
2955 -9398 4955 13915 8999 -3403 -6427 2161 13704 14866 1471 -9705 -9921 167 7226 2070
2969 2070 -7933 -12275 -6816 4555 9243 7273 -317 -4693 672 10579 12312 4729 -6829 -10991
2983 -10991 -4428 5673 4122 -5844 -14280 -10477 2269 10556 5791 -1818 -5245 -51 8987 12759
2997 12759 5505 -5284 -10332 -3707 6309 8313 -2845 -14486 -12572 996 11548 7907 -4982
3010 -4982 -11230 -1574 10817 14689 3208 -9354 -10968 -1660 6822 6089 -6822 -13859 -9917 2017
3024 2017 9714 6035 -5446 -9198 -1186 10662 14372 4136 -8485 -10144 -393 9279 5847 -5965
3038 -5965 -14475 -8890 1305 6428 1880 -6290 -9659 -1107 7548 9656 4031 -5108 -7379 -1505 7435
3053 7435 7580 -1307 -11421 -9277 1025 8986 5975 -4764 -10096 -3554 7947 10976 3294 -6219
3067 -6219 -9251 -1117 6903 8150 -1808 -11482 -10071 274 8006 5579 -4565 -12095 -5610 6988
3081 6988 13008 5899 -6977 -9292 -28 12052 9712 -2057 -11107 -7723 2899 11205 4763 -5966
3095 -5966 -11526 -5238 7316 9397 4752 -7269 -8531 -326 8363 9840 -736 -10274 -8195 2027
3109 2027 10804 6485 -6095 -10603 -3933 7602 10408 2376 -7777 -8607 2834 9154 8522 494
3123 494 -7070 -6875 3296 9354 5596 -5311 -9093 -5548 3848 9086 3129 -7149 -10131 -860 8535
3138 8535 8518 -263 -7046 -6224 2390 9231 5719 -3572 -9669 -5658 5517 9548 3447 -4983 -8841
3153 -8841 -2730 6680 11773 568 -8919 -8817 -77 10114 7309 -3305 -12253 -6427 4947 11336
3167 11336 2413 -8092 -10181 131 9678 9963 -335 -8791 -6308 3231 10776 7114 -3600 -9709
3181 -9709 -3468 7693 10452 3578 -8288 -9697 -917 7869 7278 -1692 -10632 -8889 2378 8036
3195 8036 4407 -5469 -7261 -1293 5224 8474 4411 -3078 -7575 -1617 5678 7980 1355 -7471 -7798
3210 -7798 1682 8169 7003 -2372 -9848 -4647 5598 10317 4461 -5994 -7312 -389 5816 6970
3224 6970 892 -7731 -7543 -1060 5818 5961 -2336 -9560 -6737 5343 11358 7718 -4405 -8559 -765
3239 -765 10255 9485 -289 -10804 -9949 -716 6493 3767 -6442 -11128 -5187 3853 10019 4986 -4109
3254 -4109 -7036 -1019 8758 8485 52 -9657 -9804 -926 6270 3211 -4892 -10388 -3974 5475 9782
3269 9782 4752 -3439 -4692 2202 6507 8021 446 -7192 -8313 -3238 2011 3018 -4502 -10937 -6600
3284 -6600 3521 9862 6067 -2399 -5415 1363 9709 9670 1537 -8511 -8021 -853 3836 3454 -5864
3299 -5864 -10286 -7078 1843 9139 6491 -1758 -6162 419 8687 11160 4190 -7117 -9680 -1377 3944
3314 3944 2412 -6772 -12037 -8523 2758 10063 4990 -3410 -3268 3537 10609 10926 4530 -5810 -6556
3329 -6556 -1208 3826 2948 -7528 -13601 -10062 -315 7188 4023 -3616 -5294 2270 11176 10855 2013
3344 2013 -5017 -4690 1151 5181 929 -7261 -10209 -7276 -412 4713 3421 -1758 -3365 1817 9073
3359 9073 10441 5260 -2760 -4591 1302 5068 2896 -5924 -11405 -9221 -758 4227 711 -3323 -4371
3374 -4371 95 9610 11967 4736 -568 -3714 991 7265 5646 -1576 -9922 -9569 -1431 5460 2748
3389 2748 -5134 -8240 -811 9120 11427 4937 -4046 -4060 3183 8051 2687 -4594 -9973 -7344 -1466
3404 -1466 2524 -138 -4978 -7418 -1320 8157 10754 4110 -1774 -2517 4109 7800 4859 -3238 -9868
3419 -9868 -6230 -1214 2023 -891 -6107 -7167 -521 5066 6441 3342 -361 -1158 2163 6824 6462
3434 6462 -160 -6289 -6328 -1606 4215 1658 -4619 -5986 -1853 5801 8709 3486 -2013 -978 3530
3449 3530 7373 6259 588 -5480 -4107 -956 3949 1667 -3098 -7859 -4781 2431 7492 5090 -2000
3464 -2000 -4085 1804 9365 7201 206 -5233 -2725 2847 5593 1968 -3829 -6809 -3444 3098 4953
3479 4953 1450 -2756 -3766 1453 7086 5782 -264 -6072 -4518 1663 6022 1919 -5109 -6331 -3547
3494 -3547 2848 3873 -383 -5657 -4144 1423 4403 3093 -270 -1950 -976 1078 4388 1947 -1193
3509 -1193 -3770 -3557 1332 3571 -523 -5766 -8041 -3780 1956 1932 -1226 -5519 -2655 3050 5651 4076
3525 4076 -869 -2646 -1435 1676 4478 676 -4984 -6851 -2612 891 3691 -1276 -5798 -3364 1725
3540 1725 8371 5672 -1259 -4469 -842 3546 4478 -346 -7583 -6756 -3283 -508 178 -2981 -6284 -2205
3556 -2205 3470 6706 4955 2599 302 1572 5768 5522 1566 -5520 -7365 -4321 1577 -628 -5201
3571 -5201 -6413 -3552 2895 5101 4343 694 706 2998 5113 5341 1399 -2507 -4947 -4069 -2562 -1118
3587 -1118 -2997 -5277 -5580 1473 5307 7020 4000 1204 3452 7784 7059 3265 -2912 -5018 -3456
3602 -3456 -3132 -3186 -5510 -6664 -5558 -1096 4689 4817 3318 2470 4655 7867 9251 4657 -1655 -4169
3618 -4169 -3304 -1065 -855 -6353 -11045 -6793 -4 3464 3906 2030 1558 5323 7987 8694 4287 122
3634 122 -2572 -4224 -2877 -1999 -6279 -10753 -8398 -2866 1646 2917 1096 1391 6107 9447 9803 5064
3650 5064 1573 -333 -501 -953 -4512 -7051 -9044 -8161 -4655 -588 294 948 1711 3575 8221 8994 7312
3667 7312 3155 -968 -334 42 -1788 -6299 -9744 -9170 -5266 -1509 395 913 1002 4972 7429 9701
3683 9701 9327 5292 2037 -75 -460 -1350 -5155 -10430 -11804 -7722 -2612 -728 -3404 -3308 2010 8538
3699 8538 9347 7054 3783 2361 3982 2758 -164 -4659 -7789 -8402 -6373 -4675 -2485 -2382 -1431 1847
3715 1847 6306 10532 9071 5177 3326 3043 4001 -593 -5689 -8333 -8620 -7651 -6462 -5328 -5565 -2381
3731 -2381 1693 4708 6902 8216 8182 7006 4862 3480 2707 -280 -6097 -9408 -8905 -5573 -4055 -6156
3747 -6156 -4864 -736 3656 6779 7034 5815 5297 6048 4993 2467 580 -4030 -6614 -7447 -7014 -4533
3763 -4533 -6705 -5675 -2591 2359 6896 7789 5884 5919 6609 7457 5179 1181 -4163 -5848 -5792 -6086 -7216
3780 -7216 -8098 -6626 -4017 373 3119 5971 5964 5755 5921 6551 6635 2072 -985 -4183 -5433 -4203 -6763
3797 -6763 -8002 -7424 -3785 -345 2866 3490 4189 6522 7997 8022 4975 2540 129 -1839 -4972 -4862
3813 -4862 -6777 -6266 -7814 -6748 -2653 1386 4450 3906 3574 6684 8126 6728 3731 1157 -1522 -2022
3829 -2022 -3569 -4736 -7111 -7085 -6324 -3898 -1538 892 2794 3116 4405 5722 7167 4082 1596 -1946
3845 -1946 -2668 -3084 -2710 -6366 -7080 -5964 -2570 -1533 -110 200 3237 5190 6732 5144 5455 2403
3861 2403 1682 -80 -1548 -3113 -4304 -5848 -8517 -5362 -1732 -305 -1919 -132 2644 5567 5774
3876 5774 2041 1976 2310 2763 -530 -4306 -4506 -5200 -4609 -4046 -3031 -1622 204 1012 1488 2942 5044
3893 5044 4637 4789 1149 346 -206 -963 -3275 -4055 -4045 -4012 -3117 -2387 -1720 -870 793 2516 3096 3630 5029
3912 5029 3952 1564 1813 1903 603 -2563 -4332 -3802 -544 -279 -2329 -2511 -339 3918 3927 1266 1084
3929 1084 2212 3053 2659 592 -1109 -2034 -1905 -2253 -2371 -2309 -1750 -640 -10 711 1874 2522 2162 1654
3947 1654 1945 3096 1405 551 -933 -888 -723 -1453 -2933 -2103 -1903 -786 -545 -1702 -43 2238 1288
3964 1288 973 1275 2054 1960 600 243 -973 -714 -1085 -1738 -3172 -1365 -1153 -991 -208 337 1965 2687
3982 2687 1980 2880 2079 894 1466 289 -780 -427 -2265 -2427 -3891 -3147 -1299 -1318 -663 -1991 434
3999 434 3399 3331 2565 2437 1417 3230 2103 87 -950 -1469 -1414 -2449 -3794 -1939 -2171 -841 98
4016 98 1336 2780 3119 2314 841 2358 1084 1188 -529 -2006 -2503 -2193 -2609 -3966 -2382 -93 1365
4033 1365 833 495 2516 4145 4176 4203 1474 1960 2435 593 -2730 -2574 -3590 -3339 -4376 -3623 -2294 -733
4051 -733 627 712 2570 3560 4137 2703 1235 2007 465 -988 -1069 -3836 -3905 -4122 -2433 -3449 -739 657
4069 657 1781 2329 2150 2896 3678 4020 2220 -297 -1629 79 -2066 -3894 -5270 -5590 -3193 -1865 -1003
4086 -1003 -603 1507 3262 3943 3200 4427 3396 2521 317 -2527 -2057 -3889 -4721 -4682 -4229 -1848 -1941 -2550
4104 -2550 -1090 2566 4704 3347 3019 2263 4451 3033 -766 -3109 -4065 -2797 -3951 -5737 -4776 -2482
4120 -2482 -1180 -319 476 1196 4061 6464 3793 3326 1248 1633 -367 -2766 -3371 -4751 -4864 -4694 -3474
4137 -3474 -2175 -862 1186 2516 3448 3763 4946 4219 3811 2541 534 84 -3065 -4722 -3638 -2692
4153 -2692 -3532 -2263 -2337 105 2016 3355 3711 3654 5544 4994 2883 555 -135 -1061 -2997 -4812 -4396
4170 -4396 -4649 -4461 -2060 -2220 1282 2214 4679 3441 4697 4729 3867 3633 957 -288 -724 -2388 -2907
4187 -2907 -4698 -4339 -2416 -2498 -911 710 2499 4462 5470 3147 3205 2530 2435 935 -674 -2742 -3556
4204 -3556 -3878 -4521 -4298 -2600 255 818 897 1785 5316 5108 3855 3427 3289 2012 354 -2652 -3670
4221 -3670 -3628 -2360 -4682 -4613 -2866 78 2125 1764 863 4483 4832 4574 3032 1172 1272 -348 -1440
4238 -1440 -2469 -2981 -4324 -3345 -2011 -1029 -1477 984 1586 2326 2866 3081 2849 2015 747 -601 -1092 -1716
4256 -1716 -3602 -4663 -3882 -2676 -4027 -1926 -762 989 2414 2565 1742 2663 3759 3044 630 375
4272 375 -1647 -1050 -2123 -3714 -4526 -2670 -1084 -1625 -2182 -244 1505 2122 2221 2396 3466 2923 485
4289 485 -289 -1631 -3036 -2014 -3047 -2934 -2054 -514 -1714 -1400 1033 2748 3438 2556 1775 2269 3018
4306 3018 1654 -944 -1979 -1878 -2160 -2333 -3177 -3862 -1600 -1154 -307 327 20 2537 2626 1702 2633 2277
4324 2277 1422 291 -423 -847 -2017 -652 -2437 -2272 -693 1188 503 907 615 2671 3326 2495 917
4341 917 1128 1284 114 -2265 -2582 -1440 -2046 -2439 -3295 -2614 -289 503 725 1306 1391 2324 4339 1999
4359 1999 246 1138 1176 -26 -2660 -3172 -2722 -1607 -1682 -1094 -763 171 94 1763 1155 1264 2071 1335 1114
4378 1114 5 -171 -1115 -2102 -2244 -2493 -2526 -1341 -2403 -716 1061 2198 1839 2503 2059 3078 1688
4395 1688 1357 869 284 -322 -1958 -3709 -1989 -2661 -2016 -1669 -2023 -358 828 3061 1324 840 1883
4412 1883 2725 2321 216 -254 -487 -1302 -2089 -2679 -1858 -907 51 105 1494 1430 2372 2838 1226 1319 831 1346
4432 1346 529 -568 -1864 -2488 -2931 -2525 -2910 -1272 -705 294 846 2961 1699 1756 2177 1476 2056 1209
4450 1209 212 -2566 -2386 -886 -1015 -2851 -2189 -770 981 1643 834 -33 986 2164 1450 619 -281
4467 -281 -1266 -286 -2316 -1415 -2109 -1702 -1794 -352 -359 1160 1312 2348 2484 1112 2616 2112 856 246 -1034
4486 -1034 -1224 -1918 -1100 -1577 -2377 -519 -90 -295 -796 1310 1084 498 866 1667 1103 957 -1416 -1790 -1373
4505 -1373 -75 -1208 -2430 -2757 285 213 -215 -220 1398 1349 2095 1000 283 51 226 -1124 -1031 -993 -1483
4524 -1483 -715 -2108 -308 1124 346 259 -196 278 2293 1796 1225 -918 -135 -169 977 -358 -2260 -1468
4542 -1468 411 364 -908 -783 -455 -56 570 284 -1319 627 -436 368 -268 -445 33 -1151 -2140 -1396
4560 -1396 -602 134 -488 -1137 -599 1026 694 1596 784 982 457 116 -441 -327 -372 -681 -2642 -1706 261
4579 261 -1452 -402 -1957 -332 2221 1926 -19 646 724 2538 822 -229 -877 -1299 401 -149 -128
4596 -128 -633 170 816 322 204 1178 1553 1446 -555 -587 631 1235 -363 -1647 -1613 -1152 577 63 -1334
4615 -1334 -1683 11 362 1939 -114 -322 584 582 996 1015 211 746 -123 -628 -772 -311 -1436 -1151 -1879
4634 -1879 1563 918 -834 -697 298 1004 -93 -184 -291 50 284 -421 -1770 -1163 -638 -485 -165 -530 40
4653 40 1973 1349 882 -293 842 2007 1013 -829 -1170 -259 677 -1473 -1703 -3417 -114 317 -290 -738
4671 -738 646 -411 433 633 1875 565 307 967 -449 655 1016 -1116 -1933 -1083 32 662 -732
4688 -732 -1657 -698 886 2397 1270 -706 964 2200 1388 -1251 -2005 -670 -189 -1015 -1589 -2484 109
4705 109 -191 226 192 731 2607 413 1198 1188 1236 1005 -856 -759 -1794 -201 -1453 -788 -1543 -772 23
4724 23 310 1027 2056 1817 2019 748 -705 1000 1801 -395 -2288 -2298 -1329 -608 -1837 -2635 -485 1069
4742 1069 1820 1743 825 625 2543 2388 343 1492 -946 -123 -1514 -1775 -1419 -1959 -2493 -1775 -1677 669
4760 669 193 1253 1099 1466 2589 1494 1226 487 -242 -907 -1087 -833 -988 -1938 -1418 -874 169 373 1065
4779 1065 1883 712 1576 1248 2417 1391 -1321 -2088 -1043 -1336 -2469 -3704 -2664 -1038 -215 294 1068
4796 1068 1383 2529 2284 1710 1609 2204 596 296 -724 -813 -1508 -2081 -1888 -1168 -109 1109 520 -182
4814 -182 827 2314 1792 437 -336 1059 565 -1822 -2155 -1558 -503 -1254 -2099 -1662 125 287 1360
4831 1360 1164 920 1740 2470 1982 37 -639 -210 -472 -1750 -1763 -3516 -442 -400 -266 -1048 -1764 547 1960
4850 1960 1639 509 2091 1346 -243 -293 -412 -541 56 -1494 -141 -554 -452 -620 382 493 950 75
4868 75 418 155 123 1541 -408 -1662 -1459 202 465 -1956 -1609 -713 629 623 -610 -605 1370 1061 1193
4887 1193 -242 -164 78 1064 1298 -1421 -443 -228 422 355 -989 -118 364 -503 -692 621 -411 -126 9
4906 9 432 -414 226 -119 43 147 767 562 -211 -418 -380 758 317 -807 -1410 586 -114 171 -1196 422
4926 422 723 1934 -431 -519 117 -79 -78 -426 -1262 -76 114 -1712 -1804 -1019 -612 799 143 134 333 944
4946 944 1679 1391 931 1387 805 421 474 -694 -1185 -1976 -770 -2116 -701 -876 593 -647 126 197 2626
4965 2626 788 952 -53 1245 -202 -1766 -1729 -1231 103 -642 -1612 -1437 930 1331 1493 1562 1468 2751
4983 2751 2673 1522 1237 -177 96 -590 -1835 -1609 -2772 -2380 216 -1243 -104 871 1451 2083 2526 1736
5001 1736 1759 1308 950 751 -1766 -1189 -2642 -1936 -1236 -896 -804 -1160 -579 2006 2890 4071 1194 1106 2054
5020 2054 1346 -1547 -2093 -1304 -2089 -1530 -3116 -2110 -2214 206 731 727 743 3242 3729 2012 1647 1110 1461
5039 1461 643 -1480 -1675 -1481 -1895 -1732 -1855 -171 -123 -596 910 1364 2475 2177 1708 1293 1205 346 -534
5058 -534 -3339 -2408 -2835 -776 -2022 -2506 -1470 710 1311 1402 1667 2539 3634 3313 1796 -190 86 -865
5076 -865 -1089 -1513 -3438 -1368 -1060 -1208 -828 -2 609 883 1248 362 1896 2015 2563 360 -103 -701 -483
5095 -483 -1744 -2088 -502 -863 -1007 142 604 1098 3180 1365 2478 1483 1306 928 -928 -924 109 -994
5113 -994 -1405 -3439 -2137 -1725 -1061 -1342 -279 593 2669 2776 2351 1317 1238 1738 845 -820 -1430 -396
5131 -396 -931 -1005 -1796 -1440 112 491 -15 303 915 1341 1686 783 1289 743 -454 -53 -456 -355 -445 -1101
5151 -1101 -1824 -511 395 515 -427 313 998 1135 2100 1799 164 -107 743 -96 -1775 -1820 -750 -862 -2228
5170 -2228 -2321 -714 -546 -185 -474 -976 -364 1937 1284 393 644 429 -97 -43 -991 118 -518 268 -854
5189 -854 -206 -1310 -189 -6 -621 99 1944 1297 370 1490 334 1166 -1052 -1317 -768 -71 -864 -2393
5207 -2393 -1889 -2324 -410 -71 -316 -217 1014 2288 1929 870 -78 1932 1996 296 -1438 -362 -794 -88
5225 -88 -2037 -2002 -1588 -825 82 -176 845 762 912 1031 996 1256 446 644 -679 -1367 -940 -541 -1151 -1832
5245 -1832 -3056 468 409 -421 1646 1808 1972 2783 1402 1110 894 182 -1190 -2037 -3389 -2076 -1894 -2375
5263 -2375 -2365 -1106 772 1575 2583 1171 2561 2676 2513 1669 -275 -176 -673 -2909 -1809 -3635 -1966
5280 -1966 -2051 -1127 -739 1103 1520 2537 2031 2383 3184 2297 1547 245 216 -1908 -3750 -3767 -2762 -2995 -1352
5299 -1352 -1235 -758 850 2988 4215 2289 2420 2102 3175 2416 -1316 -2920 -1739 -2460 -3283 -4457 -3712
5316 -3712 -633 411 -102 -804 2541 3669 4961 2792 650 1721 1156 -1287 -930 -3729 -3351 -2403
5332 -2403 -3082 -2218 -1302 1062 1762 2298 3487 2830 4304 2566 2888 1630 302 -1702 -3602 -3998 -2049
5349 -2049 -2908 -3091 -3048 -1294 1855 1663 2762 3032 3001 4586 3002 969 -376 -766 -449 -2103 -3093 -4224
5367 -4224 -1514 -797 -1328 -455 314 3413 3760 4024 2906 2311 1344 945 -635 -2442 -2584 -1751 -2358 -3567
5385 -3567 -3316 -1595 -670 1276 2286 3278 2002 3352 1943 3589 3544 523 -43 -2529 -2524 -1267 -2820
5402 -2820 -3499 -2013 -1386 -518 -226 1200 1114 2280 3516 1693 1732 574 227 -2379 -3162 -2772 -1357 -2446
5420 -2446 -3015 -2897 -829 1285 2304 863 1159 2269 2043 2569 1146 -1355 -1349 -1488 -2017 -2261 -1984 -1622
5438 -1622 -2357 -388 -292 1155 -419 1219 2245 1793 3328 2268 949 -1303 -121 103 -1740 -2152
5454 -2152 -2748 -1696 -631 -255 -772 486 1954 2149 2116 2076 1732 1183 -307 -806 -643 -678 -1024 -1826 -2545
5473 -2545 -1694 -100 -423 912 535 954 1895 2409 1652 1112 932 317 -48 -1116 -1102 -1141 -2222 -1591 -1028
5492 -1028 888 797 480 -682 2139 2771 1764 338 -663 -239 1010 -265 -1964 -2720 -2133 -101 -382
5509 -382 -837 -1124 905 774 844 2101 1528 209 340 520 1921 505 -1001 -2078 -2314 -266 -718 -1274
5527 -1274 -236 58 588 1258 1757 1228 247 577 455 371 -136 215 -805 -1193 -997 -806 1396 246 -2925
5546 -2925 121 1489 3327 871 -492 -1452 43 2020 195 -1644 -1796 -798 958 285 -415 -627
5562 -627 -856 434 1246 1348 224 -24 6 2081 1174 112 -1249 -224 -1373 -1015 -31 894 -1260 -885
5580 -885 882 1678 975 -243 -157 -145 -208 93 720 859 -491 -527 -2196 -923 654 -331 -1070 -732 463
5599 463 2522 890 256 -1001 -235 1487 206 -831 -2215 -787 -309 -114 -1269 -1874 -1194 -669 1328
5616 1328 1302 1743 163 -665 507 2617 1017 -149 -1947 105 798 400 -263 -1204 -1029 -1669 1189
5633 1189 881 -798 175 179 815 1646 170 -389 -1174 -413 253 -444 261 -1162 -2618 -786 -184 1319
5651 1319 1123 -1487 1143 212 2480 1431 -162 -1719 -919 550 434 82 -1502 -339 -900 630
5667 630 813 542 -480 -1197 -831 1136 2092 536 183 -1831 -832 1655 402 -2889 -1780 -1012 789
5684 789 635 -804 -1095 -349 859 1647 3546 691 142 -983 764 249 1264 -1876 -2496 -1730 -6
5701 -6 1715 -118 -1221 -1486 -188 1017 2552 563 131 -82 587 1543 -611 -2589 -2128 -2006 -1077 1890
5719 1890 364 -235 -325 458 1531 2825 2250 -177 -1325 663 2108 1326 -1949 -3197 -1988 76
5735 76 410 -1181 -2153 958 1442 1631 2513 1840 1755 -399 892 1312 436 -794 -1082 -2598 376 -440
5753 -440 608 -1698 -1623 -522 1970 3075 2661 204 180 1505 1912 458 185 -2226 -1251 -1745 376
5770 376 98 -2653 -1386 -413 1637 2464 1887 355 205 1717 3681 1958 -1618 -2267 -1801 605 -771
5787 -771 -2698 -3078 -1246 -1392 334 1502 1168 1356 1919 1569 2059 1250 -92 -1535 -1897 -1544 -219 -153
5805 -153 -2231 -1608 171 1857 1314 1448 658 457 1925 2560 1018 141 -978 -1373 -2020 -840 -415 -2851
5823 -2851 -3334 -774 935 2028 666 303 -55 2419 2905 3199 80 -979 -884 674 64 -1647 -2867
5840 -2867 -1964 -1621 11 1691 655 -446 -774 743 2836 3388 2181 -1159 -2055 -233 -67 -1387
5856 -1387 -2463 -3698 -2256 44 1065 833 -1645 333 1894 3121 2359 820 731 -271 548 917
5872 917 -243 -1579 -3950 -1990 -1044 1707 -150 -2808 -2424 559 3568 3044 -759 -1506 214 873
5888 873 1514 27 -2507 -3636 -1424 -737 1205 345 -1366 -378 1155 2171 1526 -102 -630 -637 1235
5905 1235 1733 -153 -2423 -2391 -2816 -1066 326 -1316 -1878 -1055 1376 1250 1840 -349 -73 228 416 2046
5923 2046 1643 -918 -470 -1350 -524 1181 310 -2450 -2678 -910 1966 2775 1409 -1606 -98 2618 2631
5940 2631 2312 104 -1141 256 1063 -793 -853 -1688 -1196 -898 834 810 274 -1237 -895 1365 3014 1440
5958 1440 510 -1991 81 790 420 -961 -2735 -2349 -1254 949 750 452 -543 -1075 -660 2439 835
5975 835 1520 -964 -796 958 289 1787 -2556 -2838 -1268 449 2099 857 -1565 -1184 2587 2985 1775
5992 1775 507 -1366 -154 1526 1693 -441 -2111 -2010 -1013 97 207 -627 -2271 -2682 -17 3151
6008 3151 1491 614 -697 1025 2333 1691 272 -1109 -1370 -1661 465 -689 -742 -2576 -862 -635 1359
6025 1359 2541 50 180 393 1825 2667 1435 -1338 -3220 -1644 321 -272 -2184 -4774 -2332 600
6041 600 1387 1664 -21 -290 1247 4023 3147 1673 -938 -1301 -778 6 152 -1922 -2928 -3389 -538
6058 -538 686 331 734 -1892 1257 3320 3198 1368 -478 -576 429 -280 37 -1954 -2754 -2238 -1403 423
6076 423 1767 973 -414 895 3335 3310 2384 610 -2164 -564 687 1142 -1098 -4373 -3014 -901
6092 -901 387 289 -1126 -2092 593 2711 3234 2160 392 -588 254 1011 939 -1190 -3859 -2484 -399
6109 -399 1293 894 -1664 -1359 128 3659 3017 1429 -169 -539 1442 1424 424 -1803 -2041 -2437 -1055
6126 -1055 -774 -204 -1311 -830 -59 3257 4070 2397 330 321 1030 1577 1611 204 -2417 -4346 -1553 -433
6144 -433 -110 -1164 -1507 -241 1894 2991 2401 1186 -225 -305 3113 2007 -545 -1827 -2415 -1287 1013
6161 1013 874 -2008 -1882 -168 1046 1971 2230 109 -188 2177 2578 2700 -201 -1518 -1841 -612 1461
6178 1461 -684 -1572 -1400 -1710 191 2295 2401 -367 617 1441 2596 3260 145 -1951 -1351 -695 46
6195 46 -437 -1125 -1120 -436 666 1953 1087 436 -905 -712 2346 2271 -19 -1572 -2602 -704 1726 1453
6213 1453 -1877 -3627 -1559 843 1968 1589 -1386 -740 1233 2590 1549 629 -477 -1889 -819 448
6229 448 -896 -1273 -1598 -2495 -661 1034 1319 -929 -369 -151 1506 1736 -65 -819 -1614 -978 945 685
6247 685 -631 -2865 -1196 1253 2032 1123 -619 -1372 542 1625 1742 834 -997 -993 598 2484 934
6264 934 -1160 -3389 -2637 865 1377 -196 -830 -1091 127 1404 1089 483 -467 -239 247 921 1391 -1100
6282 -1100 -1204 -1015 439 1830 -13 -1447 -1723 -1198 1588 1410 502 -897 -92 285 613 1524 -1046
6299 -1046 -1872 -780 -369 688 -46 -948 -1352 -1597 1991 1377 2338 -841 -2012 -55 1432 573 -609
6316 -609 -2461 -1302 252 1982 -1543 -1623 -2581 -889 1726 1367 1258 -967 -554 735 1480 722 313
6333 313 -1128 99 538 1612 -260 -696 -1372 -696 1461 1360 640 4 -1539 352 1445 1530 113
6350 113 -592 -1167 -1274 797 -77 -155 -1768 -827 682 1600 1431 -216 193 794 2103 2624 177 -1256
6368 -1256 -863 854 2723 913 -761 -2415 693 947 -133 770 -258 -362 66 1086 1218 414 -1298
6385 -1298 -1487 751 692 -547 -2398 -2395 -663 427 1545 431 -839 47 1911 1744 1464 206 -252
6402 -252 -888 -95 778 -716 -1049 -2388 -1599 -238 610 -249 -262 -962 833 1470 2219 1434 -704 -1986
6420 -1986 -181 869 879 -1177 -1786 -1619 -300 610 54 -1027 -87 406 2520 2592 760 -70 131 701
6438 701 1805 113 -2319 -2702 -1915 -122 -370 -779 -625 32 848 1048 1074 379 -620 1114 798 1435 502
6457 502 -485 -2173 -2623 -1233 397 301 -666 -542 1108 1423 2239 1766 -553 -651 924 1245 1232 -897 -1964
6476 -1964 -1582 -68 -501 179 -924 -620 -208 2364 2366 1246 -391 -1180 951 2699 967 -883 -1446
6493 -1446 -1599 233 683 -1766 -2347 -543 877 541 408 -493 1382 492 1957 2040 823 459 -738
6510 -738 -1661 -360 -535 -374 -1841 -715 -276 401 2159 845 186 -281 798 1690 1417 -775 -1710 168
6528 168 -528 -524 -825 -1599 -1680 -485 951 1038 847 272 130 834 2085 1564 37 -787 -1041 523 805 -1583
6548 -1583 -1874 -1800 -302 -132 275 750 634 244 1474 2371 2133 937 -338 -380 -687 -113 -1577 -2085 -2422
6567 -2422 -1810 795 740 -405 -660 970 1058 1004 2340 860 -120 -222 -230 -511 -1078 -814 -2426 -1395 785
6586 785 631 1511 -1138 -923 214 1881 1123 87 -644 -763 839 304 -113 -2762 -3044 -64 20 -329
6604 -329 91 -2175 16 937 2034 2168 1484 22 -645 -38 652 -476 -1631 -1753 -34 -1294 -213
6621 -213 -44 -1563 -315 833 2352 -264 398 747 695 298 445 1181 165 -781 -634 -658 -863 4 -833
6640 -833 -1622 -33 1478 698 -369 -407 -816 1979 1383 487 -850 -1653 113 528 -209 127 -1780 -315
6658 -315 690 170 298 841 610 881 996 1045 614 991 -390 -191 324 608 -7 -860 -1233 -239 -593 -382
6678 -382 -559 -555 1011 108 482 688 1211 -452 202 417 359 -383 -1863 -1858 -1396 -1141 590 -292 -445 -785
6698 -785 2119 2200 1108 -348 424 424 565 891 -257 -28 -1727 -782 -798 -1395 -415 -1019 -138 312 1548
6717 1548 319 -458 38 1260 202 1149 -19 -585 -759 -677 118 -1453 -1573 -989 -323 -698 -328 668
6735 668 1346 1265 187 990 1119 1057 263 -694 -759 9 -108 196 -1609 -675 -12 -254 -1087 706 975 1151
6755 1151 1228 1381 613 -223 669 82 140 -953 -1002 -1102 -1573 635 1130 457 -1374 595 918 1050 665
6774 665 514 -23 317 460 -121 -861 -697 -1214 -1590 -910 204 587 999 545 -26 936 2073 1375 843
6793 843 620 404 824 -119 -1100 -1745 -1146 -856 -7 -415 -165 -219 1027 2108 1416 378 142 1203 -311
6812 -311 -47 -368 52 -1342 -23 -9 136 425 -583 -280 136 822 707 1161 1085 375 204 223 597 -1100
6832 -1100 -508 23 -808 -8 -324 -386 52 -571 -1351 1034 618 891 -516 -582 250 1464 -186 -1299 -721
6851 -721 -958 -176 -145 -918 -983 124 175 -192 -66 312 673 31 394 -204 -343 -1041 -464 -430 85 -764 -950
6872 -950 -1184 -599 607 138 -818 182 -518 1426 270 1085 94 727 798 -37 -902 -1207 -114 389 342
6891 342 211 -411 356 783 -159 63 802 1783 -539 25 45 626 367 -1198 -774 -613 -798 -590 -413 -1380
6911 -1380 425 353 -137 428 175 544 -136 383 -615 392 291 -1040 -905 -999 -871 -468 -438 -1444 -650
6930 -650 520 1224 -148 684 421 982 1357 -632 -33 888 -209 922 -587 -910 -19 -547 -540 -1399 -394
6949 -394 -172 -122 46 313 805 109 188 984 1285 463 -807 41 -299 186 -1145 -1584 -22 -271 -10 -31
6969 -31 -748 535 1013 1188 881 946 484 39 97 -1088 -649 135 -402 -1896 -1101 -215 67 543 1839 225
6989 225 95 1155 1075 -343 205 -137 511 -578 -897 -1021 -980 -1186 -863 -141 166 -888 960 1193 -251
7008 -251 625 1078 2 -19 121 -120 247 -1020 334 -1598 -547 35 -1054 -941 -320 376 2320 -621
7026 -621 1754 1199 94 -645 -758 -1320 -337 -1906 -1012 -11 -2212 -164 597 -958 -436 -64 1614
7043 1614 590 1101 1373 376 -54 -772 641 -537 -1631 -1135 -1770 -928 1095 -59 173 1077 1110 1085
7061 1085 1380 548 449 -471 -1098 -997 -797 -237 -527 -705 -756 -765 -500 11 758 183 1230 907 859 1053 -162
7082 -162 -289 -787 915 -1112 -1127 -636 -1339 -1202 -724 -16 206 1837 646 1446 330 452 -259 333 -568
7101 -568 -180 -706 -1856 -152 -976 -726 -903 -946 -185 820 245 86 970 881 718 263 895 244 -246 -1104
7121 -1104 887 -501 -174 -609 -791 752 382 -393 1143 950 102 961 277 629 680 709 -255 -83 -844
7140 -844 37 -93 -1159 484 478 -88 454 330 825 739 681 -180 -568 593 -1176 -1382 26 -795 -454 -573
7160 -573 -762 -769 1166 -292 107 -136 58 738 305 -770 -85 20 -353 -334 -881 -1057 86 -223 261 190
7180 190 -320 574 -344 582 62 1045 -156 -190 -794 555 -1421 -965 -367 -1017 449 470 -473 -693 326
7199 326 -1193 406 -218 -241 593 613 635 -339 -388 -547 -419 -353 -834 -67 1119 -1086 -605 -300 776 -1030
7219 -1030 -413 -844 694 302 181 431 -360 149 -346 163 -46 -215 327 -834 234 -1275 551 -316
7237 -316 888 27 -733 -437 73 -411 -790 730 -245 -903 190 -590 -185 -117 -806 -563 -215 -697 132
7256 132 949 1198 542 1022 -485 -506 -787 -1070 628 -184 -558 -397 -257 -123 272 223 321 171 105 369 -615
7277 -615 -634 35 826 146 -479 -386 9 -131 -847 -189 -1272 -889 -640 509 -537 30 1511 562 350
$$ [...]
8191f97
##END NTUPLES=NMR FID
##END=
