##TITLE=1H_AT-11
 DMSO+CD3ONa
 308 sc, 
 25.08.2022
##JCAMPDX= 6.0         $$ Bruker NMR JCAMP-DX V2.0
##DATA TYPE= NMR FID
##DATA CLASS= NTUPLES
##ORIGIN= UXNMR, Bruker Analytische Messtechnik GmbH
##OWNER= root
$$ XWIN-NMR		Version 3.5
$$ Thu Aug 25 11:16:05 2022 Russian Standard Time (UT+4h)  she@DPX200
##.OBSERVE FREQUENCY= 200.1313499994
##.OBSERVE NUCLEUS= ^1H
##.DELAY= (6, 6)
##.ACQUISITION MODE= SIMULTANEOUS
##.ACQUISITION SCHEME= undefined
##.AVERAGES= 308
##.DIGITISER RES= 18
##SPECTROMETER/DATA SYSTEM= spect
##.PULSE SEQUENCE= zg30
##.SOLVENT NAME= CDCl3
##.SHIFT REFERENCE= (INTERNAL, CDCl3, 0, 15.7039)
##AUDIT TRAIL= $$ (NUMBER, WHEN, WHO, WHERE, WHAT)
$$ ##TITLE= Audit trail, XWIN-NMR		Version 3.5
$$ ##JCAMPDX= 5.01
$$ ##ORIGIN= Bruker BioSpin GmbH
$$ ##OWNER= she
$$ F:/spectra/data/she/nmr/H-F/1/audita.txt
$$ ##AUDIT TRAIL=  $$ (NUMBER, WHEN, WHO, WHERE, WHAT)
(   1,<2022-08-25 11:14:29.06 +0400>,<she>,<DPX200>,
      <continue with go, POWCHK disabled, PULCHK disabled
       configuration hash MD5:
       00 E9 B6 7A A2 85 ED C7 34 08 36 98 17 FE 4E 26
       data hash MD5: 16K
       52 B1 4C 4E F3 27 21 83 1A 0A 6C F7 5E 02 21 16>)
$$ ##END=
$$ 
$$ hash MD5
$$ B8 0F F7 C0 4E 1C 81 A1 D6 99 16 C6 8A 31 36 19
##$RELAX= 
##$RELAX= 
##$RELAX= 
##$RELAX= 
##$RELAX= 
##$RELAX= 
$$ Bruker specific parameters
$$ --------------------------
##$DU= <F:/spectra>
##$EXPNO= 1
##$NAME= <H-F>
##$PROCNO= 1
##$TYPE= <nmr>
##$USER= <she>
##$AMP= (0..31)
100 100 100 100 100 100 100 100 100 100 100 100 100 100 100 100 100 100 
100 100 100 100 100 100 100 100 100 100 100 100 100 100 
##$AQSEQ= 0
##$AQ_mod= 1
##$AUNM= <au_zg>
##$AUTOPOS= <>
##$BF1= 200.13
##$BF2= 200.13
##$BF3= 200.13
##$BF4= 200.13
##$BF5= 200.13
##$BF6= 200.13
##$BF7= 200.13
##$BF8= 200.13
##$BYTORDA= 1
##$CFDGTYP= 0
##$CFRGTYP= 5
##$CHEMSTR= <none>
##$CNST= (0..31)
1 1 145 1 1 1 1 1 1 1 1 1 1 1 1 1 1 1 1 1 1 1 1 1 1 1 1 1 1 1 1 1 
##$CPDPRG= <>
##$CPDPRG1= <>
##$CPDPRG2= <>
##$CPDPRG3= <>
##$CPDPRG4= <mlev>
##$CPDPRG5= <mlev>
##$CPDPRG6= <mlev>
##$CPDPRG7= <mlev>
##$CPDPRG8= <mlev>
##$CPDPRGB= <>
##$CPDPRGT= <>
##$D= (0..31)
0 1.2 0 0 0 0 0 0 0 0.06 0 0.03 0 0 0 0 0.0002 0 0 0 0 0 0 0 0 0 0 0 0 
0 0 0 
##$DATE= 1661410106
##$DBL= (0..7)
120 120 120 120 120 120 120 120 
##$DBP= (0..7)
150 150 150 150 150 150 150 150 
##$DBP07= 0
##$DBPNAM0= <>
##$DBPNAM1= <>
##$DBPNAM2= <>
##$DBPNAM3= <>
##$DBPNAM4= <>
##$DBPNAM5= <>
##$DBPNAM6= <>
##$DBPNAM7= <>
##$DBPOAL= (0..7)
0.5 0.5 0.5 0.5 0.5 0.5 0.5 0.5 
##$DBPOFFS= (0..7)
0 0 0 0 0 0 0 0 
##$DE= 6
##$DECBNUC= <off>
##$DECIM= 32
##$DECNUC= <off>
##$DECSTAT= 4
##$DIGMOD= 1
##$DIGTYP= 9
##$DL= (0..7)
0 120 120 120 120 120 120 120 
##$DP= (0..7)
150 150 150 150 150 150 150 150 
##$DP07= 0
##$DPNAME0= <>
##$DPNAME1= <>
##$DPNAME2= <>
##$DPNAME3= <>
##$DPNAME4= <>
##$DPNAME5= <>
##$DPNAME6= <>
##$DPNAME7= <>
##$DPOAL= (0..7)
0.5 0.5 0.5 0.5 0.5 0.5 0.5 0.5 
##$DPOFFS= (0..7)
0 0 0 0 0 0 0 0 
##$DQDMODE= 0
##$DR= 18
##$DS= 0
$$ [...]
##$SUBNAM2= <"">
##$SUBNAM3= <"">
##$SUBNAM4= <"">
##$SUBNAM5= <"">
##$SUBNAM6= <"">
##$SUBNAM7= <"">
##$SUBNAM8= <"">
##$SUBNAM9= <"">
##$SW= 18.0517283424941
##$SWIBOX= (0..15)
0 0 2 0 0 0 0 0 0 0 0 0 0 0 0 0 
##$SW_h= 3612.71676300578
##$TD= 16384
##$TD0= 1
##$TE= 0
##$TE2= 300
##$TE3= 300
##$TEG= 300
##$TL= (0..7)
0 120 120 120 120 120 120 120 
##$TP= (0..7)
150 150 150 150 150 150 150 150 
##$TP07= 0
##$TPNAME0= <>
##$TPNAME1= <>
##$TPNAME2= <>
##$TPNAME3= <>
##$TPNAME4= <>
##$TPNAME5= <>
##$TPNAME6= <>
##$TPNAME7= <>
##$TPOAL= (0..7)
0.5 0.5 0.5 0.5 0.5 0.5 0.5 0.5 
##$TPOFFS= (0..7)
0 0 0 0 0 0 0 0 
##$TUNHIN= 0
##$TUNHOUT= 0
##$TUNXOUT= 0
##$USERA1= <user>
##$USERA2= <user>
##$USERA3= <user>
##$USERA4= <user>
##$USERA5= <user>
##$V9= 5
##$VALIST= <valist>
##$VCLIST= <CCCCCCCCCCCCCCC>
##$VD= 0
##$VDLIST= <DDDDDDDDDDDDDDD>
##$VPLIST= <PPPPPPPPPPPPPPP>
##$VTLIST= <TTTTTTTTTTTTTTT>
##$WBST= 1024
##$WBSW= 4
##$XGAIN= (0..3)
0 0 0 0 
##$XL= 0
##$YL= 0
##$YMAX_a= 3926897
##$YMIN_a= -4910503
##$ZGOPTNS= <>
##$ZL1= 120
##$ZL2= 120
##$ZL3= 120
##$ZL4= 120
##$ABSF1= 10
##$ABSF2= 0
##$ABSG= 5
##$ABSL= 3
##$ALPHA= 0
##$AQORDER= 0
##$ASSFAC= 0
##$ASSFACI= 0
##$ASSFACX= 0
##$ASSWID= 0
##$AUNMP= <proc_1d>
##$AZFE= 0.1
##$AZFW= 0.1
##$BCFW= 1
##$BC_mod= 2
##$BYTORDP= 1
##$COROFFS= 0
##$CY= 11.3945322036743
##$DATMOD= 1
##$DC= 2
##$DFILT= <>
##$DTYPP= 0
##$F1P= 2.36226072786647
##$F2P= -0.459571619588291
##$FCOR= 0.5
##$FTSIZE= 0
##$FT_mod= 4
##$GAMMA= 1
##$GB= 0.15
##$INTBC= 1
##$INTSCL= 1
##$ISEN= 128
##$LB= 0.24
##$LEV0= 0
##$LPBIN= 0
##$MAXI= 10000
##$MC2= 0
##$MEAN= 0
##$ME_mod= 0
##$MI= 1.114404
##$NCOEF= 0
##$NC_proc= 0
##$NLEV= 6
##$NOISF1= 3.799351
##$NOISF2= 2.8
##$NSP= 1
##$NTH_PI= 0
##$NZP= 0
##$OFFSET= 15.70392
##$PC= 1
##$PHC0= -18038.82
##$PHC1= 8.40069
##$PH_mod= 1
##$PKNL= yes
##$PPARMOD= 0
##$PSCAL= 0
##$PSIGN= 0
##$REVERSE= no
##$SF= 200.130013532006
##$SI= 16384
##$SIGF1= 3
##$SIGF2= 2
##$SINO= 400
##$SIOLD= 16384
##$SREGLST= <1H.CDCl3>
##$SSB= 0
##$STSI= 0
##$STSR= 0
##$SW_p= 3612.71676300578
##$SYMM= 0
##$S_DEV= 0
##$TDeff= 0
##$TDoff= 0
##$TI= <>
##$TILT= no
##$TM1= 0
##$TM2= 0
##$TOPLEV= 0
##$USERP1= <user>
##$USERP2= <user>
##$USERP3= <user>
##$USERP4= <user>
##$USERP5= <user>
##$WDW= 1
##$XDIM= 8192
##$YMAX_p= 0
##$YMIN_p= 0
$$ End of Bruker specific parameters
$$ ---------------------------------
##NTUPLES= NMR FID
##VAR_NAME=  TIME,          FID/REAL,        FID/IMAG
##SYMBOL=    X,             R,               I
##VAR_TYPE=  INDEPENDENT,   DEPENDENT,       DEPENDENT
##VAR_FORM=  AFFN,          ASDF,            ASDF
##VAR_DIM=   8192,          8192,            8192
##UNITS=     SECONDS,       ARBITRARY UNITS, ARBITRARY UNITS
##FACTOR=    0.0002768,     1,               1
##FIRST=     0,             0,               0
##LAST=      2.2672688,     0,               0
##MIN=       0,             -4910503,        0
##MAX=       2.2672688,     3926897,         0
$$ Real data points
##PAGE= N=1
##DATA TABLE= (X++(R..R)), XYDATA
$$ [...]
3050h5p08J453o96o4L49j531J246J458q19j711P13J75m66P28o11K222k908J112
$$ -85 -793 660 -36 -100 249 -1282 -36 1422 603 -1108 -395 -220 -686 42 -569 1653 -1255 -143
3068a43n9J240m97p83P92q11pL16j471K32J608l42r19R37j3L70O96j155l86l36
$$ -143 -202 1038 541 -242 550 -261 -268 48 -1423 -1191 417 75 -844 93 80 450 1146 -9 -395 -731
3088g31l56J615P35j685N78j758J741j02j130P87j759K085l33ro10J269P86o10
$$ -731 -1087 528 1263 -422 156 -1602 139 37 -1093 -306 -2065 20 -313 -322 -932 337 1123 513
3106E13O6r19K059j316p96M32J813k814J133J241q66p7J79j059m78J283n86J278
$$ 513 579 -340 1719 403 -393 39 1852 -962 171 1412 546 469 648 -411 -889 394 -192 1086
3124A086j406J097l61o24M90K65L93l9j917j18J575n08j418K025J04l28k415K362
$$ 1086 -320 777 416 -208 282 547 940 901 -1016 -1134 441 -67 -1485 540 644 316 -2099 263
3142B63J580o18p45j335M54l93J092j616J313J115o18j341R84O32j536R27J065
$$ 263 1843 1225 480 -855 -401 -794 298 -1318 -5 1110 492 -849 135 767 -769 158 1223
3159A223M06j473RN4l57J038P6q93j895j064L473J562k725q91J207j46j174K323
$$ 1223 1629 156 165 219 -138 900 976 83 -1812 -2876 597 2159 -566 -1457 -250 -396 -1570 753
3177G53q41L5Q10o88k09L43m06J419j051j535J436Mj159J625R93j997q68K016
$$ 753 -88 -53 757 69 -140 203 -203 1216 165 -1370 66 70 -1089 536 1529 -468 -1336 680
3195F80p59j682K333L26m34j125J144Q21j928J10L16k33Q26J57Q18k013P75R48
$$ 680 -79 -1761 572 898 464 -661 483 1304 -624 -514 -198 -431 395 552 1370 -643 132 1080
3213A080j01j800J77P84J73M34j025J228j396R27j124K3m22J869j352R49k001
$$ 1080 979 -821 -644 140 313 747 -278 950 -446 481 -643 -620 -1042 827 -525 424 -1577
3230a577J182q25P31L74O9r17J016J084j102p83J434j451K917p99o21j724J889
$$ -1577 -395 -1220 -489 -115 -46 -963 53 1137 35 -748 686 -765 2152 1353 732 -992 897
3247H97k755J931k03p69J327O54j896l80M45m73J521r44Q11M8R19k352J120M21
$$ 897 -1858 73 -130 -899 428 1082 -814 -1194 -749 -1222 299 -645 166 214 1133 -1219 -99 322
3265C22N88j107j318R18Q86k53R73m51j060K595j771O83j671J32o66L82J404j43
$$ 322 910 -197 -1515 -597 289 36 1009 558 -502 2093 322 1005 -666 -534 -1200 -818 586 443
3283D43j803J199J055o87m84J53o92R69J0o96J21J676L38k381J202p3N55j144
$$ 443 -1360 -161 894 207 -277 -124 -816 153 163 -533 -412 1264 1602 -779 423 350 905 -239
3301b39r95K082k08j378K91J105j830R29Q47O51m79k62m58r14N42q76J329N61
$$ -239 -1234 848 640 -738 -447 658 -1172 -243 604 1255 776 514 56 -858 -316 -1192 137 698
3319F98j356K65K194k548j14r01O60o20K274L26j744p4J106k51L32k47M14O9J291
$$ 698 -658 -393 1801 -747 -861 -1762 -1102 -1722 552 878 -866 -940 166 -85 247 0 414 483 1774
3338A774j758K72K35n61J175n27l81l51J12M24q71l52P48r95J07j1K269j616p39
$$ 1774 16 288 523 -38 1137 610 229 -122 -10 414 -457 -809 -61 -1056 -949 -960 1309 -307 -1046
3357a046M59r6j396L37K122p80k83J983p99j429M95J203j325J049P03r53p79k6
$$ -1046 -587 -683 -2079 -1742 380 -400 -683 1300 501 -928 -433 770 -555 494 1197 244 -535 -561
3375e61Q34K48M35k7r52K15n04K284k815P65N88j273J294o2k044J007P59o47J621
$$ -561 273 521 956 929 -23 192 -312 1972 -843 -78 510 -763 531 469 -1575 -568 191 -456 1165
3394A165j191m88l7J513j198J72K17L82j524N65K00q22M75J586r28j095M6J099
$$ 1165 -26 -514 -551 962 -236 -64 153 535 -989 -424 -224 -1046 -571 1015 87 -1008 -962 137
3412A37l52J110j246nl01R82R24M48N29k312J171j942N35q0m00m91K392J7j300
$$ 137 -215 895 -351 -356 -657 325 1249 1697 2226 -86 1085 -857 -322 -402 -802 -1293 1099 1116 -184
3431a84m62J917r1N88j406j758J460q80j358J085J520k182K399j596J162n84L71
$$ -184 -646 1271 1180 1768 362 -1396 64 -816 -2174 -1089 431 -1751 648 -948 214 -370 1
3448Ak09j863J878L10j132J145J034j614j288K202p33Q96p62L60o13J445l1j197
$$ 1 -208 -2071 -193 117 -1015 130 1164 -450 -1738 464 -269 627 -135 225 -388 1057 1026 -171
3466a71J025j067k12N62j23j60o3l44J041j22q10Q41j579J087m77K687r90l84
$$ -171 854 -213 -425 137 14 -146 -209 -553 488 366 -444 397 -1182 -95 -572 2115 1125 741
3484G41n42o18q11R16J074q23j485P51O14R19o43N30j519J256j515j2R47J154
$$ 741 199 -419 -1230 -314 760 -63 -1548 -797 -183 736 93 623 -896 360 -1155 -1167 -220 934
3502I34J81j743m10J311K68j507k2R1J097p23J616j342j68K46M1N46K27o44Q51
$$ 934 1115 -628 -1038 273 541 -966 -988 -897 200 -523 1093 -249 -417 -171 -130 416 643 -1 850
3521H50j076k68p29J710p12n46K011k623J568l15k86R49j07o32P07lj453R87J870
$$ 850 -226 -494 -1223 487 -225 -771 1240 -1383 185 -130 -416 533 426 -206 501 498 -955 32 1902
3540A902k488J145L46l24P50k315j131J131J05J280j341J354j009J304j531M9
$$ 1902 -586 559 905 581 1331 -984 -2115 -984 -879 401 -940 414 -595 709 -822 -773
3556g73Q69N73j333K343k44q45r59Q31m70J405j901L94o04M00L99P64j403n44
$$ -773 96 669 -664 1679 1435 590 -369 462 -8 1397 -504 -110 -714 -314 85 849 -554 -1098
3574a098K004J475j224j238J985k124J81p6L73j139J49J562j793J141n34o77L12
$$ -1098 906 2381 1157 -81 1904 -220 -39 -115 258 -881 -732 830 -963 178 -356 -1033 -721
3591g21K525q31j384m98J910k30r43N58l87J415k459J070J381p66O74N38j394
$$ -721 1804 973 -411 -909 1001 771 -172 386 -1 1414 -1045 25 1406 640 1314 1852 458
3608D58j18n95j015P35K1J659k107J06N76J737j833J415k58K92m14k153J477n75
$$ 458 340 -255 -1270 -535 -514 1145 -962 -856 -280 1457 -376 1039 781 1073 659 -1494 -17 -592
3626e92J063k303J784M25j18o28K16j78P76L54r62L30P94j583K37o27J432Q83
$$ -592 471 -1832 -48 377 259 -369 -153 -331 445 799 -163 167 961 -622 -385 -1012 420 1303
3644A303j281M47M22N42k919R47J01J769j729l60M91J461q45J96j211K00K080
$$ 1303 22 469 891 1433 -1486 -539 -438 1331 -398 -758 -267 1194 349 545 -666 -466 1614
3661A614k818J231j219O02M7j293J649J121j10k99j064J473o84J794k924N95K57
$$ 1614 -1204 27 -1192 -590 -543 -1836 -187 934 824 525 -539 934 250 2044 -880 -285 -28
3678b8m66P79j295J960j049K69j40J388n30l91q28N06N17j112j919K590J206k111
$$ -28 -494 285 -1010 950 -99 170 30 1418 888 497 -331 175 692 -420 -2339 251 1457 -654
3696f54J496j395J775k92j249K29R36l72r73l54P39J014r38o1k7J370j173k248
$$ -654 842 -553 1222 930 -319 -90 846 474 -499 -853 -114 900 -38 -99 -126 1244 71 -2177
3714b177J784l14R15P85k284K458n67j245J060m43J630j617r49l54J086J316j144
$$ -2177 -393 -707 208 993 -1291 1167 600 -645 415 -28 1602 -15 -964 -1318 -232 1084 -60
3731f0q2P69p36p42r11J231J49q78R14R28L7k34k159K294K35k92j952M99Q77O98
$$ -60 -142 627 -109 -851 -1762 -531 -382 -1260 -346 582 619 385 -1774 520 755 463 -1489 -990 -113 585
3751E85M76j128L52p41J656r91J289k402J073j420J199J363k386k56L605k505
$$ 585 1061 -67 285 -456 1200 209 1498 -904 169 -1251 -52 1311 -1075 -1331 2274 -231
3767b31j016J624j041J726k40K15p48q30m91J473L99p23J448m84k162K366O27
$$ -231 -1247 377 -664 1062 822 1037 289 -541 -1032 441 840 117 1565 1081 -1081 1285 1912
3784A912p75q79j268K928k325L67J74p40K135j165p43l8j201J837j543K425j535
$$ 1912 1137 258 -1010 1918 -407 -40 134 -606 1529 364 -379 -417 -1618 219 -1324 1101 -434
3801d34O45k121J359Q37J200l86k497K921j443L66j558J042J089j113m5j79K616
$$ -434 211 -1910 -551 286 1486 1100 -1397 1524 81 447 -1111 -69 1020 -93 -138 -317 2299
3818B299k392Q58k094R74J128k02k607J293J693j718Q07k59J967k032J140k523
$$ 2299 -93 765 -1329 -355 773 571 -2036 -743 950 -768 39 -220 1747 -285 855 -1668
3834a668P00J244j697M59J54R29o36K58k12rK942l203O26j279K055j792m81K613
$$ -1668 -968 276 -1421 -962 -808 121 -515 -257 -469 -478 2464 -739 -113 -1392 663 -1129 -1610 1003
3852A003K75J48k043j108L800n06k683J032m86Q76Q15q9k700K246j084m07Q22
$$ 1003 1278 1426 -617 -1725 2075 1569 -1114 -82 -568 308 1123 1034 -1666 580 -504 -911 -89
3869h9o83J767m63j515J348j97j303j07P78l78K07N8L67J633J15j710k35J250
$$ -89 -772 995 532 -983 365 168 -1135 -1242 -464 -842 -635 -577 -210 1423 1538 -172 -407 843
3887H43j028j11J94O54R4n98k587K130J780K55l736J753K730k216k700J097J928
$$ 843 -185 -296 -102 552 646 48 -2539 -409 1371 1626 -2110 -357 2373 157 -2543 -1446 482
3904D82J887k485j150J407Q34k081J716k15j302j98N06L33N81k55O67k194J717
$$ 482 2369 -116 -1266 141 975 -1106 610 395 -907 -1105 -599 -266 315 60 727 -1467 250
3921B50k76k66M46j057K697k232N65J926o36j905k538K715L8P91j838Q29n5O83
$$ 250 -26 -292 154 -903 1794 -438 127 2053 1417 -488 -3026 -311 -273 518 -1320 -491 -546 137
3939A37l71J79j500J141O95K12q75Q65J72k446R4J890r64J119k679J713J023p70
$$ 137 -234 -55 -1555 -414 281 493 -382 483 655 -1791 -1697 193 -771 348 -2331 -618 405 -365
3957c65k058J969j14p6N36pJ11K60J191j093L40j611J814j328l33K241j425j694
$$ -365 -2423 -454 -568 -644 -108 -115 -4 256 1447 354 694 -917 897 -431 -764 1477 52 -1642
3975a642O88J170K84j68j70Q94l70q4m10n28J561p77r49J031o13J39K84J673k151
$$ -1642 -954 216 500 332 162 1056 686 602 192 -336 1225 448 -501 530 -83 56 340 2013 -138
3994a38jr79J75J598O68k154N59L026j827m84j560Q61J177o51Q86j45j582K129
$$ -138 -139 -1118 -943 655 1323 -831 -272 2754 927 443 -1117 -256 921 270 1156 1011 -571 1558
4012A558j977j718K319J014k915J938J067M74j100q23O70M21j788j197K406o14
$$ 1558 -419 -2137 182 1196 -1719 219 1286 1760 660 -163 507 928 -860 -2057 349 -265
4028b65J529q26j403J299L43J15m64m55M99j433L11M02R19J48j409J9K132o24
$$ -265 1264 438 -965 334 677 792 328 -127 372 -1061 -750 -348 571 719 -690 -671 1461 837
4046H37J15q65J525k287J828j163r49J115j460M95K97n02P44N11j958J967m73
$$ 837 952 87 1612 -675 1153 -10 -959 156 -1304 -809 -512 -1014 -270 241 -1717 250 -223
4063b23j02L60Q73n34j746J590j28N55k387K268j251P80Q61k5j103m85J8J606
$$ -223 -325 35 908 374 -1372 218 90 645 -1742 526 -725 55 916 891 -212 -697 -679 927
4081I27p5j331k32J597P5j446K153j296j174M75J038j57m91j451N10R64J736j872
$$ 927 852 -479 -711 886 961 -485 1668 372 -802 -327 711 554 63 -1388 -878 86 1822 -50
4099e0Q25L77k028k38l93J648O10j90k010R06P84J740k103l0M84r81k12M60R18
$$ -50 775 1152 -876 -1114 -1507 141 751 561 -1449 -543 241 1981 -122 -152 332 -649 -861 -401 517
4118E17p37K84R02j064M51J661l255J660L38j597O94K38n45Q15r58N05J804r99
$$ 517 -220 64 966 -98 353 2014 -1241 419 757 -840 -146 92 -453 362 -596 -91 1713 714
4136G14j504L40p7M11O37l53pJ11k40J756k108m83P2J406k370J709J46j441P34
$$ 714 -790 -450 -527 -116 521 168 161 272 32 1788 -320 -803 -731 675 -1695 14 160 -1281 -547
4155e47M98J97R07p89j406J349J415m2j428k22J86l11K94n74J117j330j45J765
$$ -547 -49 148 1055 266 -1140 209 1624 1582 154 -68 118 -193 101 -473 644 -686 -831 934
4173I34m23m78J244k102J177q58J50N03n72O23K31j009P29J048j894K221m24j367
$$ 934 511 33 1277 -825 352 -506 -356 147 -425 198 429 -580 149 1197 -697 1524 1100 -267
4191b67L24n60r42J151J100k236K46L51J489r76k09J298K84M25j776q79J626n15
$$ -267 57 -503 -1445 -294 806 -1430 -1184 -833 656 -320 -529 769 1053 1478 -298 -1177 449 -66
4209f6j785J506j02k39j114K348o59l29L68K3m61k69K170j845M26J940k460J246
$$ -66 -1851 -345 -447 -686 -1800 548 -111 -440 -72 -49 -510 -779 1391 -454 -28 1912 -548 698
4227F98j459o04K010J066k328p55L501k994N58J05r7N68p22Q94N71q36J119j271
$$ 698 -761 -1365 645 1711 -617 -1372 2129 -865 -307 -202 -299 269 -453 441 1012 176 1295 24
4245B4N39M50j748j87M92J743j694q86J831J65j694r01O93J135R86q82Q19r97
$$ 24 563 1013 -735 -922 -430 1313 -381 -1267 564 729 -965 -1866 -1173 -38 948 66 885 -112
4263a12m47J047j875J070L65k58J1J306n27q13R29j185o8Q02j350L33j41J0J09
$$ -112 -559 488 -1387 -317 48 -210 -199 1107 580 -233 696 -489 -557 245 -1105 -772 -913 -903 -794
4282g94J268k467L173o48j244J301k133J733M95j168k62J183R5K29o86N47p59
$$ -794 474 -1993 1180 532 -712 589 -1544 189 684 -484 -746 437 532 761 75 622 -137
4299a37O25j19R74k267J440o64N47R88j111l87K79j33k89j06K53j99J071j276
$$ -137 488 369 1343 -924 516 -148 399 1387 276 -111 168 35 -254 -360 -107 -306 765 -511
4317e11j04m00K072p3k014J488j5J314k140l23M56N18m14K52L95p96k65J177N5
$$ -511 -615 -1015 1057 984 -1030 458 443 1757 -383 -706 -250 268 -146 106 501 -295 -560 617 672
4336F72J77j397O68j8o58L76J294j762Q05J17j250K394o94n40l43N1L11K42q43
$$ 672 849 -548 120 102 -556 -180 1114 -648 157 274 -976 1418 724 184 -159 -108 203 445 -398
4355c98j64J220j264j13J476j487J206Q94j297J115j852J711j166L1J234l608
$$ -398 -562 658 -606 -719 757 -730 476 1370 73 1188 -664 1047 -119 -88 1146 -2462
4371b462L011Q98k781N63R68K73j796K017O23k254R44J33J078q42j35j60R82L23
$$ -2462 549 1447 -1334 -771 197 470 -1326 691 1314 -940 4 137 1215 373 238 78 1060 1383
4389A383k704J284K53K9j393k05K022j483J87J153Jp67K95j147J383n58M56r02
$$ 1383 -1321 -37 216 245 -1148 -1353 669 -814 -627 526 527 -240 55 -1092 291 -267 189 -713
4407g13K22J329n50o33P23m39p40P93J169j129K52L95o79n92L77p55M49L38N9
$$ -713 -491 838 288 -345 378 -61 -801 -8 1161 32 284 679 0 -592 -215 -970 -521 -183 -124
4426a24m5K13n24R36j966J663k99J981j084l96Q98k121N50k02J198j765J858j814
$$ -124 -169 44 -480 456 -1510 153 -146 1835 751 355 1253 -868 -318 -520 678 -1087 771 -1043
4444a043L497k598J79j398J648k006J596j183J716r94P62q01R74k13p40q29J725
$$ -1043 2454 -144 35 -1363 285 -1721 -125 -1308 408 -586 176 -625 349 136 -604 -1433 292
4461B92N37p01o42J825k637l4K388K21k081L82M51M33j149k40K756k282m24J170
$$ 292 829 128 -514 1311 -1326 -1360 1028 1249 -832 -450 1 434 -715 -955 1801 -481 -905 265
4479B65o58O10j84p78k27J674j136k18k78J356j755Q77J962l647J623J083j305
$$ 265 -393 217 33 -745 -972 702 -434 -652 -930 426 -1329 -452 1510 -2137 -514 569 -736
4496g36J646K39o61r5p64J239k493Q93J083j612K002J68J16o36k49M32P66o15
$$ -736 910 1149 488 393 -371 868 -1625 -732 351 -1261 741 909 1025 389 140 572 1338 723
4514G23r28M94l42j473K033p99J48m26M22N92j232R28j309J143O13l08j549J990
$$ 723 -205 289 -53 -1526 507 -292 -144 -570 -148 444 -788 140 -1169 -26 587 279 -1270 720
4532G20J98M26J22l405K203K85N66j844N76jQ45k21j86N63o38L27j482k65P23
$$ 720 918 1344 1466 -1939 264 549 1115 -729 -153 -154 691 470 284 847 209 536 -946 -1211 -488
4551d88R66n07m78N53M72o89J415o67M73j094o04M23j299K748j773J054j074R59
$$ -488 478 -29 -507 46 518 -171 1244 577 1050 -44 -648 -225 -1524 1224 -549 505 -569 390
4569C90n63P02j303N36j71N52l3j921J854J472j016j843J211q03O7j3J987N01
$$ 390 -173 529 -774 -238 -409 143 110 -1811 43 1515 499 -1344 -133 -936 -869 -882 1105 1606
4587A606k784K307j031m11J560j065M14r33m10N71Lr25Q48O68m61o66o5P42R5
$$ 1606 -1178 1129 98 -313 1247 182 596 -337 -747 -176 -173 -1098 -250 418 -43 -709 -774 -32 63
4606F3k06K248k861j85J841k324P09j93N89K99P27o05o15R13o56J73k24k18J922
$$ 63 -143 2105 -756 -941 900 -1424 -715 -908 -319 -20 707 102 -513 400 -256 -83 -307 -525 1397
4625A397j653L99K93o90j281J347L81Q19o67l4n36K15l94K93P4r54O70L72m68
$$ 1397 -256 143 436 -254 -1535 -188 193 1012 345 311 -225 -10 -404 -111 -37 -991 -321 51 -417
4644d17p70J920j796J109K66p10J517j109J66k67j031J195J056q98p11J248L68
$$ -417 -1187 733 -1063 46 312 -398 1119 10 176 -91 -1122 73 1129 231 -480 768 1136
4661A136p24n85P13K08Q5q59q59J187p3J9J227j772R46r2o26l79Q14J899k830
$$ 1136 412 -173 540 748 833 -26 -885 302 229 248 1475 -297 649 557 -69 -448 366 2265 -565
4680e65J111j566j3l12K010r39q03K204L33j817P71j034j624J361J533n23j287
$$ -565 546 -1020 -1033 -1345 665 -274 -1077 1127 1460 -357 414 -620 -2244 -883 650 127 -1160
4697a160N55O6M27P92R8k48J36j320L38J067J34k5N04j820L87M21j21J28j247
$$ -1160 -605 -539 -112 680 778 530 666 -654 -316 751 885 860 1364 -456 -69 352 231 359 -888
4716h88L21O60j93P8r4n60M08R01l21n45r32J631m46l09m11R50K47j04j338Q51
$$ -888 -567 93 -100 -22 -116 -676 -268 633 312 -233 -1165 466 20 -289 -700 250 497 393 -945 -94
4736i4k25n53Q24J99p08J40P91M30n39O20K72j874N70k06J15L51j096J421P86
$$ -94 -319 -872 -48 151 -557 -417 374 804 265 885 1157 -717 -147 -353 -238 113 -983 438 1224
4755A224J45J56p92m01L08j065n16J158P56l71m72p26k71M04L04M91o8R43j574
$$ 1224 1369 1525 733 332 640 -425 -941 217 973 602 130 -596 -867 -463 -159 332 264 1207 -367
4774c67Q71l55K41Kr42J397j779K69j65r35J239R51n76j131J694n74k37o9m59
$$ -367 504 149 390 392 -550 847 -932 -663 -828 -1763 -524 427 -149 -1280 414 -160 -397 -466 -925
4793i25J015k61k07O36M29j162j195L086j669J357m46K73k022l24J065J809l74
$$ -925 90 -171 -378 258 687 -475 -1670 1416 -253 1104 658 931 -1091 -1415 -350 1459 1085
4810A085j431M63L99p89m63J753j206L75j014J076k385K250M98Q20j830L85q3
$$ 1085 -346 117 516 -273 -736 1017 -189 186 -828 248 -2137 113 611 1431 -399 -14 -97
4827i7j173O81m55J426l40J388m61j112N94j199o47J040P15j010N00q74K41K246
$$ -97 -1270 -589 -1044 382 42 1430 969 -143 451 -748 -1395 -355 360 -650 -150 -1024 -783 1463
4845A463q73j331N18L96k219P91Q98O86L20J57P10j430P24m81j120j31P85P8J013
$$ 1463 590 -741 -223 173 -2046 -1255 -357 329 649 806 1516 86 810 329 -791 -922 -137 -59 954
4864I54r27P72l43Q5j158M24L26K29j016M46J68j099N01O03j61O65p85r43n13
$$ 954 27 799 456 541 -617 -193 133 362 -654 -208 -40 -1139 -638 -35 -196 469 -316 -1259 -1772
4883a772J941n33j435K846j050K178o70k054P75J405j957N74J405n77j09O94k384
$$ -1772 169 -364 -1799 1047 -3 2175 1505 -549 226 1631 -326 248 1653 1076 967 1661 -723
4900g23j13J226L13q40o82J771L89k466K035j471J773Q48j502k56n87mK28J823
$$ -723 -836 390 703 -137 -819 952 1341 -1125 910 -561 1212 2060 558 302 -285 -289 -61 1762
4918A762k502J157q99J366m00k2J689k849q38K56O27J550k386R11j120K151J303
$$ 1762 -740 417 -482 884 484 462 2151 -698 -1536 -1280 -653 897 -1489 -578 -1698 453 1756
4935A756r64Ol5j500J231n51N0m42P67l43J012j054J020j312J278k72j841K194
$$ 1756 792 798 763 -737 494 -57 -7 -449 318 -25 987 -67 953 -359 919 647 -1194 1000
4953A000p16n83jJ38q25R46P3j819J681L80K11K04k22n10J37o38m59J426j892
$$ 1000 284 -299 -300 -162 -987 -41 32 -1787 -106 274 485 689 467 -43 94 -544 -1003 423 -1469
4972a469K112j004J291n91m00M15J370j803k30K88J157j627J374k05R74l778L042
$$ -1469 643 -361 930 339 -61 354 1724 -79 -309 -21 1136 -491 883 678 1652 -2126 916
4989I16k91j274N3j737P48K026m98J123l38j11K19j411m09Q79M89P2j537P12R29
$$ 916 625 -649 -596 -2333 -1585 441 -57 1066 728 617 836 -575 -984 -105 384 456 -1081 -369 560
5008E60j802P87J9J26J151k426J912L90j601J485k87j955P79K402p70q36j748
$$ 560 -1242 -455 -436 -310 841 -1585 327 717 -884 601 314 -1641 -862 1540 770 -66 -1814
5025a814K495p84M17r39k99J040K734k088l27j856j61K163k103K161o52O70L50
$$ -1814 681 -103 314 -625 -924 116 2850 762 435 -1421 -1582 581 -1522 639 -13 657 1007
5042A007m0j372J204N91j736j8Q25o31J254R1o69j149J28K85j029J397l19K81
$$ 1007 967 -405 799 1390 -346 -364 461 -170 1084 1175 506 -643 -515 -230 -1259 138 -181 100
5060A00M02J129j936m76J343R90m49k145k40J882j330Q31J30l94J293j144p34
$$ 100 502 1631 -305 -781 562 1552 1103 -1042 -1282 600 -730 101 231 -163 1130 -14 -748
5077g48l06J462m00K21O13j611N06P2N87j384O05m43O84P43j102n41J841j30j031
$$ -748 -1054 408 8 229 842 -769 -263 -191 396 -988 -383 -826 -142 601 -501 -1042 799 669 -362
5096c62P34r41r88K384k68j298O02M40J863r10N55O9n02k282j83J137O97j055
$$ -362 372 -569 -1557 827 559 -739 -137 303 2166 1256 1811 1880 1378 -904 -1087 50 747 -308
5114c08L15n76j38P01k22O75q76p32Q08J158n47O85j119L97n13K35K66r87J192
$$ -308 7 -569 -707 -6 -228 447 -429 -1161 -353 805 258 943 -176 221 -292 -57 209 -778 414
5133D14p8L7j271O39n98O08o24J413k545J808M27p98J6m20K012j576J105j372
$$ 414 336 373 -898 -259 -857 -249 -873 540 -2005 -197 230 -568 -552 -972 1040 -536 569 -803
5151h03J639k687M14J545o54O29n68J322p51n45R69r95M20M04q21J018J842k861
$$ -803 836 -1851 -1437 108 -546 83 -485 837 86 -459 510 -485 -65 339 -482 536 2378 -483
5169d83O95j06J689k403r47J934J845j791J44p40r12Q36J334O79k397J306j508
$$ -483 212 106 1795 -608 -1555 379 2224 433 577 -163 -1075 -239 1095 1774 -623 683 -825
5186h25j55Q81j77j21J315o41m40J361j671P22M56L29k418J420J103q36J169M
$$ -825 -980 -99 -276 -397 918 277 -163 1198 -473 249 705 1034 -1384 36 1139 303 1472 1476
5204A476K79k405J575r60L96j31j486K248n79N06l43j070n78n99K464p29l83k93
$$ 1476 1755 -650 925 -35 361 230 -1256 992 413 919 576 -494 -1072 -1671 793 64 -319 -612
5222f12K010q17p52l45J507r57l9P94r86J45J8p80L3L09L49K1j23J027P79j211
$$ -612 1398 581 -171 -516 991 34 -5 789 -197 -52 -34 -814 -781 -472 -123 -102 -225 802 1581 370
5242C70q89m8p43K109q76Q52j532N42j84m39O78N36q68K189p55q66J27jk31j508
$$ 370 -519 -567 -1310 799 -77 775 -757 -215 -399 -838 -160 376 -492 1697 942 76 203 202 -29 -1537
5262a537J958O75p13p4K64k558K060l75j72k121K695M04j472Q83j34K83j108J980
$$ -1537 421 1096 383 309 573 -1985 75 -300 -472 -2593 102 506 -966 -83 -217 66 -1042 938
5280I38m13j441K21O33o09J009O0n31o81M55n0P34k56j15j53O91k8Q09j377j154
$$ 938 525 -916 -695 -62 -671 338 398 -133 -814 -359 -409 325 69 -46 -199 492 464 1273 -104 -1258
5300a258R78R94j442R9m48J000l51M86q98K38J82J549k48j288l12J71O53o27Q24
$$ -1258 -280 714 -728 -629 -1077 -77 -428 58 -840 -602 -420 1129 881 -407 -719 -548 105 -522 302
5319C02o61j1J014n55Q77j491L99P72j20j040L06J97j161J329n58n0j198Q14K641
$$ 302 -359 -370 644 89 966 -525 -126 646 526 -514 -208 -11 -1172 157 -401 -451 -1649 -835 1806
5338A806k746J972K66n8J07o15j968J994j083n51p89J048K25R30o11o93n03J11
$$ 1806 -940 1032 1298 1240 1347 732 -1236 758 -325 -876 -1665 -617 -392 538 -73 -766 -1269 -1158
5356a158l86J329O43o6L5k95j532J91K420k261K72J174k168J622K03j107K157
$$ -1158 -1544 -215 428 362 397 102 -1430 -1239 1181 -1080 -808 366 -1802 -180 23 -1084 1073
5373A073j483O10k74P08j363J898j571J143k9k239J616K538l514Q99l76J328j380
$$ 1073 -410 200 -74 634 -729 1169 -402 741 712 -1527 89 2627 -887 12 -364 964 -416
5390d16J497j614K75P56m19n68L0m97r24K827j167N36Q1n21o46J289M87k40m96
$$ -416 1081 -533 -258 498 79 -489 -459 -956 -1880 947 -220 316 397 -124 -770 519 1006 766 270
5409B70J383k532P46r92J522m50L27m53j51r36L57O24JK29K56l68j59Q61k19p82
$$ 270 1653 -879 -133 -1125 397 -53 274 -179 -330 -1266 -909 -285 -284 -55 201 -167 -326 535 316 -466
5429d66J100J143k503p58Q27Q09j80J72j286J695q90J338k237J097O92j533J317
$$ -466 634 1777 -726 -1484 -657 152 -28 144 -1142 553 -337 1001 -1236 -139 553 -980 337
5446C37K76j138l5j74P86Ql89M00m90k78j711L979j443J209k164K178j811o49
$$ 337 613 -525 -560 -734 52 60 -329 71 -419 -697 -2408 1571 128 1337 -827 1351 -460 -1109
5464a109J23K018j371l50J572L92k779J219L16l55o30J182J05r64P41j487J910
$$ -1109 -986 1032 -339 -689 883 1275 -1504 -285 31 -324 -954 228 333 -631 110 -1377 533
5481E33j959K960l37j098j287N02J151n50K35k63J42q97Q51l09m06J373j023J277
$$ 533 -1426 1534 1197 99 -1188 -686 465 -85 150 -113 29 -868 -17 -326 -732 641 -382 895
5499H95j397J270L99M5J86k37j070m03l73P16q4k108K192o88J156n64O06J455
$$ 895 -502 768 1167 1212 1398 1161 91 -312 -685 31 -53 -2161 31 -657 499 -65 541 1996
5517A996k792M97J041o24k51L34Q86q09m70J532k197J088O20K15j033o56Q13M50
$$ 1996 -796 -299 742 118 -133 201 1087 278 -192 1340 -857 231 851 1066 33 -623 190 640
5535F40J198r89J99j46k978K531p61O31O9Q50p09j367K06L97q09J541P0j251o35
$$ 640 1838 849 1048 902 -2076 455 -306 325 394 1244 535 -832 -626 -229 -1038 503 573 -678 -1313
5554a313j122K494p27O54j122J493r36J192N07j252L05K32O42j830J277j007M30
$$ -1313 -2435 59 -668 -14 -1136 357 -579 613 1120 -132 173 405 1047 -783 494 -513 -83
5571h3j579L205j893o30K104o63J432k998N65J716l61j822J319R51j667K63N65
$$ -83 -1662 1543 -350 -980 1124 461 1893 -1105 -540 1176 815 -1007 312 1263 -404 -141 424
5588D24m80j336M43J152J30K6j455J882N33k194J260N3r45K15J189P19p65l433
$$ 424 -56 -1392 -949 203 333 359 -1096 786 1319 -875 385 438 -507 -292 897 1616 851 -2582
5606b582K346J34L24j046K189o33p95p78M59J564j462J99m09l64R71l04J616k467
$$ -2582 -236 -102 222 -824 1365 732 -63 -841 -382 1182 -280 -81 -490 -854 117 -187 1429 -1038
5624a038P21O76k25Q14j723q13J989j525J910J31m50J155o37N70k593J066j600
$$ -1038 -317 359 134 948 -775 -1588 401 -1124 786 917 467 1622 985 1555 -1038 28 -1572
5641a572O31M0L645m810J943r5j121K725j485P59N06m08n92P67j678J69N93J263
$$ -1572 -941 -901 2744 -2066 -123 -218 -1339 1386 -99 660 1166 758 166 933 -745 -576 17 1280
5659A280j624j084K105Q12k025L02J312q87n81m9J808j466l11m1l8Q44r83N55
$$ 1280 -344 -1428 677 1489 -536 -234 1078 191 -390 -439 1369 -97 -408 -449 -487 357 -626 -71
5677g1J29J896k802p01J288q3P27j058J692k135K105j179k188J422n0P68L9k74
$$ -71 58 1954 -848 -1549 -261 -344 383 -675 1017 -1118 987 -192 -2380 -958 -1008 -240 -201 -475
5695d75n64J255J45Q92k404K147m68R87j517Q16j83m68j079N53K819j940j848
$$ -475 -1039 216 361 1253 -1151 996 528 1515 -2 814 631 163 -916 -363 2456 516 -1332
5712a332J499JR94r97j83n38j89J56J777k027N95l15l8K27l1K37O36j36P84j027
$$ -1332 167 168 1162 165 -18 -556 -745 -589 1188 -839 -244 -559 -597 -370 -401 -164 472 336 1120 93
5732I3L8O2L56j349l95Q26r98K051j052j212J242J061P16M29l144J660j64J241
$$ 93 131 193 549 -800 -1195 -369 -1367 684 -368 -1580 -338 723 1439 1868 -1276 384 220 1461
5750A461j506k76J67j491J382J331k65N02j830J524j925J149M71n72J5J56n9K14
$$ 1461 -45 -321 -154 -1645 -263 1068 803 1305 -525 999 -926 223 694 122 137 293 234 448
5768D48L62j088O03j750J650o25k55K11m4N77j194J198n38o9j60j03o25L325k723
$$ 448 810 -278 325 -1425 225 -400 -655 -444 -488 89 -1105 93 -445 -514 -674 -777 -1402 1923 -800
5787h00J680p26o11n49K098Qr75j531J425j180j54P22j14M3N60L86j771R86P38
$$ -800 880 154 -457 -1006 1092 1100 125 -1406 19 -1161 -1315 -593 -707 -664 -104 282 -1489 -503 235
5806B35l52n07J687k126J059m07O49o23k27k86J25J490r50j78K97q7k14P24q69
$$ 235 -117 -624 1063 -1063 -4 -411 238 -385 -612 -898 -773 717 -233 -411 -114 -201 -415 309 -560
5825e60k37J842k005J282m81Q52Mo08Q33j815o95K780L09j543J252q5r44j262
$$ -560 -797 1045 -960 322 -159 693 697 89 922 -893 -1588 1192 1501 -42 1210 1125 181 -1081
5843a081J068k62M2k83J116j074J888j221l77j051K135j427J039o78L71j366J528
$$ -1081 -13 -275 -233 -516 600 -474 1414 193 -184 -1235 900 -527 512 -166 205 -1161 367
5860C67n43Q05M19o95l81j1L15j171P13J640k255k83R59m25K334j536p73K68j34
$$ 367 -176 629 1048 353 -28 -39 276 -895 -182 1458 -797 -1080 -121 -546 1788 252 -521 -253 -387
5879c87j874J714J82j89j20K094j943j48O27q91K31o15J587o66N25r6J85k039
$$ -387 -2261 -547 -365 -554 -674 1420 -523 -671 -44 -935 -704 -1319 268 -398 127 31 216 -1823
5897a823J767j544J083r4m33K348j634k9n74J445n34l26J0O54o29K38j98M32K32
$$ -1823 -56 -1600 -517 -611 -1044 1304 -330 -359 -933 512 -22 -348 -338 316 -313 -75 -273 159 391
5916C91p72k92p77J119J93J291j200m87P5o19M57j069J069J588k103K08J418Q2
$$ 391 -381 -673 -1450 -331 -138 1153 -47 -534 -459 -1078 -621 -1690 -621 967 -1136 -928 490 572
5934E72j882J475p58J129N10j952J084K246l505n42R59j272J509j26j78M54o46
$$ 572 -1310 165 -593 536 1046 -906 178 2424 -1081 -1623 -664 -1936 -427 -553 -731 -277 -923
5951i23J017j258J086J999k751N77j95M56J225m068K138M57J507j667K8N39O78
$$ -923 94 -1164 -78 1921 -830 -253 -448 8 1233 -2835 -697 -240 1267 -400 -372 167 845
5968H45j451P0J47P52M74L6p05p17j1O11P9K3l45R31J66j442J38N99n21M83l58
$$ 845 -606 -536 -389 363 837 873 168 -549 -560 51 130 153 -192 739 905 -537 -399 200 -321 162 -196
5989a96O41q31M1P31l15j231K55J722m53o25n29J174K34k075J176J276j430l0
$$ -196 445 -386 -345 386 71 -1160 -905 817 364 -261 -790 384 618 -1457 -281 995 -435 -465
6007d65N9N88l18Q39p57J880j461o68q9R13j501J733j052J334j869J522j277L55
$$ -465 -406 182 -136 703 -54 1826 365 -303 -392 521 -980 753 -299 1035 -834 688 -589 -234
6025b34J415k265J621k49K74o45J069K41j984P26l61l68N44p27K24O89j34J140
$$ -234 1181 -1084 537 288 562 -83 986 1227 -757 -31 -392 -760 -216 -943 -719 -30 -164 976
6043I76n47n30J028n86j280L23K375k129j96J090o76k77J510j745M74n8K58J29
$$ 976 429 -101 927 341 -939 -616 1759 -370 -566 524 -152 -429 1081 -664 -190 -248 10 139
6061A39J043j180l77J200k24l82q49l97q7n41J609K684l489J526j342n91R21M03
$$ 139 1182 2 -375 825 601 219 -630 -1027 -1114 -1655 -46 2638 -851 675 -667 -1258 -337 66
6079F6J078k149J137j023J793n66r00j02M9J485k537P34J081J88j18P52M29k759
$$ 66 1144 -1005 132 -891 902 336 -564 -666 -617 868 -1669 -935 146 334 216 968 1397 -1362
6097a362J07K396j741L16j040KK403p75j854K020j019J220j613L33J447k51K3
$$ -1362 -1255 1141 -600 -284 -1324 -1322 1081 306 -1548 472 -547 673 -940 -607 840 589 612
6114F12p15k25K036j172q98J049j083Q69p03n11j82L81j348K106p34N02P69j471
$$ 612 -103 -328 1708 536 -362 687 -396 473 -230 -741 -923 -542 -1890 216 -518 -16 753 -718
6132g18J215n4l84j153Q39n52K223o72o60l03J078j41K92k667K101l34P07o9r95
$$ -718 497 443 59 -1094 -255 -807 1416 744 84 -219 859 718 1010 -1657 444 110 817 748 -247
6151b47m35J060M67q3k11j132k79K97j81l0R96j169J225r90N1J875j533j464M01
$$ -247 -682 378 845 762 551 -581 -860 -563 -744 -774 222 -947 278 -712 -661 1214 -319 -1783 -1382
6170a382L71J738K36k73o30l92J791j625K69N31K68j994K84R40O77o84j929l60
$$ -1382 -1011 727 963 690 60 -332 1459 -166 103 634 902 -1092 -808 132 809 125 -1804 -2164
6188b164K514M10K80j059q73Q13j115K447Oj623O02j02k50q58K350k392K034k865
$$ -2164 350 760 1040 -19 -892 -79 -1194 1253 1259 -364 238 136 -114 -972 1378 -1014 1020 -1845
6206a845Q92J296n3p18M00J414j901N62J50j569K85K87N71k59J579j453M4k14
$$ -1845 -953 343 290 -428 -28 1386 -515 47 197 -1372 -1087 -800 -229 -488 1091 -362 -318 -532
6224e32P35o69k24Q70l61l35r76Q61l23K857j572j796J977l19N71j950Q81J080
$$ -532 203 -466 -690 180 -181 -516 -1492 -631 -954 1903 331 -1465 512 193 764 -1186 -305 775
6242G75j333K001q53k323K340m40o52p48K207q03J087p62j05k248O69Q0M42o27
$$ 775 -558 1443 590 -1733 607 167 -485 -1233 974 171 1258 496 391 -1857 -1188 -1108 -666 -1293
6260a293J766q92P03n40R54r29P82qn59J12K3m21J63p02R72M70j290k23O39Q22
$$ -1293 473 -419 284 -256 698 -231 551 543 -16 96 119 -302 -139 -841 131 601 -689 -912 -273 549
6280E49m02k114K801j267L17R43k52j102L57K16N54r69N99n97L32N66j46m09M01
$$ 549 147 -1967 834 -433 -116 827 575 -527 -170 46 600 -369 230 -367 -35 531 385 -24 377
6299C77k69J150o46k13k507J959K238j682r66j0O44P01k374K235M32j218P00j840
$$ 377 108 1258 612 399 -2108 -149 2089 407 -559 -569 75 776 -1598 637 1069 -149 551 -1289
6317a289J632n52N50l56O00j765J586j001J48R85j62q19O7J87Q65m57j110J370
$$ -1289 343 -209 341 -15 585 -1180 406 -595 -447 538 376 -443 -376 -189 676 219 -891 479
6335D79p82o20o96J921m39L57k0n56R77j962J710j790J681R28j513m73J375k49
$$ 479 -303 -923 -1619 302 -137 220 200 -356 621 -1341 369 -1421 260 1188 -325 -798 577 328
6353C28P88j220J52p07o57J522J557k066m80j039J732N54j188K391k969J835n77
$$ 328 1116 -104 48 -659 -1316 206 1763 -303 -783 -1822 -90 464 -724 1667 -1302 533 -44
6370d4P62Kj697k89J757k300K011m91n40J702n91m24m24L67p75N69R69n00l68
$$ -44 718 720 -977 -1266 491 -1809 202 -289 -829 873 282 -142 -566 -199 -974 -405 564 64 -304
6389c04k08J214j430K390p72O47k178J365k011o49P38J565j99R94j133p49J606
$$ -304 -512 702 -728 1662 890 1537 -641 724 -1287 -1936 -1198 367 168 1162 29 -720 886
6406H86j927L799l369R94P49j665J552J17j042m08P60j144K185j511K37j114K63
$$ 886 -1041 2758 -611 383 1132 -533 1019 1136 94 -314 446 -698 1487 -24 213 -901 -638
6423f38m16P81K03o90O88L35m91O04j851J405Q23k605j90K433Q1P69k389q7M78
$$ -638 -1054 -273 -70 -760 -72 263 -228 376 -1475 -70 753 -1852 -2042 391 472 1241 -1148 -1235 -757
6442g57J349j121M01O38p84J55M98j823M58J804R7o76j714J980J240k021k72N12
$$ -757 592 -529 -128 510 -274 -119 379 -1444 -986 818 915 239 -1475 505 1745 -276 -548 -36
6460c6oJ786q95j880J743p61K37j044K58p77M20K184k328J917r92j093J440j281
$$ -36 -42 1744 849 -1031 712 -49 188 -856 -598 -1375 -955 1229 -1099 818 -174 -1267 173 -1108
6478a108J485M79n34M54j560J711l76j313q9J14j59J821L41j184P92j634R15R8
$$ -1108 377 856 322 776 -784 927 551 -762 -851 -737 -896 925 1266 82 874 -760 155 253
6496B53j38J530k216J624P66l002K138o09p75J183r35J238n86N74q60P6l47m39
$$ 253 115 1645 -571 1053 1819 -1183 955 346 -429 754 -181 1057 471 1045 185 261 -86 -525
6514e25j024J808o75J688j97j062Q90r63J621j128o7J220j334K34L19l72o61L72
$$ -525 -1549 259 -416 1272 1075 13 903 -60 1561 433 366 1586 252 486 805 433 -228 144
6532A44l73K44L97P37q82n08k91p97N75J35L46n07Q42o88L49N84k48R70j977k02
$$ 144 -229 15 412 1149 267 -241 -532 -1329 -754 -619 -273 -780 62 -626 -277 307 59 1029 -948 -1150
6552a150P24O54J325k233N11Q71j048l65J418k04Q85N51l293N76K720k950J197
$$ -1150 -426 228 1553 -680 -169 702 -346 -711 707 503 1388 1939 -1354 -778 1942 -1008 189
6569A89n04N55p29o94J157l7n42J52Q88n44J29L44l14j146J533R12p1k136Q64
$$ 189 -315 240 -489 -1183 -26 -63 -605 -453 435 -109 20 364 50 -1096 437 1349 1278 -858 6
6588Fj304M85K00R67l05j095K05J361m10j252J542N89K67j682m56J998m50j477
$$ 6 -1298 -813 -613 354 49 -1046 -841 520 110 -1142 400 989 1256 -426 -882 1116 666 -811
6606h11J217j703K83j7O65M65k91J029j614J147r93N30l42J438p23r16P35N7n4
$$ -811 406 -1297 -1014 -1031 -366 99 -192 837 -777 370 -623 -93 -435 1003 280 -636 99 156 102
6625A02n36r92P32Q53Q5j360M75OJ120j736K343j149N65j870J892P66j251j115
$$ 102 -434 -1426 -694 159 244 -1116 -641 -635 485 -1251 1092 -57 508 -1362 530 1296 45 -1070
6643a070J057M42o36o21R66J19r3j587J646J081kj142j63L41q88J610q25r96L26
$$ -1070 -13 429 -207 -828 138 257 164 -1423 223 1304 1302 160 -3 338 -550 1060 235 -761 -435
6662d35O30j15r20K70j78P33j178r31L256j309RN96j040n31M25L68J093r17j064
$$ -435 195 80 -840 -570 -748 -15 -1193 -2124 1132 -177 -168 428 -612 -1143 -718 -350 743 -174 -1238
6681a238J805j57M30o59p56K94j896K083k006K026r4M90J29Q6j117K110k514K756
$$ -1238 567 410 840 181 -575 -281 -2177 -94 -2100 -74 -168 322 451 537 -580 1530 -984 1772
6699A772k013q04L148k106j130L15J742m06J289j998J263j313J280j542Q57L54
$$ 1772 -241 -1045 2103 -3 -1133 -818 924 518 1807 -191 1072 -241 1039 -503 354 708
6715G08J075j802j61m68J92q88J856Rj207r9J25j46J300q19O88J041j096p63J058
$$ 708 1783 -19 -180 -648 -456 -1344 512 521 -686 -785 -660 -806 494 -325 363 1404 308 -455 603
6734F03j162J207p08lK049k115j481j32J072J921p30k98p80k9J002M06j882R82
$$ 603 -559 648 -60 -63 1986 -129 -1610 -1742 -670 1251 521 223 -557 -586 416 822 -1060 -78
6752g8M22l89L73o54N57j91P74J73j088N07j156k35J131j324R1J381n24L71J467
$$ -78 344 -45 328 -326 231 40 814 987 -101 406 -750 -985 146 -1178 -1087 294 -230 141 1608
6771A608k282J052p91M10j312K350j17q58m30J572o86J021j809P93j421K272j709
$$ 1608 -674 378 -413 -3 -1315 1035 918 60 -370 1202 516 1537 -272 521 -900 1372 -337
6788c37J893n61j128P31q62J720j129L25j885K38M8J277j029m7J126p49R16r5
$$ -337 1556 995 -133 598 -264 1456 327 652 -1233 -995 -947 330 -699 -746 380 -369 547 452
6806D52j183J030p30j82Q46j954J247j166J778j565R34R49P8P78j743J249j100
$$ 452 -731 299 -431 -613 233 -1721 -474 -1640 138 -1427 -493 456 534 1312 -431 818 -282
6823b82K95j490K315N1l72j363M47J775Q15j576j158l42R76j260Q01P8p12J514
$$ -282 13 -1477 838 889 517 -846 -399 1376 2191 615 -543 -885 91 -1169 -368 -290 -1002 512
6841E12o02n38n63O87L25j321J806j018J650o72Q31p67j816J001o89K503o93k000
$$ 512 -90 -628 -1191 -504 -179 -1500 306 -712 938 266 1097 330 -1486 -485 -1174 1329 636 -1364
6859a364J279n29m23O88K99K887k792p29J878j611J575r08q47J253p51o84R68
$$ -1364 -85 -614 -1037 -349 -50 2837 45 -684 1194 -417 1158 250 -597 656 -95 -779 189
6876A89j198K424m51p19n40Q82J56j77M68p45j892J108l73k37J527j247J200O55
$$ 189 -1009 1415 964 245 -295 587 743 566 1034 289 -1603 -495 -868 -1105 422 -825 375 1030
6894A030p91l11m0j407R10J659j221j23N04J026j524l51J302m57R10j467n31J241
$$ 1030 239 -72 -112 -1519 -609 1050 -171 -294 210 1236 -288 -639 663 206 1116 -351 -882 359
6912C59j915L045j524K91p23O55m2J26p05P33P85k335J463n96J156k61o66K83
$$ 359 -1556 1489 -35 256 -467 188 146 272 -433 300 1085 -1250 213 -383 773 512 -154 129
6930A29P32p48l13J486o30j868J87J383m91m67M41L1n28L32Q05M45l72j981Q48
$$ 129 861 113 -200 1286 656 -1212 -1025 358 -133 -600 -159 -128 -656 -324 481 926 554 -1427 -579
6949e79k93J742J073j288m68j168K074r41m81J5M28j060O62j75N16p27Q78q18
$$ -579 -872 870 1943 655 187 -981 1093 152 -329 -314 114 -946 -284 -459 57 -670 208 -610
6967f10J467o8L38j292M77r48J125j355J829r83j506P61K52M31k40L82M24K24
$$ -610 857 789 1127 -165 312 -636 489 -866 963 -20 -1526 -765 -513 -82 -322 60 484 708
6985G08L28j840K839p35n15k132R29O03m3l65o9J100k765R84L35M35L47k679K110
$$ 708 1036 -804 2035 1300 785 -1347 -418 185 142 -223 -292 808 -1957 -973 -638 -203 144 -2535 -425
7004d25Q98m27P46j454J385l17o42p50K564n32r76Q68M12J29o52r65j48P12M70
$$ -425 473 46 792 -662 723 406 -236 -986 1578 1046 70 938 1350 1479 827 -138 -286 426 896
7023H96j918Q30p65J871l72j48n77j192K95J374l15q38K48j751L818j500J04j48
$$ 896 -1022 -192 -957 914 542 394 -183 -1375 -1080 294 -21 -859 -611 -2362 1456 -44 60 -88
7041h8k096K899j883K037l17l9j745J527K29p72j007J370o27k72J383r1q83n18
$$ -88 -2184 715 -1168 869 552 513 -1232 295 524 -248 -1255 115 -512 -784 599 508 -375 -893
7059h93J303n06n56R14M81o28L36j055J824k402R38J004p31j820K601o0j375n83
$$ -893 410 -96 -652 262 743 115 451 -604 1220 -1182 -244 760 29 -1791 810 750 -625 -1208
7077a208J060M06P32r71j21L31o90J365j473J760l292K134k17J85L42m85O60n00
$$ -1208 -148 258 990 19 -102 229 -461 904 -569 1191 -2101 33 -184 1 343 -142 518 18
7095A8j375J567K3j607K508q74j366M88J021l52k258J663m69J164m28L61j293
$$ 18 -1357 210 233 -1374 1134 260 -1106 -618 403 51 -2207 -544 -1013 151 -277 84 -1209
7112a209J064M49j281m81R24K2J540j06j688K139j774P66k12j621K648j757M05
$$ -1209 -145 304 -977 -1458 -534 -512 1028 922 -766 1373 -401 365 153 -1468 1180 -577 -172
7129a72J991j478j73J461q27P74k432L17M03j197K373k989K626n10M50o89L62
$$ -172 1819 341 168 1629 802 1576 -856 -539 -136 -1333 1040 -1949 677 167 617 -72 290
7146B90M14k287J183J586j760oj362J719J200k356J590j002K839k048j306J971
$$ 290 704 -1583 -400 1186 -574 -580 -1942 -223 977 -1379 211 -791 2048 0 -1306 665
7162F65j225J535o76j99M36j309R31m6l66K8M43p85J67J289j393J838j957J221
$$ 665 -560 975 299 100 536 -773 158 112 -254 -226 217 -568 -401 888 -505 1333 -624 597
7180E97j215n69K011j673k96l41J005J208p31j828J807n42l54L93q02J530o21
$$ 597 -618 -1187 824 -849 -1145 -1486 -481 727 -4 -1832 -25 -567 -921 -528 -1330 200 -421
7197d21J701o64o67M16j490J426O88q48o9o25Q72l90j087K018p12o61l05J003
$$ -421 1280 616 -51 365 -1125 301 989 141 72 -553 319 -71 -1158 860 148 -513 -818 185
7215A85J171j510J5j025J237N34q33P38j326P67k53mP93m19l62K048j724m50N48
$$ 185 1356 -154 -139 -1164 73 607 -226 512 -814 -47 -300 -304 489 70 -292 1756 32 -418 130
7234A30m31M00m08J78n28J097p49o2P89n15p73OJ244j602Q74p9K068j593J215
$$ 130 -301 99 -309 -131 -659 438 -311 -373 416 -99 -872 -866 378 -1224 -350 -429 1639 46 1261
7253A261j17j297R49r5r5Q16q75N50r84q72Q32J696q84j548J158j080J71k0J643
$$ 1261 1144 -153 796 701 606 1422 547 1097 113 -759 73 1769 885 -663 495 -585 -414 -434 1209
7272A209j293q84J050L47r39l68R74j368K175j027M56p64O1J534n20K86l13j224
$$ 1209 -84 -968 82 429 -510 -878 96 -1272 903 -124 332 -432 -371 1163 643 929 616 -608
7290f08O42M38k96k19J825k827K564k174K790k792o57J827j132N57j182J588J6
$$ -608 34 472 176 -43 1782 -1045 1519 -655 2135 -657 -1314 513 -619 -62 -1244 344 360
7307C60p13J052j367N74n96K11n2J569r10l94J211j291Q3o49P92l82M25j4K52
$$ 360 -353 699 -668 -94 -690 -479 -531 1038 128 -266 945 -346 -263 -912 -120 -502 -77 -91 161
7326A61L7m77J19m24o65Q25M74k39J607j634P60k017J257k5J16J409j067M69J01
$$ 161 198 -279 -160 -584 -1249 -424 50 -189 1418 -216 544 -1473 -216 -241 -125 1284 217 686 787
7345G87m55Q28o31p40J456j434L11o5J052k344M64O88N25j86q22J604p29M37j352
$$ 787 332 1160 529 -211 1245 -189 122 57 1109 -1235 -771 -83 442 256 -566 1038 309 746 -606
7364f06N07P12l40n17J478j948L97J86Q41j129O62n52r04O30K032p54j49Q18j234
$$ -606 -99 613 273 -244 1234 -714 -317 -131 710 -419 243 -309 -1213 -583 1449 695 546 1364 130
7383A30o39O34J147j261K89j421J221m86k05J465j601K557k499Q60p89Q79q23
$$ 130 -509 125 1272 11 300 -1121 100 -386 -591 874 -727 1830 -669 191 -598 281 -542
7400e42J83j4R0j722J189J094p85l08J469j991K649k165J654J04r49r49N82N59
$$ -542 -359 -373 -283 -2005 -816 278 -507 -815 654 -1337 1312 -853 801 905 -44 -993 -411 148
7418A48j54m40J84J116l54j548j034J927m59n00L61N05N22N34p51N16N58j486
$$ 148 -6 -446 -262 854 500 -1048 -2082 -155 -614 -1114 -753 -248 274 808 57 573 1131 -355
7436c55l46L058k771P57l53R51j076J98k81M97j578J025K508l056K36N07J35n51
$$ -355 -701 2357 -414 343 -10 941 -135 63 -218 279 -1299 -274 2234 -822 -586 -79 56 -495
7454d95M74Q25j021J10L53R77j108j52l64J488k078J405k039J339J234m10R50
$$ -495 -21 804 -217 -107 246 1223 115 -37 -401 1087 -991 414 -1625 -286 948 538 1488
7471A488j452j17l37N87n3p69N77L02R56j162r81J601k00Q39m84j355J91K21N90
$$ 1488 36 -81 -418 169 116 -653 -76 226 1182 20 -961 640 440 1279 795 -560 -369 -148 442
7490D42O33q84j571M32M61j109K577K88r82J79j596L60J078j453L78J639K20l23
$$ 442 1075 191 -1380 -948 -487 -1596 981 1269 287 466 -1130 -770 308 -1145 -767 872 1092 769
7508G69j187j195J286J808k493J505J7L8k0l28n05K13J87l90K17K51M98j701J390
$$ 769 -418 -1613 -327 1481 -1012 493 510 548 528 200 -305 -92 95 -295 -78 173 671 -1030 360
7527C60j84P33p49J318j594J104o72l68J5O82j33l23l28R15j333M91L01m87L47
$$ 360 176 909 160 1478 -116 988 316 -52 -37 645 512 189 -139 776 -557 -66 235 -252 95
7546I5J023j220O65m16p14J254j297J193m28M50j391M18j386K047j116Q89j964
$$ 95 1118 -102 563 147 -567 687 -610 583 155 605 -786 -368 -1754 293 -823 66 -1898
7563a898K900j347L69L59k02r96O66j097K821j60j251r05p14K886j309r9K9l69
$$ -1898 1002 -345 24 383 181 -815 -149 -1246 1575 1415 164 -741 -1455 1431 122 23 52 -317
7581c17j21P37j084J507o47j819K658p30P56j038n90J636q51L42o57N15L04m72
$$ -317 -438 299 -785 722 75 -1744 914 184 940 -98 -688 948 97 439 -218 297 601 129
7599A29l84J139o61J6M97j525L16L52k99O26j455J045J242p69L06m25q65K005
$$ 129 -255 884 223 239 736 -789 -473 -121 -420 206 -1249 -204 1038 269 575 150 -715 1290
7617A290l27r68j278K51q52J599J037k45j738L46j75J916J31n18k98n11J944j427
$$ 1290 963 -5 -1283 -1032 -1884 -285 752 507 -1231 -885 -1060 856 987 469 171 -340 1604 177
7635A77M45k344J680k06q48R30q14j84J734j168J539p22Q69L01m78q62P48j561
$$ 177 622 -1722 -42 -248 -1096 -166 -980 -1164 570 -598 941 219 1088 1389 911 49 797 -764
7653g64J306j198R41L88N04M40j681K86k28J16Q5J597k198l18J516r38p6J97K04
$$ -764 542 -656 285 673 1177 1617 -64 222 -6 110 195 1792 -406 -724 792 -146 -222 -25 179
7672A79Q69j578l38r21K112Q52j953M64J391j725N26j537j71J620k76J524k409
$$ 179 1048 -530 -868 -1789 323 1175 -778 -314 1077 -648 -122 -1659 -1830 -210 -486 1038 -1371
7689a371J902k79n79Q63Q09n32M61q90j076J295j284P45Q06j138M56J94m30j1
$$ -1371 531 252 -327 536 1345 813 1274 384 -692 603 -681 64 870 -268 188 382 -48 -59
7707e9M13j378J068J396r07k337J759J215j757J823r7j402J88N89L41p40l67N19
$$ -59 354 -1024 44 1440 533 -1804 -45 1170 -587 1236 1139 -263 -75 514 855 115 -252 267
7725B67K45J155k836P82k84R24n28m23J821n22lm26l80K87k93r0j188J207J445
$$ 267 512 1667 -1169 -387 -671 253 -275 -698 1123 601 598 172 -208 79 -214 -304 -1492 -285 1160
7744A160o59r08J423p53p82R02r93l32M15K252p90n39j129R54n70O20j400Q38
$$ 1160 501 -407 1016 263 -519 383 -610 -942 -527 1725 935 396 -733 221 -349 271 -1129 -291
7762b91O73O33P11j263j210K290k190L53P12J30J71J10j066J933j237j705K35
$$ -291 382 1015 1726 463 -747 1543 -647 -294 418 548 719 829 -237 1696 459 -1246 -1011
7779a011M67L80o79l10P61K151j055P03j385K80J27j544K735k566J767j920J612
$$ -1011 -544 -164 -843 -1153 -392 1759 704 1407 22 302 429 -1115 1620 -946 821 -1099 513
7796E13l19p06J579q41j009J050m13j038K177j460M64o15J096J131j492j69q88
$$ 513 194 -512 1067 226 -783 267 -146 -1184 993 -467 -3 -618 478 1609 117 -52 -940
7813i40J602j032l94J015j303K493n92j741J263j520P64J350k33k93l56Q7n94
$$ -940 662 -370 -764 251 -1052 1441 849 -892 371 -1149 -385 965 732 439 83 170 -424
7830d24K88J317p5q96M75j060j58O83J018j884m8j068K798n20M7J260j547k27
$$ -424 -136 1181 1106 210 685 -375 -533 150 1168 -716 -764 -1832 966 446 493 1753 206 -21
7848b1n54j61K241j109p82J19L57o91M10J602j570M51K82N05J42O0j123L56j63
$$ -21 -575 -736 1505 396 -386 -267 90 -601 -191 1411 -159 292 574 1079 1221 1281 158 514 351
7867C51qm67j191J403J323j482p02J292m63O38Q44j318m87R04Q11j413K96o1R24
$$ 351 343 -124 -1315 88 1411 -71 -773 519 56 694 1538 220 -267 637 1448 35 331 270 1194
7886A194o73m34n04K41N29L3m20L44L11j617K15r56J852j5J111r30l24J20R14
$$ 1194 521 87 -417 -176 353 386 -34 310 621 -996 -781 -1737 115 100 1211 281 -43 77 991
7905I91j759k16O74Q97K30l02j5j458J52O80Lq17Q41M50o31O44k72J43J034k095
$$ 991 -768 -984 -310 587 817 515 500 -958 -806 -126 -123 -940 -99 351 -280 364 92 235 1269 -826
7925h26P51J129l2j60j419m92J057R95j238l4R0m7J44K69q57r37R35J35J401j841
$$ -826 -75 1054 1022 862 -557 -1049 8 1003 -235 -269 -179 -226 -82 187 -670 -1607 -672 -537 864 -977
7945i77K76O87J54r85n74K926p48r57M38p47J34J669j441k04r69R53J260j343
$$ -977 -701 -14 140 -845 -1419 1507 759 -198 240 -507 -373 1296 -145 -349 -1318 -365 895 -448
7963d48J103j479j55K081j018l17K53l47J408j938N68L75J77K7o83LK105j132
$$ -448 655 -824 -979 1102 84 -233 20 -327 1081 -857 -289 86 263 290 -393 -390 1715 583
7981E83m71j697K683j485J467j075l47Q88l8j33k43J437k774L008l190K770j024
$$ 583 112 -1585 1098 -387 1080 5 -342 546 508 375 132 1569 -1205 1803 -1387 1383 359
7998C59j152O39O94O89k284K060m89K67j23q57K308q38j257O45r47K205j579n94
$$ 359 -793 -154 540 1229 -1055 1005 516 783 660 -197 2111 1273 16 661 -286 1919 340 -254
8016b54P39J127r85j023j290R34k8R78P19j327J566L80k288K277k459K065q70
$$ -254 485 1612 627 -396 -1686 -752 -780 198 917 -410 1156 1536 -752 1525 -934 1131 261
8033B61oP94j979J649j17p40J476k230J799p42L56n70M37N9j931J457k460J134
$$ 261 255 1049 -930 719 602 -138 1338 -892 907 165 521 -49 388 447 -1484 -27 -2487 -1353
8051a353Q27J592o84l82J417j112q65J750o84q92J478r63l13o91R80J08K01o16
$$ -1353 -526 1066 382 0 1417 305 -560 1190 506 -386 1092 129 -184 -875 105 213 414 -202
8069b02R45j649K023q5k325J877m70m21J099l4j582J865j079o44P08R22l98p65
$$ -202 743 -906 1117 1032 -1293 584 114 -307 792 758 -824 1041 -38 -682 26 948 550 -215
8087b15J080m30P02j639J521q39J58j2O83o97n20K98o38P37p42N66j95J23p44
$$ -215 865 435 1137 -502 1019 180 338 326 1009 312 -208 90 -548 189 -553 13 -182 -59 -803
8106h03l95Q86n31K81J99O48J50M62k53k89P06j853L55J60K509k490K84J958j982
$$ -803 -1198 -312 -843 -562 -363 285 435 897 644 355 1061 -792 -437 -277 2232 -258 26 1984 2
8125BR17j83k774K89J546j947K296j297N44J533j550J043Q39j882J444j693Q83
$$ 2 919 736 -2038 -1749 -203 -2150 146 -1151 -607 926 -624 419 1258 -624 820 -873 10
8142A0k127J927m22P74L33q34N94O6J494j918J107j614J693p71N37k75k245O14
$$ 10 -2117 -190 -612 162 495 -339 255 321 1815 -103 1004 -610 1083 312 849 574 -1671 -1057
8160a057Q58J51o9J82j651J865m01n82J826l42p01k28j833J887O40j440J33J29
$$ -1057 -199 -48 -117 65 -1586 279 -122 -704 1122 780 79 -149 -1982 -95 545 -895 -762 -633
8178f33m10L31J234p98N44M54r1j274m96Q42L76J532q60
$$ -633 -1043 -712 522 -276 268 722 631 -643 -1139 -297 79 1611 751
8191G51
$$ Imaginary data points
##PAGE= N=2
##DATA TABLE= (X++(I..I)), XYDATA
0@%%%%%%%%%%%%%%Kl10O16o16O16o16P06j014J232j267J575j860K168k523K838
$$ 0 0 0 0 0 0 0 0 0 0 0 0 0 0 0 2 -308 308 -308 308 -308 398 -616 616 -651 924 -936 1232 -1291 1547
29A547l399L955m448N027n715O423p164Q045r026J0070j1233J2496j3893J5421
$$ 1547 -1852 2103 -2345 2682 -3033 3390 -3774 4271 -4755 5315 -5918 6578 -7315 8106
43H106j7077J8875k0831K2997k5372K7945l0772L3903l7373M1190m5429N0206
$$ 8106 -8971 9904 -10927 12070 -13302 14643 -16129 17774 -19599 21591 -23838 26368
55B6368n5606O1765o8819P7035q6764R8442j12781J30887j54596J87057k34290
$$ 26368 -29238 32527 -36292 40743 -46021 52421 -60360 70527 -84069 102988 -131302
66a31302L09613m47998P81042k962414k459444Q739788R7612o394455P23757M186267
$$ -131302 178311 -269687 511355 -2451059 -4910503 3829285 3926897 -2467558 -1743801 2442466
76B442466k212413j797851K280244M38044j989819P37393Q37197j760171o5865
$$ 2442466 230053 -1567798 712446 1150490 -839329 -101936 735261 -1024910 -1090775
85a090775L209615k31365l838271M43916L957157j462334m144488K035837M123018
$$ -1090775 2118840 1887475 -1950796 -1506880 2450277 987943 -3156545 -1120708 3002310
94C002310k287440l633481K188053L063583j826900k038219J762240J261041j772417
$$ 3002310 714870 -2918611 -730558 2333025 506125 -1532094 230146 1491187 -281230
103b81230p28829J045736l63761j57075J805096n93432k632365J606647K841600
$$ -281230 -1010059 35677 -328084 -485159 1319937 726505 -1905860 -299213 2542387
112B542387k762204k522886L720283J922300m225488j415458L864197P28246l196604
$$ 2542387 -219817 -2742703 977580 2899880 -1325608 -2741066 1123131 1851377 -1345227
121a345227n1702K681725j11193j903224K09987R98111l93072j53093M09337q58362
$$ -1345227 -1396929 1284796 1173603 -729621 -519634 478477 85405 -67688 341649 -516713
131e16713m36436J812709M03669k444760m7644L013698k78136l338403M87428
$$ -516713 -953149 859560 1263229 -1181531 -1229175 1784523 1506387 -1832016 -1344588
140a344588L279938p73153l051129J069806K662428j358813k160873J511770J532527
$$ -1344588 1935350 1162197 -1888932 -819126 1843302 484489 -1676384 -164614 1367913
149A367913j326294o01166R33025m23307l84457J232796m36388j874533J253184
$$ 1367913 41619 -559547 373478 -49829 -434286 798510 362122 -1512411 -259227
158b59227K195638j940752k154261K467616J906313k777351j580140K756341J142595
$$ -259227 1936411 -4341 -2158602 309014 2215327 -562024 -2142164 614177 1756772
167A756772k517331o85842K080796K49027j506995R7706P94036l15768K2847N06417
$$ 1756772 -760559 -1446401 634395 883422 -623573 -525867 268169 -47599 -24752 481665
177D81665p53113n69630J352479M41518j909596k38398K403294N1858k715257
$$ 481665 -271448 -841078 511401 952919 -956677 -1195075 1208219 1260077 -1455180
186a455180J47679K814502l81348k663631O47880K293305q80575j733559R83545
$$ -1455180 -1307501 1507001 1125653 -1537978 -890098 1403207 522632 -1210927 -227382
195b27382J041649q79770k38403O04067n57465k27336J186110k40484j553584
$$ -227382 814267 -65503 -303906 300161 -257304 -484640 701470 460986 -1092598
204a092598Q24032J755203j362819j802302J734031J667465j919853j388646J956252
$$ -1092598 -268566 1486637 123818 -1678484 55547 1723012 -196841 -1585487 370765
213C70765J055758j840604p36834J572745M77919j096193j68462N55250j61018
$$ 370765 1426523 -414081 -1150915 421830 899749 -196444 -364906 190344 29326
222B9326m8574M14150m59137n63503R64214O02143j457179n42289J894687M14045
$$ 29326 -19248 394902 -64235 -627738 336476 938619 -518560 -1060849 833838 1247883
232A247883k171015k01317K242989j21996k167169M09276J877411o22227j406131
$$ 1247883 -923132 -1124449 1118540 996544 -1170625 -761349 1116062 493835 -912296
241i12296P12101P99748o60616j47498M72163m35498j59135Q74540k77419j231992
$$ -912296 -200195 599553 -61063 -208561 263602 -171896 -331031 543509 266090 -965902
251i65902O62221J434724r43112j468761J132695J398222j210943j242066J214422
$$ -965902 -303681 1131043 187931 -1280830 -148135 1250087 39144 -1202922 11500
260A1500J023758j186298q29630J045881N75279q30130k65502N85431o416k34763
$$ 11500 1035258 -151040 -980670 65211 640490 -189640 -455142 130289 123873 -110890
270a10890K77772j74576m98418O23205O34419j074557o80703J452043O15266j694007
$$ -110890 166882 -7694 -506112 117093 751512 -323045 -1003748 448295 1063561 -630446
280f30446m10757J834658J67849j785773P7879J541297l03268j156432M28797
$$ -630446 -1041203 793455 961304 -824469 -746590 794707 491439 -664993 -236196
289b36196O71029m66624j75857L96245k51446j93626O49860k9755r50886K55483
$$ -236196 434833 -31791 -207648 188597 -62849 -256475 393385 363630 -587256 -331773
299c31773J157606m79499j286251O63431J315273q10424j251952R27831J115818
$$ -331773 825833 346334 -939917 -276486 1038787 228363 -1023589 -95758 1020060
308A020060r40403q73492Q81918N39204p71297k11458N35727j19262k29215M10810
$$ 1020060 79657 -793835 88083 627287 -144010 -355468 180259 60997 -168218 242592
318B42592j26319o16705N16949P35847q69652p23093J164080N91471j378580m04221
$$ 242592 116273 -500432 16517 752364 -117288 -840381 323699 915170 -463410 -867631
328h67631J458690J88525j383245L5396J182222j98558q82303K86607N07645l13178
$$ -867631 591059 779584 -603661 -568265 613957 415399 -466904 -180297 327348 14170
338A4170j41470K57519k31075j81547N37949N2506p87538Q2673R68436k28742
$$ 14170 -127300 130219 -100856 -282403 255546 308052 -479486 -396813 571623 342881
348C42881j070847L68939J095892m97294j049284N89832R18801o55924p27495
$$ 342881 -727966 -359027 736865 239571 -809713 -219881 698920 42996 -684499
357f84499O83354N03674o15439k15206M89013r3503k99791L67296L1373n79170
$$ -684499 -1145 502529 -112910 -328116 160897 67394 -232397 134899 166272 -412898
367d12898L03069P22159o32657p49731Q99101O64141j071107m79403J149992K67616
$$ -412898 -109829 612330 -20327 -770058 129043 793184 -277923 -757326 392666 660282
377F60282j100725o7796R43152r4373p03179K17379M36803k72591j56427K84406
$$ 660282 -440443 -508239 434913 340540 -362639 -145260 291543 18952 -137475 146931
387A46931j09437k44207L70784J74925o01883q5468P83518j6446r05700J29510
$$ 146931 37494 -206713 164071 338996 -262887 -348355 435163 418717 -486983 -357473
397c57473R53108k61320r52982L83449Q82642m62348p07437N17558M34377n67276
$$ -357473 595635 334315 -618667 -235218 647424 185076 -522361 -4803 429574 -137702
407a37702j56201N05498j33139l32530M14078R6738o22116J75517P01426m45868
$$ -137702 -293903 211595 78456 -254074 160004 256742 -365374 -189857 511569 65701
417F5701o66357O73745N64566q09832m30337Q32178K66079p80712j17541O93587
$$ 65701 -600656 73089 637655 -172177 -602514 229664 495743 -284969 -402510 291077
427B91077O540n47004J06293L75647k11186j97077K59553l0822k97204K58341
$$ 291077 297617 -249387 -143094 232553 21367 -175710 83843 53021 -244183 14158
437A4158K91906m43379k27646O04221J26528p23062j1338P80048j12368p72063
$$ 14158 306064 -137315 -364961 239260 365788 -357274 -368612 411436 299068 -472995
447d72995K45154O93696l82977n70783M70276L80252m73604r8438M30637j75268
$$ -472995 -227841 465855 82878 -487905 -17629 362623 -110981 -209419 221218 45950
457D5950l20252L64846R4301m95616J54443N68066l26451n28594M50260M35978
$$ 45950 -274302 90544 184845 -310771 -156328 411738 85287 -443307 6953 442931
467D42931n27704l41212N65240K60547n59282j71491N23175M6733m64812Q2161
$$ 442931 -84773 -425985 139255 399802 -159480 -330971 192204 238937 -225875 -143714
477a43714L70505j82978k02643K69865J3793l03614J85777K73488l79006k39808
$$ -143714 226791 43813 -158830 111035 124828 -178786 6991 280479 -98527 -338335
487c38335N09764J79905n70620n9607O35244o3295o65648J69889N91388k88002
$$ -338335 171429 351334 -219286 -278893 356351 293056 -372592 -202703 388685 100683
497A00683m34786L92295K32101m28109k2900L48144j83761j88684L61104M0158
$$ 100683 -334103 58192 290293 -137816 -160716 187428 3667 -185017 176087 216245
507B16245m36228P3823M08755k03421l84676K87118L72825l33560l41092L75546
$$ 216245 -219983 -146160 262595 59174 -325502 -38384 334441 881 -340211 35335
517C5335K83708m12888j86300M16180M1426l83528R7506K94680k05030j40272
$$ 35335 319043 -93845 -280145 136035 177461 -206067 -108561 186119 -18911 -159183
527a59183K76463j9334l12625J51166L15138k41087k59318L42643J83630m62035
$$ -159183 117280 97946 -214679 -63513 251625 10538 -248780 93863 277493 -184542
537a84542j28758N13627K7485m93181J35502M28655k81722l21496L33162J38845
$$ -184542 -313300 200327 227812 -265369 -129867 298788 17066 -304430 28732 167577
547A67577l17448M8734K56999j85050j66722K56904Q6659k69037m458K84901m8649
$$ 167577 -149871 -101137 155862 -29188 -195910 60994 147653 -121384 -125842 159059 110410
558A10410k95823J11692L12703j79136l01629K53779K37114l18550j30143L54189
$$ 110410 -185413 -73721 238982 59846 -241783 11996 249110 -69440 -199583 154606
568A54606K0937l21933P6686K30914j84050j48840K49835P9961k59460J4533K59706
$$ 154606 175543 -146390 -69704 161210 -22840 -171680 78155 158116 -101344 -86811 172895
579A72895j43438k56561K72002K30254l62655j32202M21426n504m13470J38720
$$ 172895 29457 -227104 44898 275152 -87503 -219705 201721 196217 -217253 -78533
589g8533L35217k36284k01432K70007O7033k50791L1691J88652j05336j41896
$$ -78533 256684 20400 -181032 88975 156008 -94783 -63092 125560 20224 -121672
599a21672J31340Q8312j71230m5599K21483R523k67694L6801K72375j14845k40293
$$ -121672 9668 97980 -73250 -118849 102634 112157 -155537 -118736 153639 38794 -201499
610b01499K01928J86827k47802j05578K48080J9563k20898O5307J81748j27523
$$ -201499 429 187256 -60546 -166124 81956 101519 -119379 -54072 127676 153
620A53j35860J69832P1076k15076J0781K41439r9004k33264J95081J79761k65662
$$ 153 -135707 34125 105201 -109875 -99094 142345 43341 -189923 5158 184919 -80743
631h0743r0550K86237j2876k58311R6705J95488j36673j13092J51200M8852j51643
$$ -80743 -171293 114944 102068 -156243 -59538 135950 -723 -113815 37385 86237 -65406
642f5406j3913J44445j3508j38004O3908J29802j24292j19800J83335Q3578k16008
$$ -65406 -79319 65126 51618 -86386 -22478 107324 -16968 -136768 46567 130145 -85863
653h5863r894K20505o6595j87106J35519J31369j76616p1535J91602J6092j81088
$$ -85863 -95757 124748 58153 -128953 6566 137935 -38681 -110216 81386 97478 -83610
664h3610L7794J67641q8577j34874J36231Q0560j85040j6652K02099n8701j79475
$$ -83610 -45816 121825 33248 -101626 34605 115165 -69875 -86527 115572 56871 -122604
675a22604J25052J22283j68427m5383J83841j4409j69390N0461J31873p1771r6706
$$ -122604 2448 124731 -43696 -89079 94762 80353 -89037 -38576 93297 21526 -75180
686g5180Q9485P0438j04560m7427J21485J3293j38533L3376J35599r3481j16504
$$ -75180 14305 84743 -19817 -67244 54241 67534 -70999 -37623 97976 4495 -112009
697a12009J38934O6745j66692o824J66776n2211j50490R5474J16137j24407p0588
$$ -112009 26925 93670 -73022 -79846 86930 34719 -115771 -20297 95840 -28567 -99155
708i9155J45929J8611j57114L0723J46595p9289j15914J34226O3083j60465k569
$$ -99155 46774 65385 -91729 -61006 85589 6300 -109614 24612 87695 -72770 -75339
719g5339J54632n0301j25387R0220P8173j13539l3001J17502Q913j03425J2713
$$ -75339 79293 28992 -96395 -6175 71998 -41541 -74542 42960 51873 -51552 -38839
730c8839R2374l0513q3640N3465P6211q1365n5959J11390K2393j27734J8486J26956
$$ -38839 53535 23022 -60618 -7153 69058 -12307 -68266 43124 65517 -62217 -43731 83225
742H3225o0178j02466R5011O0945j24293j6165J39892k9718j27648O6323J02870
$$ 83225 23047 -79419 15592 76537 -47756 -63921 75971 46253 -81395 -15072 87798
753H7798j03020o0186J33716J5069j39384L4711J23489p8726q6782J01892M0543
$$ 87798 -15222 -75408 58308 73377 -66007 -31296 92193 13467 -73315 28577 69120
764F9120j10464L069J03395l8818q2557O0401O3475p0888m8857P1489L2305q0080
$$ 69120 -41344 -38275 65120 26302 -56255 4146 67621 -3267 -52124 19365 51670 -28410
776b8410j1713Q6485j0900q9850L6012P8960o3526n2820Q7788K1682j07656J5456
$$ -28410 -40123 46362 35462 -54388 -18376 60584 -2942 -55762 32026 53708 -53948 -38492
788c8492J05461n6050r1255R1322O3524j12953k7783J17029j7028j06833N7343
$$ -38492 66969 10919 -80336 10986 74510 -38443 -66226 50803 33775 -73058 -15715
799a5715P8963q9197m2104J02397m977r8334L9541Q1524o3310n0579P8510K7714
$$ -15715 63248 -25949 -68053 34344 29367 -68967 -29426 52098 -11212 -61791 16719 44433
811D4433p6047m664O8662j4672o6145K6457O1252l4995m6678N0031L2797o3936
$$ 44433 -31614 -36278 32384 17712 -48433 -21976 39276 4281 -42397 7634 40431 -23505
823b3505j9057P5301o666p6852L9848O8121o4056m8975Q3685J6777r1560K1959
$$ -23505 -42562 32739 26073 -50779 -10931 57190 -6866 -55841 27844 44621 -46939 -24980
835b4980R2055n2844p1601P8077L6109r3027l644R5095l1463p6697O1093N2225
$$ -24980 67075 14231 -57370 20707 56816 -36211 -39855 55240 23777 -52920 8173 60398
847F0398p6853k1408P5125n782o4089K7769M7088l8231l3083M2382J5092m6871
$$ 60398 -16455 -37863 37262 31480 -32609 -4840 42248 4017 -29066 13316 28408 -18463
859a8463k514N1118n057n1487K1243N0530m4361n1039N4744L6590o6046p928P6244
$$ -18463 -20977 30141 25084 -26403 -5160 45370 1009 -50030 4714 41304 -24742 -32670 43574
872D3574j5486o5733K9759M5157n6723j9666P2480l557p3392L3510N9195o3042
$$ 43574 28088 -37645 -7886 37271 -19452 -39118 33362 29805 -43587 -10077 49118 -13924
884a3924m1864P9515J5817p9499J1434P4793m1309n6572N4993K4101n5239j690
$$ -13924 -55788 23727 39544 -39955 -28521 46272 4963 -51609 3384 27485 -27754 -29444
896b9444N0977j4997l2065K2906J8171l0472j3580L1980R506l4071K522M4480
$$ -29444 21533 6536 -25529 -2623 15548 -14924 -28504 3476 12982 -21089 -18567 25913
908B5913j4660n3381K7579N1133m1987l3716O1924K0061o9361j330N2180j7746
$$ 25913 11253 -42128 -14549 36584 -5403 -39119 22805 42866 -26495 -27825 24355 6609
920F609l7378L6194K7168m2861l868M5378k3073n0818M7670M1679o3629j8530
$$ 6609 -30769 5425 32593 -10268 -14136 31242 8169 -42649 5021 46700 -16929 -35459
932c5459P6441k801p4561K5645N4462m2829l0916M5975O677l1637R585J4969j9469
$$ -35459 40982 38181 -36380 -10735 43727 898 -30018 15957 22634 -9003 582 15551 -3918
945c918q767J5430P567j5714k436K6547N203m6408J682N2225j4654n1386L9332
$$ -3918 -12685 2745 10312 -5402 -7838 18709 23912 -22496 -20814 31411 16757 -34629 4703
958D703M6259n4478k9317N1315L036m5463J7072L3875k8629k1287L5683o16m4664
$$ 4703 50962 -3516 -32833 18482 21518 -23945 -6873 27002 -1627 -22914 12769 12153 -32511
971c2511J5728M6336l2072m1502N5188K3261o6875l606O7376k6764m8246M6032
$$ -32511 -16783 29553 -2519 -44021 11167 34428 -32447 -36053 31323 4559 -43687 2345
983B345K7983m3581J422L3743j8552k1263J4137R701q115l251Q715Q578j9478
$$ 2345 30328 -13253 -11831 21912 3360 -17903 -3766 5935 -2180 -5431 3284 11862 -7616
996g616j4279L0668j755m2045K6383M7456m5800l7272N6695J2946n6545P168N0718
$$ -7616 -21895 8773 7018 -35027 -8644 38812 -6988 -44260 12435 25381 -31164 -23996 26722
1009B6722j4344l4329J9026K0204k2811n724K8178q902l1939L0662L1119n0342
$$ 26722 12378 -21951 -2925 17279 -5532 -11256 16922 8020 -23919 6743 37862 -12480
1021a2480j8460O7484k022p4811K7951N9918m0517l5286M0739J0340k9344j105
$$ -12480 -30940 36544 34522 -40289 -12338 47580 7063 -28223 12516 22856 -6488 -7593
1033g593J3162k317j028L010N639o929j6034J5274J6494l7910j524N7075j7708
$$ -7593 5569 3252 2224 5234 10873 3944 -12090 3184 19678 -18232 -19756 37319 19611
1046A9611o2787M0310N0328n8281k7319N9011Q122n3595R151L8689j9522k5776
$$ 19611 -43176 -2866 47462 -10819 -38138 20873 28995 -24600 -15449 23240 3718 -22058
1058b2058K5617J3986l6260L001M2838k1308m5664M6154L5289o6056j4685O9731
$$ -22058 3559 17545 -18715 -15714 27124 5816 -39848 6306 41595 -24461 -39146 30585
1070C0585j1894n6177L0562L6352l3223k1469K8092R558j5084p978J1416O272
$$ 30585 18691 -37486 -6924 29428 -3795 -25264 2828 12386 -2698 -10676 740 7012
1082G012j8345m568K9401j1883l1036L2324K2507m9716M38N6098k9316m8347M7464
$$ 7012 -11333 -15901 13500 1617 -29419 2905 25412 -24304 -23866 32232 2916 -45431 2033
1095B033L7046n3839j8180N2812N190m3802P804L9570j9604l1373L4002J7326
$$ 2033 39079 -14760 -32940 19872 25062 -18740 -10936 28634 9030 -22343 11659 28985
1107B8985m3011M524M0192k9773l6263N2940J6274n9980L441N4686j8083m1675
$$ 28985 -14026 -9502 30690 917 -35346 17594 33868 -26112 -22671 32015 13932 -27743
1119b7743K1439K4761j9027j5062J1270J7830p007j9626J4821J5721k4150L19
$$ -27743 -6304 18457 -570 -15632 -4362 13468 6461 -13165 1656 17377 -6773 -6454
1131f454L1639k4054k4107L9285J3786n0466Q000N0077k5675m3988L8797L1548
$$ -6454 25185 1131 -22976 16309 30095 -20371 -12371 37706 12031 -31957 6840 38388
1143C8388m6702k1446M5455P006m4484N239L8267k5878k7019L8831P775m2978
$$ 38388 -8314 -29760 15695 22701 -21783 -16544 21723 -4155 -31174 7657 15432 -27546
1155b7546J3243L7381l2538k3549M7635N228m6012Q795L5392o904k3689L639K2450
$$ -27546 -14303 23078 -9460 -33009 14626 19854 -26158 -17363 18029 11125 -12564 -8925 13525
1168A3525j643k4431M270K9548j9422k8169K9483J6244l6241M467L5554k4754
$$ 13525 11882 -12549 -8279 21269 1847 -26322 3161 19405 -16836 -12369 23185 -1569
1180a569k7762M4160J1326n3935N011N1271k0777m4654L6524L2738m6736j9023
$$ -1569 -29331 14829 26155 -27780 -22769 28502 7725 -36929 -405 32333 -14403 -33426
1192c3426N2958L508m8693J3404L8513l0323j7988L9839r33l8442J8602L1303
$$ -33426 19532 23040 -25653 -12249 26264 -4059 -22047 17792 16859 -21583 -2981 28322
1204B8322k6622k1723L2947Q908k7891n536K5204Q137k8670r461L0464M649l7047
$$ 28322 1700 -20023 12924 21832 -6059 -11595 13609 21746 -6924 -16385 14079 18728 -18319
1217a8319J0284L4737k6169k4237L7190J1304m9097J3003M1412l1579l1786M7487
$$ -18319 -8035 26702 533 -23704 13486 24790 -24307 -11304 30108 -1471 -33257 14230
1229A4230J5326n2206J285N0580j7862m2438L2918K7400m0739j4322M6076j999
$$ 14230 29556 -22650 -21365 29215 11353 -31085 1833 29233 -11506 -25828 20248 18249
1241A8249m2741J7841L2368k8499j4699L0598J898l2625M722K6668p567k3216
$$ 18249 -24492 -6651 25717 -2782 -17481 13117 15015 -17610 -12888 13780 6213 -17003
1253a7003J1028J9458j4792k1199K2183J9123l0501j2546M0439J977m4050J5239
$$ -17003 -5975 13483 -1309 -22508 -325 18798 -11703 -24249 16190 18167 -25883 -10644
1265a0644L8973l7368k3385M8783Q060m9606Q970M7409k8574l4766L9926J6419
$$ -10644 28329 -9039 -32424 16359 24419 -25187 -16217 31192 2618 -32148 7778 24197
1277B4197m5504N68M9510j7420m1081L1970K6038m0703r687M1461k601l8376J3978
$$ 24197 -21307 -20739 28771 11351 -29730 2240 28278 -12425 -22112 19349 16748 -21628 -7650
1290g650L2036k1433k4546K2772J4101k0488p915K8268L333l4429M584L3460j5105
$$ -7650 24386 2953 -21593 1179 15280 -5208 -13123 15145 18478 -15951 -11367 22093 6988
1303F988l1020L0597K5201m4145j2020M9304n374m9230K3669M0808l9656k4454
$$ 6988 -24032 6565 31766 -12379 -24399 24905 19531 -29699 -6030 34778 -4878 -29332
1315b9332N0137M382n4902J4594M6750l1942l1841M5521J4622m9480O297M3619
$$ -29332 20805 25187 -29715 -15121 31629 -313 -32154 13367 27989 -21491 -15194 28425
1327B8425k2302l7563L1940K3617l1863j2068L2797p5l2761P976K8348j0873k4388
$$ 28425 6123 -31440 500 24117 -7746 -19814 12983 12908 -19853 -11877 16471 5598 -18790
1340a8790J4967K3201k3998j9781L4549P498m2294P791M4410j8626m4001L6521
$$ -18790 -3823 19378 -4620 -24401 10148 17646 -24648 -16857 27553 8927 -35074 1447
1352A447L0240m7466j1424N1881j0116m6269K6841L7110l9800k2440M9237L891
$$ 1447 31687 -15779 -27203 24678 14562 -31707 -4866 32244 -7556 -29996 19241 23132
1364B3132n1494J4259M6780l1515l4240M0615J6654m4902R39L9847j1015l1406
$$ 23132 -28362 -14103 32677 1162 -33078 7537 24191 -20711 -19772 20075 9060 -22346
1376b2346K2255K1697k5324j7664K8085J1831k9666m234L6184n506l6592J5206
$$ -22346 -91 21606 -3718 -21382 6703 18534 -11132 -15366 20818 15312 -21280 -6074
1388f074L5681l0445k7272M0617J7516n2194M253M9289k3990m0990L7879K8781
$$ -6074 29607 -838 -28110 12507 30023 -22171 -17918 31371 7381 -33609 4270 33051
1400C3051m9942o973N1971r773m9813K6674L8047m2795k1001N1737J160m7859
$$ 33051 -16891 -23864 28107 18334 -31479 -4805 33242 -9553 -30554 21183 22343 -25516
1412b5516J3537M1958k9312k8508L5819J5055l6273k077L4154q775l0434J1970
$$ -25516 -11979 29979 667 -27841 7978 23033 -13240 -15317 18837 10062 -20372 -8402
1424h402K9235j7018k5845K4377J9963l2868j3795L8119J699m1558J4743L7704
$$ -8402 20833 3815 -22030 2347 22310 -10558 -24353 13766 15465 -26093 -11350 26354
1436B6354l1630k3377M2271Q831m9141R592M7026k6670l6958L8617K7269m8741
$$ 26354 -5276 -28653 13618 22449 -26692 -17100 29926 3256 -33702 4915 32184 -16557
1448a6557r706M8621p909m2882K2237L5103l5617j8525M0800R31l8136J2738L1469
$$ -16557 -26263 22358 14449 -28433 -6196 28907 -6710 -25235 15565 16496 -21640 -8902 22567
1461B2567k3990k2338L0837J1861k9743m691K9083K548k9420O32L3463n976l8080
$$ 22567 -1423 -23761 7076 18937 -10806 -15497 13586 16134 -13286 -12654 20809 14833 -23247
1474b3247K0015L1269l0419k0504L7016M423m0446J5621L4494l3261k0872M2785
$$ -23247 -3232 28037 -2382 -22886 14130 18553 -21893 -6272 28222 -5039 -25911 16874
1486A6874M945m7948J0117M8845k6193m2482L6870L0145m1425j4214M4673j983
$$ 16874 21819 -26129 -16012 32833 6640 -35842 1028 31173 -10252 -24466 20207 18224
1498A8224l8131J5793K7598k7324j3302L1665N93l1907J1315K5170j9244k0205
$$ 18224 -19907 -4114 23484 -3840 -17142 14523 15116 -16791 -5476 19694 450 -19755
1510a9755K0631J7992k4538j7822K9910J3877l6757p438M3251p572m0900K2494
$$ -19755 876 18868 -5670 -23492 6418 20295 -16462 -23900 19351 11779 -29121 -6627
1522f627L1830l0136j9047L6574M081l5951J5487K7789k9875j6179M0235K295
$$ -6627 25203 -4933 -23980 12594 16675 -19276 -3789 24000 -5875 -22054 18181 20476
1534B0476m4444J1212M3703k4471l6921K9467L0143l8448j8970L9301M711l5092
$$ 20476 -23968 -12756 30947 6476 -30445 -978 29165 -9283 -28253 11048 15759 -19333
1546a9333R798K1703j3663j1844J6974L244j6436N826J4802q696j7458J5040K2487
$$ -19333 -9535 12168 -1495 -13339 3635 6879 -9557 -3731 11071 2375 -15083 -43 22444
1559B2444k3199k5069L5524K1695m6957j0644N0119k178m6796J5578L5090k4531
$$ 22444 -755 -25824 9700 31395 -15562 -26206 23913 21735 -25061 -9483 25607 1076
1571A076j8789K6593J018k2684J5318J4391k8419o972L8403l170m1428J1563M2277
$$ 1076 -17713 8880 9898 -12786 2532 16923 -11496 -18468 19935 16765 -24663 -13100 29177
1584B9177j9790m0849K8324L3395l0052k2553K6143J3724k1265o327J2890J572
$$ 29177 9387 -31462 -3138 30257 205 -22348 3795 17519 -3746 -10073 2817 4389
1596D389o138J118L992q727J656J5577o977k3212J3208K9045k6034l0868M1459
$$ 4389 -1749 -631 3361 -5366 -3710 11867 4890 -18322 -5114 23931 -2103 -32971 8488
1609H488K5538m9024j5720N0216L785m4999P964L2760j5740j6970J4389L548j5334
$$ 8488 34026 -14998 -30718 19498 23283 -21716 -13752 19008 3268 -13702 687 4235 -11099
1622a1099J1088R387k1117p830L6755j854m1950Q241M5350j6401m3329K3522L5967
$$ -11099 -11 9376 -11741 -19571 17184 15330 -26620 -18379 26971 10570 -32759 -9237 26730
1635B6730k2219k8002J7995K4023j1784j9584J1397J5308r711p735R778q124j428
$$ 26730 4511 -23491 -5496 18527 6743 -12841 -1444 13864 4153 -3582 6196 -1928 -3356
1648c356J8464p579l0150K0350L5082l5997l4613M5031K8888m9685j9767M6356
$$ -3356 15108 7529 -22621 -2271 32811 -3186 -37799 7232 36120 -13565 -33332 13024
1660A3024J1492m0775r19K7485k739j4528N764K871o254J1243M954k1718j658
$$ 13024 24516 -16259 -17178 10307 7568 -6960 -1196 1675 -4579 6664 11618 -10100 -11758
1673a1758L5054o825l9612J0351L9928q135m2335J0346L7190p566l7238O641L2027
$$ -11758 23296 16471 -23141 -12790 27138 19003 -23332 -12986 24204 16638 -20600 -13959 18068
1686A8068o036l1643Q824K2614q036r914N738p022Q58K1278j1399l0828K3207
$$ 18068 12032 -19611 -10787 11827 3791 -6123 -385 -7407 -6549 14729 3330 -27498 -4291
1699d291L6277l6307l4519M4843K9123m6815k1163M4380J6739l7176j3088K9633
$$ -4291 31986 -4321 -38840 6003 35126 -11689 -32852 11528 28267 -8909 -21997 7636
1711G636N909j6281j787J614J251J1138k625k0454J715L2182n309l8677L276M5209
$$ 7636 13545 -2736 -4523 -2909 -1658 9480 6855 -13599 -11884 20298 14989 -23688 -20412 24797
1725B4797l128m6194j356M8431J513m7536R96M5354m763l7374O735K2922m620
$$ 24797 21669 -24525 -25881 22550 24063 -23473 -22477 22877 18114 -19260 -12525 10397 5777
1738E777o993j080q338R556K4575j8769l4568K9821L8425l8534l8112M2565L6725
$$ 5777 -1216 -2296 -10634 -1078 23497 4728 -29840 -19 38406 -128 -38240 4325 41050
1751D1050m4872l1394M1410K4152l2613k0109K2367J7189j2319j1220k451Q973
$$ 41050 -3822 -35216 6194 30346 -2267 -22376 -9 17180 4861 -6359 -8810 163
1763A63J0928n685k0781K572K9174j06l6212m547M5170O489n0227q829N4781R196
$$ 163 11091 5406 -15375 -12803 16371 16265 -19947 -24494 20676 27165 -23062 -31891 22890 32086
1777C2086n3543n740M7686J41l4833N58K2048j173l597n634j2126J2608K2970
$$ 32086 -21457 -27197 20489 20630 -14203 -13645 8403 7230 3633 -2001 -14127 -1519 21451
1790B1451k0295l3485L0534L8634l4587m1618L6111M0295l8443l4960L3437L2115
$$ 21451 1156 -32329 -1795 36839 2252 -39366 -3255 37040 -1403 -36363 -2926 29189
1802B9189k6411k8046J7436K4909q378j8319k480J4742J1377r398j8969J016K9255
$$ 29189 2778 -25268 -7832 17077 8699 -9620 -12100 2642 14019 4621 -14348 -13332 15923
1815A5923M017l5445j3512M9964J2268n4296j3501N7438J1187n4458q790M4524
$$ 15923 19940 -15505 -29017 20947 33215 -21081 -34582 22856 34043 -20415 -29205 15319
1827A5319O745l4111n259J9615N299j990r338j2243J5301K5518k2406l3497K8039
$$ 15319 22064 -12047 -17306 2309 7608 5618 -3720 -15963 -662 24856 2450 -31047 -3008
1840c008L6959k7020m2246L0785M1826k7672m0414K2186L7094j5638l5356J0955
$$ -3008 33951 6931 -35315 -4530 37296 9624 -30790 -8604 28490 12852 -22504 -11549
1852a1549K9408k557k6241l776J6936J3082q728k2174n71L0008J1617m0530j6806
$$ -11549 17859 15302 -10939 -14715 2221 15303 6575 -15599 -16170 13838 25455 -15075 -31881
1865c1881M8408J8631n1749j8514N3342J7896n0506j4406M1426J2240l0189j2167
$$ -31881 16527 35158 -16591 -35105 18237 36133 -14373 -28779 12647 24887 -5302 -17469
1877a7469J4536J3610R6j6904j3240J9936K3555k2199l2180K3760L7955k4539
$$ -17469 -2933 10677 10773 -6131 -19371 565 24120 1921 -30259 -6499 31456 6917
1889F917m3154K4098M3598j9016m4131J5525M2084r371l8070M939L2587R95k6923
$$ 6917 -36237 -12139 31459 12443 -31688 -16163 25921 16550 -21520 -16581 16006 17001 -9922
1902i922m696J6542J2856n694k2057p128L3159J6324m2434k1013M5826K3229m9480
$$ -9922 -14618 1924 14780 9086 -12971 -20099 13060 29384 -13050 -34063 11763 34992 -14488
1915a4488k1805M8207K1743m2152j9304L3385J8444k2138j7112P416J8649L549
$$ -14488 -36293 11914 33657 -8495 -27799 5586 24030 1892 -15220 -7804 10845 14394
1927A4394j8827j5560K0020K4044k0164l0425J8382L6514j5495m2209J2839M3925
$$ 14394 -4433 -19993 27 24071 3907 -26518 -8136 28378 12883 -29326 -16487 27438
1939B7438p352m5712N105M5106l178l8731k255L4401J838k1760r917J2546J5260
$$ 27438 20086 -25626 -20521 24585 21407 -17324 -19579 14822 16660 -5100 -15017 -2471 12789
1952A2789o54k3815r237L3510J5403l8779k1965M4057K1474m1448k4441L8648
$$ 12789 12135 -11680 -20917 12593 27996 -10783 -32748 11309 32783 -8665 -33106 5542
1964E542K5441l3487k7325K7619K3842j7051k2868N966K4141K171k0286j2791
$$ 5542 30983 -2504 -29829 -2210 21632 4581 -18287 -12321 11820 13991 -6295 -19086
1976a9086J9390K0157j6028k8534J4395L4120p171m0782L410M3685Q05m4873k586
$$ -19086 304 20461 4433 -24101 -9706 24414 17243 -23539 -20129 23556 24361 -20512 -23098
1989b3098M3396L974m1019m028L1172P878k1385j1443P294J7783K887k6883q538
$$ -23098 20298 24272 -16747 -20775 10397 18275 -3110 -14553 -7259 10524 13411 -13472 -22010
2002b2010L1172J7042l4956k1570L4113K7398l3942k6951L1288K6806k5885k7500
$$ -22010 9162 26204 -8752 -30322 3791 31189 -2753 -29704 1584 28390 2505 -24995
2014b4995J8614L0701j2403k5949K279K0566O064j7696j4625J7319J8071j1076
$$ -24995 -6381 24320 11917 -14032 -11753 8813 14877 -2819 -17444 -125 17946 6870
2026F870k7426N766L2911O12l9320N0L7817Q708m2996o064L8312P436l3132r023
$$ 6870 -20556 -14790 18121 18733 -20587 -20537 17280 25988 -17008 -23072 15240 22676 -10456 -19479
2040a9479K6132R682j4692j2848M637J7078L276k2426j1908K7395J6197k7796
$$ -19479 6653 16335 1643 -11205 -6568 10510 13786 -8640 -20548 6847 23044 -4752
2052d752k1702K7112K4394k1717l0565K1724K9216j6147l0584J3291K8410p368
$$ -4752 -26454 658 25052 3335 -27230 -5506 23710 7563 -23021 -9730 18680 11312
2064A1312k4116J091K0070O512j6846j2211J0107J6249m277k5329k22L1959M875
$$ 11312 -12804 -11713 8357 14869 -1977 -14188 -4081 12168 7891 -17438 -17660 14299 19174
2077A9174l5423p903L9208P430l6988r287L5073Q441k8375p780J8895J3290j0481
$$ 19174 -16249 -24152 15056 22486 -14502 -23789 11284 19725 -8650 -16430 2465 15755 5274
2090E274j6376L292J7327M707k0195j1074J9451J7659j9769k2528J7599K8010
$$ 5274 -11102 -7810 9517 14224 -5971 -17045 2406 20065 296 -22232 -4633 23377
2102B3377j7510k8022J3718K9241j1133k9072P110K7501l154k4303J030J7996
$$ 23377 5867 -22155 -8437 20804 9671 -19401 -12291 15210 12056 -12247 -11217 6779
2114F779N348j2818j0454P493J4731N21k3744l399K7423P607k9523r978L2633
$$ 6779 12127 -691 -11145 -3652 11079 11600 -12144 -15543 11880 19487 -10036 -20014 12619
2127A2619Q279k9883r965K6067J0272k2178j0011J4434J2525p673j5845K682J5618
$$ 12619 20898 -8985 -18950 7117 17389 -4789 -14800 -366 12159 4486 -11359 -8677 6941
2140F941L488j4111j2106J4888J5385j3224j9569R752K8575j0443k8156R091K7082
$$ 6941 10429 -3682 -15788 -900 14485 1261 -18308 -8556 20019 9576 -18580 -9489 17593
2153A7593n546k7632K265K7064j610k1347k039J5081N522p645j0687K931J4544
$$ 17593 12047 -15585 -13320 13744 12134 -9213 -11252 3829 9351 1706 -8981 -6050 8494
2166H494K631j9341p270K2555R208k4944j0530K7210J0114k4227j2567K1059J1397
$$ 8494 11125 -8216 -15486 7069 16277 -8667 -19197 8013 18127 -6100 -18667 2392 13789
2179A3789j4454j1518J0777J2583o127j4610K109J3405M119j0083j1447R667J5959
$$ 13789 -665 -12183 -1406 11177 5050 -9560 -7451 5954 10073 -10 -11457 -1790 14169
2192A4169p915j8642L130K5114p117k3954M955K4761k497k4332L008J9872j058
$$ 14169 6254 -12388 -9258 15856 8739 -15215 -10260 14501 12004 -12328 -9320 10552 9494
2205I494j5600k362J0058N428n037p538j517J2660M218j5684p301J8644Q963k0869
$$ 9494 -6106 -8468 1590 7018 1981 -5557 -7074 5586 9804 -5880 -13181 5463 14426 -6443
2219f443p825J7980J0266j4077j2530J1921J4511j1329j3361Q822J0594m894r582
$$ -6443 -14268 3712 13978 -99 -12629 -708 13803 2474 -10887 -2065 8529 3635 -5947
2232e947j250J1167L370q220o062L570J3102l595j7629L033J8401r01k2539J320
$$ -5947 -7197 3970 7340 -880 -6942 -3372 9730 6135 -11494 -8461 9940 9039 -13500 -12180
2246a2180K3026j782j8858J191J5295J070j1739k840O570N452k769n203l254J1705
$$ -12180 10846 9064 -9794 -8603 6692 7762 -3977 -6817 -247 5205 2436 -2767 -6021 5684
2260E684M961j4583p098J5128P488j2711j0421J2449J0739j2607j0439J0148J2145
$$ 5684 10645 -3938 -11036 4092 11580 -1131 -11552 897 11636 -971 -11410 -1262 10883
2273A0883r079j0758L970J2744n153p365K08O259K364l454p667L896J0561M30
$$ 10883 1804 -8954 -4984 7760 2607 -4758 -4550 1709 4073 619 -7048 -3152 7409 7839
2287G839j5848N96J6345J397j7797j666J6926O08j4749J82J0289J534p224k952
$$ 7839 -8009 -7413 8932 10329 -7468 -9134 7792 8400 -6349 -6167 4122 5656 -1568 -4520
2301d520M356M439L90p163l535R078L377p946o823Q731O646q456o676P167R090
$$ -4520 -164 4275 4665 -2498 -6033 3045 6422 -1524 -8347 384 7030 -1426 -8102 -935 8155
2316H155n371j2788P322J0473n957q290L153P715k958l992Q61M070J590l202m587
$$ 8155 2784 -10004 -2682 7791 1834 -6456 -3303 4412 1454 -2538 -1677 2393 3983 781 -3806
2331c806q61R948P59j2241r08J4618m02j3015j382J1294Q55q696p53M515M708
$$ -3806 -4667 5281 6040 -6201 -7109 7509 7107 -5908 -7290 4004 4859 -3837 -4590 -75 4633
2346D633n004m168K746L533m27l258q37N263J709m804m622L885P218m485q831
$$ 4633 -371 -4539 -1793 1740 1313 -1945 -2782 2481 4190 -614 -5236 -1351 5867 1382 -7449
2361g449M199Q482l446q115M328P727l241n204K145N509k851m274J041m59L602
$$ -7449 -3250 5232 1786 -6329 -2001 5726 2485 -2719 -574 4935 2084 -2190 -1149 -1608 1994
2376A994L04m045j759P271J807r980j693Q958J729p374j086P505J316n558l808
$$ 1994 2298 -1747 -3506 3765 5572 -4408 -6101 2857 4586 -2788 -3874 3631 4947 -611 -4419
2391d419O407J284k797k007Q46K846o57m831Q31K333J562k124l825K259N481j046
$$ -4419 1988 3272 475 -1532 -686 2160 1503 -3328 -2497 -164 1398 -726 -4551 -2292 3189 2143
2407B143p041K732P067j601p132K445M291n99m197J359K461k541L0j407k35M648
$$ 2143 -4898 -2166 4901 3300 -3832 -1387 2904 2305 -1892 -533 1928 -613 -583 -1990 -2225 2423
2423B423j223k595k770M061M978p876R46M208O32l564j619K663L219n294k88J561
$$ 2423 1200 -1395 -4165 -104 4874 -3002 -2056 2152 2784 -780 -2399 264 3483 -1811 -2099 -538
2439e38J982l41k661R54L146k783O20o20k480N538N63n710m69O551r03n855J9
$$ -538 1444 1103 -1558 -604 2542 -241 379 -241 -2721 2817 3380 -2330 -2799 3752 2849 -3006 -2987
2456b987N710K22o153J549O176m623k303K433J310j670M35l25j068K264qk06l420
$$ -2987 2723 2945 -3208 -1659 4517 -106 -2409 24 1334 -336 99 -226 -1294 970 962 756 -2664
2473b664N219k81l173r82M171J097m128k91l17M390k378k056O27L170k132j586
$$ -2664 2555 2274 -899 -1881 2290 3387 -741 -1032 -1349 3041 663 -1393 -766 2404 272 -1314
2489a314J781o60p85R92P31k810K092q33J071l365N298j54l995j59L532m27l103
$$ -1314 467 -193 -978 14 745 -2065 27 -806 265 -3100 2198 2044 -1951 -2110 1422 995 -2108
2506b108K256K051l318k81J333r3p43M13R52j252L94j55O45j501J263L39j179
$$ -2108 148 2199 -1119 -1400 -67 -160 -903 -490 462 -790 -396 -551 94 -1407 -144 195 -984
2523i84r5N09P56N32l153K045K188k456k597L396J091l65j487L615l516r11J517
$$ -984 -1079 -570 186 718 -2435 -390 1798 -658 -3255 141 1232 867 -620 2995 -521 -1432 85
2540H5j156K0K185K41k035K33J888o56j933J672J882j384k802K070L61l89k389
$$ 85 -1071 -1051 1134 1375 -660 -427 1461 805 -1128 544 2426 1042 -1760 310 671 282 -2107
2557b107L392k545K101q97N06o4q6n47K12J56K06l41l82O92j181J842j34k573
$$ -2107 1285 -1260 841 -56 450 386 300 -247 -35 121 327 -14 -396 296 -885 957 823 -1750
2575a750J411K089m10l174J963J579l659J332K23O06j088J505mj473N19K505l513
$$ -1750 -339 1750 1340 -1834 129 1708 -1951 -619 -396 210 -878 627 623 -850 -331 2174 -1339
2592a339M13J808J082l493K011J96j614l46Q24O28J30o38K25j403J985q42j363
$$ -1339 -926 882 1964 -1529 482 678 -936 -1282 -458 170 300 -338 -113 -1516 469 -373 -1736
2609a736n13N63J004J828q76j784K789j811k214J436M554k423k215K126Q94l173
$$ -1736 -2249 -1686 -682 1146 270 -1514 1275 -536 -2750 -1314 3240 817 -1398 728 1622 -1551
2625a551O55J317n6n28J05J450k321M79O62r17r78K978K83j594j805L159l9k892
$$ -1551 -896 421 365 -163 -58 1392 -929 -450 212 -705 -1683 1295 1578 -16 -1821 1338 1299 -1593
2643a593K083l34k28n42J573K80k159r30K355r46Q31J03j166J752p02j767Q17
$$ -1593 490 156 -72 -614 959 1239 -920 -1850 505 -441 390 493 -673 1079 377 -1390 -573
2660e73K435k742J623l24j251N18J750j026j682J019J647n62j916L713j974j111
$$ -573 1862 -880 743 419 -832 -314 1436 410 -1272 -253 1394 832 -1084 2629 655 -456
2676d56J700k42k124O21M99k40j752K301J36j990K087o05k78O54Q50l62k209J607
$$ -456 1244 1002 -1122 -501 -2 -242 -1994 307 443 -1547 540 -65 -343 311 1161 799 -1410 197
2694A97K365k207m41N05j213J418l16N66j970K327n68k66K43N43k112L89J395
$$ 197 2562 355 -86 419 -794 624 308 874 -1096 1231 663 397 640 1183 -929 -540 855
2711H55k395K199j917J563k337K150R61k573P64J181o92j813J600J368j440q79
$$ 855 -1540 659 -1258 305 -2032 118 1079 -1494 -730 451 -241 -2054 -454 914 -526 -1405
2727a405J956k54n59P60O72L70j685L076l030J740j394m39l90J78o68o30Q68Q5
$$ -1405 551 297 -262 498 1170 1540 -145 2931 -99 1641 247 -192 -582 -404 -1072 -1702 -834 -749
2745g49o82J985j065M13m99l26J085jR31j478K10n95K452j722l6K710m242M13
$$ -749 -1431 554 -511 -98 -597 -923 162 161 1092 -386 -176 -771 1681 -41 -77 2633 -1609 -1196
2763a196L831n87k625J074O22L76n56O92k188K27p99L07K020j946R11j145J82
$$ -1196 2635 2048 -577 497 1119 1495 939 1631 -557 -330 -1129 -822 1198 -748 163 -982 -800
2780h00K564k947K241k20j250J415j669K244k164L38j43j231K069J646j408j989
$$ -800 1764 -1183 1058 838 -412 1003 -666 1578 -586 -248 -391 -1622 447 2093 685 -1304
2796a304J644N29j22P5J453l866J566n7M17j400K964r18r0k424K036k10K32kl87
$$ -1304 340 869 747 822 2275 -1591 -25 -82 335 -1065 1899 981 891 -1533 503 293 525 523 136
2815A36j281Q52O29q37l20J367q31k9N22N32o55j247J400p09p85l58O61k22K705
$$ 136 -1145 -293 336 -501 -821 546 -285 -314 208 740 85 -1162 238 -471 -1256 -1614 -953 -1175 1530
2834A530l381K408m01O13l224L308j655n77J774O95j584R98O71q06m17p96K652
$$ 1530 -1851 557 156 769 -2455 853 -802 -1379 395 1090 -494 504 1175 369 -48 -844 1808
2851A808k555r14J462Q85q31p04J224J79r42J198k570K335Q93p74j098J550M24
$$ 1808 -747 -1661 -199 686 -145 -849 375 554 -388 810 -1760 575 1468 694 -404 1146 1570
2868A570j054j019l80M95J628j932o37J522J282k644o9K293q88k60j246K017r28
$$ 1570 516 -503 -883 -388 1240 -692 -1329 193 1475 -1169 -1238 1055 167 -93 -1339 678 -250
2885b50p53J276j060l50J744Q85k337k34J171R70k547O51J331j877J426l24M35
$$ -250 -1003 273 -787 -1137 607 1492 -845 -1079 92 1062 -1485 -834 497 -1380 46 -278 157
2902A57r19Q85k82o74k38O60K22k72J537j337k43R24j181k81J490O2P38j386O75
$$ 157 -762 123 -159 -833 -1071 -411 -189 -461 1076 -261 -504 420 -761 -1042 448 510 1248 -138 537
2921E37j358M20K158j757o64J500q75R6j32P10J165k643L442o33k250o59M14n62
$$ 537 -821 -401 1757 0 -664 836 -39 57 -75 635 1800 -843 2599 1966 -284 -943 -529 -1091
2939a091J060j175J436j162K113q05k48M6Q76n67m29N27p74Q76j390L00J302j295
$$ -1091 -31 -1206 230 -932 1181 376 128 174 1050 483 54 581 -193 683 -707 -407 895 -400
2957d00L44Q27o03o49o4N74O37j021J463n74o99L58j043J249l36p4m19Q19p81
$$ -400 -56 771 168 -481 -545 29 666 -355 1108 534 -165 193 -850 399 63 -11 -430 389 -392
2976c92R81m83P08j768l3J737j605P20K07j043J95J495p40K93N41j252M99L39
$$ -392 589 106 814 -954 -987 750 -855 -135 72 -971 -776 719 -21 272 813 -439 60 399
2994C99O96l005K35L308j243k18J438k147j1M87J562j968k60n24q78J606K27M32
$$ 399 1095 -1910 -1675 1633 390 172 1610 -537 -548 -61 1501 -467 -727 -1251 -2129 -523 -296 136
3012A36j027K453j253j585K614j141P7p06J816j903p30Q28m78J25p17K141o34
$$ 136 -891 1562 309 -1276 1338 197 274 -432 1384 -519 -1249 -421 -899 -774 -1491 650 16
3029A6j4J492p11j780L63o9J142N26J558k896j090J357N90j162O15j149r35K779
$$ 16 2 1494 783 -997 -634 -703 439 965 2523 -373 -1463 -106 484 -678 -63 -1212 -2147 632
3047F32j82M38j275k04j581J924J560j547p15J142k151J434J196o90j639J67J529
$$ 632 450 888 -387 -591 -2172 -248 1312 -235 -950 192 -1959 -525 671 -19 -1658 -1491 38
3064C8P71j690L25K179J51j571J525j146j529L36M37N53j593K496kk212K582j113
$$ 38 809 -881 -556 1623 1774 203 1728 582 -947 -611 -174 379 -1214 1282 1280 -932 1650 537
3082E37p90L53J474j935j372J023P71r01O96m26J326j93J06J70m28k98n42Q17
$$ 537 -253 100 1574 -361 -1733 -710 61 -840 -144 -570 756 563 669 839 411 113 -429 388
3100C88k108J682J157j43j131P89k150J244R9j415K509j04j439K46J320k72p60
$$ 388 -1720 -38 1119 976 -155 634 -1516 -272 -173 -1588 921 817 -622 -376 944 672 -88
3117h8J06j09j09J004r81l41O66j26K09j819L089j848j659L134j544P73l03j064
$$ -88 18 -91 -200 804 -177 -518 148 22 231 -1588 1501 -347 -2006 1128 -416 357 54 -1010
3135a010J611j91l98Q77j503R04r02J57J236j891P87Q94l02o83J156n75M22j442
$$ -1010 601 410 12 889 -614 290 -612 -455 781 -1110 -323 571 269 -414 742 167 589 -853
3153h53J457j109N86r94J400j876L26O35Q40l48j040M19L16J523j151M03j138
$$ -853 604 -505 81 -913 487 -1389 -1063 -428 412 64 -976 -557 -241 1282 131 534 -604
3170f04L3K11M68R3q64l60J50Q83j38l86l43J881k98n63p19J448O25l1j203M97
$$ -604 -571 -360 108 201 -663 -1023 -873 10 -128 -514 -857 1024 726 163 -556 892 1517 1486 283 780
3190G80q40l34P78R41l81q22O9Q78j305r40O23Q71l53o53P7J082J85j88O03j429
$$ 780 -60 -394 384 1325 944 122 191 1069 -236 -1176 -553 318 -35 -688 -611 471 656 468 1071 -358
3210c58J785j801m31J25J97O4K66j438R33k5R91j352M69N81P59p11k33J581k037
$$ -358 1427 -374 -805 -680 -483 -419 -153 -1591 -658 -683 308 -1044 -575 6 765 54 -179 1402 -635
3229f35m35K036j076m17K047j614q51J049o36J660j922J962p53j417K260k42q62
$$ -635 -1070 966 -110 -527 1520 -94 -945 104 -532 1128 -794 1168 415 -1002 1258 1016 154
3246A54j129J421J079j883O98j715O73J85J636n82M15k418K218J039k572K267
$$ 154 -975 446 1525 -358 340 -1375 -702 -517 1119 537 952 -1466 752 1791 -781 1486
3262A486J08l051L356k158K88r36P94p68L9P81j418J611j59K25j319J435Q79p35
$$ 1486 1594 -1457 1899 -259 29 -907 -113 -881 -842 -61 -1479 132 -27 198 -1121 314 1193 458
3280D58k67j82O18j330p01n16J766J761j614K32o94O07P51k158P91N42k0Q79k032
$$ 458 191 9 627 -703 -1404 -1920 -154 1607 -7 225 -469 138 889 -1269 -478 64 44 923 -1109
3299a109K825j576j42j06k69J48r35Q87P26J201j240j63P5m32J340k35Mj748K682
$$ -1109 1716 140 -2 -108 -377 -229 -1164 -277 449 1650 410 247 322 -110 1230 995 999 -749 1933
3318A933j831r55K289j604N60M89n90R01j325L03j090M03J005P30j422J455r81
$$ 1933 102 -853 1436 -168 392 881 291 1192 -133 170 -920 -517 488 1218 -204 1251 270
3335B70p98R99m99p47M10O27K44r52L28m90J320k96k1m46R9Q55p43j539Q71k06
$$ 270 -528 471 -28 -775 -365 262 506 -446 -118 -608 712 416 395 -51 48 903 160 -1379 -508 -714
3355g14k16L03O1J025l83J99j129J356j455Q21J44J093l49r38J030O89j731k79
$$ -714 -930 -627 -566 459 76 275 -854 502 -953 -132 12 1105 756 -182 848 1537 -194 -473
3373d73J793j405O29r64N03j204O38K28J082p63n03j195Q79J397j472J927k466
$$ -473 1320 -85 544 -420 83 -1121 -483 -255 827 64 -439 -1634 -755 642 -830 1097 -1369
3390a369K920k605J871p79M45k23j183J342j445J831N27l88j502k1K63J178L51
$$ -1369 1551 -1054 817 38 483 260 -923 419 -1026 805 1332 944 -558 -579 -316 862 1213
3407A213n33r79Q06R75j376J026j865L133j352J2j356kj348P80M91J004k268K543
$$ 1213 680 -299 507 1482 106 1132 -733 2400 1048 1060 -296 -298 -1646 -866 -375 629 -1639 904
3425I04k49q54m37J120k10N16j280N94o64R09q72J77L92n35J483r40p6Q0L94Q50
$$ 904 655 -199 -636 484 274 790 -490 104 -560 349 -523 -346 46 -489 994 54 -22 58 452 1302
3445A302k165L96J072k597K320R9J71P14k438P21J15J395K00q60P14p15J939k935
$$ 1302 -863 -467 605 -1992 328 427 598 1312 -1126 -405 -290 1105 1305 445 1159 444 2383 -552
3463e52K240o22k426J192j09O57P18R10o77l189J878p44P98m5p70J216J279j571
$$ -552 1688 1066 -1360 -168 -277 380 1098 2008 1331 -1858 20 -724 74 29 -741 475 1754 183
3481A83k336J180J178j172J67K190j420m11p87J872K13j781J099J534k279J014
$$ 183 -2153 -973 205 -967 -800 1390 -30 -441 -1228 644 857 -924 175 1709 -570 444
3497D44n95N70K47k543K526j151j077J220k12L111j281q38n04m0J081J67j868
$$ 444 -151 419 666 -1877 649 -502 -1579 -359 -571 2540 1259 421 -83 -123 958 1125 -743
3514g43K007k414K96K400k741J765j123O50l27j274L01L86J596l201J471J341
$$ -743 1264 -1150 -854 1546 -1195 570 -553 97 -230 -1504 -1203 -817 779 -2422 -951 390
3530C90J143j94r86J54j76j250K362r89o80M68p13o9l0K06J247q06o31J016k289
$$ 390 1533 1339 353 507 331 -919 1443 454 -226 242 -471 -540 -570 -364 883 77 -554 462 -1827
3549a827N82J022q85K602j291O68j572O60P4N27pk8j81j588M98P71K77l78J5k45
$$ -1827 -1245 -223 -1108 1494 203 871 -701 -41 33 560 553 525 344 -1244 -746 25 302 -76 -61 -306
3569c06Mn04o53l1K624j155j67O5l45J082j022m73N36L32L74p96J968j639m94
$$ -306 -302 -806 -1459 -1490 1134 -21 -188 -123 -468 614 -408 -881 -345 -13 361 -435 1533 -106 -600
3588f00M90r78J193J374k037p66K106Pr72j097K636j624O30j005Q70j610K62J88
$$ -600 -110 -1088 105 1479 -558 -1324 782 789 -183 -1280 1356 -268 362 -643 227 -1383 -1121 -933
3606i33L46J360m83k489L358m20j156J140l215J879N57L76r39O87j83J036r89
$$ -933 -587 773 290 -2199 1159 739 -417 723 -2492 -613 -56 320 -619 68 -115 921 -68
3623f8P58k05M37J40j639j686J871M62P01j92j73m58l14o87K097o34p83r77J796
$$ -68 690 485 922 1062 -577 -2263 -392 70 771 579 406 -52 -366 -1053 1044 410 -373 -1350 446
3642D46P94j074j407M5N79J073j5L12j209J550j101j187K912j200r52L50J825
$$ 446 1240 166 -1241 -1196 -617 456 441 753 -456 1094 -7 -1194 1718 518 -434 -84 1741
3659A741r50N23j957J73J81P88l78j350K404P8k199K403j155O48j377R54j15j93
$$ 1741 791 1314 -643 -470 -289 499 121 -1229 1175 1253 -946 1457 302 950 -427 527 412 219
3677B19O00j677N83N29l50J042k542K611o70k960J715J580n5j205J613M48J099
$$ 219 819 -858 -275 254 -96 946 -1596 1015 345 -2615 -900 680 625 -580 1033 1481 2580
3694B580l719m81L167n81L02k383J511k55J26j229n72J631P36p76j565K797k14
$$ 2580 -1139 -1620 1547 966 1268 -1115 396 141 267 -962 -1534 97 833 57 -1508 1289 1075
3711A075m15r30q4K316j458j727L63R21J382j382K6q49J814j053J186j546K24
$$ 1075 660 -270 -354 1962 504 -1223 -860 61 1443 61 87 -762 1052 -1 1185 -361 -137
3728a37j338K102J130k24j086L12n78J105J541l939J326K02K5k717K101l56j485
$$ -137 -1475 627 1757 1533 447 759 181 1286 2827 -1112 214 416 441 -2276 -175 -531 -2016
3745b016K692q37m51J322J747l064R48j829J511j252K076K2p6O35k532O48M11
$$ -2016 676 -161 -612 710 2457 -607 341 -1488 23 -1229 847 869 793 1428 -1104 -456 -45
3762d5k4j073k09K193J082j728o86J266J36p42m77n99J608p65r28r10K259L46
$$ -45 -69 -1142 -1351 842 1924 196 -490 776 912 170 -307 -906 702 -63 -991 -1901 358 704
3780G04r8q13J736r51j446P2J285M49j927J408j49P78N45k790K293R63j308j758
$$ 704 606 -207 1529 578 -868 -796 489 938 -989 419 270 1048 1593 -1197 1096 2059 751 -1007
3798a007J852j750L245l954M98J423j13l96o18j88J698M98j862J300m67J343j366
$$ -1007 845 -905 2340 -1614 -1116 307 194 -202 -820 -1008 690 1188 -674 626 159 1502 136
3815A36j505J946nO95l76j81j193K070j540q46J093q07Q62j049J164O00O91k484
$$ 136 -1369 577 572 1267 891 710 -483 1587 47 -799 294 -513 349 -700 464 1064 1755 -729
3833g29m1J535o04j377J901k051K040j79j053P62N75j312J05q84J579N57q68n44
$$ -729 -770 765 161 -1216 685 -1366 674 495 -558 204 779 -533 -428 -1312 267 824 -44 -588
3851e88m94J280j181L85Q00l48r39J636O40o46k65j14J40l06L06m60k054J868
$$ -588 -1082 198 -983 -598 202 -146 -1085 551 1191 545 280 166 306 0 306 -154 -2208 -340
3869c40L40o95N24O61p76j474R42J173m02n76m4L98O43p5j003J744n28r47R79
$$ -340 0 -695 -171 490 -286 -1760 -818 355 -47 -623 -667 -269 374 299 -704 1040 512 -435 544
3888E44j009k08O81M72r57J1N65j040J29j30P20K244l163K100j303n96j685J373
$$ 544 -465 -673 8 480 -477 -466 99 -941 -812 -942 -222 2022 -1141 959 -344 -940 -2625 -1252
3906a252J193P64L64j884M56J761k025J242n91q33J847j054p30J295R24k940J728
$$ -1252 -59 705 1069 -815 -359 1402 -623 619 28 -805 1042 -12 -742 553 1477 -1463 265
3923B65J43Q73k896R16P06P99j187k28L92L93q22O19n82J342k75j71M1j245J790
$$ 265 408 1281 -1615 -699 7 806 -381 -609 -217 176 -646 -27 -609 733 458 287 328 -917 873
3942H73j142o57m82L09R91j519R05Q56O23n79j426J515J024k164M97J66n7J51
$$ 873 -269 -926 -1408 -1099 -108 -1627 -722 134 757 178 -1248 267 1291 -873 -376 -210 -267 -116
3960a16M37j353J731N94j475j224J878K95p74N26l98P1m13r96O75J060j028J084
$$ -116 321 -1032 699 1293 -182 -1406 472 767 -7 519 121 192 -221 -1217 -542 518 -510 574
3978E74r74K3M60M24k295K337O73j052m78J279q21J764k013n23K734j288k839
$$ 574 -400 -377 83 507 -1788 549 1222 170 -308 971 150 1914 -99 -622 2112 824 -2015
3995b015K268j62M39k565J169R61m39M73j700J368n80J427P0j466K372j677p7
$$ -2015 253 91 530 -2035 -866 95 -344 129 -1571 -203 -783 644 714 -752 1620 -57 -134
4012a34J280j019J353m56q32j48n79O25K24p65N55l07m62N59K064k430J446l79
$$ -134 1146 127 1480 1024 192 44 -535 90 314 -451 104 -203 -665 -106 1958 -472 974 595
4030E95j51R26k510R16J3P61q13%O53k0n39j88m4J078l6J70j081O16N17j739k52
$$ 595 444 1370 -1140 -224 -211 550 -263 -263 390 370 -169 -357 -401 677 641 811 -270 346 863 -876 -1128
4051a128P44J020L37k104J877R2R10q77j886O51K138k831K37J633p91O55k407
$$ -1128 -384 636 973 -1131 746 838 1748 871 -1015 -364 1774 -1057 -820 813 22 677 -1730
4068a730J269N75J172M1j263J028j142Q30l79n00J478n44j396O71J1J237k153
$$ -1730 -461 114 1286 1327 64 1092 -50 780 401 -99 1379 835 -561 110 121 1358 -795
4085g95M51J486k85j016K56K19m43m75J393n56j08l02j180K871j344m20M20p8
$$ -795 -344 1142 857 -159 97 316 -127 -602 791 235 127 -175 -1355 1516 172 -248 172 94
4103I4r61J858M79r68j513Q90o8P49j430J449j514Q4K932j944j581K812j086j32
$$ 94 -867 991 1470 502 -1011 -121 -189 560 -870 579 -935 -851 2081 137 -1444 1368 282 150
4121A50j469P04l92K609n53k724M99J091J588j584j314J907j90P16k189Q61J357
$$ 150 -1319 -615 -1007 1602 1049 -1675 -1176 -85 1503 -81 -1395 512 322 1038 -1151 -290 1067
4138A067j417L23q32J514J613k871J914j418O66k43o57q29J130p46q98J343J415
$$ 1067 -350 -27 -859 655 2268 -603 1311 -107 559 316 -341 -1170 -40 -786 -1684 -341 1074
4155A074K30j391L42Q70j527j354J234J40J173l92m81l31M32p69J143j627K480
$$ 1074 1304 -87 255 1125 -402 -1756 -522 -382 791 399 -82 -413 19 -750 393 -1234 1246
$$ [...]
8191e95
##END NTUPLES=NMR FID
##END=
