##TITLE=1H_AC 1611
 acetonitril-d3
 108 sc, 
 17.11.2022
##JCAMPDX= 6.0         $$ Bruker NMR JCAMP-DX V2.0
##DATA TYPE= NMR FID
##DATA CLASS= NTUPLES
##ORIGIN= UXNMR, Bruker Analytische Messtechnik GmbH
##OWNER= root
$$ XWIN-NMR		Version 3.5
$$ Thu Nov 17 14:19:57 2022 Russian Standard Time (UT+4h)  she@DPX200
##.OBSERVE FREQUENCY= 200.1313499994
##.OBSERVE NUCLEUS= ^1H
##.DELAY= (6, 6)
##.ACQUISITION MODE= SIMULTANEOUS
##.ACQUISITION SCHEME= undefined
##.AVERAGES= 108
##.DIGITISER RES= 18
##SPECTROMETER/DATA SYSTEM= spect
##.PULSE SEQUENCE= zg30
##.SOLVENT NAME= Acetic
##.SHIFT REFERENCE= (INTERNAL, Acetic, 0, 15.7039)
##AUDIT TRAIL= $$ (NUMBER, WHEN, WHO, WHERE, WHAT)
$$ ##TITLE= Audit trail, XWIN-NMR		Version 3.5
$$ ##JCAMPDX= 5.01
$$ ##ORIGIN= Bruker BioSpin GmbH
$$ ##OWNER= she
$$ F:/spectra/data/she/nmr/H-F/1/audita.txt
$$ ##AUDIT TRAIL=  $$ (NUMBER, WHEN, WHO, WHERE, WHAT)
(   1,<2022-11-17 14:13:56.14 +0400>,<she>,<DPX200>,
      <continue with go, POWCHK disabled, PULCHK disabled
       configuration hash MD5:
       00 E9 B6 7A A2 85 ED C7 34 08 36 98 17 FE 4E 26
       data hash MD5: 16K
       E2 BB 18 92 F1 4B 43 C7 83 1A 89 48 61 45 EC B2>)
$$ ##END=
$$ 
$$ hash MD5
$$ 0C E9 7E 96 7E 96 8A ED 2B 56 CF D9 F8 11 26 36
##$RELAX= 
##$RELAX= 
##$RELAX= 
##$RELAX= 
##$RELAX= 
##$RELAX= 
$$ Bruker specific parameters
$$ --------------------------
##$DU= <F:/spectra>
##$EXPNO= 1
##$NAME= <H-F>
##$PROCNO= 1
##$TYPE= <nmr>
##$USER= <she>
##$AMP= (0..31)
100 100 100 100 100 100 100 100 100 100 100 100 100 100 100 100 100 100 
100 100 100 100 100 100 100 100 100 100 100 100 100 100 
##$AQSEQ= 0
##$AQ_mod= 1
##$AUNM= <au_zg>
##$AUTOPOS= <>
##$BF1= 200.13
##$BF2= 200.13
##$BF3= 200.13
##$BF4= 200.13
##$BF5= 200.13
##$BF6= 200.13
##$BF7= 200.13
##$BF8= 200.13
##$BYTORDA= 1
##$CFDGTYP= 0
##$CFRGTYP= 5
##$CHEMSTR= <none>
##$CNST= (0..31)
1 1 145 1 1 1 1 1 1 1 1 1 1 1 1 1 1 1 1 1 1 1 1 1 1 1 1 1 1 1 1 1 
##$CPDPRG= <>
##$CPDPRG1= <>
##$CPDPRG2= <>
##$CPDPRG3= <>
##$CPDPRG4= <mlev>
##$CPDPRG5= <mlev>
##$CPDPRG6= <mlev>
##$CPDPRG7= <mlev>
##$CPDPRG8= <mlev>
##$CPDPRGB= <>
##$CPDPRGT= <>
##$D= (0..31)
0 1.2 0 0 0 0 0 0 0 0.06 0 0.03 0 0 0 0 0.0002 0 0 0 0 0 0 0 0 0 0 0 0 
0 0 0 
##$DATE= 1668679589
##$DBL= (0..7)
120 120 120 120 120 120 120 120 
##$DBP= (0..7)
150 150 150 150 150 150 150 150 
##$DBP07= 0
##$DBPNAM0= <>
##$DBPNAM1= <>
##$DBPNAM2= <>
##$DBPNAM3= <>
##$DBPNAM4= <>
##$DBPNAM5= <>
##$DBPNAM6= <>
##$DBPNAM7= <>
##$DBPOAL= (0..7)
0.5 0.5 0.5 0.5 0.5 0.5 0.5 0.5 
##$DBPOFFS= (0..7)
0 0 0 0 0 0 0 0 
##$DE= 6
##$DECBNUC= <off>
##$DECIM= 32
##$DECNUC= <off>
##$DECSTAT= 4
##$DIGMOD= 1
##$DIGTYP= 9
##$DL= (0..7)
0 120 120 120 120 120 120 120 
##$DP= (0..7)
150 150 150 150 150 150 150 150 
##$DP07= 0
##$DPNAME0= <>
##$DPNAME1= <>
##$DPNAME2= <>
##$DPNAME3= <>
##$DPNAME4= <>
##$DPNAME5= <>
##$DPNAME6= <>
##$DPNAME7= <>
##$DPOAL= (0..7)
0.5 0.5 0.5 0.5 0.5 0.5 0.5 0.5 
##$DPOFFS= (0..7)
0 0 0 0 0 0 0 0 
##$DQDMODE= 0
##$DR= 18
##$DS= 0
$$ [...]
##$SUBNAM2= <"">
##$SUBNAM3= <"">
##$SUBNAM4= <"">
##$SUBNAM5= <"">
##$SUBNAM6= <"">
##$SUBNAM7= <"">
##$SUBNAM8= <"">
##$SUBNAM9= <"">
##$SW= 18.0517283424941
##$SWIBOX= (0..15)
0 0 2 0 0 0 0 0 0 0 0 0 0 0 0 0 
##$SW_h= 3612.71676300578
##$TD= 16384
##$TD0= 1
##$TE= 0
##$TE2= 300
##$TE3= 300
##$TEG= 300
##$TL= (0..7)
0 120 120 120 120 120 120 120 
##$TP= (0..7)
150 150 150 150 150 150 150 150 
##$TP07= 0
##$TPNAME0= <>
##$TPNAME1= <>
##$TPNAME2= <>
##$TPNAME3= <>
##$TPNAME4= <>
##$TPNAME5= <>
##$TPNAME6= <>
##$TPNAME7= <>
##$TPOAL= (0..7)
0.5 0.5 0.5 0.5 0.5 0.5 0.5 0.5 
##$TPOFFS= (0..7)
0 0 0 0 0 0 0 0 
##$TUNHIN= 0
##$TUNHOUT= 0
##$TUNXOUT= 0
##$USERA1= <user>
##$USERA2= <user>
##$USERA3= <user>
##$USERA4= <user>
##$USERA5= <user>
##$V9= 5
##$VALIST= <valist>
##$VCLIST= <CCCCCCCCCCCCCCC>
##$VD= 0
##$VDLIST= <DDDDDDDDDDDDDDD>
##$VPLIST= <PPPPPPPPPPPPPPP>
##$VTLIST= <TTTTTTTTTTTTTTT>
##$WBST= 1024
##$WBSW= 4
##$XGAIN= (0..3)
0 0 0 0 
##$XL= 0
##$YL= 0
##$YMAX_a= 844988
##$YMIN_a= -903628
##$ZGOPTNS= <>
##$ZL1= 120
##$ZL2= 120
##$ZL3= 120
##$ZL4= 120
##$ABSF1= 10
##$ABSF2= 0
##$ABSG= 5
##$ABSL= 3
##$ALPHA= 0
##$AQORDER= 0
##$ASSFAC= 0
##$ASSFACI= 0
##$ASSFACX= 0
##$ASSWID= 0
##$AUNMP= <proc_1d>
##$AZFE= 0.1
##$AZFW= 0.1
##$BCFW= 1
##$BC_mod= 2
##$BYTORDP= 1
##$COROFFS= 0
##$CY= 11.3945322036743
##$DATMOD= 1
##$DC= 2
##$DFILT= <>
##$DTYPP= 0
##$F1P= 2.36226072786647
##$F2P= -0.459571619588291
##$FCOR= 0.5
##$FTSIZE= 0
##$FT_mod= 4
##$GAMMA= 1
##$GB= 0.15
##$INTBC= 1
##$INTSCL= 1
##$ISEN= 128
##$LB= 0.24
##$LEV0= 0
##$LPBIN= 0
##$MAXI= 10000
##$MC2= 0
##$MEAN= 0
##$ME_mod= 0
##$MI= 1.114404
##$NCOEF= 0
##$NC_proc= 0
##$NLEV= 6
##$NOISF1= 3.799351
##$NOISF2= 2.8
##$NSP= 1
##$NTH_PI= 0
##$NZP= 0
##$OFFSET= 15.70392
##$PC= 1
##$PHC0= -18038.97
##$PHC1= 22.6007
##$PH_mod= 1
##$PKNL= yes
##$PPARMOD= 0
##$PSCAL= 0
##$PSIGN= 0
##$REVERSE= no
##$SF= 200.130013532006
##$SI= 16384
##$SIGF1= 3
##$SIGF2= 2
##$SINO= 400
##$SIOLD= 16384
##$SREGLST= <1H.CDCl3>
##$SSB= 0
##$STSI= 0
##$STSR= 0
##$SW_p= 3612.71676300578
##$SYMM= 0
##$S_DEV= 0
##$TDeff= 0
##$TDoff= 0
##$TI= <>
##$TILT= no
##$TM1= 0
##$TM2= 0
##$TOPLEV= 0
##$USERP1= <user>
##$USERP2= <user>
##$USERP3= <user>
##$USERP4= <user>
##$USERP5= <user>
##$WDW= 1
##$XDIM= 8192
##$YMAX_p= 0
##$YMIN_p= 0
$$ End of Bruker specific parameters
$$ ---------------------------------
##NTUPLES= NMR FID
##VAR_NAME=  TIME,          FID/REAL,        FID/IMAG
##SYMBOL=    X,             R,               I
##VAR_TYPE=  INDEPENDENT,   DEPENDENT,       DEPENDENT
##VAR_FORM=  AFFN,          ASDF,            ASDF
##VAR_DIM=   8192,          8192,            8192
##UNITS=     SECONDS,       ARBITRARY UNITS, ARBITRARY UNITS
##FACTOR=    0.0002768,     1,               1
##FIRST=     0,             0,               0
##LAST=      2.2672688,     0,               0
##MIN=       0,             -903628,         0
##MAX=       2.2672688,     844988,          0
$$ Real data points
##PAGE= N=1
##DATA TABLE= (X++(R..R)), XYDATA
0 0 0 0 0 0 0 0 0 0 0 0 0 0 0 0 0 6 -108 108 -108 108 -108 182 -216 216 -283 324 -335 433 -511 544 -650 756
32 756 -863 970 -1082 1201 -1361 1522 -1705 1897 -2113 2352 -2610 2890 -3200 3537 -3898 4303
48 4303 -4738 5220 -5749 6338 -6985 7707 -8507 9419 -10460 11641 -13014 14634 -16573
61 -16573 18954 -21935 25814 -31072 38665 -50698 72565 -125624 585636 111529 -666054
72 -666054 524684 704030 -266294 -605553 239129 344523 -299801 -458024 178849 333737
82 333737 -150485 -308378 256040 385143 -137898 -211644 360600 293394 -266641 -118128
92 -118128 385378 71595 -355923 26962 356788 -116434 -355018 96009 226502 -221494
102 -221494 -255987 204004 262433 -127698 -143703 245675 264206 -180722 -229545 236356 260522
113 260522 -264116 -241484 312479 192363 -391900 -193219 341593 39949 -430869 -53695
123 -53695 357364 -6681 -299298 79117 327791 -4352 -212396 90275 274031 -50086
133 -50086 -276974 24070 205127 -173003 -343050 93828 242203 -189018 -221440 261522
143 261522 234008 -224155 -118248 295036 116340 -267950 -68903 252766 27156 -272312
153 -272312 -60937 207531 579 -250023 -15447 257173 18590 -239716 40451 280924
163 280924 -55434 -282053 84942 256719 -133019 -233575 166645 208418 -173995 -158297
173 -158297 196094 139059 -186371 -113231 180354 89056 -201835 -113222 173662 76086 -200500
184 -200500 -56252 240710 72058 -207447 3217 246701 -24603 -252087 29954 207787
194 207787 -84722 -209708 90448 181319 -102737 -163449 109497 148919 -112709 -138826 125141
205 125141 139155 -130255 -134949 137732 112936 -162891 -96772 183766 79354 -186383 -45741
216 -45741 188783 8757 -199764 -2878 173338 -26507 -171330 26510 147793 -48899
226 -48899 -155608 46720 151853 -50195 -133877 94368 168615 -84131 -145005 98101 105051
237 105051 -153607 -129447 116027 62890 -153855 -61800 147455 52718 -116636 -6736 155986
248 155986 41845 -116472 -15279 118573 -10395 -152941 -16012 116722 -35732 -145345
258 -145345 38417 136848 -52481 -118847 80557 118106 -75185 -81054 102463 84720 -89686
269 -89686 -60951 94641 47477 -108244 -60716 87213 35264 -109332 -44908 103727 30692
280 30692 -106605 -6917 131602 8784 -113206 25339 125525 -28389 -111030 41791
290 41791 94960 -55185 -91137 48725 67360 -63915 -73377 54172 61585 -60287 -60282 72705
302 72705 71875 -57476 -40333 90643 51204 -82901 -29608 85067 305 -108099 -15053
313 -15053 79237 -14526 -84750 18461 81613 -11214 -59185 32716 71856 -22211 -58784 34233
325 34233 62439 -41018 -68337 38500 54924 -54714 -59672 51855 40563 -63523 -32426
336 -32426 67991 27873 -63137 -8396 72538 16461 -54953 -3514 55241 -6928 -63257 -6958
348 -6958 43168 -10958 -51043 17465 62793 -6932 -46616 24709 49698 -26762 -48511 24738
360 24738 32296 -35630 -29713 37170 22639 -39631 -18822 40845 18601 -34427 -9451 38400
372 38400 7839 -37616 -3766 36020 1105 -34100 7346 37365 -11936 -45607 886 29456
384 29456 -16082 -29687 26014 45007 -4830 -16370 28077 22769 -34369 -32475 17162 11469 -30810
397 -30810 -14558 27914 12927 -22157 -5306 23539 4878 -19949 672 24837 2578 -24521
409 -24521 -2633 23962 3171 -14161 11500 25839 -9734 -27860 -3682 -2028 -32123 -25012
421 -25012 16736 20575 -1456 12500 34990 19642 -7934 -2453 9177 -5788 -23069 -11949
433 -11949 5139 -7049 -26463 -12850 13275 5340 -12538 8320 32101 8429 -8961 11891
445 11891 16860 -9238 -11932 10322 8595 -9800 -12312 -9179 -12599 -15112 -12355 -3793 8901 12062
459 12062 11264 20207 18669 -413 -4500 6848 -2617 -17207 -3653 5984 -10693 -13133 4101 1853
473 1853 -12355 -5686 10220 9366 1057 540 1773 3917 1336 -3060 342 10266 7128 -1061 2073
488 2073 1930 -10979 -16178 -6672 -5592 -8276 513 4707 -244 5805 12603 3392 -1561 10558 13924
503 13924 4554 3900 4650 -5134 -13200 -14946 -17034 -15143 -6000 -2931 3838 17273 16178 3445 6581
518 6581 12752 4207 -3798 -623 -4561 -13359 -8223 -4323 -8690 -4711 6165 5664 4275 10705 5421
533 5421 -5916 -7404 -5250 -7356 -3811 1505 5381 15088 19322 3793 -7344 -1570 -4651 -16487
547 -16487 -9355 6409 2176 -4111 1709 6977 288 -2845 -3608 536 5728 1080 -8474 -2529 8883
562 8883 3139 -1605 7023 9787 -940 -3640 -1609 -8933 -15430 -14880 -12623 -2996 10711 14775 11051
577 11051 12453 12745 466 -9817 -9604 -6045 -3506 1138 1676 327 4688 5078 -3740 -1662 7379
592 7379 -182 -14267 -7297 2357 -5499 -9618 1414 9552 11460 12211 8591 6119 8385 -3201 -17876
607 -17876 -11531 -4426 -16294 -14660 6176 8914 -3604 -278 5523 2295 6602 12977 9009 7336
621 7336 11852 2904 -7585 -6133 -8611 -11951 -8389 -5849 -9894 -4351 4280 -1473 -993 14868 11699
636 11699 -949 6244 16518 4942 -6691 -1866 279 -10174 -11407 -3813 -758 -3741 -7097 -3979
650 -3979 2798 719 -5582 -167 14862 13889 1338 6562 14227 -685 -12274 -811 2212 -13425
664 -13425 -14301 1297 -139 -10373 -5137 3369 1148 -496 3792 7689 9615 5518 3690 10411 7966
679 7966 -8177 -9042 6098 -1602 -19602 -10336 3036 -10576 -16060 4923 14251 1444 856 17181
693 17181 18986 4317 -2926 2685 3487 -8302 -14945 -4173 2566 -9762 -11915 5457 8535 -8225
707 -8225 -6701 13806 12698 -6304 1245 15443 5050 -9967 -198 9660 -5604 -14991 -2926
720 -2926 5574 -6995 -13002 -1963 8063 1508 -4401 6061 14986 2907 -6250 6919 12180 -6517
734 -6517 -14276 4888 7377 -12031 -9665 8168 3624 -9809 -940 10630 1344 -8434 1882 11283
748 11283 3024 -7315 -1173 8737 -370 -12061 -2238 7779 -5811 -14462 2335 11426 -6626
761 -6626 -11101 10323 13905 -5448 -5013 10827 8600 -7500 -4604 6706 -495 -14065 -6148 8874
775 8874 3052 -8975 -2236 11021 3755 -8176 584 12000 183 -10663 2330 12021 -4880
788 -4880 -15171 2012 10035 -8795 -12563 6621 8968 -6422 -5321 12059 8703 -7998 -3463
801 -3463 10257 6022 -9763 -7892 4686 539 -15102 -7531 7425 1253 -10064 2773 17587
814 17587 3141 -11564 3766 13502 -3175 -12005 3650 8526 -5727 -9705 3542 5263 -9498
827 -9498 -11023 5366 7572 -5201 -4598 8337 9272 -4362 -5187 8076 4905 -8454 -3688 9085
841 9085 766 -15389 -6023 7857 -543 -9854 2812 11535 626 -5249 5372 6368 -4729 -9496
855 -9496 2583 9346 -268 -4033 5046 6966 -6041 -9773 -316 -283 -9696 -6068 9299 6921 -3756
870 -3756 693 12812 5650 -6383 1498 6840 -4600 -10827 -1968 43 -6507 -8986 3247 10170
884 10170 4264 -80 4364 6750 -2200 -8518 -1852 3487 -2597 -3472 9139 8443 -4685 -6132 1923
899 1923 -2031 -9079 -2842 4984 111 -1441 5769 6221 -855 -1223 2799 2874 -2847 -6388 -3899 -44
915 -44 -5554 -8071 2386 8714 2527 1716 11305 7761 -7841 -10322 753 -2320 -8796 -2172 6322
930 6322 2005 -1207 1815 2162 -975 -1567 -1631 270 4463 -1017 -4037 2267 3543 -1890 -1028 5541
946 5541 1185 -3479 2061 1173 -8206 -7730 683 -1493 -3098 8565 8284 2942 2931 4297 -2024 -4846
962 -4846 -2293 -3254 -532 3120 -4446 -6433 3361 2447 -4773 88 9105 3879 -965 4496 6100 -2694
978 -2694 -4145 -1207 -2898 695 1123 -2765 -3800 2801 -1274 -7870 -2313 4259 -110 -307 6136 5778
994 5778 836 976 1041 -1441 372 1289 -5360 -4940 2172 -2882 -10578 -2631 3016 -1022 1878 10468
1010 10468 6590 4471 7178 3688 -4937 -1877 -2381 -9214 -4624 3691 -587 -4381 741 1990 -1060
1025 -1060 2300 1265 -2573 1953 5785 -2163 -3252 4627 3666 -4711 689 5940 -2532 -7132 -3466
1040 -3466 -4880 -6183 -2893 -1637 167 8819 11269 4035 4956 7586 -535 -7070 -2605 -2752 -7130
1055 -7130 -3310 2247 314 -1684 713 -1096 -2112 4164 4290 -2311 -128 3082 1081 -445 4327
1070 4327 3799 296 3475 1018 -5039 -6543 -3329 -7555 -5851 2183 2349 -101 5947 10296 5012
1085 5012 881 665 -996 -2305 -847 -2450 -3701 664 -656 -6306 -1312 4750 -780 -1532 4941
1100 4941 4782 -1438 -1533 1193 -47 1998 1935 -828 -1679 -465 -2139 -3778 -495 -1845 -4365 776
1116 776 2699 757 2796 5045 168 -3588 1807 1279 -5829 -2542 5196 3248 -2582 -2214 1942 737
1132 737 -3953 -1541 1851 2094 -2896 -2664 3841 5177 -2795 -2412 4497 3994 -3865 -3345 3672 -368
1148 -368 -6474 -624 5498 -1304 -4807 3421 6687 -1217 -2759 1799 3428 -1707 -3738 2364 4433
1163 4433 -2841 -6009 2963 4409 -6564 -6436 6713 6560 -6957 -3810 9366 3608 -6956 -1928
1177 -1928 7093 -1860 -11453 -3323 7126 488 -8071 -299 10646 3115 -8507 3394 12907 -1659
1191 -1659 -10679 3349 10032 -7925 -12568 4641 7441 -7769 -7840 9010 8129 -7150 -3868 11516
1205 11516 7713 -8475 -4606 11179 5159 -11355 -4353 11134 1938 -14252 -1639 12164 -1094
1218 -1094 -13732 2560 15340 -1950 -12692 6935 15162 -5381 -12503 7591 12698 -9028 -12492
1231 -12492 8262 9018 -13181 -12726 10765 9665 -13912 -8293 16477 8744 -13604 -2326 18511
1244 18511 4017 -16353 814 17641 -1996 -19022 -1013 15193 -5882 -20388 3776 16444
1256 16444 -6645 -15453 11661 19076 -9130 -14214 14978 16776 -13737 -13912 14965 8804 -21659
1269 -21659 -12541 16137 5560 -20675 -4524 23235 6141 -19387 -345 23678 554 -21513
1281 -21513 3254 23139 -4852 -23426 5814 19094 -12918 -24203 11128 21413 -13376 -19874
1293 -19874 16772 20875 -17516 -15792 21708 16994 -21732 -11545 24683 10224 -25949 -10800
1305 -10800 23699 4261 -26731 -4035 26127 1508 -25457 2787 29225 -4034 -27357 9390
1317 9390 29681 -8670 -26653 13248 23135 -17767 -25292 16909 19975 -21857 -18112 25266 19412
1330 19412 -23838 -15019 27732 13925 -28126 -12171 27731 7151 -31615 -5683 31104 318
1342 318 -33389 1105 33779 -4038 -30950 9027 31433 -11127 -28827 15156 28433 -17383
1354 -17383 -26746 20259 24417 -25358 -26464 21572 19204 -28383 -17792 32223 19390 -27994 -8358
1367 -8358 36402 8214 -36263 -6186 33133 -1127 -37119 832 34509 -5531 -35139 8320
1379 8320 34719 -12210 -32111 16547 33205 -17580 -31220 22360 30460 -22642 -24867 27738
1391 27738 22553 -31711 -22139 28205 11103 -38649 -12893 37208 12177 -31935 907 41780
1403 41780 3919 -36463 2115 34854 -9720 -40587 7571 35392 -16445 -39849 16003 36141
1415 36141 -20145 -31774 28018 33646 -26886 -28011 29539 24341 -32421 -23529 34965 20148 -33869
1428 -33869 -15847 34401 9173 -41409 -10843 36567 3683 -38179 3242 42747 -2018 -37189
1440 -37189 12322 40471 -12140 -35753 19071 33210 -25869 -35203 23258 27564 -31397 -29116
1452 -29116 32783 27424 -32156 -20893 38178 21818 -36785 -14959 41925 13425 -41948 -7541
1464 -7541 43237 1179 -47232 -3433 39953 -6438 -43020 8448 41299 -10778 -36021 17663
1476 17663 37941 -14966 -31522 23812 33335 -24624 -31401 23703 22272 -34672 -25028 32954 18500
1489 18500 -37127 -11764 42767 11246 -39630 -3373 42294 573 -42073 3314 40602 -8561
1501 -8561 -42326 9256 39969 -14184 -39843 17087 40048 -22166 -39506 23647 33683 -27977
1513 -27977 -29875 33806 28819 -31334 -20968 36556 19938 -36441 -17337 33947 8364 -39279
1525 -39279 -8116 36415 4503 -36475 2794 41109 -4060 -38793 9932 38335 -13733 -39872
1537 -39872 15961 35861 -24052 -33325 26739 32665 -28677 -28091 31903 23817 -34543 -24480 34420
1550 34420 19763 -35645 -14465 38191 13603 -39054 -8592 39796 4026 -42380 -1379 41058
1562 41058 -2227 -38483 9213 38460 -12115 -35985 16029 31878 -20506 -31485 20864 28062
1574 28062 -23355 -25576 27130 26423 -26450 -20677 31264 17360 -36205 -16839 33968 9208 -38296
1587 -38296 -7976 37993 4245 -36517 1848 37820 -3946 -35033 7044 35060 -10222 -32856
1599 -32856 14064 33060 -16235 -32482 17454 27260 -22161 -26688 24925 22762 -28164 -20163 30215
1612 30215 17757 -29739 -12015 33644 9892 -33327 -5145 32928 1946 -32903 484 31284
1624 31284 -5447 -33872 5749 30543 -10529 -32362 12431 30531 -13383 -25865 20971 27460
1636 27460 -19473 -23127 22486 19237 -26918 -19012 24467 13400 -28223 -12117 27151 9206
1648 9206 -26486 -3809 30618 4221 -28159 -196 30392 -2663 -29480 6052 27233 -11243
1660 -11243 -29049 10152 24318 -15624 -25293 16585 22204 -18865 -18653 22009 20225 -20042 -16225
1673 -16225 22654 13491 -24916 -11935 22884 6157 -27377 -6194 25006 3501 -26236 -274
1685 -274 26451 -1216 -24405 5127 25599 -5534 -22376 8348 21430 -12620 -22096 12844
1697 12844 18353 -15388 -17388 16317 16379 -17642 -12498 19752 12819 -19177 -8072 22370 8112
1710 8112 -22460 -5266 20871 2599 -21642 -698 20425 -2319 -20001 5132 20993 -5087
1722 -5087 -19916 8299 19327 -9307 -19057 11464 16261 -12572 -16226 13530 12432 -16253 -11550
1735 -11550 15929 11003 -15559 -7210 16231 6004 -16401 -3920 17392 2903 -17042 -566
1747 -566 15902 -1635 -19247 1516 16633 -4877 -15869 6492 15701 -5750 -12777 9119 13252
1760 13252 -9161 -11103 11251 9257 -13108 -11616 11002 7948 -13035 -7116 14223 5659 -12020
1773 -12020 -1358 14905 1384 -14468 -1216 15077 -1475 -13797 1907 12304 -4661 -13446
1785 -13446 4490 11511 -5517 -10637 7233 10979 -6779 -8463 7794 7687 -6753 -7233 8724
1798 8724 7205 -9840 -7564 9052 3068 -12363 -4072 12184 1964 -9475 1176 10498 -703
1811 -703 -8987 2778 8758 -3398 -9142 2981 8984 -4229 -9678 3408 8262 -5559 -7722 5329
1825 5329 7236 -7249 -6178 7573 5180 -6689 -2767 9157 4825 -5930 -2061 6255 35 -9537
1839 -9537 -3346 4475 -2152 -8428 1136 7684 1420 -4747 3233 9415 -519 -5492 1934 4598 -6396
1854 -6396 -9196 2457 2830 -5891 -2772 6769 4818 -2347 -4 5258 2070 -5026 -1815 3140 1469
1869 1469 -4235 -1683 5150 1278 -5991 -2160 4779 -413 -5185 162 4947 -898 -2924 3167 4267
1884 4267 -2227 -2170 2351 918 -2958 -2251 -820 -453 -2283 -2007 2557 2492 -1231 -1213 3172 1942 -5007
1901 -5007 -1423 2492 -587 -3104 422 5175 -1553 -2122 2653 2097 -2842 -3203 20 1292 -1121 -2521
1917 -2521 575 3189 1401 102 2753 4194 32 -2834 1720 -964 -4806 -3553 1323 -377 -1463
1932 -1463 2316 2458 -96 1448 2484 1204 -1825 -1170 -1244 -1375 -1024 -2432 -1251 811 83 -2139 1274
1949 1274 4377 -1039 -1417 3296 1360 -2531 -1303 1376 625 -1404 -776 149 -70 938 -555 -1093
1965 -1093 1271 697 -1232 554 2651 526 -1246 301 1046 -1566 464 617 -1512 -1232 1030 -666
1981 -666 -2600 237 668 -495 -982 948 449 -939 757 242 -563 1041 435 -1816 580 974 -1008
1998 -1008 -3339 35 -243 -2024 -788 601 -1366 977 1919 1351 545 2470 133 -165 1089 -215
2014 -215 -3601 -3431 -223 -1798 -2947 144 765 1391 1364 1974 1885 2182 1773 -114 -1134 1072 -846 -4532
2032 -4532 -1266 17 -1178 -1591 860 648 707 1576 336 -113 1744 2092 -771 66 1054 -846 -2885
2049 -2885 121 302 -2301 -963 -223 -799 -476 1353 -500 -177 1381 1353 -204 933 1504 281 -700
2066 -700 1043 -788 102 223 -782 -700 -347 279 -1850 50 912 348 374 -229 1643 1049 -69 332
2084 332 -66 -630 -311 -1255 -355 -717 -1289 -1188 540 1251 239 1237 555 863 330 1712 1716 -1256 -792
2103 -792 -102 -655 -1033 -262 113 -950 -826 405 -192 741 -356 624 1378 867 -581 -838 722 483
2121 483 -2015 -499 365 158 -1216 588 814 114 165 1092 1480 -106 542 41 178 -240 -904 -565 705
2140 705 -576 -358 294 299 -1943 -842 1431 -225 -513 892 1232 -448 -1409 585 870 -211 -1133 293
2158 293 1650 -496 -1430 926 1553 -469 -807 1341 955 -1186 -1239 1339 2361 -2279 -1408 1866 81
2175 81 -1110 -606 2738 -221 -716 256 1521 798 -881 645 2256 -8 -1391 211 1680 -237
2191 -237 -1422 918 1307 -1945 -1928 1532 1724 -763 -1059 2860 1764 -433 -275 2721 86 -883 -1249
2208 -1249 659 -828 -3680 -1167 1734 287 -1962 214 3067 -572 -1134 1121 2924 -1290 -2255
2223 -2255 452 1052 -2131 -2171 1022 224 -2415 -1629 1488 1391 -1642 -86 3240 1416 -1274 -571 2671
2240 2671 217 -2295 -720 1936 -926 -2382 180 2181 -675 -2775 1172 2778 -1143 -1719 1901
2255 1901 1259 -1988 -1022 915 962 -1195 -1517 3195 1502 -2361 -1941 2303 614 -3057 -1920 1507
2271 1507 -43 -3040 -628 2921 -975 -1663 1989 3355 544 -1978 1008 1211 -1683 -2017 -338 1625
2287 1625 -1480 -1783 2382 1903 -1059 -539 2984 1376 -2416 -846 377 -31 -1943 -1031 2382 103
2303 103 -1991 468 2767 -345 -2200 -51 1676 -1215 -2715 268 2020 -1247 -1809 -10 2031
2318 2031 -1671 -2220 456 2652 -1021 -1700 1687 1248 -1707 -1068 1819 165 -953 -1044 1746 -145
2334 -145 -2127 -1486 1358 856 -468 546 1404 378 -1757 564 1115 -1111 -2939 90 1694 -1126
2350 -1126 174 1952 1064 -307 -245 1296 1770 -1787 -1732 1039 898 -1627 -792 1482 1833 -710 -79
2367 -79 1996 293 -2686 -1158 582 -1995 -2359 812 1910 77 509 1064 2332 1003 12 364 -233
2384 -233 -1419 -1733 -535 -555 -2152 -761 602 1624 -1219 606 2060 1659 -1315 755 706 -124 -1683
2401 -1683 -46 1059 -1303 -940 -1158 866 -441 -214 746 924 209 -138 1444 1079 -527 -1119 353
2418 353 1576 -1149 -1177 799 -210 -583 264 1219 617 -1259 1020 -5 -1098 818 373 431 -141 -1614
2436 -1614 -230 454 -136 -1251 1042 2050 -397 -1603 852 -122 -1790 -1360 84 -146 -762 -41 464
2453 464 1186 842 -783 -304 1467 -487 -1936 -638 -556 629 -502 -55 -494 93 753 1684 576 401
2471 401 776 -571 -278 -787 -255 -1557 -1084 -688 49 1283 -203 -471 200 289 910 -1169 1537 825
2489 825 -1331 -407 180 -450 -663 309 269 -434 803 -1412 -14 746 1021 -1091 433 300 -238 -154 -239
2508 -239 1317 -279 -533 -34 -32 38 168 605 249 139 577 315 -221 109 -151 -182 223 -180 299 686 -369
2529 -369 -1350 541 234 -325 314 314 629 -66 312 1071 -137 424 -577 76 -512 -462 246 -1021 678
2548 678 -982 -640 245 176 -660 6 433 -347 176 943 -46 -271 -312 -176 352 -326 869 207 -518 -167
2568 -167 -701 -819 34 315 884 1089 86 351 947 1741 -732 -601 -638 610 -1660 -1674 405 663 -30
2587 -30 -410 2536 1216 -414 -16 1995 787 -227 -805 538 167 -986 -522 502 -193 -1403 219
2604 219 579 -445 -1690 743 1642 181 -923 1006 1278 -901 -919 773 25 -728 107 1198 566
2621 566 -1010 127 -44 -863 -1705 453 1556 -260 -978 1630 2505 -566 -1667 1123 1579 -431 -509
2638 -509 -191 314 -2889 -807 1620 625 -1446 -1540 2208 1051 -611 330 2045 276 -1342 -1015 1912
2655 1912 -681 -2577 859 986 -1226 -2241 1468 2590 -491 -1761 1579 1774 -1173 -1275 1737 2167
2671 2167 -2667 -2145 2232 549 -1663 -1444 2688 1212 -2328 -128 2940 1171 -3028 348 2962
2686 2962 -1205 -3412 -29 1892 -1443 -2148 1088 2581 -1089 -2206 3105 3711 -1343 -2781 2475
2701 2475 1354 -3466 -2422 3032 2083 -4036 -1014 3004 941 -3813 -1106 4988 312 -4545 327
2716 327 3122 -497 -3884 1643 3210 -1525 -3776 1998 4245 -2469 -3990 2670 3467 -3492 -3256 2662
2732 2662 3072 -3685 -2539 5626 2419 -4491 -1451 4564 2015 -5024 -1179 4110 -1451 -3891 1000
2747 1000 4094 -577 -4250 1867 5198 -1178 -4868 3058 5542 -2972 -6677 3279 4763 -4619 -4386
2762 -4386 4639 3279 -5684 -3477 4855 2141 -4989 -839 6224 2597 -4738 149 5596 -294 -6483
2777 -6483 -1233 4557 -1528 -7094 1102 6369 -1810 -4505 3625 7854 -4144 -5214 4399 5005 -5538
2792 -5538 -4226 4984 2740 -5515 -2724 7329 1997 -6053 -2130 5860 1343 -7448 -1840 8333
2806 8333 1384 -7127 196 8672 -1208 -7300 1401 6714 -3729 -6323 4610 5671 -4576 -6792
2820 -6792 4375 5482 -3596 -4397 5106 5054 -4800 -5495 5622 3769 -8609 -3011 7549 2743 -8187
2835 -8187 -1382 8642 218 -8571 2199 7619 -1752 -6160 3037 6723 -3175 -7603 3011 6433
2849 6433 -4770 -6970 3271 7515 -6392 -7253 7132 6426 -7328 -4548 8759 4598 -9403 -3173
2863 -3173 7594 2192 -8237 -962 7884 -433 -6345 92 7837 122 -8315 845 8746 -2325
2877 -2325 -8784 2497 8518 -4877 -7477 5270 6221 -7934 -5562 9011 4884 -8295 -3348 8295
2891 8295 4199 -8952 -2373 7158 2161 -7579 -1103 9056 2405 -9321 -990 10299 -119 -10520
2905 -10520 777 9331 -3517 -10335 5252 8718 -5359 -6605 6087 6899 -6752 -6067 6034
2918 6034 5343 -7102 -5559 6434 4270 -7699 -3865 9282 4346 -9058 -1536 11690 1625
2931 1625 -10928 47 11679 -3360 -10225 3354 9801 -4734 -8557 4691 7875 -5396 -7515
2944 -7515 5662 8421 -4926 -7673 7183 8048 -8894 -6753 8440 5967 -9409 -6071 9557
2957 9557 2658 -10283 -1966 10396 996 -8098 227 8671 -1325 -8085 1693 8116 -2351 -8645
2971 -8645 2322 9417 -4127 -9521 4331 9453 -6884 -8249 8309 6555 -8234 -5482 9186
2984 9186 4276 -9177 -2932 9088 2583 -8738 -2897 9179 1330 -8434 -851 10432 -214
2997 -214 -10231 1571 9549 -2028 -9984 3353 10255 -5152 -8790 6742 7570 -6973 -6838 6213
3011 6213 5365 -8186 -5168 7370 4595 -7747 -3676 8931 3816 -9692 -2884 9779 2821 -9751
3025 -9751 -1062 9603 -1003 -10557 1420 9316 -3505 -8609 4519 7961 -4485 -7400 5774
3038 5774 6641 -5544 -7440 5836 6287 -6073 -5924 6767 5185 -8020 -5170 8743 3201 -9094
3052 -9094 -1675 9532 1286 -8993 510 7656 -585 -8150 1204 8097 -2924 -8112 3116 9355
3066 9355 -3658 -7522 4335 8471 -4562 -6612 6246 6727 -7554 -5870 6834 3927 -8278
3079 -8278 -3123 8423 2734 -7878 -1706 7704 1934 -7151 -1245 8289 10 -7842 1115 7990
3093 7990 -1473 -7970 1969 7450 -3456 -8084 3967 5717 -6015 -5760 6919 5408 -6007 -4452
3107 -4452 6792 4633 -6437 -2939 5905 2382 -6863 -2224 6854 953 -8073 -887 7835 167
3121 167 -7650 1726 6953 -1798 -6325 3602 6926 -2948 -6335 3783 5762 -4095 -4802 4074 4053 -4527
3137 -4527 -4529 5649 3572 -4667 -2176 6926 3140 -7149 -2175 6857 1210 -6642 -476 6613 -833
3152 -833 -7100 565 5182 -526 -6399 2219 5666 -2618 -5382 2086 5694 -3026 -4933 3658 4636
3167 4636 -4659 -4424 5565 2490 -6089 -3303 5311 1674 -5422 -1561 5259 1592 -4923 -1121 4760
3182 4760 1163 -5455 -242 5716 -1081 -5506 915 4417 -2480 -5091 2392 4424 -3186 -3609 3090
3197 3090 3285 -3379 -3072 2839 3322 -3719 -1718 2589 1920 -4320 -1927 4590 981 -5394 -992 4760
3213 4760 1052 -4394 234 3879 -618 -4349 800 2694 -1864 -3453 1349 3197 -1544 -3481 2406
3228 2406 3315 -2626 -2517 2534 2880 -1861 -2420 2097 2649 -4231 -928 3228 1241 -2849 -1159 4095
3244 4095 899 -3221 246 3260 -24 -3109 236 3097 -1799 -2840 1692 2181 -1048 -3039 2337
3259 2337 2116 -2120 -1486 2193 1813 -2567 -1595 2959 1110 -2926 -957 1183 715 -2222 -1116 2215
3275 2215 516 -1618 569 3185 104 -3423 13 3429 -1671 -2672 691 2059 -2198 -1355 1719
3290 1719 2594 -1467 -1529 2302 595 -1688 -1286 1033 1198 -1243 -1805 1753 1801 -2101 -113 2578 -256
3307 -256 -1950 427 1324 -593 -1954 1078 892 -667 -193 167 2145 -630 -847 1127 388 -207 -1023
3324 -1023 -3 692 -379 -2258 1509 392 -835 -1085 1342 253 -1843 -33 2238 -707 -353 1066
3340 1066 310 -194 -646 -149 761 241 -1127 -62 744 -349 -2144 642 2279 640 -1061 619 747
3357 747 -681 -528 224 -577 -1667 55 1131 181 221 515 -132 -156 357 -284 -220 970 -314 303 911
3376 911 -256 -1210 739 1461 -1081 -472 698 -90 -459 -213 586 381 -883 569 247 -439 399 562
3394 562 912 1775 583 -1007 660 178 -612 -1117 488 -462 -807 550 1243 -870 -99 394 -9 -1203
3412 -1203 96 -245 -1132 157 279 -814 -173 661 16 -215 -21 80 233 451 -229 -802 356 847
3430 847 -256 710 772 356 -580 -781 946 -53 375 1111 -747 -213 854 335 -221 -101 -228 -753 -607
3449 -607 265 173 -372 197 201 -1756 360 290 -1785 -875 1208 -718 -1029 63 353 -678 292 350 -231
3468 -231 47 495 154 -71 992 -1058 -66 -366 -81 -500 827 1418 29 127 211 -166 -521 -12 103
3487 103 -204 -595 594 620 -851 280 376 -277 -129 -637 -668 -957 -935 -408 -84 285 -576 91 162 61 263
3508 263 -1056 990 99 -672 1116 -138 1436 -389 54 -156 263 325 279 213 373 -258 -608 79 -345
3527 -345 -230 -586 363 -435 402 273 -734 -724 349 463 669 -286 -342 -254 -317 -48 483 -329 472 -404 -552
3548 -552 -811 566 501 -596 336 551 -118 -530 717 650 -450 388 841 -470 -760 142 -461 794 -536
3567 -536 -580 -488 1101 -303 -1244 803 704 -178 -82 212 307 -1032 -83 338 69 -513 758 755 778 -121 -218
3588 -218 246 -466 -489 -127 30 332 183 707 -258 46 47 403 -345 -494 -515 384 -204 -85 664 -227 -18
3609 -18 -1108 179 503 -482 445 636 -62 -6 -852 -912 690 715 -726 -134 121 590 -1357 -236 52
3628 52 -1762 -7 362 4 -934 -399 234 -297 -735 -150 92 32 -353 1169 227 180 -631 -153 183 80
3648 80 215 -240 856 -766 -322 -41 -207 445 -307 -123 721 -562 -867 685 663 -309 -482 388 785
3667 785 -469 -700 10 -368 -539 641 1170 433 -981 -1415 699 -559 -1169 -1343 470 -504 -889 -804
3685 -804 988 -18 -404 -415 1379 96 -861 1037 1229 -1008 -895 115 308 -345 -763 917 487 -319
3703 -319 -761 -604 452 57 -906 353 187 -44 1033 128 894 -592 803 321 -91 -1228 -470 230
3721 230 -686 -473 -362 635 458 -684 151 1394 -1481 -301 353 230 -571 -264 246 677 -881 -569
3739 -569 707 -275 -6 -630 235 -76 -1572 265 617 -43 -345 360 1146 -783 -1191 -163 -728 -932
3757 -932 -281 873 -1092 -444 -447 -308 938 27 -316 1112 -310 -1498 449 1109 1094 240 285 706 1079
3776 1079 -1107 -412 127 400 65 160 -106 -280 -520 633 437 -749 -364 -264 678 -1700 -812 1062
3794 1062 168 112 -227 109 363 185 -945 790 -240 -985 -540 -121 -628 -1902 818 527 64 445
3812 445 -706 -424 -123 -1004 -28 -305 68 -665 1069 -114 -675 -536 -727 91 303 533 382 -9 -543
3831 -543 31 508 1074 -890 742 1176 972 -1136 385 236 78 -32 -388 319 -310 -47 -43 501 -487
3850 -487 36 449 485 214 -454 1513 318 -425 519 54 97 22 477 -193 -201 -522 707 87 116 1181 266
3871 266 -119 -377 -336 703 -735 660 182 -443 -423 144 -247 -1632 233 -495 -408 120 -318 168 -962
3890 -962 -420 93 -886 -658 -313 545 -976 -1125 -676 -548 1544 374 -8 -263 -193 400 -270 316 -504
3909 -504 256 112 317 224 -493 669 70 358 272 -126 -48 -156 -22 256 753 -65 -224 68 -665 -81 -205
3930 -205 183 -841 -4 608 826 -215 -848 -329 520 -236 80 738 1054 205 23 9 44 802 -486 -283
3950 -283 -875 119 -569 85 -1122 -2 838 804 -244 -330 274 -223 1063 1139 -82 357 552 442 201
3969 201 -249 -172 -321 108 -152 -428 285 242 189 -64 -597 56 243 104 339 436 236 10 -1060 207 184
3990 184 506 62 -766 752 238 -263 627 -365 887 387 134 -39 431 451 1029 299 916 -166 312
4009 312 -485 -513 399 206 -179 837 -146 -120 0 -669 -408 -564 422 -793 -114 66 396 62 119 -290
4029 -290 -260 558 205 273 73 124 -660 -550 20 442 -502 -58 -70 -274 -162 67 562 437 258 19 -33 -697
4051 -697 186 -799 733 420 921 -876 282 -225 1455 570 569 -376 227 1395 228 104 -1542 45
4069 45 -413 -517 -294 311 542 -670 -518 -455 -157 -923 -182 -69 -250 938 75 -193 554 -136 434 422
4089 422 -758 -1128 -617 203 -739 -534 -568 559 -29 753 676 925 480 -541 704 565 -597 -757 415
4108 415 -259 -752 -210 868 11 -657 -80 -503 290 -532 58 702 -107 -613 1211 713 -182 -1117 417
4127 417 -76 -638 -528 358 -509 -884 -567 216 101 485 -97 754 538 -1343 589 48 1061 219 -318
4146 -318 565 -1250 -1396 580 1164 -818 -887 -739 367 274 -1079 145 -18 1 -514 394 1687 -1310
4164 -1310 -749 605 -841 -1375 -205 722 269 -1020 -1416 830 174 -678 332 1331 -766 -886 110
4181 110 803 -66 -598 190 1406 -1294 -563 746 1011 -1420 -1185 568 1200 -1062 507 1104 1451 -1117
4199 -1117 525 796 1269 -1566 -460 1470 -514 -352 -446 2024 -1302 -1248 -192 1622 -330 -2281 -148
4216 -148 2038 -1195 -1308 643 1005 -1313 -1712 1166 364 -1393 -542 850 1024 -1772 -496 1418 423
4233 423 -1715 146 1229 509 -1167 -258 764 -417 -386 134 2312 -936 -1740 -45 2661 -976 -2161
4250 -2161 340 2766 -1792 -2273 1702 1399 -1684 -242 2097 1015 -1979 -1103 1455 1783 -2672 -920
4266 -920 1587 -3 -1919 127 2061 -491 -1098 -353 2508 -198 -1931 -395 2604 -374 -1684 2079
4282 2079 2819 -1931 -1739 1411 1199 -1824 -1882 1201 1341 -2006 -1114 2174 -84 -1668 -350 2379 135
4299 135 -2873 -445 2852 480 -2433 1176 2287 -47 -1954 1251 2855 -936 -2593 1511 1165
4314 1165 -1006 -2142 1889 2071 -575 -1943 2382 2195 -2197 -998 1283 1616 -1933 -1186 2595 410
4330 410 -2868 -507 2788 -192 -1878 1151 3641 259 -3469 546 2188 -699 -3129 950 1821
4345 1821 -2036 -3330 2095 2874 -2114 -1478 1878 1738 -1894 -2277 2353 371 -2454 -683 2554 1132
4361 1132 -3183 -679 2195 18 -1587 -374 2714 -981 -3090 700 2206 -1206 -3356 1684 2719
4376 2719 -1542 -2237 2823 3616 -1825 -1574 2078 1904 -1169 -1237 2078 1303 -2573 -721 2703 965 -3256
4393 -3256 484 2136 -96 -3708 -134 2012 -735 -2360 -242 2148 -1661 -2624 1182 2337 -2074
4408 -2074 -1920 2525 2047 -2123 -1700 1662 1477 -2254 -875 2131 1433 -2110 -785 3493 128 -2394
4424 -2394 -810 2709 134 -3036 165 2218 -361 -3488 1287 3538 -870 -2284 1397 3032 -1150
4439 -1150 -2590 660 1157 -2568 -640 1352 1809 -2119 -1587 2429 1161 -2304 -122 2880 101 -2672
4455 -2672 -155 3472 329 -2946 1100 2535 -232 -1776 523 1832 -1481 -2496 800 2395 -907
4470 -907 -1491 1115 2437 -1850 -1647 1859 1406 -1964 -735 2852 346 -2972 -1114 3050 -76 -2259
4486 -2259 -1077 2164 -503 -1466 923 2452 58 -2029 1105 1849 -712 -2053 847 2777 -1816
4501 -1816 -1559 997 1905 -1380 -1309 2348 1305 -1558 -1098 2451 438 -2446 -1334 2779 1199 -2010
4517 -2010 69 1298 -178 -3254 -350 3143 -701 -2272 769 2459 -1199 -2560 1038 1852 -1428
4532 -1428 -798 1316 1537 -685 -1884 1390 795 -1697 -1701 1998 2313 -1281 -1289 1778 950 -2251 -191 1499
4550 1499 225 -2483 440 1664 304 -941 -110 2922 -716 -1907 253 2198 -456 -1548 1554
4565 1554 1877 -2038 -1422 1271 1394 -2234 -1409 2181 670 -985 19 2829 480 -2175 -215 1430
4581 1430 469 -2453 -735 2068 -1130 -1353 952 2094 -416 -1775 1350 2287 -1417 -1455 727 1026
4597 1026 -1059 -600 1156 2427 -1626 -1125 2081 -386 -1700 -59 1633 6 -1841 377 2055
4612 2055 626 -1542 804 1313 -541 -1127 117 1905 -129 -1198 1195 2193 -211 -1601 1014 1492
4628 1492 -1723 -1189 1935 1398 -957 131 1697 -53 -1183 -307 1168 515 -1233 1254 330 161
4644 161 -787 -176 941 -136 -1450 866 1496 -128 -1305 666 1408 -620 -901 969 321 -769 -847
4661 -847 908 504 -1602 -636 1475 887 -1211 -551 1121 806 -1009 -761 1403 220 -1686 -421 -10
4678 -10 368 -1902 251 1233 -186 -1441 720 336 147 -1106 294 982 -1475 -1140 474 405 -655
4695 -655 -817 519 307 -1250 123 704 -559 -855 -274 267 542 -1152 207 1012 -576 -417 -139 985
4713 985 -151 -1528 478 295 -941 -1076 170 553 -215 -423 1373 59 -1200 71 1581 248
4729 248 -1704 -39 1017 387 -481 -55 562 97 -835 165 1177 937 77 416 -387 -1222 -164 118
4747 118 568 -1038 -338 930 1095 -223 -608 275 -565 -923 -744 538 -138 -423 -1 -377 -551 -1141 443
4766 443 724 -422 -921 -453 377 -998 -530 -234 583 325 -130 807 1658 -391 -173 -185 136 -1334 -1326 -156
4786 -156 -248 56 -744 -31 -224 -475 -666 907 -112 -148 88 550 294 -478 -199 -285 -880 160 0 508
4806 508 -975 -1777 -271 453 -487 153 936 1684 -972 -853 -20 926 -702 370 66 89 -59 -869 12
4825 12 -227 -401 -12 1254 -423 -301 201 350 -243 -526 -523 323 -461 -838 -348 -377 376 142 246 616 364
4846 364 -381 360 394 382 -41 144 377 109 184 548 -123 121 -165 -785 568 445 212 453 -649 67
4866 67 863 -315 -458 -258 56 -244 193 564 -143 122 144 416 1205 -120 -481 759 -197 429 -1074
4885 -1074 -340 976 -401 -443 655 -153 509 -741 -14 164 477 959 1186 266 -689 457 229 -579
4903 -579 -794 -212 441 -400 -78 176 -178 81 517 205 178 -133 -140 -263 -416 802 -15 370 47 -273 12
4924 12 -325 87 428 574 -808 952 222 517 173 425 -351 7 -122 251 766 192 -167 -726 65 -593
4944 -593 200 138 -371 1 355 245 -442 -451 682 219 345 212 -134 -287 195 0 379 251 -369 24 -385
4965 -385 55 711 286 -133 410 263 -91 162 -923 -711 19 -167 227 563 -219 313 388 761 260 -108
4985 -108 -91 -536 106 343 -162 -324 35 -263 -42 -418 -1311 -123 -733 -455 -1118 -313 -47 113 791 -421
5005 -421 589 387 531 306 177 200 -458 -795 -10 84 137 -174 15 613 -459 -73 -494 -412 343 -1409
5025 -1409 43 120 95 -654 -157 -155 1129 -100 447 742 -145 364 -1126 137 -231 -879 -359 90 501
5044 501 -82 736 83 206 546 -618 -278 23 -640 -86 -656 -1051 905 -512 296 -351 -1307 -758 -647
5063 -647 267 -739 -21 120 -443 -65 1202 -279 -250 -418 -276 -332 -695 -48 884 77 -359 447 256 -894
5083 -894 321 1085 715 -112 407 465 540 561 35 -49 -1000 592 376 137 -937 620 -622 88 -60 364
5103 364 469 -573 -149 -285 -846 436 930 66 325 -225 -223 -77 -183 806 -13 -245 53 99 -719 749
5123 749 428 -365 483 372 -920 1423 32 -406 -142 193 -956 120 832 -596 -160 309 673 -193
5141 -193 -618 -76 83 257 358 289 118 144 510 -3 231 -1045 -403 713 141 572 99 9 34 146 1415
5162 1415 -396 -429 264 687 475 -390 -89 -782 -719 -336 298 284 -632 -161 464 -568 -82 481 446 -460
5182 -460 -124 -150 -1048 -282 -165 -492 565 300 154 276 945 -140 311 -460 255 835 -276 479 -55
5201 -55 -120 271 781 131 -206 -897 -232 315 -74 -506 256 320 -857 389 6 -65 -1134 237 404 -553
5221 -553 -546 -812 -498 108 461 -280 387 -216 -495 -25 358 -286 -460 -197 16 0 197 -227 -454 -896 209
5242 209 -399 -33 580 742 362 47 -493 362 -122 176 -33 59 -109 23 -555 49 -108 -178 -291 -187 345
5263 345 677 308 -423 460 -486 0 765 418 -449 -51 -90 -3 162 -71 -637 208 -173 214 -556 175 -135
5284 -135 172 221 -826 -335 523 138 -948 -308 -164 68 154 787 -162 460 -602 -20 448 -851 122
5303 122 -47 -357 170 54 328 -125 563 -757 529 -46 -367 -1078 -1046 803 -334 -376 69 721 -253
5322 -253 114 -312 -716 -351 -176 7 69 738 615 -321 157 950 232 342 -535 -1347 -926 394 -71 274
5342 274 -28 -358 357 22 127 712 607 1077 193 -666 -91 501 178 64 303 -1624 -601 -358 452
5361 452 -122 -295 143 -183 207 189 -500 -183 206 -205 -282 427 907 -264 -46 168 -456 732 -226 -637
5381 -637 -362 -292 -305 -841 61 -804 993 142 -394 313 -167 -632 -346 648 184 182 -185 -1345 -386 -336 -348
5402 -348 310 104 253 235 31 -358 121 26 -475 -364 -64 -1020 -372 140 344 279 888 551 -336 800 -303
5423 -303 -405 651 -1144 -263 402 140 -144 827 -156 -8 -240 93 341 -287 358 -604 168 -184 460
5442 460 -525 -319 175 -576 -847 330 566 -395 228 494 -131 536 394 885 626 323 -4 -94 245 704
5462 704 -135 -203 241 -392 -546 -660 -183 -411 200 -187 -68 328 381 423 664 -990 538 322 -456 177
5482 177 -144 201 -234 368 -85 -311 -150 -51 -649 81 -50 -203 -417 -24 404 242 -195 -381 145 -438
5502 -438 -350 -510 161 433 -215 4 51 129 -386 -432 -342 -41 -157 -1167 -240 -510 -329 -674 -207 328 175
5523 175 -140 -957 31 340 -382 -1251 353 36 128 472 -60 -107 -1129 -6 -107 -210 -119 121 274 274 -157
5544 -157 -199 93 353 12 329 -501 -1003 -201 1075 -92 -421 493 109 776 -504 -350 220 -372 -667
5563 -667 -17 -29 663 -530 182 -32 74 -675 24 -144 -619 509 -14 505 -102 -651 518 330 -82
5582 -82 -149 738 -8 -183 -419 -340 -46 -464 -416 1612 -611 -213 7 1359 261 -656 486 803 -554
5601 -554 -1070 775 86 -890 -258 669 938 364 -61 186 1103 -1095 -843 280 1172 8 -959 -65 -62
5620 -62 -54 -341 633 398 -2 130 -46 259 117 576 1134 -416 -383 -1111 258 -381 -577 731 -197 -979
5640 -979 -687 639 345 -191 -95 649 -165 -452 -85 398 -257 -454 -850 1217 697 -452 -171 709 -900
5659 -900 -389 -269 -175 -417 -560 694 197 -175 -476 611 244 -435 -353 368 1081 647 -108 1708 576
5678 576 -393 -428 1668 1319 -131 -268 1205 290 -186 33 595 749 -745 276 340 -136 -681 -176 1324
5697 1324 -974 -804 217 903 384 -126 585 1098 -1479 -293 657 565 -996 -870 246 -449 -263 -293
5715 -293 369 -385 -1310 269 1013 58 262 305 759 -796 -1301 92 160 -583 -115 -474 728 -762 -120
5734 -120 708 483 -757 -181 -751 543 -579 -409 1896 830 -1046 -634 767 1197 -430 -62 1129
5751 1129 -656 -1189 -217 1834 -33 -586 -653 1119 -715 -1216 80 364 -1266 85 200 286 -694 -520
5769 -520 1353 1488 -1363 -1056 794 481 -532 -298 1213 845 -122 -22 367 204 -357 -53 1345 612
5787 612 -1312 -63 1335 -892 -1017 -186 -118 -597 -451 754 461 -1357 -1588 677 323 -1111 -1254 501
5805 501 688 -1346 -236 1393 277 -452 -783 2100 745 -1681 85 2236 -1086 -1409 1802 659
5821 659 -934 -35 616 1623 -170 -527 740 1822 -139 -228 1497 936 -558 -983 753 562 -1613
5838 -1613 -914 1200 299 -777 -63 758 677 -1424 -115 2235 -473 -870 206 1496 -672 -956 522
5855 522 1612 -689 -732 952 654 -1075 -775 1072 1492 -627 -923 907 1059 -1586 -1134 1171 92
5872 92 -1510 102 1385 376 -1720 219 2127 -818 -1447 139 1099 -643 -822 1647 1112 -1095
5888 -1095 -991 762 1160 -1300 -1537 592 75 -1043 -53 647 178 -688 -932 2176 1359 -947 200
5905 200 1156 -317 -2232 -52 1504 -562 -1803 814 1036 -586 -1830 533 1324 -596 -842 1666
5921 1666 448 -1708 -518 1873 628 -2061 -495 1466 731 -574 -695 1405 711 -1478 77 1615
5937 1615 -116 -1888 1030 1464 160 -1087 94 1568 -228 -941 1202 1780 -1424 -1664 1485 1590
5953 1590 -1122 -763 916 1259 -1554 -793 882 27 -1540 -408 960 930 -1865 265 406 420 -2161
5970 -2161 638 859 106 -561 26 1730 -878 -683 1087 296 -938 -862 1290 388 -1016 392 565
5987 565 -40 -352 -435 458 55 -425 -108 2093 516 -1045 593 945 319 -820 30 1558 -195 -1416
6005 -1416 241 2215 109 -1418 354 250 -1349 -1468 1098 747 -623 -924 424 351 -272 -583 711
6022 711 -195 -1025 -1120 888 377 -923 -4 790 -7 -1001 -831 -540 -123 -1077 27 1513 -34 -1660
6040 -1660 730 1225 -610 -177 441 331 361 -463 397 958 -1474 -238 1134 580 -1530 -690 768 766
6058 766 -1883 -151 1503 716 -880 749 567 -309 -874 628 469 -847 -628 1294 258 -1189 -967
6075 -967 261 815 -290 -538 939 704 -1094 -221 977 156 -477 -273 367 626 -952 392 1052 -147
6093 -147 -1240 -200 968 -178 -227 1163 1643 -545 65 715 53 -162 -115 1139 937 -827 -517 2
6111 2 604 -463 -1267 1060 158 -1017 -191 700 136 -887 -213 224 135 -629 -712 655 -681 -1020 586
6130 586 1007 -255 142 466 97 -1059 -899 708 2134 -758 -1048 850 122 -169 159 1788 482
6147 482 -759 129 694 469 -1025 450 832 -367 -558 -349 749 -902 136 468 7 -1141 -1017
6164 -1017 113 1110 -223 -1133 381 137 -124 -597 1232 -425 -423 456 397 -1027 215 456 163 949
6182 949 -283 -38 848 -655 -920 -83 -470 171 -193 51 400 -251 -525 604 845 -278 -380 845
6200 845 489 -21 -291 377 -90 246 -101 872 34 -262 -338 398 395 -443 352 37 517 -666 24 -46 348
6221 348 -601 974 21 114 -119 234 -199 -550 96 -264 -531 -460 -477 -211 -101 -1 -384 -68 -151 -863 -195
6242 -195 844 425 -462 363 789 252 271 -177 -495 140 54 269 657 323 488 -930 78 -903 556
6261 556 429 967 -313 2 85 593 -10 -645 -264 -608 678 229 865 89 -658 -854 -97 470 528 -36
6281 -36 -428 474 306 312 513 125 489 -384 -114 -254 57 -41 884 -77 -644 445 -123 106 -767 -474 516
6302 516 -376 -409 394 1238 -334 -515 633 -202 -396 261 968 791 -854 -593 634 -77 -95 807 -43
6321 -43 80 -271 536 236 -820 -295 -773 -672 73 -229 -623 382 1025 -362 262 -248 310 -562 592
6340 592 645 446 386 575 1002 -102 1219 437 -120 -1023 755 118 93 68 -388 -402 786 971 471 -568
6360 -568 -399 -138 -773 569 270 227 1177 152 -395 186 -197 1261 839 -209 -596 121 -88 -339 126
6379 126 445 1182 -91 576 -595 149 971 -145 -16 514 -8 269 147 464 -693 390 -380 -245
6397 -245 26 305 1183 -513 -561 -471 451 -375 141 387 212 -401 629 -25 400 236 195 -184 1027 -406
6417 -406 -1 -599 -843 -737 -393 -607 -42 378 1152 955 454 49 493 487 302 781 -321 196 230 -448 -170
6438 -170 151 275 -44 -38 226 133 -168 553 209 -416 -113 -599 -359 -132 796 73 266 630 -132 -937 100
6459 100 -1223 683 607 -845 805 480 -150 150 -776 953 551 -223 -285 94 854 -422 113 -497 -214
6478 -214 -1071 -32 -519 -216 -131 -162 -852 -511 -467 -666 -487 670 476 596 -4 -78 322 -209 339 759 -224
6499 -224 -542 208 280 322 343 1260 430 -46 -1147 -134 -349 -219 169 -650 -184 -115 328 -581 -219 -117 498
6520 498 -153 -10 -18 374 -409 -257 -75 -122 768 371 286 -342 1156 274 655 337 102 740 163 6 609
6541 609 -256 659 -86 -622 -100 130 -282 399 -330 315 481 -99 454 107 124 346 707 -654 281 85
6561 85 673 -517 -404 -126 -153 -412 381 596 -1517 -324 -86 -20 -18 -589 238 446 -422 -503 405 365 -669
6582 -669 -48 307 55 274 -191 -64 126 416 -287 -150 -790 -385 114 -931 -350 -118 161 339 70 817
6602 817 70 -1234 -38 157 442 -595 -93 -253 709 298 47 -530 -87 805 -248 63 -109 258 116
6621 116 146 -181 110 -274 -536 111 -233 155 -93 207 -531 112 444 164 -609 -457 732 309 254 -236
6641 -236 305 573 -1274 -507 -122 801 -146 -674 274 177 -107 354 464 -16 -234 467 -548 322 279 684
6661 684 229 1306 -741 -410 -323 -70 -263 562 -582 -293 3 -491 452 498 -211 -376 -132 -680 -994 451
6681 451 -214 111 335 -392 38 -33 529 466 79 -1143 -641 380 -293 -302 54 -378 -235 314 1286 -402
6701 -402 -95 -616 -155 287 390 -406 -841 -685 350 -536 912 145 -976 -789 29 654 309 -129 262
6720 262 -270 247 277 -434 334 -272 390 -440 136 -525 -334 -1009 -660 236 239 -16 -1007 -285 -44 -350 81
6741 81 -308 -334 -333 -181 -183 -929 -32 -38 -377 312 777 132 194 394 -667 -145 464 -60 -259 -1050 38 135 -296
6764 -296 -167 1168 -357 -125 526 336 418 -897 -422 579 -255 -518 -244 -524 -134 918 -186 -648
6782 -648 -451 -700 -756 636 219 -59 673 421 -705 -15 177 -119 991 -1255 -26 1207 -697 102
6800 102 243 -98 287 616 203 -316 58 -539 830 583 337 -648 -51 -478 889 642 -354 -133 -507
6819 -507 675 -2 522 463 -529 172 30 685 321 337 -189 -1214 189 276 84 -440 -524 -260 -567 -1411
6839 -1411 -328 262 -70 -290 352 -190 -495 -216 364 -238 -737 -1098 387 -383 -387 342 -650 -437 87 151
6859 151 -137 790 -332 102 -1486 0 98 830 -140 -293 -570 -573 291 -608 -338 -386 419 339 42 30 -79
6880 -79 -260 -153 -406 443 -58 326 558 -242 -77 -567 -16 79 75 -198 -292 238 76 445 -343 121 -514 -588
6902 -588 -475 -13 53 739 -478 -459 279 -358 150 283 -817 -762 -48 -259 -442 -93 117 67 105 -236 613
6923 613 -165 21 -588 324 414 675 -597 346 -358 -570 -517 -600 -870 -41 -553 -1521 -731 320 625 465
6943 465 -254 571 45 -144 129 -331 316 374 785 -128 305 -385 -906 107 46 -266 206 470 -482 363
6963 363 1382 -206 -928 867 236 -224 -310 -697 -110 -456 -592 356 72 773 211 -2 -503 530 67
6982 67 -74 772 -310 -134 -457 -274 553 147 -157 -262 -452 514 265 -784 215 -882 -406 -201 -447
7001 -447 520 -157 -310 -326 -487 668 164 -704 168 405 268 -697 1003 154 -617 318 255 832 -606 787
7021 787 -291 92 -68 -42 -292 248 -550 -217 134 -1 306 -75 -741 -612 213 -66 -52 -369 318 -22
7041 -22 378 -1010 374 192 -642 1127 -43 -646 -525 735 457 -95 753 -51 -52 24 715 -462 686
7060 686 -471 -900 131 883 557 -1039 276 37 154 -581 168 -845 981 -121 -521 -701 -82 664
7078 664 -235 406 185 -17 -368 344 510 -53 -526 371 362 -110 -715 1390 541 336 1237 795 -395 77
7098 77 145 1373 -631 -37 -212 269 -242 224 634 184 -286 564 583 116 -282 554 401 40 361 176
7118 176 314 -144 391 -324 513 -47 804 337 531 -1063 444 1307 696 358 -19 -84 637 -284 -206 578
7138 578 -851 -868 -1460 1545 635 -1112 -796 310 -94 -947 68 591 -192 -234 -661 752 804 1016 589
7157 589 880 719 -529 1046 125 247 -456 496 520 -121 -116 1344 905 182 88 278 55 -581 -222 328
7177 328 717 -731 236 330 59 -239 -13 1158 -8 452 -400 749 -1040 -594 1246 51 412 -924
7195 -924 342 216 366 55 38 -120 -786 136 520 458 -774 -405 686 -80 -1401 -464 118 62 -1025
7214 -1025 216 113 785 -329 -254 1107 -1216 -461 287 190 390 -966 238 1575 -245 -92 364 653
7232 653 -709 -1256 345 201 -553 995 670 -760 -397 -708 311 52 -1287 151 1034 483 -585
7249 -585 751 1198 -388 -828 -546 1186 -332 -606 407 616 -437 -652 282 455 -324 -497 634 391
7267 391 -1500 -1046 1558 183 -1779 -343 58 248 -766 510 52 -218 -1122 -470 1122 -1070 -1334
7284 -1334 174 799 -217 -804 1005 -56 -748 -348 653 513 -1239 -19 294 77 -1474 -1671 55
7301 55 984 -280 420 1711 810 -909 573 1932 -1073 -262 -236 505 159 -816 15 265 281 -1246 219
7320 219 723 -1321 -1426 1296 905 -693 -1265 593 685 -451 -836 1202 -124 -1564 -244 624 754
7337 754 -1452 565 390 125 -2042 -12 796 902 -808 -455 157 -771 -591 951 36 -960 -613 774
7355 774 187 -1958 -872 1575 618 -47 877 1251 651 -588 -112 1510 -129 -1706 287 403 -971
7372 -971 -1023 342 734 -515 -893 813 620 -674 -1086 1266 445 -720 -876 858 487 -1095 -227 1258
7390 1258 -69 -2028 -238 570 -403 -545 173 -478 -196 -1492 -839 784 -636 -1172 1345 514 -669
7407 -669 -243 -790 854 -677 -1266 194 817 -702 -384 -267 330 -983 879 1374 696 -953 451
7424 451 680 691 -112 -592 1146 181 -1255 76 -159 -671 -1364 -79 1081 -241 -1780 243 70 -950
7442 -950 -248 311 570 -1092 -735 64 252 -728 400 773 -282 -686 282 1330 1041 -627 -592 1132
7460 1132 627 -2178 355 1068 -324 -1361 83 1548 91 -757 311 1247 -941 -420 386 687 -972
7477 -972 -224 563 1166 -803 -675 798 161 -88 -1242 604 775 -766 -679 770 -188 -1081 -690 1754
7495 1754 -569 -181 301 546 -729 -1184 815 638 -123 -534 226 523 -1212 -913 275 533 -1208 -387
7513 -387 480 544 -668 431 1512 -303 -534 -297 1138 -346 -847 -238 813 266 -356 224 768 -482
7531 -482 -666 1043 1186 320 -235 223 809 -843 -950 1073 -2 -881 -918 -257 -92 -1167 -1489 232
7549 232 -438 -509 -514 115 -617 -1311 570 376 -149 -1059 336 31 301 -551 629 596 -405 -696 576 634
7569 634 -521 798 -444 732 -524 -100 65 390 204 -107 150 41 92 -181 666 623 -1304 -748 517
7588 517 -533 -563 179 779 830 -43 -735 858 141 -704 219 -325 -138 -367 773 600 -151 -403 506 251
7608 251 -286 175 692 338 915 -330 -148 85 122 141 606 66 -965 177 170 1084 -382 1165 -691
7627 -691 -558 -335 -211 1579 50 17 83 544 -458 26 629 785 -159 -1219 323 762 -428 337 815
7646 815 -400 -452 -1073 -572 -116 101 51 752 271 -871 426 118 -162 -188 115 327 -131 -897 94 -1
7666 -1 -692 -34 -117 316 -1162 -3 -111 875 -252 -282 816 505 -914 -1098 -592 -325 228 617 -125 276
7686 276 155 -135 277 -303 -419 357 -147 -337 -211 286 690 -1175 -827 402 730 14 362 923 110
7705 110 -134 -293 260 -399 -95 -238 561 -207 844 547 55 633 -547 -571 -158 605 -375 822 -141
7724 -141 -653 135 -646 -209 85 -548 679 598 499 -118 -567 927 -485 434 1053 357 284 -395 7 544
7744 544 -292 118 -812 -277 -304 222 824 -217 -132 -856 -158 495 92 242 479 926 -562 703 -656
7763 -656 -177 264 -348 676 -595 -170 743 -226 322 -269 573 -150 494 484 50 317 -563 136 -28 710
7783 710 -697 -113 -459 31 -1088 692 -67 18 -220 450 -27 1213 326 270 -887 522 158 -312 -97
7802 -97 -260 -298 -423 -89 748 1044 -118 4 1175 -1022 344 56 246 169 -71 96 280 -20 427 -1005
7822 -1005 213 -197 362 -837 -138 725 715 389 490 676 -386 -110 -1345 -207 -268 1336 -322 -330 -460
7841 -460 183 -117 -401 -441 -437 631 -50 272 -66 810 320 557 -509 -100 1010 -625 -253 296 -870
7860 -870 -6 -398 1070 129 -167 -508 93 363 83 -381 -238 119 206 279 -741 105 398 -18 -914 550
7880 550 233 214 21 63 -26 -720 -190 -744 472 763 -244 -501 1251 323 -489 272 -543 -190 112 -564
7900 -564 519 -990 358 453 622 -386 332 129 257 547 100 -88 -444 257 188 -463 559 74 -605
7919 -605 490 830 535 -686 -979 -234 149 560 -92 312 150 586 -200 131 -520 120 33 221 -299 -92
7939 -92 498 490 -365 198 -278 199 -124 315 806 -301 -197 -386 14 455 221 613 -222 -879 -380 -585 696
7960 696 -189 -658 501 -307 136 -409 122 602 -556 -96 236 158 -526 125 563 153 79 812 -87 560
7980 560 -106 -281 238 86 -231 331 -408 779 985 617 526 -468 -175 -168 583 552 -136 -256 -602 -291 1236
8001 1236 -482 -868 39 -77 332 1215 -75 29 -600 309 -211 -430 -116 45 1169 -105 586 440
8019 440 47 586 -409 590 -198 95 12 -448 -97 369 -629 -230 -114 -99 388 -396 -691 140 1471 59
8039 59 -816 -487 -599 143 316 564 -425 108 361 37 -24 -823 -258 -447 -366 136 151 508 -334 -671 563
8060 563 -97 336 -767 -1050 -427 20 915 -1144 -1079 515 -76 199 166 61 -509 -710 -69 -961 -1258 -989
8080 -989 -50 -854 -523 -339 370 784 -700 656 -66 609 -106 869 -592 -507 -441 396 -379 749 -559
8099 -559 -806 -94 591 634 509 -7 -1397 299 524 -997 -341 204 -76 -727 -117 217 168 108 64 -250
8119 -250 -346 716 -380 -201 -372 194 40 -469 291 -128 -472 -395 897 45 -115 -439 -128 -151 50 -1257
8139 -1257 -315 -296 -565 -526 -618 -1017 483 378 -866 1336 212 359 64 -223 144 -362 -215 600 -244
8158 -244 118 -488 449 305 925 -283 -354 -668 -477 87 -4 360 176 -1006 513 143 -742 179 247 -71
8178 -71 -461 -698 -111 -510 -275 -1336 -372 352 -661 -375 1004 -338 -202
8191b02
$$ Imaginary data points
##PAGE= N=2
##DATA TABLE= (X++(I..I)), XYDATA
0 0 0 0 0 0 0 0 0 0 0 0 0 0 0 0 0 0 0 0 0 -5 102 -108 108 -108 108 -108 125 -213 216 -218 251 -324 330 -393 437
35 437 -493 549 -621 681 -763 851 -940 1047 -1158 1275 -1413 1550 -1717 1885 -2075 2289
51 2289 -2526 2788 -3075 3395 -3774 4190 -4685 5261 -5951 6792 -7832 9169 -10960 13476
65 13476 -17296 23653 -36293 70598 -350898 -903628 393524 844988 -141114 -451214 433082
76 433082 551266 -239114 -435852 178565 303167 -247662 -419203 113522 264367 -251162
86 -251162 -336298 252751 285088 -257374 -147709 389154 145499 -325000 27217 417652
96 417652 -11802 -292689 158909 315256 -178444 -294175 132138 171010 -236970 -238303 188251
107 188251 240042 -154292 -185060 257150 285768 -219291 -223937 326873 271775 -295973 -139061
118 -139061 408814 131226 -403877 -81904 345362 -35452 -383544 805 281703 -57614
128 -57614 -263089 76860 296996 8101 -183795 126990 318152 -48733 -264567 101685
138 101685 234704 -217703 -309979 165000 190998 -258096 -167674 284582 144105 -251632
148 -251632 -57661 296494 81568 -231308 -20290 247306 21920 -252643 -44235 214290
158 214290 -12309 -264707 9021 275662 -26319 -262478 84344 274400 -115812 -257164
168 -257164 141107 215267 -173037 -179514 192523 155348 -181911 -112732 200169 119223 -174907
179 -174907 -92437 184211 78509 -216216 -102397 187562 43717 -227221 -17440 261585
189 261585 26714 -215910 50690 240277 -61446 -219574 75843 186860 -100994 -172539
199 -172539 106219 154240 -113483 -146704 118656 142438 -119661 -127324 141699 126620 -153368
210 -153368 -112243 165712 84921 -182381 -51717 203228 41138 -185353 -1801 184169
220 184169 -16830 -175997 28058 161052 -38086 -155190 36070 133836 -70428 -162215
230 -162215 63436 156485 -69145 -127463 125112 157840 -103237 -108433 131859 81657 -160898
241 -160898 -91557 119183 25885 -159914 -48583 128928 30669 -114721 1261 150156
251 150156 34469 -111805 7630 132451 -24476 -151987 14828 122154 -61753 -142319
261 -142319 56744 110931 -84764 -104290 88686 87569 -87421 -58534 108811 69650 -88311
272 -88311 -44982 101422 47207 -104988 -52653 91587 23335 -121667 -32602 110215 2760
283 2760 -124097 11338 128137 -17735 -108043 45376 111830 -42454 -86872 56189 79880
294 79880 -56581 -72576 52335 58965 -68801 -74584 52576 53956 -74939 -60785 76890
305 76890 56956 -70528 -20644 104326 32580 -85255 -3873 89314 -12320 -97469 81
316 81 68010 -27640 -76289 20170 66718 -22651 -58135 35970 69875 -27737 -58142 45887
328 45887 66279 -44885 -58396 49455 45721 -64268 -44578 58948 22768 -72694 -23753
339 -23753 64491 13479 -59072 530 69584 13150 -46936 5108 51745 -10421 -61124 73
351 73 44096 -18450 -53274 21778 58423 -15065 -43505 29890 40801 -32085 -34301 34054 24590
364 24590 -40452 -24066 36065 15378 -40635 -14545 39727 11875 -34919 -5211 36455 -29
376 -29 -36208 5075 40402 -1199 -32808 11302 35276 -19263 -46376 917 21536 -22021 -25358
389 -25358 31991 40052 -10666 -13043 32030 18388 -32030 -22887 20047 8810 -26123 -9971 20767
402 20767 3527 -22782 -2256 23238 3121 -21483 -1450 21608 -1539 -23533 2900 25460
414 25460 3567 -6508 22736 26550 -14845 -26075 -1973 -7577 -37166 -22625 12876 13141 -3483
427 -3483 10796 29324 14621 -4344 4468 18173 4297 -16912 -10032 7430 -6614 -32435 -15501
440 -15501 12464 -1834 -16404 10847 25305 -2515 -8897 14981 16826 -1911 746 12738 8568
453 8568 -2141 -9256 -14013 -14907 -18426 -18041 -3361 8181 2572 6312 21490 13985 -5026 3804
467 3804 12674 -2202 -8225 7327 4433 -14265 -11699 1452 -1269 -7654 -4234 2759 5707 2385
481 2385 -4038 -4481 2572 1643 -3297 7000 15116 8015 1965 6697 2295 -10885 -11717 -6684 -10314
496 -10314 -6142 2620 -3112 -10009 487 6316 -505 3159 15060 15285 11188 11739 5815 -4326 -10169
511 -10169 -15493 -18585 -10688 -7138 -11037 -1430 14058 10898 1979 8870 10442 1653 3853 6737 -5384
526 -5384 -10305 -6953 -8195 -10900 1162 7238 4909 7170 10309 261 -8380 -11812 -12672 -6291 4527
541 4527 2114 2201 15338 15985 -85 -3637 3701 -3992 -13687 -4100 5419 1988 -1115 796 368 2485
557 2485 -1074 -8198 -1451 8057 562 -8608 -1616 3851 63 4557 16145 13798 3079 -1099 -7879
572 -7879 -15201 -13736 -11953 -13429 -2759 10765 11490 6746 7878 8231 272 -3709 -6057 -7235 -986
587 -986 3852 -524 1520 10596 4579 -8137 -1183 10009 -1173 -11651 -7700 -5383 -9547 -8341
601 -8341 -3390 5769 17772 17929 7551 10236 11015 -6511 -15214 -1065 -440 -14944 -12002 -1320
615 -1320 -6270 -6353 -708 -2780 -2766 8451 11496 7084 12794 13073 5031 1602 -309 -8748 -9742 -4079
631 -4079 -9160 -12443 -2190 -3369 -13522 -4041 13426 8787 99 9787 15901 4955 -1710 2955
645 2955 3324 -3852 -7402 -2594 389 -4243 -11552 -10210 502 -961 -10861 -2059 13970 9506 -131
660 -131 12751 15859 -1846 -6831 6225 4498 -10513 -7226 624 -3030 -9930 -6367 -2801 -2883 -3665
675 -3665 -1960 7206 11047 -43 2489 17299 12887 -7038 -866 11190 -4479 -18759 -4629
688 -4629 -178 -17643 -18513 873 8262 -994 1055 13504 17346 5856 -1663 5344 8162 -5774
702 -5774 -11454 2054 4235 -12984 -14858 4999 5505 -13127 -6936 11799 5499 -6965 4553 16059
716 16059 2888 -7303 5870 11567 -2204 -11809 -2902 5004 -6873 -14713 -4490 6653 -2387
729 -2387 -8176 7273 15935 -1480 -7827 11020 12364 -8091 -8361 9168 4206 -11902 -4111 8290
743 8290 -811 -11471 -1073 9014 319 -8404 -131 11075 4440 -6043 3442 11259 -977 -12295
757 -12295 2296 10059 -8798 -15187 4328 9729 -9707 -10407 9116 8647 -5710 -1024 12269 5991
771 5991 -8435 -3856 7732 955 -12397 -6692 8095 2140 -8976 -874 10187 1504 -9260
784 -9260 3592 13879 -779 -11327 6545 13821 -5195 -13661 2465 5945 -10124 -9616 7449
797 7449 5556 -9847 -4252 11839 8284 -6225 -1669 12496 6909 -7391 -5232 6431 -954 -16172
811 -16172 -5523 10069 -2150 -13892 3882 15995 362 -10652 4904 11838 -2993 -6962
823 -6962 7701 9686 -6433 -10263 4110 5132 -9615 -10106 4158 6891 -5969 -5123 9454 6831
837 6831 -6026 -1675 11464 5476 -9735 -1616 10293 -687 -14733 -3439 6884 -3364 -8320
850 -8320 5679 10612 -2198 -7607 2822 5693 -4876 -7528 4052 9481 1142 -1882 6696 5983
864 5983 -7224 -9034 1725 -441 -12411 -6427 7943 3671 -5620 1884 10964 2768 -2273 5050
878 5050 7730 -3577 -10130 -2748 342 -4588 -8399 2612 9074 3778 -2328 2399 4641 -4962 -8358
893 -8358 2116 5167 -3138 -1049 9788 5355 -5282 -4094 -70 -5211 -7606 74 3576 -1555
907 -1555 -1060 4929 5671 2049 423 4260 4567 -1734 -8568 -4012 -1386 -8279 -9030 5430 9318 209
923 209 323 12530 5783 -8148 -6031 1422 -3357 -5109 1683 5104 1895 -413 -626 -220 1636 -1964
939 -1964 -3305 3149 5213 -2243 -4277 2417 1205 -3333 5160 8858 -762 -1901 2912 -3170 -10176
954 -10176 -4108 -591 -4505 653 6990 4598 2701 2877 1826 584 1711 -1895 -5299 2747 2406
969 2406 -7324 -6767 1526 -3276 -6397 2639 8255 1521 712 4328 1230 102 172 -2118 -2208 4285 3318
986 3318 -5144 -2475 1886 -4414 -7801 -1421 1713 -2461 998 5201 2994 2570 5033 -722 -569 6655
1002 6655 3074 -5886 -3178 2084 -7354 -10616 -3128 -3063 -2769 5967 8051 2336 6271 7810 -681 -2326
1018 -2326 3806 -1855 -8108 -1599 2065 -3344 -1582 48 -3600 -884 4514 -1525 -4582 5212 4527
1033 4527 -3470 13 7949 2143 -821 6077 4303 -816 -3385 -6481 -9729 -5609 -3260 -5404 278
1048 278 8480 6751 3907 6496 6267 -1617 -2284 1634 -2479 -5750 -1375 720 -2579 1009 1357 -3404
1064 -3404 -1717 2842 384 -2902 1499 1298 -1322 1654 5328 2420 3889 7273 -113 -5701 -2764
1079 -2764 -6846 -13114 -6238 2148 1255 -326 5256 5363 3313 4201 2473 -820 1268 1241 -5640 -2502
1095 -2502 2009 -3315 -6716 441 3025 -2509 -2607 3806 2067 963 1624 395 -778 2425 2995 539
1111 539 1709 1045 -4679 -3082 -406 -2394 -2305 2520 1398 -1668 2669 3406 -3622 -2652 4457 2250
1127 2250 -3630 -1433 3410 2198 -2467 -757 2123 1048 -3933 -3260 2132 3617 -2340 -2737 3631
1142 3631 4339 -4091 -2590 5243 4037 -4992 -401 4574 -3655 -7192 383 4923 -1555 -4186 2348
1157 2348 3794 -1403 -2311 2211 4264 -1981 -4924 3622 6570 -5477 -7806 5117 5343 -9275 -5223
1172 -5223 8437 4132 -6700 83 10505 2045 -7588 247 7960 164 -11154 -4345 6833 -1253
1186 -1253 -9947 748 11834 -160 -8814 5092 13083 -3831 -9725 6351 8945 -7943 -11395
1199 -11395 5486 6246 -9337 -7965 8481 6283 -9540 -4787 11757 6923 -8772 -3052 13031
1212 13031 4896 -11408 -2117 12723 -1198 -14929 -31 12146 -4477 -15341 4124 14575
1224 14575 -5354 -13454 7299 13893 -6445 -10234 10783 11802 -9879 -11579 10722 9356 -15654
1237 -15654 -12141 12852 6635 -16190 -6035 16172 4296 -16646 1296 20668 1776 -15172
1249 -15172 4202 19401 -2868 -18040 3049 14605 -9546 -19773 6040 15835 -10432 -16005
1261 -16005 13631 17576 -11773 -12089 18102 15645 -13669 -10308 17713 6674 -22604 -9183 17849
1274 17849 2312 -22983 -3042 23277 2826 -22536 3258 23622 -2061 -20669 7838 23729
1286 23729 -8080 -22834 10416 20844 -14771 -22497 13299 19185 -17244 -17186 19622 15816 -21719
1299 -21719 -12574 25055 12697 -23047 -7759 26318 7595 -26698 -7115 23648 -422 -27823
1311 -27823 -404 26975 -5058 -29399 5824 29431 -8445 -26019 13673 27702 -13198 -23928
1323 -23928 16583 20677 -22283 -23664 19158 18224 -25470 -16899 27555 16606 -25892 -11724 28844
1336 28844 11074 -27994 -5412 32056 2382 -34010 -1648 32856 -4543 -33230 5668 30628
1348 30628 -9714 -29841 12025 29052 -15979 -25422 20477 28221 -19581 -23090 24004 21661 -28983
1361 -28983 -23286 24487 14092 -31035 -13070 34619 12862 -31752 -3684 37450 4420 -35311
1373 -35311 -1123 34004 -4247 -35745 6080 32855 -12265 -34885 13805 32410 -16516 -32512
1385 -32512 20831 30138 -22159 -27227 26524 27343 -26871 -18841 33835 18720 -35637 -17562 30805
1398 30805 4884 -40713 -8797 36790 4826 -32961 4868 40889 -1522 -35645 10227 37571
1410 37571 -13883 -39907 13734 34391 -21870 -37672 21749 33208 -25777 -27669 31361 28210
1422 28210 -30737 -23939 32008 20211 -33970 -16476 38529 16025 -36120 -10328 35690 3019
1434 3019 -43453 -5784 37147 -3379 -40626 7660 40322 -10794 -35273 19697 38521 -20164
1446 -20164 -31224 26555 30998 -30663 -31595 26687 22234 -36600 -25459 33690 20788 -36771 -17519
1459 -17519 40120 14743 -40263 -6916 46416 8797 -41864 -1237 43815 -3696 -44588 3152
1471 3152 37429 -12817 -41561 11655 36504 -17335 -33871 21650 35913 -20083 -27268 29011
1483 29011 30619 -29180 -25576 31564 16812 -40275 -19045 37243 10415 -41029 -6339 42443
1495 42443 4015 -39354 2288 43499 -4322 -40479 6836 39595 -12032 -41803 15203 40896
1507 40896 -18843 -37980 22528 37403 -26386 -34747 27572 27616 -33617 -24677 36563 22952 -32940
1520 -32940 -15653 37517 14133 -36988 -10553 34828 3591 -40685 -2957 38020 -3214 -38776
1532 -38776 8785 40863 -9546 -37516 16031 37820 -20883 -35448 23103 31570 -26700 -29073
1544 -29073 30329 27964 -31921 -23998 33726 20501 -36281 -19516 36267 15185 -37327 -9963
1556 -9963 40039 7365 -40506 -3451 39502 -2772 -40695 7003 39232 -10662 -35264 15691
1568 15691 35742 -17128 -31838 19846 27391 -25857 -30269 25052 24718 -27729 -22484 31939 23275
1581 23275 -30691 -15309 36792 12886 -38061 -11576 36348 4359 -39731 -1608 37256 -1930
1593 -1930 -35220 6027 34931 -7884 -33782 13446 33848 -15043 -31611 17516 30984 -21050
1605 -21050 -27809 23164 23195 -27314 -21929 27350 17208 -31383 -15451 31649 12043 -32554 -6652
1618 -6652 33875 6206 -31305 -52 33136 -2024 -31996 5226 32561 -9584 -32555 8727
1630 8727 28318 -14577 -30374 15780 26862 -18178 -23140 25277 25036 -22699 -17274 26266 16322
1643 16322 -28650 -15860 24335 8663 -28972 -9120 27756 4620 -29074 -637 31768 -910
1655 -910 -27617 5627 30642 -6509 -27536 10758 26718 -14491 -25927 14049 21121 -19690
1667 -19690 -22161 19738 18777 -20265 -17345 22665 16796 -21675 -10295 25884 9715 -25754 -7932
1680 -7932 25255 2453 -27117 -3358 25512 -1420 -25762 3530 25603 -4814 -22640 9973
1692 9973 23284 -9734 -21671 13866 20197 -14874 -19681 14669 15757 -17318 -16069 18980 11749
1705 11749 -21239 -10206 21250 8905 -20682 -5148 23836 4077 -22082 -2463 21776 -1182
1717 -1182 -22750 3005 19535 -5543 -19999 6983 19583 -8078 -18631 10032 17283 -11005
1729 -11005 -14655 12486 13755 -14223 -12961 14745 9593 -17144 -8265 16577 7563 -15971 -5234
1742 -5234 16661 3605 -17071 -1048 18671 264 -17231 2420 17379 -4905 -17989 4216
1754 4216 13883 -6124 -14034 8290 13662 -8190 -11022 12658 11877 -11521 -8547 12733 8564 -13780
1768 -13780 -8679 11522 3402 -15561 -3948 13922 3512 -13595 -935 15738 697 -14276
1780 -14276 1792 14609 -2670 -12628 4383 11127 -6483 -12775 6303 9537 -7950 -9462 8035
1793 8035 9921 -7165 -8033 8891 7716 -8447 -5191 10629 5724 -10920 -3445 11085 1818 -12754
1807 -12754 -1768 10597 -383 -8460 1675 9315 -2017 -8396 3168 9863 -3253 -8127 4265
1820 4265 7949 -5059 -7588 5680 7149 -5804 -6807 6924 4815 -8744 -4984 7398 4003
1833 4003 -7360 -577 8918 3649 -5354 -71 6807 -1154 -8542 -1896 3591 -3317 -7990 201 7976
1848 7976 162 -4904 4334 8345 -1991 -3470 5501 4338 -6991 -6701 2128 1062 -7415 -2870 5468
1863 5468 3210 -3737 434 5249 1935 -3760 -1469 4807 1892 -5480 -247 5984 371 -5934 -598
1878 -598 3287 -3678 -5069 1217 3159 -2920 -1966 4443 3723 -1598 -1284 2627 1681 -1932 -2058 261
1894 261 45 -2724 -2216 3001 2554 -1968 -909 4401 211 -5386 551 2492 -2206 -2799 2892 3638
1910 3638 -544 -1080 1816 1613 -2281 -2860 -994 733 -1009 -2965 153 3792 942 -845 3177 4073
1926 4073 -1012 -1493 1913 -1021 -5071 -1822 -739 -1841 -982 1862 2284 -573 1182 1409 2249 -311
1942 -311 -1156 -650 423 -1495 -3072 -963 742 -1262 -2175 2008 2540 -814 -527 2375 685 -1931
1958 -1931 -254 17 -808 -6 -1592 -802 -823 400 -1752 -1063 1249 1050 -1922 339 2847 -493 924
1975 924 1167 -78 148 1612 -5 -1470 -340 940 -1065 -1959 1083 -254 -1118 998 1635 -340
1991 -340 1119 743 -1117 555 1809 -695 -473 1436 1722 -2224 -1412 173 -1015 -1884 -579 178 -1157
2008 -1157 953 207 1341 3508 3163 -229 89 1762 641 -2490 -1571 -595 -2936 -2354 -652 -457 839
2025 839 1913 1970 1717 2845 1451 -1019 113 1991 -1554 -1984 -354 -905 -652 -308 511 -724 1234
2042 1234 1254 -284 -278 1608 1065 -1085 902 1517 -98 -1646 709 569 -467 -1121 -2389 -1562 65
2059 65 415 -228 -211 1811 7 338 989 955 -1043 514 995 260 623 -927 -1107 -995 747 237 -2354
2078 -2354 -675 -433 -389 -1055 866 1690 1307 675 430 799 1057 -649 -1415 -731 114 -1710 -2018 -342
2096 -342 -452 -492 344 2095 164 -108 1331 718 158 380 -82 -405 -492 -119 -703 105 293 -267 -391 506
2116 506 -559 -163 1143 1740 -366 -72 1321 -727 -1060 -57 696 -1049 -1025 339 360 -765 431
2133 431 205 332 -563 -106 7 1064 -890 -875 1879 752 -1574 -906 1727 1725 -1393 -32 990 -597
2151 -597 -574 828 814 -659 -1826 1384 1089 -1680 -1491 1185 224 -708 -1297 1118 341 -998 -1383 1983
2169 1983 767 -3000 -473 1674 908 -2673 1 1664 144 -2576 -253 2894 -794 -1538 -143
2184 -143 1582 460 -1469 -227 2223 64 -1980 487 1407 -29 -1796 1496 2288 -2735 -2582 1640
2200 1640 745 -1825 -339 2270 868 -227 69 2198 1356 -1508 -836 1041 -92 -3621 -1990 1652
2216 1652 -1739 -1336 333 1728 -480 -928 2257 2637 -705 -1012 1308 1384 -1708 -2422 438 892 -2552
2233 -2552 -2711 768 1383 -2082 -668 2276 1619 -1140 103 3038 245 -1918 -9 2127 -655 -3814
2249 -3814 254 1433 -1409 -2335 759 2295 -2380 -1175 2053 1485 -1522 -753 1976 1523 -1084 61
2265 61 2762 633 -1982 -972 2663 1027 -2459 -442 1829 -492 -2729 63 2636 -463 -970 2052
2281 2052 4612 1140 -2216 693 1216 -2534 -2288 1144 1308 -2443 -1053 2177 2363 -416 -105 3029
2297 3029 996 -1467 -402 1823 -783 -2993 -255 1222 -427 -2813 1931 3593 -137 -2283 453
2312 453 2237 -1696 -1939 833 1725 -1560 -2002 593 1902 -1222 -1152 1069 864 -1652 -546 2134 546
2329 546 -737 220 2018 482 -2208 -559 605 -653 -1529 -1337 2318 434 -1269 933 2105 -1043
2345 -1043 -1442 1547 1397 -1927 -1914 1155 589 -1466 -24 2188 1866 -961 -1953 838 631 -1178 -2221
2362 -2221 1044 687 -972 -591 1638 1556 -361 1767 2373 504 -1928 -2019 -511 -1401 -2711 -927 -254
2379 -254 -353 145 2210 2341 639 -363 1320 736 -1632 -1647 -195 -411 -2435 -1243 690 -133 -1754
2396 -1754 2020 2124 425 -578 981 1654 76 -625 -908 558 -449 -2256 -636 1221 35 -1058
2412 -1058 301 683 -596 -373 876 2439 -144 144 1190 775 -1128 -304 -334 -979 -1119 203 1630
2429 1630 486 21 860 1166 1143 191 -163 1139 -1026 -1913 -186 769 -119 -1904 1542 1689 -654 -267
2447 -267 18 290 -522 -614 -617 -336 541 -201 -208 2164 843 -700 942 880 48 -885 -1335 -749 -442 235 -253
2468 -253 -41 191 1234 541 60 458 646 504 252 -589 -270 358 -341 150 410 227 261 -1756 271
2487 271 957 358 -572 570 -62 -434 -124 651 478 -995 -181 -142 621 89 -1280 -784 1803 719 -482
2506 -482 951 476 1005 -212 -260 -482 -1337 -483 -2 319 297 645 -626 -462 704 924 423 -253 1056
2525 1056 799 1546 1122 -876 -845 -58 -25 -1304 125 -418 -675 293 560 -851 -1434 -74 239 853 -57
2544 -57 317 -150 513 -53 -669 187 618 -1090 -1644 -605 -168 -1558 -470 395 -241 195 1460 573 -694
2563 -694 819 1644 497 -873 -415 178 165 -805 -1148 -118 -32 -392 458 1380 555 -589 1016 1530 427
2582 427 -631 61 658 -99 -1818 238 -488 -1991 -716 620 542 -767 582 237 -156 81 557 16
2600 16 -525 -1120 -86 417 -225 -1601 -401 1654 5 -543 1107 1024 82 60 1585 606 -938 1262
2618 1262 1484 217 -2009 72 1262 -55 -1513 -791 1198 -310 -1545 -905 1209 -125 -1282 1667
2634 1667 2072 -1190 -1098 697 1901 -1390 -1323 1663 561 -2549 -810 1684 20 -2554 -176 1704
2650 1704 825 -227 565 1852 754 -1472 290 2830 -1415 -2941 330 1866 -1193 -1939 2049 1888
2666 1888 -2123 -1148 2724 2051 -2352 -867 2761 1550 -2687 -2535 1914 1429 -3236 -746 3660 365
2682 365 -2060 982 3773 294 -3057 280 2766 -2032 -2953 1597 2573 -1816 -3126 977 2029 -2151
2698 -2151 -1802 2447 3444 -2937 -2520 3031 2132 -3665 -2856 4169 973 -4511 -831 3994 1153 -3759
2714 -3759 -166 3961 -1138 -3997 783 3235 -1406 -3699 2147 3951 -1104 -2236 2759 3608 -1504
2729 -1504 -4126 2675 3311 -4337 -2339 4664 2371 -3844 -1777 6131 1087 -5527 -541 4718 -482
2744 -482 -4894 206 4026 -997 -4223 861 4101 -1536 -4793 1370 5669 -2367 -5133 3634 4961
2759 4961 -3435 -4433 4568 2559 -6128 -3115 4982 1878 -6165 -2146 5251 1180 -4749 -1448 6417
2774 6417 1417 -5445 -484 6336 -764 -6642 -226 6313 -2586 -7314 3286 6930 -2889 -5281 5153
2789 5153 5240 -4909 -3665 5515 3362 -5767 -2724 4857 2822 -5439 -1881 5876 2227 -5738 -2665
2804 -2665 6696 674 -8415 -1691 8253 -869 -7832 2748 8380 -2127 -6404 3705 6398 -4746
2818 -4746 -6912 3908 3495 -4696 -5570 4757 5131 -4381 -4742 6470 5549 -5219 -3710 7828 3114
2833 3114 -8484 -1448 9335 927 -9423 514 7573 -1637 -8981 2297 7120 -2636 -5969 3275
2847 3275 7291 -3055 -7231 3695 7421 -5529 -7208 5940 5863 -7171 -6482 7869 4694 -8792
2861 -8792 -3211 9199 2764 -8164 -361 7726 -394 -8027 -308 6824 -556 -8004 976 8632
2875 8632 -709 -8323 2420 8911 -4666 -8417 5609 7296 -7250 -6544 8063 6309 -8486 -4163
2889 -4163 9061 2648 -8288 -2516 7147 2593 -8307 -2297 8951 2197 -9527 -1009 11068
2902 11068 716 -10191 1273 10785 -1956 -10651 3806 9384 -5860 -8281 6640 7778 -5496
2915 -5496 -5287 6483 5819 -5882 -5667 7162 5203 -8323 -3772 8095 4216 -9706 -2798 10768
2929 10768 2010 -10904 348 10756 -1387 -10591 3085 9895 -4212 -9566 4272 9164 -5872
2942 -5872 -8040 5526 7205 -6377 -7588 5919 7353 -6991 -6834 8115 6479 -8617 -5252 9928
2956 9928 2984 -11130 -3528 9608 -90 -9766 196 9129 -1501 -8211 1227 9189 -2329 -9147
2970 -9147 3892 9216 -2981 -9363 5285 8716 -5764 -8547 7464 8895 -8153 -6786 9605
2983 9605 5637 -9884 -3718 9902 3011 -8776 -1851 8819 1914 -9229 -1523 9501 549
2996 549 -9504 786 9243 -1579 -9553 2360 10725 -4580 -8921 5102 7153 -5937 -6726 8554
3010 8554 6290 -7246 -5201 6498 4645 -8734 -3423 8318 4615 -8031 -3730 10245 3216
3023 3216 -10263 -693 10471 -179 -10562 609 9995 -3225 -8803 3392 9218 -4686 -8210
3036 -8210 4999 7416 -5353 -6936 5950 5736 -5148 -6578 6747 5718 -7370 -5565 8841
3049 8841 3824 -10187 -3675 9477 2104 -10102 542 9847 162 -7361 1850 7737 -1766 -7547
3063 -7547 2292 8468 -2527 -8163 3224 7876 -4342 -7225 5291 7075 -6579 -5325 8232
3076 8232 4998 -7842 -4266 8017 2527 -7659 -2528 7614 1201 -7900 -1539 7067 -940 -7280
3090 -7280 -563 7824 -1117 -8305 1964 8219 -2417 -7243 4965 7795 -5890 -6729 5443 4661
3104 4661 -6028 -4958 6561 3975 -5894 -3397 6218 3396 -6224 -2618 6581 2926 -7229 -1579
3118 -1579 7058 431 -8265 -424 6697 -1993 -6209 2491 6628 -2515 -5621 4485 5419 -3278 -4500
3133 -4500 4190 5205 -4064 -4394 3803 3237 -5270 -2967 5761 3344 -6212 -1719 6421 2018 -6540
3148 -6540 -793 6166 -309 -5887 1156 5896 -1773 -6404 1296 5488 -1714 -5982 1963 5958 -3165
3163 -3165 -5371 3269 4754 -3236 -3389 5154 4043 -5159 -2497 4520 2640 -5576 -1915 4361 1863
3178 1863 -5935 -1127 4893 23 -4757 -348 5195 -596 -4473 1270 5606 -1106 -5012 2300 4391
3193 4391 -2674 -4120 3281 3502 -2919 -2929 3526 2407 -3168 -2788 3037 2420 -3079 -1605 3289 1287
3209 1287 -4727 16 3481 131 -3773 129 4468 131 -4268 757 4730 -1007 -3457 749 2522
3224 2522 -2572 -3354 1936 2202 -2958 -2747 1709 2634 -1494 -1454 2246 1882 -4458 -1603 3006 678 -2835
3241 -2835 232 3370 506 -3186 256 2379 -40 -2215 919 1851 -905 -2824 1555 3120 -1000
3256 -1000 -2528 2047 2711 -2842 -1945 2776 2063 -2870 -1300 2338 721 -1938 -1676 2931 1022 -732
3272 -732 458 2286 -377 -2660 -806 2449 -49 -1708 449 2837 -522 -2492 1873 1981 -1636
3287 -1636 -2104 1085 1842 -1813 -405 1333 1940 -1766 -1820 1776 2220 -801 -1674 466 515 -3276 -1651
3304 -1651 1451 204 -1787 868 2846 990 -2030 735 760 -767 -961 791 466 -1235 -494 52
3320 52 1595 -85 -183 738 677 -503 -911 1194 769 -2058 -892 1187 548 -1561 633 1501 -776 -1615
3338 -1615 183 -68 -314 -859 1042 423 329 -986 537 907 -134 -1737 377 1078 -1394 -531 466
3355 466 1149 -667 -223 785 655 -1098 433 1300 131 -657 310 867 39 418 -829 -43 458 -612
3373 -612 -277 845 -236 -1197 46 830 -689 -416 1431 1211 -1082 602 725 -970 144 264 587
3390 587 -341 -255 -79 337 1553 331 27 429 1450 -1382 -347 269 30 179 -159 1436 -1157 -918
3408 -918 622 -74 612 697 792 -532 439 329 607 322 435 -770 -1183 635 237 -369 -961 607 -1531
3427 -1531 -9 855 -234 -425 872 156 -198 547 390 -1314 -655 257 -148 -1023 109 870 -127 627
3445 627 126 -57 -423 763 -325 -267 216 -111 -872 753 424 -847 -783 379 -670 -530 813 380
3463 380 -1226 469 997 -549 -195 96 -383 -504 703 176 -640 -412 470 124 -610 981 212 -500
3481 -500 307 955 -1110 437 931 -895 257 -188 -22 -391 710 64 -72 -495 786 257 -493 -112
3499 -112 -160 119 361 825 -511 91 1565 4 -888 164 -941 -99 -515 1621 159 -448 575 -72
3517 -72 -29 374 681 -508 536 -658 -507 -338 279 -978 -731 -259 403 512 400 854 -570 -372 431
3536 431 -1 -323 204 -442 1046 296 737 -196 1225 -166 -525 -926 -46 -627 -2042 555 299 -555
3554 -555 -611 61 -435 1233 33 16 417 -113 -378 251 104 -19 -750 -456 170 -571 599 100 395 -965
3574 -965 -797 1006 678 -702 845 688 173 -874 -313 119 -1194 -485 317 1029 -489 -604 154 -716
3592 -716 446 -309 -167 768 -537 -1114 237 114 -884 -448 297 581 -201 713 1538 480 -1069 -1108 -113
3611 -113 -144 485 -494 -253 -73 577 -1189 384 407 -688 -92 424 -274 -238 -108 133 305 -616 -192 468
3631 468 -513 -1284 115 717 -550 533 170 558 -289 -398 691 -709 -70 -345 513 231 -826 -243
3649 -243 117 -134 -927 617 75 -94 -156 -35 447 30 -924 156 580 468 -523 1027 585 111 35 -146
3669 -146 316 304 -1462 -86 309 116 -524 1209 982 -512 804 261 359 -1096 374 495 -644 -678
3687 -678 -1481 440 108 -648 547 479 -446 -442 1041 -200 -793 93 851 1168 -842 -665 817 222 -1135
3706 -1135 -616 -489 192 -191 356 1991 890 -597 711 828 -319 -336 65 1179 180 -171 231 -137
3724 -137 55 165 -417 584 -921 -928 306 838 -1201 -583 235 -188 55 214 90 -555 -444 353 1305
3743 1305 694 -844 -35 56 -462 252 75 672 -122 -174 483 1144 453 -1120 653 29 -1160 -990 210
3762 210 452 113 33 790 851 -490 -418 31 242 -336 -979 1716 188 199 169 216 -732 -1301 -208 330 542
3783 542 -285 -7 560 -781 -406 89 1156 -33 272 430 -131 -678 593 -624 30 -502 -135 603
3801 603 710 -221 532 1003 398 -191 490 570 -247 -877 -111 386 71 -532 -23 178 -176 -858 -131 376
3821 376 -197 -21 -105 -69 730 -158 297 795 346 -412 989 661 172 23 -480 98 -426 -15 127 139 307
3842 307 397 603 332 418 788 881 474 -155 -811 -68 -45 -249 66 316 391 -344 579 -207 88 -302 -576 -694
3864 -694 505 -284 640 235 -58 -653 634 122 -582 1081 455 -212 1011 22 688 -1008 -656 -602 382
3883 382 -324 403 77 56 -192 -178 999 -455 -615 450 350 -21 31 -600 -471 213 239 -265 -62 -984
3903 -984 -738 1281 -957 615 -222 -94 283 215 521 210 -325 455 1071 186 667 -481 -937 -481 105
3922 105 711 -303 473 812 -141 147 -430 129 -20 321 -583 -581 -111 -409 320 -472 154 -344 -927 65
3942 65 -32 508 -304 -16 -303 -1182 -113 764 -52 -511 227 494 405 245 843 1090 -746 221 222 392 764
3963 764 -1144 387 -177 -656 -243 -336 683 -7 319 849 -316 868 222 -106 37 -82 419 -104 -68
3982 -68 -106 477 1085 -575 -150 1306 894 -128 344 -910 149 344 382 708 -128 388 -100 -556 6
4001 6 1264 -891 -197 -162 134 -138 -54 35 -170 -382 382 151 383 167 -988 -39 1178 -97 -34 -47 684
4022 684 -1121 236 59 143 292 921 -156 1262 788 771 -360 -224 -494 -797 -323 229 -768 394 414
4041 414 -128 81 -649 333 279 -186 -113 98 123 303 -338 36 -1306 -126 176 202 586 278 416 -527 -424
4062 -424 -678 476 208 302 314 739 -146 -554 -374 498 1092 608 -449 788 -214 -564 319 -383 514
4081 514 -868 732 -227 202 383 -106 656 -602 41 -289 760 -376 98 442 -545 -518 -630 1602
4099 1602 -883 426 148 -97 300 -92 -1332 1110 1011 144 50 735 203 -656 -589 218 416 97 161 -26
4119 -26 -304 -677 127 612 -776 -222 -49 114 -220 -280 513 650 -376 -690 824 439 -424 -203 354 611
4139 611 -1606 -87 663 117 -804 466 1544 295 -530 421 1152 -362 -920 -673 962 256 -1172
4156 -1172 349 1346 -856 -208 221 671 -1010 -589 673 1800 -895 -189 515 679 -1161 -804 708
4173 708 329 -539 -324 1932 -49 130 -15 302 -590 -803 -219 765 -113 -1408 391 1266 192 -548
4191 -548 699 939 -455 -1287 1429 -387 -748 -611 1226 44 -1054 -110 935 117 -1914 -560 2238
4208 2238 812 -1244 488 1238 25 -1790 -571 2314 -999 -1787 924 1709 -795 -1340 569 1004
4224 1004 -875 -1064 1439 697 -1351 -2003 1305 648 -1750 -637 1480 1171 -2051 -352 1712 304
4240 304 -1699 308 1831 -661 -1505 183 1732 -886 -2078 1825 1804 -1118 -452 1735 1053 -2145
4256 -2145 -1383 1101 213 -2538 -902 1338 673 -2307 -516 1789 659 -1570 -316 2237 753 -2270
4272 -2270 1098 1431 -1172 -2096 597 2686 -247 -2705 1069 1618 -669 -1796 1786 2082 -2024 -1127
4288 -1127 1824 1890 -2314 -333 2435 1508 -2499 -1502 2636 81 -2330 -1295 2251 325 -2569 -279
4304 -279 2098 34 -2074 316 1824 -601 -1629 1179 2168 -544 -1951 1190 1871 -1730 -1015 2510
4320 2510 947 -2432 -1383 2579 1454 -2311 -1118 2459 334 -2477 -839 3176 680 -3103 -819
4335 -819 2226 -750 -2098 621 1790 -1088 -1853 944 1898 -1434 -1748 798 1403 -2537 -1731 909
4351 909 1801 -2127 -1369 1569 911 -1661 -1387 1891 1004 -2451 -671 3347 -321 -2431 14 2828
4367 2828 -1260 -2655 429 2183 -419 -2230 861 2584 -1122 -1808 2541 2177 -1606 -1848 1344 1701
4383 1701 -2692 -1254 2634 752 -1899 -895 3243 945 -2213 -981 2644 -258 -3131 308 2830
4398 2830 -449 -2660 -669 2054 -354 -2524 915 2717 -1552 -2211 1265 2365 -1207 -1562 1869
4413 1869 1334 -1273 -1287 1285 751 -2584 -253 3171 1000 -2162 -543 2041 582 -1535 -344 2651
4429 2651 193 -2715 832 2923 -420 -3131 1603 2070 -1496 -3689 923 2504 -1375 -1581 1472
4444 1472 1456 -2329 -358 1703 2275 -2290 -1489 1965 70 -2977 316 2998 168 -2376 371 3097
4460 3097 -130 -2648 -786 2320 -310 -1979 1454 2292 -1400 -2285 1905 2325 -1853 -1934 2194 2096 -2467
4477 -2467 -1492 2857 1931 -2744 -1091 2480 698 -1982 -60 1910 392 -2597 121 3171 279
4492 279 -2071 1383 2369 -1012 -2892 1580 2755 -2135 -2242 1974 1955 -1787 -2278 1866 1312 -1764 -1037
4509 -1037 751 1234 -1669 -1022 2021 264 -2539 -611 1258 647 -3016 -87 1503 -49 -2008 1918
4525 1918 2371 -711 -2839 1381 2690 -1213 -2019 784 2816 -1881 -1554 1631 1111 -1778 -1213 1542
4541 1542 1333 -2788 -263 1538 757 -1957 -555 2921 -404 -1130 1248 3202 -274 -2897 18 2643
4557 2643 -1402 -2752 -47 2852 -1170 -1882 1299 1116 -1378 -2269 1472 582 -1884 -1476 1990 1496
4573 1496 -1645 -368 2998 205 -2109 -950 1843 287 -1628 -614 1495 -1027 -2674 416 1272
4588 1272 -757 -1973 1411 2983 -1397 -2543 1449 810 -1445 -1464 852 1105 -1600 -407 1359 910
4604 910 -1319 -183 1668 1445 -2554 -124 1840 -1134 -1438 -112 2035 -488 -1672 96 1337 -387
4620 -387 -647 1323 1844 -975 -729 749 916 -1170 -1325 -151 739 -1112 -1306 880 792 -1549 -476
4637 -476 884 967 -1730 89 1957 -44 -2085 -475 1689 -220 -257 922 592 -539 -1089 533 935
4654 935 -225 -2077 1195 716 -1236 -748 1780 638 -574 -919 1831 762 -1210 262 916 675
4670 675 -1913 -743 708 1413 -1909 -415 303 1 -874 294 1728 -442 -770 1051 1352 -884 -1149
4687 -1149 1378 1499 -576 -1283 1243 803 -1408 -340 1544 826 -613 -297 720 874 -498 -270 322
4704 322 346 -190 -460 875 -179 365 159 1885 -134 -722 -122 1580 -215 312 547 808 -782 -1005
4722 -1005 1150 1091 -604 -719 233 1447 -967 353 1248 503 -1048 -702 539 129 -2004 809 -160
4739 -160 -178 783 -246 1283 101 -523 506 566 -1001 -181 661 357 -906 -456 1323 1526 -294 234
4757 234 503 1096 -1276 631 -103 68 -1036 984 1487 -860 -351 25 385 262 -210 -863 181 -788
4775 -788 -231 -53 681 -458 112 355 -95 -775 87 54 285 -437 -643 -166 365 -412 -198 780 338 -112
4795 -112 -531 51 721 -142 936 704 939 -642 -333 139 -485 -155 80 0 48 -505 -196 -338 -751 -167
4815 -167 341 186 -275 -528 112 -38 -305 240 -223 -946 -295 -10 -407 407 -787 -648 664 1318 -334
4834 -334 -214 454 -197 736 -767 -331 -712 -472 -309 -69 769 -212 -19 287 604 100 -388 -232 47 -556
4854 -556 977 412 -292 468 -759 -1476 -70 211 568 -126 148 -206 1344 381 -548 -738 561 629 62
4873 62 55 -520 124 659 -716 136 208 455 -469 1159 -121 -598 314 -465 0 -25 544 408 527 -497
4893 -497 -293 -890 -118 -547 238 -891 -470 214 880 270 19 -243 265 -542 48 455 82 -175 720 -109
4913 -109 255 254 -214 -689 -788 332 -433 568 355 152 138 416 -615 -448 -184 -314 999 17 330 581
4933 581 -515 584 853 -813 -826 -445 329 598 -305 -500 -433 221 -78 175 -677 220 -1602 -443 -384
4952 -384 -71 -27 -610 -354 -121 -87 168 1110 1190 -892 -137 -350 252 614 -479 -634 973 118 -307 -43
4972 -43 -221 -26 -890 -164 -618 -518 -473 277 -229 133 525 123 -116 -159 -195 -201 358 482 -407 891 -121
4993 -121 94 542 473 -56 -47 203 581 -622 -254 -277 -1449 38 -267 -268 317 -11 -645 80 488 -404 593
5014 593 -464 201 -186 192 726 -751 -273 -240 573 178 85 -253 219 -52 1214 -3 -642 -197 -61
5033 -61 522 528 113 -473 326 -156 595 128 37 -469 -752 580 304 218 112 304 -102 523 -27 128 50 421
5055 421 171 -1235 -996 -296 -235 -230 350 -179 -155 1169 555 -675 914 592 151 673 -56 134 272 -352
5075 -352 215 -363 76 581 109 -418 77 -394 -8 883 525 342 459 -578 -336 263 -1027 381 -91
5094 -91 -596 -479 249 -482 -349 177 -1019 -763 295 350 -292 546 528 -256 -116 -41 -524 -150 -164 -9 -95
5115 -95 -5 275 -129 489 -898 -27 476 119 -238 -559 -49 -741 234 -829 234 740 -400 219 843
5134 843 -679 1271 -312 -66 53 -201 -273 373 -100 295 -105 43 -308 -244 -577 757 698 90 871 182
5154 182 -258 -245 407 -553 64 -454 837 -541 -182 -75 1222 -323 -71 736 -420 358 -504 479 -120
5173 -120 -828 978 55 -448 -374 -573 -550 -334 -258 457 -486 -422 194 -920 631 18 -482 60 445 -7
5193 -7 -1 -130 43 71 -339 718 -152 563 216 -181 -492 773 306 411 308 -160 -130 438 183 1224 -98
5214 -98 294 116 -69 -928 -333 567 191 -298 -673 653 -225 -692 368 -478 -290 -174 635 -20 -404 495
5234 495 -578 163 33 -16 586 -175 42 864 144 -113 464 376 -176 -201 -333 45 -77 -454 -842 -488 -86
5255 -86 -788 1034 -642 252 -543 112 -107 14 -275 1057 361 -16 -354 -90 326 461 -156 -38 887
5274 887 -21 371 872 377 -253 114 -378 241 45 -110 851 26 -391 230 -255 197 -559 76 -315 -7
5294 -7 -10 -154 2 571 -835 -1501 -434 173 256 876 377 -465 326 -296 -834 -460 -657 505 -861 228
5314 228 94 -206 329 -375 80 -655 588 52 519 178 -772 -594 212 387 58 -735 -302 -279 458 405
5334 405 342 682 -91 225 -162 702 -340 796 108 321 -135 -44 -277 -140 -413 368 232 8 754 284
5354 284 34 204 -651 -102 -539 -394 -350 -780 -256 424 646 373 -540 204 -401 -17 -996 -991 1015 760 122
5375 122 400 659 180 -922 534 -15 -1246 411 -69 365 -968 -604 -253 -419 -565 -1020 -780 743
5393 743 -250 -1337 124 -252 762 -675 131 -512 486 -660 -877 435 269 120 233 349 -14 669
5411 669 -11 367 -411 -105 -468 337 558 -467 -506 169 -818 185 -456 650 -103 231 -1038 310 66
5430 66 -69 1151 -242 -351 -675 -361 266 746 -640 257 230 -49 0 -447 151 -540 -746 1205 149
5449 149 -381 -41 -1055 201 234 261 -392 415 162 -447 585 699 -34 -356 -118 -264 1171 -284 -621
5468 -621 318 -434 -177 559 196 -900 -582 -800 -107 -74 -1234 -420 -336 42 -192 -1009 569 577 -154 556
5488 556 -40 313 451 -329 60 -30 -121 -263 -850 593 -1141 187 -325 373 15 -111 57 0 -876 -555
5508 -555 -638 -75 545 -445 57 -563 122 70 721 -471 702 -292 265 -465 991 803 290 -407 317 186
5528 186 -239 313 -540 33 -294 -426 -350 96 -946 392 175 914 590 452 -106 99 338 -463 -256 -78
5548 -78 300 -39 -90 -374 -146 -615 -54 388 145 -262 -620 267 470 61 98 212 -290 -1028 85 183 -406
5569 -406 -209 -324 -167 -643 221 -722 531 643 -705 1077 795 -664 -436 -351 395 -426 -41 233 369
5588 369 -13 -874 807 457 -144 -398 1005 -676 -291 -247 445 -257 141 577 607 52 71 1488 -868
5607 -868 74 -228 -469 -59 -331 192 59 225 -711 -705 143 595 -482 -330 -170 4 -42 1134 399 -669
5627 -669 58 -142 848 -266 137 -375 656 -1 -348 -92 111 -69 -652 -332 671 62 -466 -287 100
5646 100 -31 -334 841 -171 173 -547 -186 -335 333 602 794 527 -86 864 1267 -382 -1406 -136
5664 -136 978 -814 -1005 1093 717 -581 -661 354 589 -584 -1120 477 -4 -238 -4 1343 212
5681 212 -612 -432 405 1218 -111 -394 638 -1029 -954 699 735 -307 -299 -749 1287 -593 -1213 502 -37
5700 -37 -487 -222 260 914 347 -501 809 650 -102 -603 92 759 -1112 -64 599 331 -60 -287 1106
5719 1106 -275 -895 810 1541 333 -418 -544 589 427 -936 1337 211 -182 198 604 647 -291 -964
5737 -964 1457 -188 -1152 69 -431 800 -1789 -599 555 36 -1542 -399 278 565 -1288 -800 1407
5754 1407 634 -916 -664 1109 -198 -158 488 1205 -1213 -1758 102 1384 -1085 -839 756 130 -995
5771 -995 -1083 775 323 -1585 -369 639 616 -1038 293 1294 -449 -1264 -212 501 -607 -736 -408
5788 -408 222 -275 -544 277 949 -747 -697 228 1238 -618 -765 612 731 -1113 -551 1339 14 -1460
5806 -1460 -313 1762 -294 -740 208 1321 -764 -1091 296 928 -333 -1346 -182 950 -366 -1029
5822 -1029 1115 664 -944 -1125 266 812 -1010 -23 586 779 -1327 -472 402 835 -1876 -388 1397
5839 1397 237 -1040 389 1003 -23 -807 904 329 -359 -404 343 1733 59 -1167 598 1195 -618
5856 -618 -747 555 871 121 -880 856 1594 -509 -1346 1533 321 -614 -52 1514 56 -1253 -258
5873 -258 1281 628 -1140 -302 1018 226 -1203 347 719 66 -1612 -179 1042 -610 -1675 1414
5889 1414 851 -1858 -855 1571 239 -1298 -909 1780 740 -1816 -672 1881 51 -1314 -298
5904 -298 1887 224 -670 70 1196 -621 -904 -188 1775 -832 -914 457 900 -346 -1368 748 1752
5921 1752 -113 -591 990 1218 -972 -556 228 1083 -1703 -452 2366 557 -1132 269 1854 557
5937 557 -1144 569 1321 -1038 -897 584 1872 20 -1641 760 1328 -896 -751 1216 866 -1176
5953 -1176 -964 1507 177 163 -283 402 1016 -514 -112 1257 1 -870 -489 1217 71 -1558 -229
5970 -229 982 -92 -1263 534 1760 -678 -1672 1901 1142 -731 -1921 548 1465 -1251 -639 957
5986 957 -50 -637 -710 976 220 -1352 -1435 1311 636 -604 -383 1727 116 -975 366 1157 -481
6003 -481 -1551 165 1101 -377 -1446 1345 1211 -958 -432 878 889 -885 -1145 939 547 -1128 -238
6020 -238 1701 1887 -1175 -380 2567 -349 -3 -631 1106 822 -1510 45 1450 -910 -1178 -116 826
6037 826 -753 -850 27 643 186 -807 694 1023 -1254 -826 1055 1500 -1095 -520 460 1332 -883 -104
6055 -104 836 -495 186 -307 1578 686 -377 -527 1017 -296 -1210 -511 1622 -564 -441 -8 980 -466
6073 -466 -178 -187 1293 274 -501 1001 391 -954 -617 1300 -445 -401 -781 705 341 -235 1442 1005
6091 1005 -468 -1568 -119 989 -279 -314 113 1274 310 -819 600 1371 -59 -1276 632 190
6107 190 -326 -1046 440 1287 -1857 -1309 989 546 -637 553 -224 881 70 190 996 1214 -594 307
6125 307 926 -253 230 8 543 402 -117 -368 -27 -1154 -192 -210 1044 -195 -535 -200 49 -125 -481
6144 -481 544 232 -562 -895 598 -671 -918 -568 53 310 -553 179 318 -363 -580 -674 610 582 -485
6163 -485 703 768 -1037 135 435 58 -187 -179 1072 0 80 -335 -204 470 -290 191 290 -581 -210 148
6183 148 393 -196 208 267 208 477 129 502 275 -252 -1718 257 851 -487 593 558 -295 -128 370 197
6203 197 -128 -1077 410 -130 844 -1240 -882 125 803 -636 -73 841 180 14 -99 164 -147 -252 954
6222 954 -260 -1982 -464 -123 -548 -120 241 539 613 161 166 24 726 1149 226 474 -371 210 -1185 59
6242 59 1016 -3 -353 432 160 -576 13 -5 -250 144 -78 -185 -107 -83 258 -454 104 -242 -730 729 36
6263 36 -320 225 198 -600 -668 334 -452 -311 -248 792 -529 251 -91 283 -151 -369 108 246 668 -652
6283 -652 241 -980 74 -141 -536 -247 -188 -189 146 735 251 -522 351 -573 -576 1100 -38 -87 -390 386 -380
6304 -380 408 637 -361 369 359 -350 -281 632 -172 19 385 474 -966 -118 267 -366 37 -809 -336 610 448
6325 448 -675 -895 -707 238 -509 230 -138 -32 -482 683 425 61 277 473 -321 501 304 -309 -527
6344 -527 -163 -98 -439 -998 527 -595 -196 778 -307 -90 325 -708 -543 422 988 217 231 298 495 -374
6364 -374 567 -579 83 575 538 520 61 -580 -312 193 -706 474 -98 -1235 222 -389 -878 223 474
6383 474 26 -886 733 177 -182 167 -407 -623 397 -694 -25 546 -51 -145 -72 52 587 220 42 215
6403 215 213 -108 -351 -366 -820 242 -486 -388 58 439 -666 -381 23 -305 -215 111 421 -791 -120 -642 664
6424 664 -1071 285 107 -543 -239 289 355 -284 -768 -287 314 -521 784 -209 -139 -81 -924 36 248 451
6444 451 1038 119 495 -432 203 43 -116 -72 364 -105 -584 418 -500 -217 -679 108 -128 -647 -697 -466
6464 -466 -306 426 17 -605 -167 539 -125 706 -272 105 -937 431 -691 -673 -536 -494 -451 -711 -294 470
6484 470 1594 -57 347 -588 -247 -378 549 946 -216 426 213 -378 234 -525 -381 351 -506 497 -435
6503 -435 -268 -317 639 311 -7 -89 -1423 -2 -190 -856 1172 76 542 1231 530 1013 8 694 -691
6522 -691 -1429 -270 -583 31 -215 -260 -1109 487 9 93 862 120 -318 -326 631 -246 -244 -433 -173 -60 28 -171
6544 -171 -320 388 -398 -129 825 403 91 -140 106 522 65 436 -122 524 139 -743 -356 -248 -440 123
6564 123 187 193 -813 543 -90 -269 -147 302 -62 -56 1481 817 -56 -470 -140 -324 -367 -73 -301 -623 -129
6585 -129 744 137 305 -487 277 -195 -528 118 121 -120 -441 122 101 79 -789 203 -290 -397 688 -238 -565
6606 -565 -609 212 -67 490 4 82 -400 1103 532 -236 -56 385 50 441 744 -521 898 284 127 408
6626 408 -729 19 -185 -351 95 331 -328 197 45 -456 942 214 -338 -11 -302 182 590 -292 752
6645 752 -689 221 299 -1058 -356 227 -132 -165 274 1204 -597 -348 279 -768 433 -298 599 -350 214
6664 214 440 -154 534 447 61 -536 112 -360 1295 -404 -194 -819 326 -527 -197 -51 -16 -1015 163
6683 163 -135 275 698 -196 -82 -24 -455 -346 309 -287 1384 -727 558 -756 342 393 27 234 -417
6702 -417 -396 368 341 -597 -906 -265 -890 409 340 310 1509 -1053 665 -676 -174 -540 7 426 -647
6721 -647 20 483 -144 8 712 1030 -485 -427 2 18 163 720 -188 -424 89 139 477 866 -490 -352
6741 -352 -112 -206 -571 95 296 -218 -167 311 -376 254 400 -137 91 -509 736 189 672 -35 -368 -192
6761 -192 -284 428 -6 -41 876 -546 87 -72 -280 -120 600 -91 82 303 457 128 113 -305 -814 405
6781 405 -199 -1056 -316 708 202 582 540 -568 -167 -602 843 314 371 288 -66 316 129 722 -81 -380
6801 -380 -382 -83 -90 331 -221 -557 735 154 -648 954 -785 301 -284 -57 984 563 508 -426 -503 207
6821 207 -652 -326 -417 -127 220 49 118 -368 456 450 224 27 -200 30 -441 307 -156 -510 187 -204 -206 -16
6843 -16 -1050 -204 481 -101 -837 -170 -102 260 27 233 5 -166 -755 1003 -133 -309 357 149 -18 -731
6863 -731 -422 -423 -421 -39 -166 615 -127 101 419 389 620 231 -434 322 -264 857 137 -213 -670 -247 1053
6884 1053 153 -195 74 -477 1197 552 -11 324 183 -371 -639 394 -463 -544 -434 237 437 262 581
6903 581 782 -125 -63 -93 -417 -156 346 50 -903 105 553 -810 -93 154 96 -915 182 -71 -5 1104
6923 1104 155 -203 -1140 481 42 -915 -204 484 -132 132 -140 -49 269 -526 -309 -667 -433 252 126 162
6943 162 232 338 369 -340 -344 -152 1040 354 -99 373 -152 1051 295 -838 252 259 1343 659 -495 815
6963 815 573 301 786 105 -580 -180 628 -550 -796 -494 -412 -17 78 -657 -531 -21 -663 272 397 879
6983 879 1013 -624 77 146 -600 67 -121 -243 -756 -99 -459 -754 -438 660 -272 213 487 -308 672 -339
7003 -339 239 260 48 -270 -114 -138 360 49 -163 943 -525 -763 955 340 46 -246 -733 -560 -195 17
7023 17 330 -16 -167 720 -245 -975 -194 -312 313 7 82 -632 -262 -668 658 603 -58 1769 195 -217
7043 -217 769 -170 527 87 -38 34 -696 301 214 368 393 915 594 665 323 466 -648 -567 -963 -413 -395 -393
7065 -393 461 685 455 -541 -1143 -155 -169 77 -849 -593 939 -543 345 516 -224 -968 -705 252 -764
7084 -764 -759 648 97 965 -54 -174 -284 -250 -731 -5 47 -360 -884 -248 290 761 -417 60 518 -72
7104 -72 -168 -308 11 -982 815 856 -403 -824 190 613 638 -177 191 1103 -336 310 244 -21 67 -31 -462
7125 -462 660 -361 -205 1104 350 -412 -823 92 1735 -225 -16 326 -743 -735 -542 301 457 -641
7143 -641 -443 637 248 -518 -203 1499 716 -202 -265 1176 478 -423 633 752 -316 -454 331 562 -840
7162 -840 -500 592 598 -368 -757 333 -448 -13 -134 1178 50 -1643 -1134 2252 -462 -723 -195 -126 250
7181 250 -524 -107 368 274 -486 77 -80 109 -1423 343 207 -226 -476 552 761 532 923 289 154
7200 154 -755 -520 236 -148 -742 -608 778 701 -1125 -1155 636 -734 -510 200 1545 155 21 1672
7218 1672 808 -594 -627 995 1263 -815 -743 223 342 -264 -261 1029 666 -813 -1012 1107 457 -662 -791
7237 -791 286 -200 -1680 553 94 -755 -710 364 1230 33 -1090 -477 261 -1026 -377 483 835 79
7255 79 -752 527 422 -105 47 706 865 -468 -1004 1195 408 252 -501 271 1246 -546 -440 826 169
7274 169 -1134 45 332 -100 -693 -194 639 -154 163 -229 239 225 -537 -23 1193 -1012 253 599 373
7293 373 -1445 -437 -11 -529 -817 -144 1335 766 -584 474 618 929 -1327 19 839 -763 -1280
7310 -1280 821 1047 -614 -501 -104 1317 -492 -1153 583 874 -1082 -1651 813 982 -961 48 351
7327 351 203 -1685 241 917 1026 -1292 -937 528 -451 -363 -200 659 -1059 -733 86 1314 268 -1412
7345 -1412 889 78 92 -1146 109 966 -33 -702 1642 194 -143 -1422 1021 143 -1551 -683 1398
7362 1398 579 -1103 -260 613 -177 -1143 125 549 -213 -1411 241 1488 -688 -471 22 409 -342 -1082
7380 -1082 909 931 -48 -1317 1194 614 172 -790 1415 228 -690 572 1580 166 485 -394 997
7397 997 47 -1707 -552 511 -597 -1221 858 826 489 -1031 598 776 284 -1491 622 1038 -1223
7414 -1223 -1496 788 666 -1804 -507 1283 586 -605 356 1124 950 -1520 -242 1200 -648 -821 164
7431 164 434 102 -905 -129 230 -1137 -439 -677 321 597 -1159 772 672 -212 -551 1040 2 -794
7449 -794 -480 826 -24 -8 -761 543 -1042 -690 -254 701 283 -1236 -54 1275 -440 368 674 -75
7467 -75 -970 -931 299 34 390 111 998 1602 -1302 3 1713 480 -200 434 1419 -28 -665 223 977
7486 977 1041 -594 -68 855 208 -1398 131 731 463 -1248 343 1334 334 -794 107 478 -147 520
7504 520 610 846 -383 -324 373 119 -743 -760 898 992 -1094 -207 145 37 -2095 130 958 -184 -1296
7523 -1296 -166 591 -1058 -996 -477 236 307 -1095 -276 -128 -163 -962 636 2075 -531 330 336 229 -190
7542 -190 -297 1006 257 -618 -69 684 447 -556 -1004 662 486 -650 434 609 -744 -220 544 101
7560 101 29 -586 111 535 -65 -306 328 305 -180 -421 933 -61 -750 121 363 576 -1262 361 -84 -161
7580 -161 -563 203 663 -448 -593 -51 -139 -404 -646 138 321 623 -249 -166 -322 455 -30 981 661 -573
7600 -573 -410 167 1304 -858 627 799 1380 -380 -513 836 -416 -331 258 1051 170 18 -437 -315
7618 -315 -145 -1104 189 142 -331 502 -472 445 -334 -301 1142 177 -462 -301 -562 93 -1029 -95 923
7637 923 -635 -155 83 598 -178 -230 -366 557 56 -502 -33 283 -226 -242 492 909 -140 40 900 -106
7657 -106 546 -119 -223 -226 -62 -376 590 367 -1231 28 -150 369 -722 -614 583 -268 431 -459 504
7676 504 -139 78 -1074 -121 -396 -714 -179 352 161 54 92 737 -601 -355 574 -224 581 -380 396 248
7696 248 556 -221 -273 356 9 -214 -135 1342 -748 215 -258 -1010 142 -552 -14 244 -985 248 -365
7715 -365 634 -1121 -400 -103 -791 445 -710 -73 156 974 -10 43 1041 -1608 808 379 85 564 1117
7734 1117 206 -712 -838 18 -552 -381 -55 120 -319 8 -181 -330 980 -396 -7 -125 32 132 -438
7753 -438 -14 -1222 -387 288 541 -136 304 -532 -152 401 577 691 216 -425 -503 -733 690 724 163 -352
7773 -352 -79 -457 -467 -332 -33 -247 137 -403 443 -18 984 206 -60 775 -466 428 -1540 167 700
7792 700 -56 -550 141 -254 39 -534 -250 -264 -363 390 51 -684 484 -10 149 56 627 697 -754 35 985
7813 985 130 782 432 494 28 -242 87 267 283 753 -389 24 -141 491 546 -687 603 247 393 -402
7833 -402 587 101 -573 144 172 190 460 -94 510 553 388 653 393 -273 725 -769 302 -472 746 134
7853 134 368 264 49 218 512 477 -121 -18 561 600 -472 167 146 584 463 266 -131 -282 46 997 -56
7874 -56 323 -380 291 99 -357 -744 191 -238 -391 743 -634 -135 -376 -260 100 -578 489 391 -258 205
7894 205 194 179 64 -187 242 -1 576 -192 -410 -437 41 65 415 -200 -472 -898 68 -322 62 -307 -269 -497
7916 -497 82 361 479 216 409 270 159 -1196 -501 536 1043 304 124 61 -215 -119 -535 -778 -72 -356
7936 -356 -295 974 -497 -182 41 -448 77 -66 387 343 211 15 -12 1260 78 866 579 1096 360 -1471
7956 -1471 403 205 16 -298 -759 282 132 62 -233 -718 271 258 257 256 353 371 95 977 332 283 99 657
7978 657 -210 500 130 -354 -543 -260 -271 -970 649 485 -556 93 -497 300 -808 1046 185 144 553
7997 553 1353 -30 -299 68 497 403 555 194 206 -317 -181 82 83 168 -1026 137 -259 406 -745 637
8017 637 -10 -377 1093 -397 -118 578 -192 382 -433 82 -210 34 813 399 -215 -309 -303 -84 -232 515
8037 515 -177 1034 681 656 595 -143 -909 -271 -245 669 161 2 51 -689 568 -811 -448 14 53 -316 135
8058 135 41 -65 -99 895 -269 1 957 -469 29 81 49 6 430 149 -1538 247 -194 -75 -161 264 520
8079 520 519 225 287 -204 158 574 -944 -243 0 -153 -692 -511 1337 -446 -24 -253 -17 620 48 -70
8099 -70 133 638 1199 -41 -598 -714 -8 -200 -19 81 -77 -249 -852 417 -371 -29 -483 68 75 -440
8119 -440 -94 -367 141 670 671 -107 2 -238 139 -324 629 259 -222 -150 -504 -786 -207 315 -1223 132
8139 132 -351 1513 48 -3 -588 570 714 -381 -29 534 433 -218 -354 1686 239 52 -248 -685
8157 -685 334 -469 561 11 604 -65 156 -255 446 255 975 508 122 -156 -1126 -583 -434 -918 -634
8176 -634 -181 220 56 -408 -151 -408 -661 -166 190 -886 -652 244 -22 -401 20
8191B0
##END NTUPLES=NMR FID
##END=
