##TITLE=1H_4K2510
 CDCl3
 8 sc, 
 26.10.2022
##JCAMPDX= 6.0         $$ Bruker NMR JCAMP-DX V2.0
##DATA TYPE= NMR FID
##DATA CLASS= NTUPLES
##ORIGIN= UXNMR, Bruker Analytische Messtechnik GmbH
##OWNER= root
$$ XWIN-NMR		Version 3.5
$$ Wed Oct 26 13:44:39 2022 Russian Standard Time (UT+4h)  she@DPX200
##.OBSERVE FREQUENCY= 200.1313499994
##.OBSERVE NUCLEUS= ^1H
##.DELAY= (6, 6)
##.ACQUISITION MODE= SIMULTANEOUS
##.ACQUISITION SCHEME= undefined
##.AVERAGES= 8
##.DIGITISER RES= 18
##SPECTROMETER/DATA SYSTEM= spect
##.PULSE SEQUENCE= zg30
##.SOLVENT NAME= CDCl3
##.SHIFT REFERENCE= (INTERNAL, CDCl3, 0, 15.7039)
##AUDIT TRAIL= $$ (NUMBER, WHEN, WHO, WHERE, WHAT)
$$ ##TITLE= Audit trail, XWIN-NMR		Version 3.5
$$ ##JCAMPDX= 5.01
$$ ##ORIGIN= Bruker BioSpin GmbH
$$ ##OWNER= she
$$ F:/spectra/data/she/nmr/H-F/1/audita.txt
$$ ##AUDIT TRAIL=  $$ (NUMBER, WHEN, WHO, WHERE, WHAT)
(   1,<2022-10-26 13:43:44.85 +0400>,<she>,<DPX200>,
      <created by zg, POWCHK disabled, PULCHK disabled
       configuration hash MD5:
       00 E9 B6 7A A2 85 ED C7 34 08 36 98 17 FE 4E 26
       data hash MD5: 16K
       B7 4A 94 A5 44 EB 40 1C 59 8C AE 26 14 AD FF CC>)
$$ ##END=
$$ 
$$ hash MD5
$$ 8C 7A 6B F4 36 61 5F 27 76 DB 66 4F D7 14 F6 7F
##$RELAX= 
##$RELAX= 
##$RELAX= 
##$RELAX= 
##$RELAX= 
##$RELAX= 
$$ Bruker specific parameters
$$ --------------------------
##$DU= <F:/spectra>
##$EXPNO= 1
##$NAME= <H-F>
##$PROCNO= 1
##$TYPE= <nmr>
##$USER= <she>
##$AMP= (0..31)
100 100 100 100 100 100 100 100 100 100 100 100 100 100 100 100 100 100 
100 100 100 100 100 100 100 100 100 100 100 100 100 100 
##$AQSEQ= 0
##$AQ_mod= 1
##$AUNM= <au_zg>
##$AUTOPOS= <>
##$BF1= 200.13
##$BF2= 200.13
##$BF3= 200.13
##$BF4= 200.13
##$BF5= 200.13
##$BF6= 200.13
##$BF7= 200.13
##$BF8= 200.13
##$BYTORDA= 1
##$CFDGTYP= 0
##$CFRGTYP= 5
##$CHEMSTR= <none>
##$CNST= (0..31)
1 1 145 1 1 1 1 1 1 1 1 1 1 1 1 1 1 1 1 1 1 1 1 1 1 1 1 1 1 1 1 1 
##$CPDPRG= <>
##$CPDPRG1= <>
##$CPDPRG2= <>
##$CPDPRG3= <>
##$CPDPRG4= <mlev>
##$CPDPRG5= <mlev>
##$CPDPRG6= <mlev>
##$CPDPRG7= <mlev>
##$CPDPRG8= <mlev>
##$CPDPRGB= <>
##$CPDPRGT= <>
##$D= (0..31)
0 1.2 0 0 0 0 0 0 0 0.06 0 0.03 0 0 0 0 0.0002 0 0 0 0 0 0 0 0 0 0 0 0 
0 0 0 
##$DATE= 1666777424
##$DBL= (0..7)
120 120 120 120 120 120 120 120 
##$DBP= (0..7)
150 150 150 150 150 150 150 150 
##$DBP07= 0
##$DBPNAM0= <>
##$DBPNAM1= <>
##$DBPNAM2= <>
##$DBPNAM3= <>
##$DBPNAM4= <>
##$DBPNAM5= <>
##$DBPNAM6= <>
##$DBPNAM7= <>
##$DBPOAL= (0..7)
0.5 0.5 0.5 0.5 0.5 0.5 0.5 0.5 
##$DBPOFFS= (0..7)
0 0 0 0 0 0 0 0 
##$DE= 6
##$DECBNUC= <off>
##$DECIM= 32
##$DECNUC= <off>
##$DECSTAT= 4
##$DIGMOD= 1
##$DIGTYP= 9
##$DL= (0..7)
0 120 120 120 120 120 120 120 
##$DP= (0..7)
150 150 150 150 150 150 150 150 
##$DP07= 0
##$DPNAME0= <>
##$DPNAME1= <>
##$DPNAME2= <>
##$DPNAME3= <>
##$DPNAME4= <>
##$DPNAME5= <>
##$DPNAME6= <>
##$DPNAME7= <>
##$DPOAL= (0..7)
0.5 0.5 0.5 0.5 0.5 0.5 0.5 0.5 
##$DPOFFS= (0..7)
0 0 0 0 0 0 0 0 
##$DQDMODE= 0
##$DR= 18
##$DS= 0
##$DSLIST= <SSSSSSSSSSSSSSS>
$$ [...]
##$SUBNAM2= <"">
##$SUBNAM3= <"">
##$SUBNAM4= <"">
##$SUBNAM5= <"">
##$SUBNAM6= <"">
##$SUBNAM7= <"">
##$SUBNAM8= <"">
##$SUBNAM9= <"">
##$SW= 18.0517283424941
##$SWIBOX= (0..15)
0 0 2 0 0 0 0 0 0 0 0 0 0 0 0 0 
##$SW_h= 3612.71676300578
##$TD= 16384
##$TD0= 1
##$TE= 0
##$TE2= 300
##$TE3= 300
##$TEG= 300
##$TL= (0..7)
0 120 120 120 120 120 120 120 
##$TP= (0..7)
150 150 150 150 150 150 150 150 
##$TP07= 0
##$TPNAME0= <>
##$TPNAME1= <>
##$TPNAME2= <>
##$TPNAME3= <>
##$TPNAME4= <>
##$TPNAME5= <>
##$TPNAME6= <>
##$TPNAME7= <>
##$TPOAL= (0..7)
0.5 0.5 0.5 0.5 0.5 0.5 0.5 0.5 
##$TPOFFS= (0..7)
0 0 0 0 0 0 0 0 
##$TUNHIN= 0
##$TUNHOUT= 0
##$TUNXOUT= 0
##$USERA1= <user>
##$USERA2= <user>
##$USERA3= <user>
##$USERA4= <user>
##$USERA5= <user>
##$V9= 5
##$VALIST= <valist>
##$VCLIST= <CCCCCCCCCCCCCCC>
##$VD= 0
##$VDLIST= <DDDDDDDDDDDDDDD>
##$VPLIST= <PPPPPPPPPPPPPPP>
##$VTLIST= <TTTTTTTTTTTTTTT>
##$WBST= 1024
##$WBSW= 4
##$XGAIN= (0..3)
0 0 0 0 
##$XL= 0
##$YL= 0
##$YMAX_a= 134633
##$YMIN_a= -107940
##$ZGOPTNS= <>
##$ZL1= 120
##$ZL2= 120
##$ZL3= 120
##$ZL4= 120
##$ABSF1= 10
##$ABSF2= 0
##$ABSG= 5
##$ABSL= 3
##$ALPHA= 0
##$AQORDER= 0
##$ASSFAC= 0
##$ASSFACI= 0
##$ASSFACX= 0
##$ASSWID= 0
##$AUNMP= <proc_1d>
##$AZFE= 0.1
##$AZFW= 0.1
##$BCFW= 1
##$BC_mod= 2
##$BYTORDP= 1
##$COROFFS= 0
##$CY= 11.3945322036743
##$DATMOD= 1
##$DC= 2
##$DFILT= <>
##$DTYPP= 0
##$F1P= 2.36226072786647
##$F2P= -0.459571619588291
##$FCOR= 0.5
##$FTSIZE= 0
##$FT_mod= 4
##$GAMMA= 1
##$GB= 0.15
##$INTBC= 1
##$INTSCL= 1
##$ISEN= 128
##$LB= 0.24
##$LEV0= 0
##$LPBIN= 0
##$MAXI= 10000
##$MC2= 0
##$MEAN= 0
##$ME_mod= 0
##$MI= 1.114404
##$NCOEF= 0
##$NC_proc= 0
##$NLEV= 6
##$NOISF1= 3.799351
##$NOISF2= 2.8
##$NSP= 1
##$NTH_PI= 0
##$NZP= 0
##$OFFSET= 15.70392
##$PC= 1
##$PHC0= -18396.7
##$PHC1= 17.8007
##$PH_mod= 1
##$PKNL= yes
##$PPARMOD= 0
##$PSCAL= 0
##$PSIGN= 0
##$REVERSE= no
##$SF= 200.130013532006
##$SI= 16384
##$SIGF1= 3
##$SIGF2= 2
##$SINO= 400
##$SIOLD= 16384
##$SREGLST= <1H.CDCl3>
##$SSB= 0
##$STSI= 0
##$STSR= 0
##$SW_p= 3612.71676300578
##$SYMM= 0
##$S_DEV= 0
##$TDeff= 0
##$TDoff= 0
##$TI= <>
##$TILT= no
##$TM1= 0
##$TM2= 0
##$TOPLEV= 0
##$USERP1= <user>
##$USERP2= <user>
##$USERP3= <user>
##$USERP4= <user>
##$USERP5= <user>
##$WDW= 1
##$XDIM= 8192
##$YMAX_p= 0
##$YMIN_p= 0
$$ End of Bruker specific parameters
$$ ---------------------------------
##NTUPLES= NMR FID
##VAR_NAME=  TIME,          FID/REAL,        FID/IMAG
##SYMBOL=    X,             R,               I
##VAR_TYPE=  INDEPENDENT,   DEPENDENT,       DEPENDENT
##VAR_FORM=  AFFN,          ASDF,            ASDF
##VAR_DIM=   8192,          8192,            8192
##UNITS=     SECONDS,       ARBITRARY UNITS, ARBITRARY UNITS
##FACTOR=    0.0002768,     1,               1
##FIRST=     0,             0,               0
##LAST=      2.2672688,     0,               0
##MIN=       0,             -107940,         0
##MAX=       2.2672688,     134633,          0
$$ Real data points
##PAGE= N=1
##DATA TABLE= (X++(R..R)), XYDATA
$$ [...]
$$ plain form
1796 -179 -763 -570 -10 525 406 -267 -825 -710 -293 266 603 -4 -567 -359 398 947 650 -45 -633 -410
1816 -410 761 921 619 -361 -423 -79 371 581 -60 -580 -605 -328 230 600 65 -419 -938 -198 550 411
1836 411 -25 -432 -508 -421 309 304 -33 -262 -506 -74 667 683 118 -358 21 194 724 1011 329 -389 -349 27
1858 27 211 167 -342 -855 -1057 -80 30 229 -225 -1181 -707 125 622 435 -136 -515 -341 836 964 469
1878 469 -287 -374 39 464 505 141 -378 -901 -282 128 326 166 -582 -500 -282 518 748 202 -342 -551 -30
1899 -30 401 9 -34 -403 -638 -412 682 583 179 -484 -455 12 663 894 51 -478 -154 306 596 478 -147
1920 -147 -473 -526 -5 453 220 -380 -846 -279 187 637 423 -591 -448 -65 499 342 190 -495 -711 379
1940 379 543 96 189 -435 -554 25 419 541 292 -106 -447 360 991 575 42 -225 -331 -311 256 10 -544
$$ packed form
1796a79n84J93N60N35j19o73n58J15M17N59L37o07n63K08P57N49k97o95n88K23
1816d10J171J60l02r80o2L44M50K10o41n20k5K77N58L70n35m84n19P40P48j39
1836D11m36m07p6Q7P30nl37k29k44M32P41J6n65m76L79J73N30K87o82p18M0L76
1858B7J84m4n09n13k02R77J10J99m54r56M74Q32M97j87n71l79J74J177J28m95
1878D69p56q7M13M25M1l64n19n23O19M10J98j60p48Q2K18Q00K30n46n44k09N21
1899c0M31l92m3l69k35K26J094r9m04o63K9M67O51K31q43n29L24M60K90j18o25
1920a47l26n3N21M58k33o00m66N67M66M50k14j014J43L83N64j57j52o85k16J090
1940C79J64m47R3o24j19N79L94J22k49l98l41Q07O31m16n33k67j06K0N67k46n54
$$ plain form
1961 -544 -673 -870 -233 122 -106 -515 -916 -316 284 808 603 -14 6 150 825 864 745 173 -170 108 126
1982 126 519 257 -583 -924 -763 -316 -165 -46 -437 -532 -32 308 373 182 -248 -229 512 552 224 278 -94 -336
2004 -336 -255 469 240 -159 -242 -554 -53 417 333 -79 -101 -310 235 365 410 44 -171 -323 -127 503 351 -173
2026 -173 -619 -317 -200 400 -85 -637 -650 -107 62 158 382 -195 -253 142 502 636 560 -119 -193 257 548 767
2048 767 190 -373 -621 77 301 66 -237 -394 -571 -143 107 -216 -276 -471 -617 -11 417 215 -164 -291
2068 -291 89 433 704 479 72 -202 -21 554 603 478 -180 -418 -498 174 340 160 -578 -748 -293 -285 204
2089 204 15 -457 -229 -47 282 295 162 -429 -303 397 350 208 231 -342 -486 269 218 265 -16 -583 -354 150
2111 150 414 36 -241 -145 -276 224 493 387 223 38 -4 -47 448 57 -244 -448 -510 94 179 -127 -211 -380
$$ packed form
1961e44j29j97O37L55k28m09m01O00O00N24k05o17K0J44O75L9j19n72l43K78J8
1982A26L93k62q40l41J61M47J51J19l91r5N00L40O5j91m30J9P41M0l28N4l72k42
2004c36Q1P24k29l99q3l12N01M70q4m12k2k09N45J30M5l66k15j52J96O30j52n24
2026a73m46L02J17O00m85n52j3N43J69R6K24n77n8L95L60J34p6o79p4M50K91K19
2048G67n77n63k48O98K24k35l03j57j77M28K50l23o0j95j46O06M28k02l79j27
2068b91L80L44K71k25m07k74J81N75M9j25o58k38q0O72J66j80p38j70M55QM89
2089B04j89m72K28J82L29J3j33n91J26P00m7j42K3n73j44P55n1M7k81n67K29N04
2111A50K64l78k77R6j31N00K69j06j64j85m2m3M95l91l01k04o2O04Q5l06q4j69
$$ plain form
2133 -380 -282 87 544 287 -10 -184 51 382 828 527 -443 -244 178 235 424 297 -155 -521 -274 -223 336
2154 336 -157 -601 -782 -265 -1 420 -39 -408 -141 235 720 531 433 17 -139 527 650 402 89 -210
2174 -210 -67 111 184 176 -169 -610 -680 -182 428 22 -326 -483 -342 239 257 109 -131 111 -162 112 399 201
2196 201 -274 -163 -167 442 665 -64 -524 -59 82 69 454 -59 -302 -135 55 77 72 -142 -551 -284 66 98
2218 98 260 -173 -369 -98 35 40 69 -155 -244 -90 6 176 -37 -369 -392 -61 -24 176 137 237 -101 75 320
2241 320 623 261 30 -180 -75 95 242 106 -507 -487 -710 -274 -32 -204 -403 -452 -97 -18 292 143 -223
2262 -223 -165 145 365 598 15 -24 -2 199 336 242 -62 -264 -386 -142 224 14 -198 -419 -164 -131 -18 95
2284 95 -366 -405 -248 57 94 201 -225 -329 -12 43 357 496 -577 -202 151 192 280 -24 -243 -265 -264 67 494
$$ packed form
2133c80R8L69M57k57k97j74K35L31M46l01r70J99M22N7J89j27m52l66K47N1N59
2154C36m93m44j81N17K64M21m59l69K67L76M85j89r8m16j56O66J23k48l13k99
2174b10J43J78P3ql45m41p0M98O10m06l48j57J41N81J8j48k40K42k73K74K87j98
2196B01m75J11mO09K23p29m60M65J41j3L85n13k43J67J90K2nk14m09K67L50L2
2218I8J62m33j96K71J33NK9k24q9J54R6J70k13l32k3L31L7K00l9J00l38J76K45
2241C20L03l62k31k10J05J70J47j36o13K0k23M36K42j72j99m9L55P9L10j49l66
2262b23N8L10K20K33n83l9K2K01J37r4l04k02j22K44L66k10k12k21K55L3J13J13
2284I5m61l9J57L05L7J07m26j04L17N5L14J39j073L75L53M1Q8l04k19k2JL31M27
$$ plain form
2307 494 88 -268 -168 124 29 41 108 -543 -663 12 601 284 -220 -297 -133 21 218 283 -218 -176 41 174
2329 174 164 107 14 -327 48 182 179 280 -271 -93 -60 318 291 68 171 -60 42 -77 153 -37 85 -221
2351 -221 -335 225 -61 -68 -282 -232 -11 0 477 191 125 64 284 405 436 77 96 -219 65 255 187 68 -201
2374 -201 -270 -15 117 256 -435 -332 -324 -137 17 45 -125 -375 33 146 240 262 -63 -104 -106 256 335 208 -19
2397 -19 -327 -163 266 101 33 -256 -59 -274 88 288 -62 -115 -184 -212 58 214 121 -355 -194 -162 405 377 -34
2420 -34 -501 -223 142 324 358 148 -126 -138 267 400 365 -144 -127 -196 66 210 45 -228 -236 -173 261 124 81
2443 81 -180 -254 -20 -50 0 -229 -337 -683 230 582 94 -119 -152 -46 31 133 271 216 -416 -147 129 430
2465 430 151 3 34 4 220 108 194 -94 -231 -154 -101 -13 -106 -202 -270 -88 -87 -51 209 -234 -123 -217 236 318 162
$$ packed form
2307D94m06l56J00K92r5J2O7o51j20O75N89l17n04p7J64J54J97O5n01M2K17J33
2329A74j0n7r3l41L75J34lJ01n51J78L3L78k7k23J03k31J02j19K30j90J22l06
2351b21j14N60k86pk14N0K21J1M77k86o6o1K20J21L1l59J9l15K84J90o8j19k69
2374b01o9K55J32J39o91J03QJ87J54K8j70k50M08J13R4K2l25m1kL62P9j27k27
2397a9l08J64M29j65o8k89J97k15L62K00l50n3o9k8K70J56r3m76J61L2N67k8m11
2420c4m67K78L65J82L4k10k74j2M05J33l5n09J7o9K62J44j65k73qO3M34j37m3
2443H1k61p4K34l0N0k29j08l46R13L52m88k13l3J06P7J02J38n5o32K69K76L01
2465D30k79j48L1l0K16j12Q6k88j37P7N3Q8r3r6o8J82JL6K60m43J11r4M53Q2j56
$$ plain form
2490 162 -144 -44 186 62 390 83 -20 -91 29 317 197 -169 -82 -335 40 64 -21 -42 -398 -7 8 203
2512 203 136 -145 100 -111 -37 400 283 -59 -62 75 -156 223 33 131 -208 -279 -184 146 142 -71 -244 -51 235
2535 235 226 179 -116 -209 124 65 131 330 -366 -239 -2 375 158 424 -162 -218 -161 75 -95 -127 -180 -209 11 -19
2559 -19 -53 -109 -40 -172 -28 334 223 82 -92 -241 -93 5 -100 -325 -85 -107 -101 -51 -8 -186 -134 -124 138 287
2583 287 186 -49 -235 -243 134 204 128 -156 -317 -33 171 440 17 -26 -43 -68 127 -177 187 -37 -362 -22
2605 -22 47 75 -60 -208 -229 -42 386 -90 -304 -148 -168 22 99 77 -147 78 342 -51 178 -17 -20 311 -81
2628 -81 238 242 198 -84 66 -167 0 158 25 -2 -204 -88 46 273 -18 -353 -267 -293 -165 279 68 -204
2650 -204 -133 -16 -19 181 104 -50 -178 -189 330 69 145 -76 -74 41 282 202 108 -73 -276 36 203 -142 26
$$ packed form
2490A62l06J00K30j24L28l07j03p1J20K88j20l66Q7k53L75K4q5k1l56L91J5J95
2512B03o7k81K45k11P4M37j17l42lJ37k31L79j90R8l39p1R5L30mk13j73J93K86
2535B35rm7k95r3L33n9O6J99o96J27K37L77k17K66n86n6N7K36j70l2n3k9K20l0
2559a9l4n6O9j32J44L62j11j41j74j49J48R8j05k25K40k2ON0M3j78N2J0K62J49
2583B87j01k35j86qL77P0p6k84j61K84K04K69m23m3j7k5J95l04L64k24l25L40
2605b2O9K8j35j48k1J87M28m76k14J56k0J90P7k2k24K25K64l93K29j95lL31l92
2628h1L19Mm4k82J50k33J67J58j33k7k02J16J34K27k91l35Q6k6J28M44k11k72
2650b04P1J17lK00p7j54j28j1N19k61P6k21KJ15K41q0r4j81k03L12J67l45J68
$$ plain form
2673 26 -271 -329 -10 192 75 -45 -191 -55 -114 398 207 -43 45 -161 74 274 -7 -43 21 49 -16 190 96
2696 96 -200 -253 157 137 213 73 -445 -130 174 256 393 150 -210 -107 -128 -66 175 84 -125 77 117 163 -1
2719 -1 102 -3 -85 -14 63 44 -71 -136 -148 74 222 -14 -100 -336 101 28 -160 56 -5 -188 101 45 269 -101
2743 -101 -147 -247 46 225 13 -398 84 54 6 246 13 412 29 -88 50 215 256 107 88 -57 51 40
2765 40 209 -124 -245 -226 30 -102 252 55 -174 143 -149 171 73 2 144 24 45 39 64 81 95 245 -90
2788 -90 58 190 -28 -381 -289 99 107 -130 -115 -139 -123 167 217 138 -64 -271 -29 -13 509 -178 -184 15 -180 -68
2812 -68 17 76 -240 -184 -134 196 236 54 -26 -17 -236 113 29 -28 -68 28 2 374 94 -294 -250 -215 -51 -7 26 -134
2838 -134 -306 -95 105 -9 108 18 -33 -137 -14 408 61 191 -66 172 259 253 110 -169 -8 124 96 7
$$ packed form
2673B6k97n8L19K02j17j20j46J36n9N12j91k50Q8k06K35K00k81l6O4K8o5K06r4
2696I6k96n3M10k0P6j40n18L15L04Q2J37k43l60J03k1O2K41r1k09K02M0M6j64
2719aJ03j05q2P1P7j9j15o5j2K22J48k36q6k36M37p3j88K16o1j83K89n6K24l70
2743a01m6j00K93J79k12m11M82l0m8K40k33L99l83j17J38J65M1j49j9j45J08j1
2765D0J69l33j21J9K56j32L54j97k29L17k92L20r8p1J42j20K1oK5J7J4J50l35
2788i0J48J32k18l53R2L88Qk37J5k4J6K90N0p9k02k07K42J6N22o87oJ99j95J12
2812f8Q5N9l16N6N0L30M0j82q0Rk19L49q4n7m0R6k6L72k80l88M4L5J64M4L3j60
2838a34j72K11K00j14J17r0n1j04J23M22l47J30k57K38Q7oj43k79J61J32k8q9
$$ plain form
2860 7 -96 -282 -135 -132 -75 -146 -139 -339 -61 144 0 22 -36 -99 -205 25 291 199 -291 -21 -165 -66 124 65 -308
2885 -308 -104 23 -78 301 160 145 -109 104 -79 213 105 -11 -65 -301 231 128 -240 -226 -197 -74 116
2906 116 87 -36 212 -82 -50 592 86 -32 76 -204 -203 83 409 -114 29 -147 59 96 -20 170 80 -127
2928 -127 76 26 -130 -164 35 -104 142 -168 -154 -275 -254 -177 214 201 3 18 -65 179 110 -112 -28 59 -16 -147
2952 -147 259 217 124 -108 -221 -117 82 217 -11 -169 -29 -369 -81 -7 -75 -107 183 42 177 17 240 -65
2974 -65 175 3 21 281 130 17 -7 45 1 175 -28 34 -97 57 -174 224 127 -237 152 -87 190 98 -245
2997 -245 61 46 -248 27 -3 80 -4 -66 13 -64 -20 -87 -198 -43 113 134 52 -93 -81 213 143 129 -31 -355 -34
3022 -34 -58 -89 225 145 -12 135 -97 -19 66 -379 -18 226 -264 147 137 -180 -312 22 -3 -190 -98 214 -221
$$ packed form
2860Gj03j86J47LN7p1Pk00K78K05j44K2n8o3j06K30K66r2m90K70j44R9J90n9l73
2885c08K04J27j01L79j41j5k54K13j83K92j08j16n4k36N32j03l68J4K9J23J90
2906A16k9j23K48k94L2O42n06j18J08k80JK86L26n23J43j76K06L7j16J90r0k07
2928a27K03n0j56l4J99j39K46l10J4j21K1P7L91j3j98J5q3K44o9k22Q4Q7p5j31
2952a47M06m2r3k32j13J04J99J35k28j58J40l40K88P4o8l2K90j41J35j60K23l05
2974f5K40j72J8K60j51j13k4N2m4J74k03O2j31J54k31L98r7l64L89k39K77r2l43
2997b45L06j5k94K75l0Q3q4o2P9p7M4o7j11J55J56K1q2j45J2K94p0j4j60l24L21
3022c4k4l1L14q0j57J47k32P8Q5m45L61K44m90M11j0l17j32L34k5j87R2L12m35
$$ plain form
3045 -221 290 97 203 -157 -115 -8 -35 136 -5 92 26 -88 170 179 116 -7 -185 -179 40 -3 -38 -119 50 -161
3069 -161 -153 -69 296 -26 20 -20 219 32 107 54 123 41 -168 42 -27 192 -268 -229 68 30 -113 -4 -53 41 16
3094 16 145 15 -60 -225 -78 -22 127 -34 5 -192 -199 -166 -82 -51 -26 -85 393 344 -127 -229 -146 -380 -6 210
3118 210 -64 -166 -66 49 93 82 173 -129 75 -69 -51 100 -184 -8 -167 56 -70 260 270 42 -80 -24
3140 -24 -163 40 81 44 130 50 123 -30 53 201 -49 -90 145 -156 51 -90 -56 -143 -235 168 18 -289 -236 -232 92
3165 92 21 -12 -191 84 161 191 41 -182 299 -91 80 47 32 4 -106 -97 -97 254 -12 149 -233 -45 94 -34
3189 -34 -39 -336 -89 -66 237 13 -93 13 147 -30 31 -29 -112 -15 128 252 324 12 49 -238 -19 174 -15
3212 -15 25 -141 -167 -173 231 -36 -254 -179 -191 117 55 89 125 -5 25 100 -2 19 -94 64 -115 38 175 253 -89
$$ packed form
3045b21N11j93J06l60M2J07k7J71j41R7o6j14K58Ro3j23j78OK19m3l5q1J69k11
3069a61QQ4L65l22M6m0K39j87P5n3O9q2k09K10o9K19m60L9K97l8j43J09m9R4k5
3094A6J29j30p5j65J47N6J49j61L9j97pL3Q4L1K5n9M78m9m71j02Q3k34L74K16
3118B10k74j02J00J15M4j1R1l02K04j44J8J51k84J76j59K23j26L30J0k28j22N6
3140b4j39K03M1l7Q6q0P3j53Q3J48k50m1K35l01K07j41L4q7r2M03j50l07N3ML24
3165I2p1l3j79K75P7L0j50k23M81l90J71l3j5k8j10R%L51k66J61l82J88J39j28
3189c4nk97K47K3L03k24j06J06J34j77O1o0q3R7J43J24P2l12L7k87K19J93j89
3212a5M0j66k6oM04k67k18P5j2L08o2L4L6j30L0P5j02K1j13J58j79J53J37P8l42
$$ plain form
3237 -89 -71 10 -59 68 438 107 -74 284 49 261 -99 -7 -26 9 -137 178 112 -128 -21 -201 88 76 -58
3260 -58 -99 -168 -179 65 -61 224 -17 -143 -101 -140 173 133 170 -178 -91 1 202 228 103 -14 105 -37 -86 81
3284 81 -33 -189 -29 -6 187 -97 -63 -71 -99 -30 99 115 -20 105 -85 120 0 21 29 -69 -103 -39 74 93 -50
3309 -50 249 157 128 10 -66 234 -136 -148 -161 36 -13 -108 -1 62 -54 49 -106 -80 -167 0 294 77 -124 164
3333 164 -292 20 43 360 63 -158 147 -73 69 359 10 84 -89 106 170 298 134 -296 11 25 -139
3354 -139 -170 86 93 -201 53 11 -215 158 4 202 158 167 167 -88 -252 145 146 -133 8 120 149 -2 -6 -49 229
3379 229 130 -92 -144 44 -183 -51 -62 -242 2 -41 -211 154 -87 -166 -109 237 72 -188 195 62 -27 -5 -194
3402 -194 49 -113 -238 135 123 135 -177 -86 -87 -86 134 -187 -324 -9 4 29 15 -31 152 -5 -7 -63 85 80 66 -65
$$ packed form
3237h9J8Q1o9J27L70l31j81L58k35K12l60R2j9L5j46L15o6k40J07j80K89j2j34
3260e8m1o9j1K44j26K85k41j26M2l9L13m0L7l48Q7R2K01K6j25j17J19j42m9J67
3284H1j14j56J60K3J93k84L4qk8O9J29J6j35J25j90K05j20K1Qr8l4O4J13J9j43
3309e0K99r2k9j18p6L00l70j2j3J97m9r5J07O3j16J03j55K6q7J67K94k17k01K88
3333A64m56L12K3L17k97k21L05k20J42K90l49P4j73J95O4J28j64m30L07J4j64
3354a39l1K56Pk94K54m2k26L73j54J98m4R%k55j64L97Jk79J41J12K9j51mm3K78
3379B29r9k22n2J88k27J32j1j80K44m3j70L65k41p9N7L46j65k60L83j33q9K2j89
3402a94K43j62j25L73j2J2l12R1jJK20l21j37L15J3K5j4m6J83j57kn6J48nj4j31
$$ plain form
3428 -65 -72 -28 -32 -65 -208 -172 419 370 -20 -12 -13 -54 -67 215 250 -78 -17 61 40 -76 -46 93 12 -175 86 -102 -209
3455 -209 -134 183 -154 -55 205 3 18 -89 80 -20 219 44 -54 217 114 -244 -99 52 212 56 -12 60
3477 60 34 257 -246 -67 4 -51 26 -82 289 1 -41 227 -2 -152 -129 -39 -100 157 372 -195 -67 43 178
3500 178 12 -42 42 -49 -85 22 218 -3 224 -30 272 -168 -37 -9 -148 -255 135 -100 1 -63 -85 -96 84
3523 84 -18 -110 63 -217 30 -128 -22 -2 -275 100 -4 -221 128 28 -42 18 212 -1 -153 16 -193 19
3545 19 -77 -24 99 -14 36 -270 137 321 298 70 -202 -184 18 -19 -82 115 -112 -207 24 209 -55 71 -204
3568 -204 93 175 121 113 -91 17 -77 171 -80 137 48 -41 42 125 120 -13 130 -46 16 42 1 146 -91 -229 120
3593 120 -167 105 55 12 -85 -17 -113 -13 167 91 12 85 127 -114 212 41 -141 -77 -12 -113 -31 -49 -106 79 266
$$ packed form
3428f5pM4ml3j43L6N91m9l90Qjm1j3K82L5l28O1P8k1j16L0J39q1j87K61j88j07
3455b09P5L17l37R9K60k02J5j07J69j00K39j75r8K71j03l58J45J51J60j56o8P2
3477F0k6K23n03J79P1n5P7j08L71k88m2K68k29j50K3R0o1K57K15n67J28J10J35
3500A78j66n4Q4r1l6J07J96k21K27k54L02m40J31K8j39j07L90k35J01o4k2j1J80
3523H4j02r2J73k80K47j58J06K0k73L75j04k17L49j00p0O0J94k13j52J69k09K12
3545A9r6N3J23j13N0l06M07J84k3k28k72J8K02l7o3J97k27r5K31J85k64J26k75
3568b04K97Q2n4qk04J08r4K48k51K17q9q9Q3Q3nj33J43j76O2K6m1J45k37j38L49
3593A20k87K72n0m3r7O8r6J00J80p6p9P3M2k41L26j71j82O4O5j01Q2j8n7J85J87
$$ plain form
3618 266 -39 -178 52 -44 87 306 -188 -56 -60 -271 190 361 0 146 -82 15 336 161 80 -37 115 61
3640 61 3 160 173 20 44 -134 20 -159 104 -489 0 -13 -143 229 233 -35 -6 -109 148 194 -57 -20 -28 -56
3664 -56 -10 77 240 111 -84 140 -54 73 139 82 108 47 11 -131 -9 -43 -126 -84 -59 -100 -30 -280 123 43 -89
3689 -89 55 -179 8 49 -41 99 333 42 129 -51 -80 -159 72 94 -73 -14 -35 19 -51 96 43 -106 73 207
3713 207 245 171 -174 166 -45 147 -39 -103 -104 19 -18 8 -196 -200 -255 79 68 -80 191 284 -23 35 104 197 26
3738 26 -52 91 157 -104 171 50 -145 62 -120 64 -75 -80 133 -117 -4 140 -154 -101 11 56 100 -1 113
3761 113 -89 13 26 38 -234 -88 16 -100 217 -33 24 -160 40 -150 114 -256 -148 -232 -174 -42 -31 0
3783 0 -49 -90 -47 -130 -210 -234 199 37 79 5 31 198 34 33 135 256 -39 59 -1 -6 -53 -76 -52 91 -116 7 -135
$$ packed form
3618B66l05j39K30r6J31K19m94J32mk11M61J71l61J46k28R7L21j75q1j17J52n4
3640F1n8J57J3j53K4j78J54j79K63n93M89j3j30L72Mk68K9j03K57M6k51L7qk8
3664e6M6Q7J63j29j95K24j94J27O6n7K6o1l6j42J22l4q3M2K5m1P0k50M03q0j32
3689h9J44k34J87M1r0J40K34k91Q7j80k9p9K31K2j67N9k1N4p0J47n3j49J79J34
3713B07L8p4l45L40k11J92j86o4jJ23l7K6k04mn5L34j1j48K71R3l07N8O9R3j71
3738B6p8J43O6k61K75j21j95K07j82J84j39nK13k50J13J44k94N3J12M5M4j01J14
3761A13k02J02J3J2k72J46J04j16L17k50N7j84K00j90K64l70J08q4N8J32J1L1
3783@m9m1M3q3q0k4M33j62M2p4K6J67j64jJ02J21k95R8o0nm7k3K4J43k07J23j42
$$ plain form
3810 -135 29 158 172 -100 67 -149 25 244 15 47 58 95 1 -125 -9 61 -21 104 134 47 235 138 64 -5
3834 -5 -111 -3 -176 -155 -17 242 -59 9 125 10 -242 18 85 119 -45 167 -75 -112 -112 67 89 -60 -165
3857 -165 43 -125 -164 -293 -15 215 137 -92 148 33 -70 218 -21 -63 135 -96 -128 167 -63 90 -80
3878 -80 81 -218 126 117 -123 130 36 -19 75 8 94 71 -101 -73 149 173 163 83 47 -63 -33 -111 53 -61 -154 89
3904 89 53 143 -65 -126 -293 -53 113 218 14 -113 213 102 10 176 -149 15 -12 231 -16 225 -50 187
3926 187 -28 171 -93 125 -167 -186 -59 -131 25 22 -120 67 53 -49 134 -21 195 71 130 59 276 -184
3948 -184 -56 187 -21 243 63 232 49 -152 -44 -82 166 52 82 90 94 -91 -27 -69 153 -103 123 58 -190
3971 -190 -244 15 6 -120 195 52 -88 26 69 -23 -228 -225 72 -111 -168 8 42 -11 -147 -323 135 155 130 109
$$ packed form
3810a35J64J29J4k72J67k16J74K19k29L2J1L7r4j26J16P0q2J25L0q7J88r7p4o9
3834ej06J08j73K1J38K59l01O8J16j15k52K60O7L4j64K12k42l7%J79K2j49j05
3857a65K08j68l9j29K78K30p8k29K40j15j03K88k39m2J98k31l2K95k30J53j70
3878h0J61k99L44rk40K53r4n5R4o7Q6k3j72K8K22K4j0q0l6j10L0p8J64j14r3K43
3904H9l6R0k08o1j67K40J66J05k04j27L26j11r2J66l25J64k7K43k47K41k75K37
3926A87k15J99k64K18k92j9J27p2J56lj42J87j4j02J83j55K16j24N9p1K17m60
3948a84J28K43k08K64j80J69j83k01J08l8K48j14L0QMj85O4m2K22k56K26o5k48
3971a90n4K59rj26L15j43j40J14M3r2k05LK97j83n7J76L4n3j36j76M58K0k5k1
$$ plain form
3995 109 39 -65 -96 -10 4 224 -45 66 -297 -178 315 126 13 -36 -119 56 -162 41 -12 171 -131 -19
4017 -19 -112 -176 19 43 20 -191 20 -8 -101 -130 -114 226 -166 262 21 177 2 45 -204 -268 -51 -98 184 109
4041 109 16 -37 -193 -102 56 126 207 109 54 12 -96 -71 55 80 201 203 186 108 206 511 8 -175 -56 11 36 -44
4067 -44 18 -86 -190 -11 40 -178 -91 -29 5 -12 134 143 48 -77 27 -130 51 59 -4 21 115 19 -222 -325 46
4092 46 157 -123 29 -63 -156 -21 151 59 167 -129 -76 161 -246 -168 -92 92 -173 -97 -57 26 -273 -101 -25 -87
4116 -87 143 87 -185 88 -29 -219 -150 183 -238 -275 -99 -251 -53 157 171 -180 -29 -320 -253 -41 111 48
4138 48 -193 -128 234 28 196 -44 -50 -24 53 6 -52 263 45 -292 -60 106 -115 -78 -165 -49 82 -30 -27 52
4162 52 -8 -234 -209 -25 240 -89 -163 111 -168 261 190 157 67 -70 -29 61 -9 210 135 108 -10 -24 -240 19
$$ packed form
3995A09p0j04l1Q6J4K20k69J11l63J19M93j89j13m9q3J75k18K03n3J83l02J12
4017a9r3o4J95K4k3k11K11k8r3k9J6L40l92M28k41J56j75M3k49o4K17m7K82p5
4041A09r3n3j56R1J58P0Q1r8n5m2j08K5J26K5J21Kj7p8R8L05n03j83J19O7K5q0
4067d4O2j04j04J79N1k18Q7O2L4j7J46Rr5j25J04j57J81Qo3K5R4r6k41j03L71
4092D6J11k80J52r2r3J35J72r2J08k96N3K37m07P8P6J84k65P6M0Q3k99J72P6o2
4116h7K30n6k72K73j17j90O9L33m21l7J76j52J98K10J4l51J51k91O7K12J52o3
4138D8k41O5L62k06J68k40oK6P7m7n8L15k18l37K32J66k21L7q7J16J31j12LP9
4162E2o0k26K5J84K65l29p4K74k79M29p1l3r0j37M1R0p0K19p5k7j18j4k16K59
$$ plain form
4186 19 -44 -162 -2 -34 -115 87 -6 -244 -70 121 -171 10 45 20 -125 -50 -216 72 -74 7 29 -67 21 -86
4210 -86 -27 177 -266 112 -299 91 213 40 116 9 -149 -47 194 -154 115 184 -33 -62 91 131 -147 -112
4232 -112 36 -33 -197 -22 -34 106 21 44 36 -50 107 26 51 230 -48 84 29 -17 -72 -59 62 168 15 -67 -137
4257 -137 -118 47 66 -77 -62 146 -23 -305 -97 73 51 -39 134 184 -93 63 -236 -147 120 -119 -68 65 235
4280 235 -207 -130 -106 -257 -114 49 47 -141 163 -36 143 -237 -283 -110 73 126 -23 -167 124 28 -138 128
4302 128 3 -72 64 -193 51 -202 31 105 107 215 -88 106 258 67 -161 -83 -88 145 -131 19 62 118 242
4325 242 -193 -204 -139 79 64 -299 -236 -46 -138 -268 110 288 137 -71 -92 33 -127 8 -16 -11 26 -54 286 63
4349 63 -157 52 240 -129 127 185 121 -162 41 94 -129 -240 4 -152 -320 102 -192 118 -50 21 -156 -35
$$ packed form
4186A9o3j18J60l2q1K02r3k38J74J91k92J81L5k5j45P5j66K88j46Q1K2r6Q8j07
4210h6N9K04m43L78m11L90J22j73P6j07j58J02K41l48K69O9k17k9J53M0k78L5
4232a12J48o9j64J75j2J40q5K3qq6J57q1K5J79k78J32n5m6n5J3J21J06j53q2p0
4257a37J9J65J9j43J5K08j69k82K08J70k2r0J73N0k77J56k99Q9K67k39N1J33J70
4280B35m42P7K4j51J43J63kj88L04j99J79l80m6J73J83N3j49j44K91r6j66K66
4302A28j25p5J36k57K44k53K33P4KJ08l03J94J52j91k28P8nK33k76J50M3N6J24
4325B42m35j1O5K18j5l63O3J90r2j30L78J78j51k08k1J25j60J35k4NL7q0L40k23
4349F3k20K09J88l69K56N8o4k83K03N3k23j11K44j56j68M22k94L10j68P1j77J21
$$ plain form
4371 -35 -53 121 -228 153 -108 162 248 218 -81 -101 -94 -117 75 -127 56 -106 122 -424 194 -206 50 -119 -44
4394 -44 238 -78 0 -51 -35 -138 -126 145 139 128 111 120 172 -18 135 78 -23 -41 143 32 39 60 -263 3 -84 -27
4420 -27 68 -298 4 -139 46 24 99 81 -91 47 -140 -117 28 175 169 -55 31 19 75 -156 -45 -137 -25 10
4444 10 -105 94 282 169 -62 -274 132 -4 101 -19 71 53 200 -183 -99 -59 39 133 -115 224 138 161 -303
4467 -303 96 308 188 84 124 -223 40 -98 -87 184 -47 -197 -161 -66 102 -215 320 -245 7 -77 -135 -297
4489 -297 -34 -98 -192 118 -123 -152 -161 -152 -51 175 -19 33 -7 152 -44 134 -460 -84 81 229 -115 149 215
4512 215 -67 148 -144 195 -140 103 -130 -105 168 -47 -164 -76 -104 -28 110 -27 135 58 -71 92 -55 -201
4534 -201 -2 -11 107 -17 66 -45 -77 -158 222 -3 -331 -148 -94 -126 93 3 -171 -143 61 70 -156 206 -12 -173
$$ packed form
4371c5j8J74l49L81k61K70Q6l0k99k0Pk3J92k02J83j62K28n46O18m00K56j69P5
4394d4K82l16P8n1J6j03J2K71oj1j7RN2j90J53n7j01j8J84j11PK1l23K66q7N7
4420b7R5l66L02j43J85k2P5j8j72J38j87K3J45J47ok24Q6j2N6k31J11r2J12L5
4444A0j15J99J88j13k31k12M06j36J05j20R0j8J47l83Q4M0R8R4k48L39q6K3m64
4467c03L99K12j20j04M0l47K63j38J1K71k31j50L6R5J68l17N35n65K52q4n8j62
4489b97K63o4r4L10k41k9rRJ01K26j94N2m0J59j96J78n94L76J65J48l44K64O6
4512B15k82K15k92L39l35K43k33K5K73k15j17Q8k8P6J38j37J62p7j29J63j47j46
4534b01J99rJ18j24Q3j11l2q1L80k25l28J83N4l2K19r0j74K8K04Rk26L62k18j61
$$ plain form
4558 -173 -181 191 -112 -40 -181 143 -81 7 79 -132 -3 -3 372 -73 160 -71 -72 58 -132 117 -71 -23 67 -224
4582 -224 58 28 166 134 -86 -149 -66 -54 -37 -8 209 57 -65 32 -47 26 94 -141 192 293 -23 -202 17 6
4606 6 3 130 -206 -231 -75 64 -34 -215 -51 254 59 47 116 196 -68 -83 -56 -24 336 60 -49 -140 -168 72 38
4631 38 79 -27 225 -106 -11 -127 259 68 65 67 -93 84 8 -67 16 238 -41 -84 -81 -179 -95 -62 -26 12 328 -29
4657 -29 -28 -144 -125 -153 34 -20 194 40 60 -179 -40 200 119 -98 -87 -203 -66 -34 -254 272 -23 296 -26
4680 -26 -265 116 224 -143 -69 -40 -15 -115 -3 13 -37 -12 -49 -33 93 -72 -153 208 200 -32 94 -99 102 131
4704 131 34 72 72 -54 -211 -55 -10 165 -108 -66 -56 33 -274 -121 110 -173 87 0 -11 -89 17 21 -38 -65 -261
4729 -261 132 96 147 20 81 -87 -36 -74 94 174 311 8 131 95 -105 13 195 97 27 -6 46 -28 -28 124 97
$$ packed form
4558a73qL72l03P2j41L24k24Q8P2k11J29%L75m45K33k31jJ30j90K49j88M8R0k91
4582b24K82l0J38l2k20o3Q3J2J7K9K17j52j22R7p9P3O8k35L33J01l16j79K19j1
4606FlJ27l36k5J56J39r8j81J64L05j95j2O9Q0k64j5K7L2L60k76j09r1k8K40l4
4631C8M1j06K52l31R5j16L86j91lKj60J77p6p5Q3K22k79m3Lr8Q4L3L6L8L16l57
4657b9Jj16J9k8J87n4K14j54K0k39J39K40q1k17J1j16J37L2k20N26k95L19l22
4680b6k39L81J08l67P4K9K5j00J12J6n0K5l7J6J26j65q1L61qk32J26j93K01K9
4704A31r7L8%j26j57J56M5J75k73M2J0Q9l07J53K31k83K60q7j1p8J06Mn9k7j96
4729b61L93l6N1j27O1j68N1l8J68Q0J37l03J23l6k00J18J82r8p0l3N2p4%J52k7
$$ plain form
4754 97 -98 -110 -164 69 -89 -136 97 280 -16 -119 223 62 106 110 174 -16 -207 47 -53 -228 -15 65 -196
4777 -196 58 303 -288 -82 -88 -212 -173 118 -132 64 -46 93 9 -25 18 145 94 70 -186 118 140 163 128 -78
4801 -78 -24 -63 47 41 -223 -87 -41 195 8 84 -204 -3 -86 -114 157 -9 -63 -171 11 -159 45 -208 62
4824 62 -206 39 15 -12 87 31 18 -99 106 8 -58 -272 6 100 -44 75 457 211 -124 -46 -145 -61 72 -19
4848 -19 51 -242 47 100 -166 -117 31 207 -213 -60 -30 69 -128 135 88 -55 -7 154 60 -53 -262 -109 -19
4871 -19 55 104 -108 -190 -204 251 26 9 67 -76 116 155 15 58 -98 -204 -47 189 12 -144 -163 -100 45 153
4895 153 101 134 -70 -202 -81 -202 32 -71 -56 -207 -53 46 -115 122 95 -44 146 -111 -67 -89 110 142 211
4918 211 88 -63 -151 71 127 -171 -114 -173 39 -278 -66 73 -216 154 11 90 230 -57 -116 131 256 -238
$$ packed form
4754I7j95j2n4K33j58m7K33J83k96j03L42j61M4MO4j90j91K54j00j75K13Q0k61
4777a96K54K45n91K06oj24L9K91k50J96j10J39q4l4M3J27n1k4k56L04K2K3l5k06
4801g8N4l9J10ok64J36M6K36j87P6k88K01q3k8K71j66n4j08J82j70K04k53K70
4824F2k68K45k4k7R9n6j3j17K05r8o6k14K78R4j44J19L82k46l35P8r9Q4J33r1
4848a9P0k93K89N3k66M9J48J76m20J53L0R9j97K63m7j43M8J61r4j13k09J53R0
4871a9P4M9k12q2j4M55k25j7N8j43J92L9j40M3j56j06J57K36j77j56j9O3J45J08
4895A53n2L3k04j32J21j21K34j03J5j51J54R9j61K37k7j39J90k57M4k2J99L2O9
4918B11j23j51q8K22N6k98N7n9K12l17K12J39k89L70j43P9J40k87n9K47J25m94
$$ plain form
4940 -238 -125 -209 5 -121 -134 43 -96 -119 -37 -133 -11 -138 -125 -79 -93 95 46 12 103 186 78 -22 -28 450 23
4965 23 -79 211 -120 -13 281 5 -343 224 -28 19 77 161 66 129 -225 -75 -69 -172 157 113 -141 4 121
4988 121 164 144 -33 84 -81 9 79 -137 155 81 55 84 -40 59 -128 0 -14 199 124 -21 236 37 27 -56
5012 -56 93 80 -47 250 -55 55 -39 175 119 -215 105 3 -66 133 34 52 -186 46 63 -154 138 111 164
5035 164 112 35 -36 -146 -153 65 8 172 -136 23 -102 144 25 -17 175 34 -122 -47 214 -63 -17 -41 -79 29
5059 29 -40 -111 -62 70 -113 -126 -133 89 130 -184 -154 100 -139 229 -236 -16 142 -176 88 -43 56 32 55 -112
5083 -112 5 -178 -82 -149 -230 16 -137 158 135 120 89 185 -23 -76 -187 16 78 -277 70 -12 112 -38 -215
5106 -215 -2 61 65 -204 -5 8 211 0 155 60 -182 -207 -130 -56 181 -112 75 -240 72 85 -245 127 1
$$ packed form
4940b38J13q4K14j26j3J77j39k3Q2r6J22j27J3M6j4J88m9l4R1Q3j08j00oM78m27
4965B3j02K90l31J07K94k76l48N67k52M7N8Q4r5O3l54J50Oj03L29m4k54J45J17
4988A21M3k0j77J17j65R0P0k16K92p4k6K9j24R9j87J28j4K13p5j45K57j99j0q3
5012e6J49j3j27K97l05J10r4K14n6l34L20j02o9J99r9J8k38K32J7k17K92k7N3
5035A64n2p7p1j10pK18n7J64l08J59j25K46j19m2J92j41j56P5K61k77M6k4l8J08
5059B9o9p1M9J32j83j3pK22M1l14L0K54k39L68m65K20J58l18K64j31R9k4K3j67
5083a12J17j83R6o7q1K46j53K95k3j5l1R6k08n3j11K03O2l55L47q2J24j50j77
5106b15K13O3Mk69J99J3K03k11J55r5k42k5P7P4K37k93J87l15L12J3l30L72j26
$$ plain form
5129 1 -29 157 203 83 104 -47 -31 -57 94 115 -45 -106 162 -95 -286 62 39 -109 -9 -155 19 -29 358 -92
5153 -92 188 -69 110 -124 -51 92 -82 104 -47 -90 -41 35 61 -55 13 -181 -43 -240 184 37 -85 247
5175 247 -1 -10 140 97 -39 48 194 -156 -193 -57 54 -49 45 -186 -114 114 -148 104 -237 107 -163 436
5197 436 -114 1 9 99 -115 -120 51 -44 -145 -148 62 -198 -128 97 69 95 -88 185 149 -6 -129 127 -17 83
5221 83 80 64 -182 95 173 -58 76 -133 -125 238 -96 -166 -95 8 182 -284 6 189 30 -74 118 39 71 -28
5245 -28 252 73 -76 29 -117 217 111 46 3 46 61 -51 -239 59 -39 102 -8 189 -62 -197 -3 52
5267 52 34 -212 -108 -20 56 -90 221 -98 116 18 19 -214 -284 -134 1 13 142 -280 94 -25 -209 37 -186
5290 -186 -312 332 20 -31 3 -44 86 109 122 44 -52 49 -66 -180 46 79 -18 -94 66 -32 37 -23 -36 25 115
$$ packed form
5129Al0J86M6j20K1j51J6k6J51K1j60o1K68k57j91L48k3j48J00j46J74m8L87m50
5153i2K80k57J79k34P3J43j74J86j51m3M9P6K6j16O8j94J38j97M24j47j22L32
5175B47k48rJ50m3j36Q7J46l50l7J36J11j03R4k31P2K28k62K52l41L44k70N99
5197D36n50J15QR0k14nJ71r5j01lK10k60P0K25k8K6j83K73l6j55j23K56j44J00
5221H3lj6k46K77P8k31J34k09QL63l34p0P1J03J74m66K90J83j59j04J92p9L2r9
5245b8K80j79j49J05j46L34j06o5m3M3J5j12j88K98r8J41j10J97k51j35J94N5
5267E2j8k46J04Q8P6j46L11l19K14r8Jk33p0J50J35J2J29m22L74j19j84K46k23
5290a86j26O44l12n1L4m7J30K3J3p8r6J01j15j14K26L3r7p6J60r8O9o0j3O1R0
$$ plain form
5315 115 151 -4 -36 216 -74 34 215 121 104 -129 105 -106 -18 -80 -21 -55 -21 91 60 -246 -89 124 51 -90
5339 -90 49 -4 -134 -66 129 -153 -185 236 -202 -30 151 84 24 -201 94 -22 -56 440 12 -78 10 49 -100
5362 -100 -11 74 -68 -30 -153 -141 -254 -7 -125 -78 253 -17 118 -100 50 -238 -48 18 77 25 18 107 101 -158
5386 -158 353 338 -104 -75 -156 83 -132 -76 -52 110 -134 -2 -146 -193 49 38 -158 0 96 -184 227 -126 -329
5409 -329 36 -119 -139 -12 269 -43 83 -74 93 113 -164 -71 215 -171 44 -206 91 80 84 -126 -31 -103 16
5432 16 -241 169 289 138 251 50 56 -53 -4 -79 75 87 -202 -9 -44 -78 120 22 4 16 94 -115 -75 262
5456 262 74 -81 106 175 -128 -126 378 -17 18 -120 -244 -118 -125 63 46 -56 -50 108 7 -178 12 1 108
5479 108 6 -54 -35 56 303 -156 -32 -125 -67 -72 38 -80 6 195 -74 57 -94 83 -54 -29 50 75 228 -87
$$ packed form
5315A15L6j55l2K52k90J08J81r4j7k33K34k11Q8o2N9l4L4J12l1l06J57K13p3j41
5339i0J39n3j30O8J95k82l2M21m38J72J81o7o0k25K95j16l4M96m28r0Q8L9j49
5362a00Q9Q5j42L8j23J2j13K47j18M7L31k70J35k18J50k88J90O6N9n2pQ9ok59
5386a58N11j5m42K9q1K39k15N6K4J62k44J32j44m7K42j1j96J58R6k80M11l53k03
5409c29L65j55k0J27K81l12J26j57J67K0k77R3K86l86K15k50K97j1Mk10R5p2J19
5432A6k57M10J20j51J13k01Oj09M9p5J54J2k89J93l5l4J98r8j8J2P8k09M0L37
5456B62j88j55J87O9l03KN04l95L5j38j24J26pJ88j7j02OJ58j01j85J90j1J07
5479A08j02o0J9R1K47m59J24r3N8nJ10j18Q6J89k69J31j51J77j37K5P9K5J53l15
$$ plain form
5503 -87 41 50 83 118 -167 -35 -11 -31 75 -334 97 -10 29 -40 322 -20 -26 32 183 40 -80 101 -201 255
5527 255 -134 -95 -92 -181 -202 -65 -170 74 52 -18 151 -164 148 89 -174 22 15 -191 156 226 -94 15 128 -13
5551 -13 -77 55 -139 -51 -104 -169 -54 -91 -61 47 100 40 27 68 -88 1 64 -125 79 -158 167 -273 -63 -182
5575 -182 110 109 -100 -12 -168 52 -13 52 -8 -17 -2 -63 -81 -118 5 19 -102 106 84 -136 192 157 -28 -53 198
5600 198 -64 187 10 221 198 -28 -1 111 84 102 132 -150 -141 -6 -253 -80 38 -104 3 128 -201 191
5622 191 15 -47 54 -277 -209 -21 -187 -93 -29 86 -110 49 26 112 107 -42 152 102 335 -52 132 109 106 -92
5646 -92 -52 60 98 -72 -134 -100 98 158 -172 -13 216 -20 82 206 78 -217 3 133 58 266 153 -196
5668 -196 96 -255 34 -139 46 131 -119 29 48 -144 -54 -6 -133 -107 173 -153 172 161 334 57 32 232
$$ packed form
5503h7J28RL3L5k85J32K4k0J06m09M31j07L9o9L62l42oN8J51j43j20J81l02M56
5527B55l89L9Lq9k1J37j05K44k2p0J69l15L12n9k63J96pk06L47P0l20J09J13j41
5551a3o4J32j94Q8n3o5J15l7L0J08N3o0j3M1j56Q9O3j89K04k37L25m40K10j19
5575a82K92jk09Q8j56K20o5O5o0rJ5o1j8l7J23J4j21K08k2k20L28l5j85k5K51
5600A98k62K51j77K11k3k26K7J12k7J8L0k82RJ35k47J73J18j42J07J25l29L92
5622A91j76o2J01l31O8J88j66R4O4J15j96J59k3Q6nj49J94n0K33l87J84k3lj98
5646i2M0J12L8j70o2L4J98O0l30J59K29k36J02J24j28k95K20J30p5K08j13l49
5668a96K92l51K89j73J85Q5k50J48J9j92R0M8j27K6K80l26L25j1J73k77k5K00
$$ plain form
5690 232 73 13 47 -183 153 120 121 271 -32 -167 25 -123 -60 103 -297 -69 164 80 76 -62 77 102 -249
5713 -249 -113 -261 -339 -104 129 -32 -326 -52 -122 3 -93 -71 -237 85 153 -48 165 93 -109 36 211 -94
5735 -94 252 11 14 -11 -85 24 169 -208 -50 -43 -35 108 58 -56 -8 85 -52 70 -26 158 160 -3 72 -70 -100 -17
5761 -17 -170 -136 35 180 -35 -11 -67 -243 -34 -70 -20 24 63 -165 67 -44 -88 232 -169 -168 121 195 12 115
5785 115 -155 23 -134 -27 -61 -359 82 -30 159 292 41 77 -12 220 -122 45 -125 -52 81 -49 -414
5806 -414 69 227 70 -32 -150 51 70 138 -441 19 -154 15 66 -230 -119 -17 -206 235 -23 -68 -180
5827 -180 126 9 -116 100 202 -65 -87 -276 4 -215 88 292 2 178 -1 65 28 -85 -85 116 -11 141
5849 141 -56 -1 -34 22 28 -38 9 88 104 -150 212 -36 59 83 256 60 88 80 9 156 35 21 73 180 -226 -60
$$ packed form
5690B32j59o0L4k30L36l3JJ50l03j35J92j48O3J63m00K28K33q4mj38J39K5l51
5713b49J36j48p8K35K33j61k94K74p0J25r6K2j66L22O8k01K13p2k02J45J75l05
5735i4L46k41Lk5p4J09J45l77J58PQJ43n0j14M8R3j37J22r6J84Kj63P5j42l0Q3
5761a7j53L4J71J45k15K4n6j76K09l6N0M4L9k28K32j11m4L20m01JK89P4j83J03
5785A15k70J78j57J07l4k98M41j12J89J33k51L6q9K32l42J67j70P3J33j30l65
5806d14M83J58j57j02j18K01J9O8n79M60j73J69N1k96J11J02j89M41k58m5j12
5827a80L06j17j25K16J02k67k2j89K80k19L03K04k90J76j79O6l7j13%K01j27J52
5849A41j97N5l3N6Oo6M7P9J6k54L62k48R5K4J73j96K8qp1J47j21j4N2J07m06J66
$$ plain form
5875 -60 8 -131 88 12 -26 -123 -115 -59 -52 -112 90 -123 51 -156 -87 163 124 -14 -13 58 123 94 -100 -97 -2 173 -6
5902 -6 148 -7 -83 9 252 83 -202 -29 48 149 -20 -339 -13 19 12 155 17 -161 -139 -42 159 92 -170 80
5926 80 -278 44 140 50 -82 -41 -7 142 -222 295 -142 11 208 -14 -31 -8 134 -167 26 61 178 -166 -59
5949 -59 -163 -126 10 105 31 27 99 -18 -74 74 -120 27 194 234 -123 46 -140 100 -86 127 -81 -57 -171
5972 -171 106 -18 10 135 169 -13 -61 3 138 115 -47 -132 -4 -27 -116 91 -81 125 35 95 -67 -35 132 -81
5996 -81 -256 -46 -98 -182 105 -568 -125 -105 8 28 -15 -25 -171 50 -193 -81 -38 -66 99 148 38 -109 64
6019 64 -49 48 140 190 43 177 176 -134 17 17 -14 -106 -170 -88 -94 -174 -18 -294 88 -69 56 154 40 -150 -251
6044 -251 130 104 -199 -53 -33 -64 -127 300 19 -171 -77 -81 2 35 -72 -101 8 57 174 -45 297 -36 -129 -98
$$ packed form
5875f0O8j39K19p6l8r7QN6Po0K02k13J74k07O9K50l9j38JP1O5k9j94LR5J75j79
5902fJ54j55p6R2K43j69k85J73P7J01j69l19L26L2pJ43j38j78K2R7K01o7k62K50
5926H0l58L22R6r0j32M1L4J49l64N17m37J53J97k22j7K3J42l01J93L5J17l44J07
5949e9j04L7J36R5p4mP2j17n6J48j94J47J67M0l57J69j86K40j86K13k08K4j14
5972a71K77j24K8J25L4j82m8O4J35k3j62q5J28k3q9K07j72K06r0O0j62L2J67k13
5996h1j75K10n2q4K87o73M43K0J13K0m3j0j46K21k43J12M3k8J65M9j10j47J73
6019F4j13R7R2N0j47J34jl10J51%l1r2o4Q2oq0J56k76L82j57J25R8j14j90j01
6044b51L81k6l03J46K0l1o3M27k81j90R4mQ3L3j07k9J09M9J17k19L42l33r3L1
$$ plain form
6068 -98 112 75 -94 59 -186 -346 13 -3 -12 -9 7 17 -23 -36 38 -117 -376 187 -236 12 153 -82 1 -133
6092 -133 12 111 131 193 -14 48 187 -72 -175 2 314 -122 217 -89 -25 -50 -82 -126 88 -25 1 2 -56 -120
6116 -120 15 116 46 -63 -123 8 257 9 181 156 -83 -282 39 -16 -155 -23 -255 128 -112 -292 16
6137 16 120 165 34 -121 -13 -44 -188 -262 104 -235 -54 37 -115 -273 -92 35 -40 -153 352 47 156 310
6159 310 71 123 -192 -90 89 227 118 105 -115 -159 -284 -146 139 114 80 314 -40 60 -44 -263 -95 -122
6181 -122 -98 -12 43 -85 -153 -46 74 226 221 -107 -129 -189 -214 38 -32 -92 83 113 77 -192 -21 133 -26 -96 -72
6206 -72 79 95 -181 -146 -48 -13 -46 153 -176 205 -51 -164 44 -65 219 -29 198 -82 -105 10 -89 -64 61
6229 61 -97 -28 5 173 93 12 -153 -109 139 -12 159 -131 139 -88 -18 41 40 70 -1 -72 63 -64 81 -62
$$ packed form
6068i8K10l7j69J53k45j60L59j6rLJ6J0m0j3P4j55k59N63m23K48J41k35Q3j34
6092a33J45R9K0O2k07O2J39k59j03J77L12m36L39l06O4k5l2m4K14j13K6Jn8o4
6116a20J35J01p0j09o0J31K49k48J72k5k39j99L21n5j39J32k32L83k40j80L08
6137A6J04M5j31j55J08l1j44p4L66l39J81R1j52j58J81J27p5j13N05l05J09J54
6159C10k39N2l15J02J79J38j09j3k20m4j25J38K85k5l4K34l54J00j04k19J68k7
6181a22K4Q6N5j28o8J07J20J52nl28k2o0k5K52p0o0J75L0l6k69J71J54j59p0K4
6206g2J51J6k76L5R8L5l3J99l29L81k56j13K08j09K84k48K27k80k3J15r9K5J25
6229F1j58O9L3J68q0q1j65M4K48j51J71k90K70k27P0N9jL0p1p1J35j27J45j43
$$ plain form
6253 -62 -33 162 -145 105 58 -56 51 323 29 185 -94 31 150 -47 30 -159 -242 -285 96 274 142 -1
6275 -1 49 309 86 -75 73 65 -134 -79 57 -89 6 31 18 17 63 -47 -188 112 82 -279 -183 151 -243 156 -21
6300 -21 -142 20 71 -281 -166 41 50 -267 4 37 -178 28 -156 131 -245 45 7 -58 41 -58 -292 18 2
6323 2 179 -42 79 164 -179 -2 10 23 -147 -109 56 -38 114 -427 -61 105 190 -9 -80 -187 -122 -21 -39 -362
6347 -362 -40 148 -71 191 58 89 126 154 100 106 17 -116 93 -19 66 -112 57 402 67 -48 126 7 -56
6370 -56 106 -196 -188 -92 48 128 5 -342 80 -12 -9 -22 40 -14 -384 269 -63 11 98 282 -61 -37 -28 8 -216 -69
6396 -69 -101 21 -113 27 -87 111 20 -212 98 55 -8 -313 -121 -275 167 -201 8 -99 -195 -85 22 -46
6418 -46 -45 136 -99 -254 127 -76 126 -124 -57 155 -76 -76 254 1 -37 55 135 -224 137 -215 -25 -25 5 -69
$$ packed form
6253f2K9J95l07K50m7j14J07K72k94J56k79J25J19j97P7j89q3m3L81J78j32j43
6275aN0K60k23j61J48qj99N5J36j46R5K5j3jM6j10j41L00l0l61R6L34l94L99j77
6300b1j21J62N1l52J15K07Rl17K71L3k15K06j84K87l76K90l8o5R9r9k34L10j6
6323BJ77k21J21Q5l43J77J2J3j70L8J65r4J52n41L66J66Q5j99p1j07O5J01j8l23
6347c62L22J88k19K62j33L1L7K8n4Oq9j33K09j12Q5j78J69L45l35j15J74j19o3
6370e6J62l02QR6J40Q0j23l47M22r2Lj3O2n4l70O53l32P4Q7J84l43K4RL6k24J47
6396f9l2J22j34J40j14J98r1k32L10m3o3l05J92j54M42l68K09j07r6J10J07o8
6418d6JJ81k35j55L81k03K02k50O7K12k31%L30k53l8R2Q0l59L61l52J90%L0p4
$$ plain form
6442 -69 -140 -2 -342 -109 -82 -271 -234 -13 -135 -257 94 -72 174 284 -47 234 244 75 361 175 -30 102
6464 102 -84 74 -257 -66 -144 73 91 -22 -33 93 -73 -75 99 -58 127 -212 -254 -108 18 -32 -194 120
6486 120 149 69 -115 -97 37 74 90 115 -2 -165 -46 -161 77 43 155 80 -99 231 -26 161 91 -27 200
6509 200 121 85 226 -100 56 107 77 409 111 53 -66 -22 109 -37 -22 -161 247 -59 -19 -135 -24 94 4
6532 4 279 -90 264 286 17 -20 28 -4 -2 133 40 125 -174 -137 56 49 -129 44 -306 263 3 107 18 -124 -104
6557 -104 -38 -117 39 -109 40 -25 239 -9 -32 260 -8 -226 -81 196 -47 5 68 6 -116 101 -184 1
6579 1 10 -170 68 -96 -39 75 -109 -42 81 148 62 90 -216 -179 10 -129 -56 -143 277 134 54 -162 56 -115
6603 -115 8 239 205 -7 -115 238 13 -10 111 -109 153 122 -203 97 138 -120 -229 82 -22 217 -124
$$ packed form
6442f9p1J38l40K33K7j89L7K21j22j22L51j66K46J10l31K81J0j69K86j86k05J32
6464A02j86J58l31J91p8K17J8j13j1J26j66kJ74j57J85l39m2J46J26n0j62L14
6486A20K9q0j84J8J34L7J6K5j17j63J19j15K38l4J12p5j79L30k57J87p0j18K27
6509B00p9l6J41l26J56N1l0L32k98n8j19M4J31j46J5j39M08l06M0j16J11J18r0
6532DK75l69L54K2k69l7M8l2KJ35r3Q5k99L7J93pj78J73l50N69k60J04q9j42K0
6557a04O6p9J56j48J49o5K64k48k3K92k68k18J45K77k43N2O3o2j22K17k85J85
6579ARj80K38j64N7J14j84O7J23O7q6K8l06L7J89j39P3q7M20j43q0k16K18j71
6603a15J23K31l4k12j08L53k25k3J21k20K62l1l25L00M1k58j09L11j04K39l41
$$ plain form
6624 -124 -319 -116 281 -85 103 -174 -5 -92 -175 95 198 282 53 64 -13 135 69 59 -253 44 -164 114
6646 114 -67 41 41 -285 -259 -14 147 -134 41 -179 -147 -81 -230 152 -334 33 113 -89 184 14 -209 -4
6668 -4 -16 -153 54 227 -71 -183 -4 59 -64 -119 185 18 105 37 216 183 -87 56 299 181 170 -52 -76
6691 -76 97 -241 324 -28 30 -9 0 -57 36 -20 -21 113 -323 173 -58 -28 -10 227 -123 39 -114 -105 308 12 246
6716 246 -23 99 -86 -65 134 -45 -43 -110 -219 -80 -168 62 77 -41 -85 2 252 -37 -82 195 2 150 48
6739 48 98 168 -48 128 -27 -47 44 92 132 196 40 -7 -177 56 -174 -15 -36 -160 -44 -57 -138 -66 -163 -82 97
6764 97 -146 36 -107 -159 -66 75 11 72 -165 -35 295 -77 133 -294 99 -13 74 101 67 82 13 -28 103 -129
6788 -129 -233 -257 -155 44 -109 120 265 -21 -149 -15 54 -101 -5 -108 79 218 296 284 175 198 18 1
$$ packed form
6624a24j95K03L97l66J88k77J69q7q3K70J03Q4k29J1p7J48o6j0l12K97k08K78
6646A14j81J08%l26K6K45J61k81J75k20L2O6j49L82m86L67Q0k02K73j70k23K05
6668dj2j37K07J73k98j12J79O3j23n5L04j67Q7o8J79l3k70J43K43j18j1k22k4
6691g6J73l38N65l52N8l9Rn7R3n6jJ34m36M96k31L0J8K37l50J62j53RM13k96K34
6716B46k69J22j85K1J99j79Ko7j09J39q8K30J5j18m4Q7K50k89m5K77j93J48j02
6739D8N0P0k16J76j55k0R1M8M0O4j56m7j70K33k30J59k1j24J16j3q1P2r7Q1J79
6764I7k43J82j43n2R3J41o4O1k37J30L30l72K10m27L93j12Q7K7l4J5o9m1J31k32
6788a29j04k4J02J99j53K29J45k86j28J34O9j55R6j03J87J39P8j2j09K3j80j7
$$ plain form
6810 1 110 171 -116 104 -69 -215 260 160 -97 19 -213 -33 75 70 -103 -37 -2 44 -59 213 6 74 297
6833 297 -33 -55 170 23 174 50 130 112 -85 -69 48 -230 -176 46 -61 93 147 36 -141 -40 65 402
6855 402 -72 -159 144 -75 -206 -74 -76 -61 28 0 -110 114 -183 -136 141 -42 84 -212 -55 199 -36 -71 -87
6878 -87 -113 102 135 181 35 -10 -63 -74 -110 322 -39 -73 -22 59 5 245 138 -96 -59 242 152 69 42 7 68 -233
6904 -233 -130 -236 3 134 22 -237 42 125 -131 -8 -30 79 204 20 -63 19 -179 149 11 -167 -70 161
6926 161 5 -98 51 -138 68 162 -110 -27 16 71 -107 83 -29 63 130 28 285 -105 -53 -8 -10 -47 -38 -65 -100
6951 -100 51 -284 -228 -76 -46 146 -5 5 88 210 -212 -45 20 -64 -143 -135 69 -132 -80 360 -79 14 -129 -83
6975 -83 -179 -30 -87 -136 -360 -35 -44 42 126 -132 34 -93 -5 -136 32 -226 -238 120 119 97 -220 6 170 218 -29
$$ packed form
6810AJ09O1k87K20j73j46M75j00k57J16k32J80J08nj73O6L5M6j03K72k07O8K23
6833B97l30k2K25j47J51j24Q0j8j97J6J17k78N4K22j07J54N4j11j77J01J05L37
6855D02m74q7L03k19j31J32kJ5Q9k8j10K24k97M7K77j83J26k96J57K54k35l5j6
6878h7k6K15L3M6j46m5n3j1l6M32l61l4N1Q1n4K40j07k34L7L01r0q3k7l5O1l01
6904b33J03j06K39J31j12k59K79Q3k56J23k2J09J25j84q3Q2j98L28j38j78R7K31
6926A61j56j03J49j89K06R4k72Q3M3N5j78J90j12R2O7j02K57l90N2M5kl7Rk7l5
6951a00J51l35N6J52L0J92j51J0Q3J22m22J67O5q4p9QK04k01N2M40m39R3j43M6
6975h3r6J49n7m9k24L25rQ6Q4k58J66j27Q8j31J68k58j2L58jk2l17K26J64M8k47
$$ plain form
7000 -29 -141 122 -199 -142 44 -161 59 32 -122 82 -94 -11 51 89 -95 -24 -11 55 -156 -45 -40 -97 44 -274
7024 -274 -35 -240 -111 73 -65 95 -16 38 -13 12 -91 -176 -89 20 309 62 -44 165 -245 50 159 18
7046 18 81 -407 66 110 67 -229 50 39 -325 -45 -206 -115 -211 260 175 -8 94 -88 -215 25 -94 -38 -93
7069 -93 -121 -103 38 66 -154 -57 -90 27 48 -85 154 213 -6 58 21 67 -200 -171 -19 -135 -12 -80 -128 -15 69
7094 69 169 258 33 68 214 -172 -30 -4 -139 69 46 174 -246 -18 143 -188 -60 -177 -27 45 -30 -20 -180
7117 -180 59 227 62 180 -37 96 33 -67 -85 253 102 -21 -25 -129 185 25 235 -101 -9 20 77 178
7139 178 -73 -151 -5 11 -241 -37 60 -9 -42 196 -251 30 -47 79 9 -67 -250 206 144 194 -185 123 -39
7162 -39 -193 -68 214 -193 -68 -11 35 -121 164 202 134 -222 5 -57 -162 -12 71 94 40 -80 -92 125 117 183
$$ packed form
7000b9j12K63l21N7J86k05K20k7j54K04j76Q3O2L8j84P1J3O6k11J11Nn7J41l18
7024b74K39k05J29J84j38J60j11N4n1K5j03q5Q7J09K89k47j06K09m10K95J09j41
7046A8O3m88M73M4m3k96K79j1l64K80j61R1r6M71q5j83J02j82j27K40j19N6n5
7069i3k8J8J41K8k20R7l3J17K1j33K39N9k19O4l7M6k67K9J52j16J23o8m8J13Q4
7094F9J00Q9k25L5J46l86J42K6j35K08k3J28m20K28J61l31J28j17J50P2p5J0j60
7117a80K39J68j65J18k17J33o3j00j8L38j51j23mj04L14j60K10l36R2K9N7J01
7139A78k51p8J46J6k52K04R7o9l3K38m47K81p7J26p0p6j83M56o2N0l79L08j62
7162c9j54J25K82m07J25N7M6j56K85L8o8l56K27o2j05J50Q3K3n4j20j2K17qO6
$$ plain form
7186 183 65 98 -86 -17 -131 70 50 8 -43 -75 119 96 109 -257 -17 -261 131 -87 -89 -109 103 50 12 227
7210 227 -32 163 167 -124 -93 78 -130 255 222 65 -2 -44 -182 0 -59 -145 5 -76 -284 -4 -20 -215 80
7233 80 37 146 67 -239 133 276 -294 -33 -141 -64 -240 100 -27 44 -71 -107 -7 -61 -69 -266 31 7 -66 -44
7257 -44 -246 -14 -14 7 -12 -4 -47 99 -126 -80 -38 -77 -113 -201 -39 77 -301 408 138 -173 -182 50 -15 -88 117 69
7283 69 -16 118 -1 -390 11 -37 18 -18 198 60 -42 36 12 19 -297 21 199 -60 -111 -10 84 -147 -155 174
7307 174 -139 -67 22 82 117 30 -283 52 276 16 -195 -210 -38 -34 86 -56 -99 257 -46 -207 134 -239 127
7330 127 -98 -3 123 21 -94 223 40 -167 -6 140 85 141 71 -4 -123 9 -21 -37 -32 -116 174 -161 -91 48
7354 48 -48 241 190 110 109 290 192 158 17 77 118 -193 -18 -77 -69 104 263 -210 86 -172 216 -159 22 121 -136
$$ packed form
7186A83j18L3j84O9j14K01k0m2n1l2J94k3J3l66K40k44L92k18kk0K12n3l8K15
7210B27k59J95Mk91L1J71k08L85l3j57o7m2j38J82n9q6J50q1k08K80j6j95K95
7233H0m3J09p9l06L72J43n70K61j08P7j76L40j27P1j15l6J00n4qj97K97k4p3K2
7257d4k02K32%K1j9Qm3J46k25M6M2l9l6q8J62J16l78P09k70l11rK32o5p3K05m8
7283F9q5J34j19l89M01m8N5l6K16j38j02P8k4Pl16L18J78k59n1J01R4k31qL29
7307A74l13P2Q9O0L5q7l13L35K24k60k11j5J72MJ20j42m3L56l03j61L41l73L66
7330A27k25R5J26j02j15L17j83k07J61J46n5N6p0p5j19J32l0j6Nq4K90l35P0J39
7354D8r6K89n1q0jJ81r8l4j41O0M1l11J75n9QJ73J59m73K96k58L88l75J81R9k57
$$ plain form
7379 -136 -58 207 234 40 237 -79 122 -14 -37 -248 -128 104 -51 -9 -31 -89 19 -119 120 -105 19 -106
7401 -106 9 -109 60 175 263 59 99 -13 80 10 15 -11 208 165 -159 -197 -22 -38 -196 67 -89 -95 -180 -241 -42
7426 -42 68 -224 86 -97 25 -14 -56 -235 3 28 -233 -89 110 119 139 193 -105 73 -20 102 -95 37 19
7449 19 57 -1 133 -49 -164 33 184 173 -17 36 227 3 -84 175 -11 59 44 -82 120 209 -96 -80 132
7472 132 81 42 -19 45 -33 102 360 -63 141 -123 -118 -116 -183 187 61 141 -165 66 171 -177 371 32 119 -13
7496 -13 102 -79 -127 81 86 31 110 -148 -4 172 211 -56 -124 0 66 68 -210 118 -128 -169 -74 22 136 -148 -83
7521 -83 -31 -37 -335 -382 57 -101 -22 50 -82 -87 -111 -69 132 -184 -41 150 47 -36 3 44 56 -32 -2 -49 -31 13 -252
7548 -252 69 113 2 -428 2 -30 174 -275 244 -71 -50 -59 177 2 23 -115 119 185 -273 43 -33 231 -22
$$ packed form
7379a36P8K65K7j94J97l16K01j36k3k11J20K32j55M2k2n8J08j38K39k25J24j25
7401a06J15j18J69J15Q8k04M0j12R3p0Nk6K19m3l24l8J75j6j58K63j56oq5o1J99
7426d2J10k92L10j83J22l9m2j79K38K5k61J44J99RK0N4k98J78r3J22j97J32j8
7449A9L8n8J34j82j15J97J51j1j90N3J91k24q7K59j86P0j5j26K02Q9l05J6K12
7472A32n1l9o1O4p8J35K58m23K04k64NKo7L70j26Q0l06K31J05l48N48l39Q7j32
7496a3J15j81m8K08Nn5P9k58J44J76L9k67o8J24O6Kk78L28k46m1R5R6J14k84O5
7521h3N2ok98m7M39j58P9P2j32nk4M2K01l16J43J91j03q3L9M1J2q8L0m7J8M4k65
7548b52L21M4j11m30M30l2K04m49N19l15K1rK36j75K1j38K34O6m58L16p6K64k53
$$ plain form
7571 -22 -112 -207 33 212 -50 139 253 65 13 -108 85 17 -109 -13 -6 -196 -107 65 -63 -34 159 117 29 192
7595 192 159 150 -102 -87 -236 137 99 -136 16 -181 -100 -120 -31 -14 -9 66 62 252 -47 40 113 -17 -102 74 126 -56
7621 -56 -93 -79 -233 -102 30 -13 -178 14 -165 -20 -56 103 68 97 104 36 68 -102 -221 -41 167 122 -50 -251
7645 -251 155 -231 -247 -27 -10 -109 326 71 102 -95 -32 147 -86 63 116 -195 95 41 201 174 58 50 11 -4
7669 -4 -334 75 -170 -114 -95 123 156 -135 -211 145 201 -135 8 -307 -52 217 -71 -7 -102 26 33 -36 -76 -180
7693 -180 187 195 -92 118 -48 -73 -171 121 -72 -80 -67 252 56 90 -27 234 112 -92 -11 -114 -26 52 -64 8
7717 8 -25 -22 -57 84 -219 6 -127 -179 -158 87 -431 -62 -104 4 207 -61 271 -81 -276 -183 -46 41 -91 -164
7741 -164 -179 -185 -61 45 154 165 13 -51 -126 74 162 89 -222 -54 86 59 48 -330 -77 139 -124 -149 127 -234
$$ packed form
7571b2r0r5K40J79k62J89J14j88n2j21J93o8j26R6Pj90Q9J72j28K9J93m2q8J63
7595A92l3rk52J5j49L73l8k35J52j97Q1k0Q9J7NP5mJ90k99Q7P3j30q5J76N2j82
7621e6l7J4j54J31J32m3j65J92j79J45l6J59l5K9Po8L2j70j19J80K08m5j72k01
7645b51M06l86j6K20J7r9M35k55L1j97O3J79k33J49N3l11K90n4J60k7j16ql9j5
7669dl30M09k45N6J9K18L3k91p6L56N6l36J43l15K55K69k88O4r5J28Po9m0j04
7693a80L67Qk87K10j66k5r8K92j93qJ3L19j96L4j17K61j22k04Q1j03Q8P8j16P2
7717Hl3Ll5J41l03K25j33n2K1K45n18L69m2J08K03k68L32l52j95R3J37Q7j32p3
7741a64j5oJ24J06J09J1j52o4p5K00Q8p3l11J68J40k7j1l78K53K16k63k5K76l61
$$ plain form
7765 -234 108 48 32 -129 -64 -69 25 -82 -39 34 -31 -1 -129 -37 114 16 -262 -10 157 11 -70 -58 -52 229 210 -65
7791 -65 -223 68 -1 -99 -138 91 -19 110 -31 43 244 -286 348 -120 -32 -38 63 36 66 70 163 -17 224 -26
7815 -26 -22 210 -155 -43 128 -35 11 239 -138 167 98 -73 179 134 101 -78 -30 -68 -177 256 97 48 6 131
7839 131 -13 -249 172 133 -23 -66 -8 -111 41 -120 75 109 33 253 -83 -35 -65 -251 -121 116 -106 -127 176
7862 176 -14 -221 -308 69 40 -75 -125 -217 -89 -6 -67 -171 -91 12 -58 50 -35 55 64 -34 -50 68 -98 95 -271
7887 -271 -30 -90 -279 41 -261 115 50 82 73 -45 49 238 25 -96 -72 -160 147 -206 -33 -52 219 178 -232
7910 -232 51 61 -86 -71 -146 -122 -9 -23 16 -84 -15 37 -179 37 3 101 -131 -39 -173 -129 100 -130 -165 -161 22
7935 22 -173 -85 -66 70 -285 -98 220 -54 55 -162 77 -17 128 244 77 111 -167 -211 182 -241 -24 -226
$$ packed form
7765b34L42o0j6j61O5nR4j07M3P3o5L0j28R2J51r8k78K52J67j46q1J2OK81j9k75
7791f5j58K91o9r8l9K29j10J29j41P4K01n30O34m68Q8oJ01k7L0MR3j80K41k50
7815b6MK32l65J12J71j63M6K28l77L05o9j71K52m5l3j79M8l8j09M33j59m9m2J25
7839A31j44k36M21l9j56m3N8j03J52j61J95L4p6K20l36M8l0j86J30K37k22k1L03
7862A76j90k07q7L77k9j15n0r2J28Q3o1j04Q0J03p0J08q5R0Rr8j6J18j66J93l66
7887b71K41o0j89L20l02L76o5L2rj18R4J89k13j21K4q8L07l53J73j9K71m1m10
7910b32K83J0j47J5p5K4J13j4L9j00O9N2k16K16l4R8k32R2j34M4K29k30l5MJ83
7935B2j95Q8J9J36l55J87L18k74J09k17K39r4J45J16j67L4k78m4L93m23K17k02
$$ plain form
7957 -226 -2 -51 -184 -206 -125 -209 5 -30 -213 171 86 70 78 -131 -3 -185 -24 104 52 -279 -226 9 -179 71
7981 71 -127 -23 -66 -101 118 56 -89 76 -145 -51 63 22 -59 -247 -126 -132 83 -18 -125 -49 87 174 -18 89
8005 89 -78 28 211 108 27 -10 -378 -121 -26 -67 48 131 51 -50 206 -36 -59 -111 -92 -209 287 -318 76
8028 76 27 78 61 -199 -1 67 139 -22 -26 -56 -98 -34 -75 -55 132 -99 -67 -130 -29 -66 160 -16 -94 14 21 91 -156
8055 -156 91 35 215 174 201 28 -19 141 -274 175 4 -30 108 -9 -185 245 -135 17 165 12 -138 -191
8077 -191 -231 -169 -92 -69 71 -164 42 -21 31 3 45 42 94 -247 237 -162 -104 65 -129 61 64 -103 -114 39 191
8102 191 -183 98 -97 179 -224 -33 269 35 39 6 213 -28 -3 111 -98 -180 -23 181 245 -269 52 84
8124 84 213 -127 -276 -51 -307 91 -109 50 137 16 -12 5 74 -93 129 126 -51 -31 138 7 138 23 -37
$$ packed form
7957b26K24m9j33k2Q1q4K14l5j83L84q5j6Qk09J28j82J61J28n2l31N3K35j88K50
7981G1j98J04m3l5K19o2j45J65k21R4J14m1q1j88J21oK15j01j07P6J36Q7j92J07
8005H9j67J06J83j03q1l7l68K57R5m1J15Q3q0j01K56k42k3n2J9j17M96o05L94
8028G6m9N1j7k60J98O8P2j61ml0m2O4m1K0J87k31L2o3J01l7K26j76p8J08PP0k47
8055a56K47n6J80m1K7j73m7J60m15M49j71l4J38j17j76M30l80J52J48j53j50n3
8077a91m0O2P7K3J40k35K06o3N2k8M2lN2l41M84l99N8J69j94J90Lj67j1J53J52
8102A91l74K81j95K76m03J91L02k34Ml3K07k41K5J14k09q2J57K04O4n14L21L2
8124H4J29l40j49K25k56L98k00J59Q7j21k8J7O9j67K22lj77K0J69j31J31j15o0
$$ plain form
8147 -37 -4 -228 -75 -43 230 -163 9 -155 -69 65 -63 13 140 -95 180 -356 -18 294 144 -125 175 -50
8169 -50 -212 -119 220 -239 32 -105 -91 75 25 -102 -74 216 0 32 -153 50 -20 56 -21 87 130 20
$$ packed form
8147c7L3k24J53L2K73l93J72j64Q6J34j28P6J27k35K75n36L38L12j50k69L00k25
8169e0j62R3L39m59K71j37J4J66n0j27K8K90k16L2j85K03p0P6p7J08M3j10
8191B0
$$ Imaginary data points
##PAGE= N=2
##DATA TABLE= (X++(I..I)), XYDATA
$$ plain form
0 0 0 0 0 0 0 0 0 0 0 0 0 0 0 0 0 -8 8 -8 8 -8 14 -16 16 -20 24 -26 32 -39 41 -48 56 -64 72 -81 91 -103 115
37 115 -130 145 -161 178 -200 220 -243 269 -297 329 -362 400 -441 484 -534 589 -651 718 -797
56 -797 885 -986 1105 -1248 1420 -1631 1900 -2256 2751 -3485 4688 -6995 12997 -61309 -107940
71 -107940 69102 88969 69716 134633 116686 15529 50243 87825 43084 35493 28673 -52609
83 -52609 -68445 -22268 -33073 -60437 -46327 -40674 -33309 -15098 -18242 -44554 -57314 -30509 29543
96 29543 60152 58940 64149 47160 22240 55445 76468 31109 4996 -9469 -64018 -64081 -17255
109 -17255 -47654 -83992 -45274 -32667 -28181 37827 53859 4052 12689 33174 7637 23631
121 23631 50388 11107 -9555 18571 14969 1439 7919 -12447 -31104 -4079 13371 -3447
$$ packed form
0@%%%%%%%%%%%%%%%qJ6j6J6j6K2l0L2l6M4n0N8p1Q0q9J04j20J36j53J72j94K18
37A15k45K75l06L39l78M20m63N12n66O26o91P62q41R25j018J123j240J369j515
56g97J682j871K091k353K668l051L531m156N007o236Q173j1683J9992p4306m6631
71a07940J77042J9867j9253O4917j7947j01157L4714L7582m4741p591o820q1282
83e2609j5836M6177j0805k7364J4110N653P365J8211l144k6312j2760K6805O0052
96B9543L0609j212N209j6989k4920L3205K1023m5359k6113j4465n4549o3M6826
109a7255l0399l6338L8718J2607M486O6008J6032m9807Q637K0485k5537J5994
121B3631K6757l9281k0662K8126l602j3530O480k0366j8657K7025J7450j6818
$$ plain form
133 -3447 -22443 -43367 -53741 -31984 -2853 14863 19252 5241 -859 14779 24750 27995 28616
146 28616 7461 -7568 9638 14413 -1241 -4515 -14471 -25798 67 22370 8766 1725 -4386
159 -4386 -27986 -21667 4112 -4981 -20267 -16484 -19116 -7874 23811 20336 -5201 -2023 9087
172 9087 17080 37914 34691 -254 -14301 -8867 -6138 7172 13529 -10012 -24257 -10781 -1309
185 -1309 -565 -4179 -20855 -28239 -6843 15084 16897 6037 -6896 -8437 6890 25431 30789 18515
199 18515 -1741 -9556 -3136 1563 243 -10146 -28113 -26022 -2630 7176 1853 -810 -9466 -12528
213 -12528 9803 26495 15383 6550 3651 -6301 1501 20071 10349 -8951 -8051 -6286 -3525 9456
227 9456 2613 -24686 -27510 -9473 -1381 5412 9964 -2532 -11923 1150 16227 18136 14334 5002
$$ packed form
133c447j8996k0924j0374K1757K9131J7716M389j4011o100J5638R971L245O21
146B8616k1155j5029J7206M775j5654l274r956j1327K5865K2303j3604p041o111
159d386k3600O319K5779r093j5286L783k632J1242L1685l475k5537L178J1110
172I087P993K0834l223l4945j4047N434K729J3310O357k3541j4245J3476R472
185a309P44l614j6676p384K1396K1927J813j0860j2933j541J5327J8541N358j2274
199A8515k0256p815O420M699j320j0389j7967K091K3392R806n323k663q656l062
213a2528K2331J6692j1112q833k899r952P802J8570r722j9300R00J765K761J2981
227I456o843k7299k824J8037Q092O793M552j2496r391J3073J5077J909l802r332
$$ plain form
241 5002 -6200 -1774 11755 9032 -6854 -14435 -12328 -6111 6366 12952 -374 -13978 -7647 1730
255 1730 4034 7907 4581 -9688 -11129 2334 7494 4407 1237 -8427 -11938 3872 14453 3165
269 3165 -5368 -6967 -11132 -3453 13382 12611 -294 -2673 65 3980 14365 15013 -2625 -13127
283 -13127 -6208 1301 3095 1334 -10803 -21606 -11522 5399 7954 3618 -1483 -9322 -5742 10299
297 10299 15774 3666 -5761 -7062 -2898 9856 16291 3606 -10295 -7295 1540 6804 9287 1333
311 1333 -13150 -13108 -586 5427 4356 1276 -8470 -10758 4272 15715 9485 -1087 -7247 -8893
325 -8893 -447 8996 3651 -8479 -10596 -6336 -641 8694 9249 -3637 -9258 -1217 7479 11230 8828
340 8828 -4017 -13883 -5587 8617 9911 3493 -2747 -7584 -2897 8978 9512 -2030 -9617 -9499 -5308
$$ packed form
241E002j1202M426J3529k723j5886p581K107O217J2477O586j3326j3604O331R377
255A730K304L873l326j4269j441J3463N160l087l170r664l511J5810J0581j1288
269C165q533j599m165P679J6835p71j2905k379K738L915J0385O48j7638j0502
283a3127O919P509J794j761j2137j0803J0084J6921K555m336n101p839L580J6041
297A0299N475j2108r427j301M164J2754O435j2685j3901L000Q835N264K483p954
311A333j4483M2J2522O013j071l080r746k288J5030J1443o230j0572o160j646
325h893Q446R443n345j2130k117M260N695R335N55j2886n621Q041Q696L751k402
340H828j2845r866Q296J4204J294o418o240m837M687J1875N34j1542p587J18M191
$$ plain form
355 -5308 4248 8899 -2410 -13588 -8929 1485 8789 11937 4652 -7572 -6264 3719 5697 1576
369 1576 -1706 -7765 -7587 4246 11153 5536 -806 -4190 -5352 4146 13577 7232 -4141 -8146 -7598
384 -7598 -3526 4047 3187 -5644 -7463 -1829 2108 4565 3145 -5971 -11885 -5520 5048 8987 4355
399 4355 -3390 -7438 -1408 11226 15184 8151 1384 -828 -897 3763 5741 -4526 -14848 -12026 -4182
414 -4182 1167 6028 1080 -11091 -9677 3170 8218 7827 5282 -4227 -7004 3228 5977 171 324
429 324 -825 -3799 4126 12324 4498 -6252 -9287 -9781 -2644 7032 3846 -6392 -8497 -3836 2953
444 2953 10198 11061 3393 -1680 1525 6838 6781 -49 -8170 -13635 -11328 618 7405 -920 -8345 -6173
460 -6173 -2735 4020 10619 3235 -6676 -1206 5091 4445 7311 3572 -9372 -5621 9800 11756 7571
$$ packed form
355e308R556M651j1309j1178M659J0414P304L148p285j2224J308R983J978m121
369A576l282o059J78J1833O907n617o342l384j162R498R431o345j1373m005N48
384g598M072P573q60q831j819N634L937K457j420r116n914O365J0568L939m632
399D355p745m048O030J2634L958p033o767k212o9M660J978j0267j0322K822P844
414d182N349M861m948j2171J414J2847N048l91k545r509k777J0232K749n806J53
429C24j149k974P925Q198p826j0750l035m94P137R676l186j0238k105M661O789
444B953P245Q63p668n073L205N313n7o830q121n465K307J1946O787q325p425K172
460f173L438O755O599p384r911N470O297o46K866l739j2944L751J5421J956m185
$$ plain form
475 7571 3113 -10170 -14642 -854 5037 -1632 -3638 -5917 -9261 -1086 6821 1928 -1993 -742 -484
490 -484 4254 8918 3141 -5806 -8302 -4631 3491 7275 3055 -1724 -3939 -1723 6884 8952 275
505 275 -4469 -2851 -2285 3940 9880 -837 -11225 -8329 -4661 974 10124 2831 -10773 -7098 -527
520 -527 -765 3728 4351 -3483 -1461 7601 5923 2782 1372 -5970 -4650 6327 8136 2708 -1816 -9294
536 -9294 -9226 727 5023 1056 -990 -4776 -5265 2749 6038 1778 732 -1754 -2146 6059 10198 3286
552 3286 -2417 -6686 -8833 -1827 3646 -2437 -6092 -4795 -5139 167 5709 955 -2551 1511 3550
567 3550 8489 13328 3329 -7779 -4878 -253 4858 11318 3294 -9515 -7358 -2331 -2910 757 -1112
582 -1112 -10495 -7781 1065 -281 -298 1020 -5361 -3262 10364 13637 7786 3627 -2046 -3541 4497
$$ packed form
475G571m458j3283m472J3788N891o669k006k279l344Q175P907m893l921J251K58
490d84M738M664n777q947k496L671Q122L784m220m779k215K216Q607K068q677
505B75m744J618N66O225N940j0717j0388K896L668N635R150p293j3604L675O571
520e27k38M493O23p834K022R062j678l141j410p342J320J0977J809n428m524p478
536i294O8R953M296l967k046l786m89Q014L289m260j046k486l92Q205M139o912
552C286n703m269k147P006N473o083l655J297l44N306N542m754l506M062K039
567C550M939M839r999j1108K901M625N111O460q024j2809K157N027n79L667j869
582a112r383K714Q846j346j7J318o381K099J3626L273n851m159n673j495Q038
$$ plain form
597 4497 6863 -136 -4536 -6794 -5885 198 3539 -566 -5246 -7516 -3864 5096 7198 1735 -3104
612 -3104 -7043 -6171 4556 8921 1826 -143 1399 -153 3906 6680 -2320 -7837 -2486 -1116 63
627 63 4413 -3766 -13437 -6229 4014 6135 8516 5272 -4399 -3160 5759 5777 2566 906 -4060 -4909
643 -4909 1989 4581 287 -3746 -5597 -4566 305 3068 -221 -5582 -7769 -4007 747 1683 871 444
659 444 -424 3323 9643 8365 3120 1260 -1723 -2205 5089 6419 -1776 -6858 -7049 -7010 -1161 4631 -916
676 -916 -6171 -3242 -2426 -1457 3189 1397 -4356 -2215 3269 5459 6781 4204 -2095 -1494 4632 6851
692 6851 3936 -1193 -5987 -6330 -1235 1689 -381 -4572 -6503 -3693 1702 5092 4292 -268 -4846 -1856
708 -1856 4567 6362 3888 -209 -4311 -2144 3447 3508 -2 -2355 -4771 -4162 1009 2354 -2347 -5765
$$ packed form
597D497K366o999m400k258R09O083L341m105m680k270L652Q960K102n463m839
612c104l939Q72J0727M365p095j969J542j552M059K774r000n517N351J370J179
627F3M350q179r671P208J0243K121K381l244r671J239Q919J8l211j660m966q49
643d909O898K592m294m033j851J031M871K763l289n361k187L762M754R36q12m27
659D44q68L747O320j278n245j860k983m82P294J330q195n082j91L9N849N792n547
676i16n255K929Q16R69M646j792n753K141N484K190J322k577o299O01O126K219
692F851k915n129m794l43N095K924k070m191j931K810N395L390q00m560m578K990
708a856O423J795k474m097m102K167N591O1l510k353k416O09N171J345m701l418
$$ plain form
724 -5765 -5302 -2314 4459 7844 2184 -2783 -811 2683 6558 8271 2175 -4381 -3052 434 2426
739 2426 2115 -2164 -7954 -6777 -996 2175 715 -3461 -7255 -4929 1937 5077 2778 -1305 -1933 1121
755 1121 5554 7635 4497 300 -1770 719 3617 3710 789 -4220 -6371 -3382 987 979 -1975 -4280
771 -4280 -5043 -2445 3050 2737 -642 -1848 -1598 -444 3517 5263 1298 -1650 -802 296 2880 4635
787 4635 266 -4545 -3281 535 1802 1527 -807 -4327 -4110 644 3662 2636 285 -2955 -2654 1299
803 1299 4468 2386 -1738 -3200 -2167 1041 3934 1959 -2884 -4320 -1407 1369 2235 1591 -2001 -4534
819 -4534 -2175 1717 3127 1855 -784 -2841 -449 4548 4941 867 -1695 -2139 -92 2954 4147 246
835 246 -3361 -3839 -2073 1315 3163 122 -5258 -5314 -1152 1921 2125 -1252 -4921 -3699 1812 5220
$$ packed form
724e765M63K988O773L385n660m967J972L494L875J713o096o556J329L486J992
739B426l11m279n790J177N781L171j460m176l794K326O866L140k299m083o28L054
755A121M433K081l138m197k070K489K898R3k921n009k151K989M369qk954k305
771d280p63K598N495l13l379j206K50J154L961J746l965k948Q48J098K584J755
787D635m369m811J264L816J267k75k334l520K17M754L018j026k351l240L01L953
803A299L169k082m124j462J033L208K893j975m843j436K913K776Q66o44l592k533
819d534K359L892J410j272k639k057K392M997L93m074k562m44K047L046J193l901
835B46l607m78J766L388J848l041n380n6M162L073K04l377l669J222N511L408
$$ plain form
851 5220 3758 223 -2363 -1373 3019 6494 4601 -555 -3021 -1880 991 3790 1366 -3867 -5421
866 -5421 -1867 1460 2047 -751 -4792 -5518 -1155 2561 2565 723 -1467 -2949 -20 4436 4995 1816 -463
883 -463 -996 719 3803 2807 -1372 -3837 -2535 -500 1840 2674 -1011 -3750 -3186 -451 1940 2352 128
900 128 -3033 -2270 820 2741 1911 -905 -2353 -676 2620 4232 1951 -2050 -3582 -2378 -336 1763
916 1763 2034 -1855 -3860 -1473 1588 3125 2483 -280 -1776 1261 3884 2414 166 -1533 -3196 -1114
932 -1114 2762 2320 181 -1100 -3062 -2039 1202 1487 -1518 -3498 -3912 -1955 1548 1997 -946 -2310
948 -2310 -744 1616 4684 5501 2380 -1097 -1551 9 2781 3048 -679 -3175 -2492 65 2395 1190
964 1190 -2692 -4186 -2156 477 1858 289 -3730 -5370 -2038 1234 3276 3715 145 -2054 1288
$$ packed form
851E220j462l535k586R90M392L475j893n156k466J141K871K799k424n233j554
866e421L554L327N87k798m041p26M363L716Mj842k190j482K929M456N59l179k279
883d63n33J715L084r96m179k465J302K035K340Q34l685k739N64K735K391M12k224
900A28l161P63L090J921q30k816j448J677L296J612k281m001j532J204K042K099
916A763K71l889k005K387L061J537o42k763j496L037K623j470k248j699j663K082
932a114L876m42k139j281j962J023L241K85l005j980m14J957L503M49k943j364
948b310J566K360L068Q17l121l477m54J560K772K67l727k496O83K557K330j205
964A190l882j494K030K633J381j569m019j640L332L272K042M39l570k199L342
$$ plain form
979 1288 4697 3684 2468 -826 -3214 101 3073 646 -1259 -1973 -3787 -1288 3085 2013 -1171
994 -1171 -1631 -2453 -1021 2388 1746 -2178 -2534 -1023 1025 3696 3262 -654 -2028 -976 876 3325
1010 3325 2439 -1477 -3613 -3366 -1423 1842 1974 -1427 -1596 107 1145 3107 2052 -2117 -1702 1894
1026 1894 2101 1620 1548 -2321 -3721 455 1882 803 820 -1950 -4580 -985 2505 120 -1829 -2369 -3388
1043 -3388 -614 3134 2495 237 -179 -724 165 3419 3371 1226 239 -892 -128 1434 387 -1147 -1638
1060 -1638 -1811 126 2021 -528 -3193 -2858 -2175 -611 2520 1643 -2513 -2433 -1106 399 3916 4324 -1124
1077 -1124 -2122 1192 1745 2644 3125 -1073 -3140 63 1206 560 852 -1379 -3739 -991 1331 157
1093 157 -562 -1828 -2437 310 2449 918 -954 -1929 -1855 1647 4159 1960 -90 -1597 -2351 -288 3177
$$ packed form
979A288L409j013j216l294k388L315K972k427j905p14j814K499M373j072l184
994a171m60q22J432L409o42l924l56J511K048K671m34l916j374J052J852K449
1010C325q86l916k136K47J943L265J32l401j69J703J038J962j055m169M15L596
1026A894K07m81p2l869j400M176J427j079J7k770k630L595L490k385j949n40j019
1043c388K774L748o39k258m16n45Q89L254m8k145r87j131P64J562j047j534m91
1060a638j73J937J895k549k665L35O83J564L131q77m156Q0J327J505L517M08n448
1077a124r98L314N53Q99M81m198k067L203J143o46K92k231k360K748K322j174
1093A57p19j266o09K747K139j531j872r75P4L502K512k199k050j507p54K063L465
$$ plain form
1110 3177 2291 -110 -1440 -2886 -899 2446 1361 -1690 -1443 -1099 -156 2224 1617 -1642 -1175 439
1126 439 954 2611 1815 -1892 -2163 -255 678 1803 909 -2829 -3793 -55 1549 1544 262 -2812 -3505 367
1144 367 2014 1645 1370 -358 -1617 1294 3015 1969 1313 -128 -1165 1006 2178 99 -1695 -2462
1160 -2462 -2657 -875 952 -855 -2441 -2539 -2085 -103 2122 1342 -572 -1083 -743 1618 3964 2460 -116
1177 -116 -63 280 1498 3027 1072 -1582 -1730 -1140 -924 787 -34 -2964 -3068 -905 321 1005 685 -1983
1195 -1983 -2240 1195 2755 1994 720 -710 -1536 971 2624 1516 415 -1229 -2064 -432 1533 1093
1211 1093 -464 -1992 -2253 32 1361 646 -428 -991 -597 996 2298 1013 86 -458 -1039 780 1929
1228 1929 812 -1176 -1920 -1968 72 1925 260 -2422 -2112 -741 341 2066 1519 -980 -1200 366
$$ packed form
1110C177q86k401j330j446J987L345j085l051K47L44R43K380o07l259M67J614
1126D39N15J657p96l707k71J908R33J125q94l738r64L738J604nj282l074o93L872
1144C67J647l69k75j728j259K911J721j046o56j441j037K171J172k079j794p67
1160b462j95J782J827j807j586r8M54J982K225p80j914n11L40K361K346j504k576
1177a16N3L43J218J529j955k654j48N90K16J711q21k930j04K163J226O84l20k668
1195a983k57L435J560p61j274j430q26K507J653j108j101j644q35J632J965m40
1211A093j557j528k61K285J329p15j074n63L94J593J302j285r27n44n81J819J149
1228A929j117j988p44m8K040J853j665k682L10J371J082J725n47k499k20J566
$$ plain form
1244 366 1887 2624 2058 -806 -1290 468 2335 1900 34 -2080 -2305 -444 954 402 -1658 -3124 -2341
1261 -2341 -247 591 616 -594 -1985 -1030 1222 2140 1931 184 -1030 -361 2205 3056 1067 -317 -1052
1278 -1052 -692 933 1707 -227 -1329 -1523 -1184 173 1196 -214 -2028 -2076 -693 763 1284 401 -1727
1295 -1727 -1447 360 1501 1369 667 -835 -1189 272 1694 1510 167 -1316 -1243 168 1815 1363 -722
1312 -722 -1780 -1269 222 981 748 -685 -1808 -808 420 1229 827 -98 -1249 -796 821 1881 759
1329 759 -413 -1464 -1204 828 1432 -17 -951 -1151 -682 551 1222 743 -538 -956 -277 987 1978 1178
1347 1178 -628 -1274 -89 1356 1880 428 -1239 -1738 -920 325 99 -823 -1819 -2098 -825 1011 1017 -431
1365 -431 -1764 -910 636 2232 2023 389 -708 -189 1499 1989 1321 -128 -1159 -510 808 918 132
$$ packed form
1244C66J521P37n66k864m84J758J867m35j866k114k25J861J398n52k060j466P83
1261b341K094Q38K5j210j391R55K252R18k09j747j214O69K566Q51j989j384p35
1278a052L60J625P74j934j102j94L39J357J023j410j814m8J383J456N21q83k128
1295a727K80J807J141j32p02j502l54J461J422j84j343j483P3J411J647m52k085
1312g22j058N11J491P59k33j433j123J000J228Q09m02r25j151M53J617J060j122
1329G59j172j051K60K032O04j449r34k00M69J233O71m79j281m18O79J264R91q00
1347A178j806o46J185J445N24j452j667m99Q18J245k26r22r96k79J273J836Oj448
1365d31j333Q54J546J596k09j634j097N19J688M90o68j449j031O49J318J10p86
$$ plain form
1382 132 -1301 -2391 -1932 67 835 -59 -1601 -2028 -700 913 1635 460 -735 -310 320 1401 1865
1399 1865 992 -743 -709 279 1466 1487 454 -1512 -1656 131 951 1021 -206 -1650 -1580 -51 1077 809
1417 809 -669 -1601 -825 393 1264 1252 -9 -1315 -468 1162 1045 778 -650 -1668 -993 673 446 -217
1435 -217 -734 -1103 -600 980 1176 204 -390 -355 83 1444 2013 605 -415 -360 -125 287 1035 -92 -1265
1454 -1265 -1389 -928 -255 -39 -493 -1349 -1507 -737 604 1675 546 -448 82 1328 2046 1937 687 -542
1472 -542 -160 473 888 1008 -683 -2152 -1595 10 421 31 -770 -2246 -1333 221 808 441 46 -1098
1490 -1098 -463 1436 1454 581 321 -342 -24 1228 1244 36 -717 -1015 -569 911 1385 -307 -1282 -1003 -131
1509 -131 933 1454 -81 -1310 -857 -428 389 1297 -278 -1594 -1261 -249 864 1293 -301 -1611 -413
$$ packed form
1382A32j433j090M59J999P68q94j542m27J328J613P22j175j195M25O30J081M64
1399A865q73j735L4R88J187K1j033j966j44J787Q20P0j227j444P0J529J128k68
1417H09j478r32P76J218Q71j2j261j306Q47J630j17k67j428j018O75J666k27o63
1435b17n17l69N03J580J96r72n94L5M38J361N69j408j020N5K35M12P48j127j173
1454a265j24M61O73K16m54q56j58P70J341J071j129r94N30J246P18j09j250j229
1472e42L82O33M15J20j691j469N57J605M11l90q01j476R13J554N87l67l95j144
1490a098O35J899J8q73k60o63L18J252J6j208p53k98M46J480M74j692r75K79Q72
1509a31J064N21j535j229M53M29Q17R08j575j316L33J012J113M29j594j310J198
$$ plain form
1526 -413 449 1073 930 -215 -1211 -201 951 609 612 -308 -1493 -204 1309 1202 501 -327 -1600 -301
1544 -301 1375 1452 -244 -644 -832 -721 1050 722 -293 -751 -904 -835 711 536 -574 -972 -521 -229 867
1563 867 1399 114 -63 275 741 1541 1366 201 -423 -474 -60 590 662 -740 -1741 -1180 -677 10 659
1582 659 -844 -1581 -572 316 489 965 191 -817 372 1152 1110 1191 182 -935 -317 1104 771 -331
1600 -331 -783 -1616 -919 642 707 -188 -658 -842 -444 668 1138 -70 -361 -719 -230 915 733 106 -646
1619 -646 -1059 -557 643 676 -655 -1260 -699 -234 509 1195 -263 -440 -56 599 1514 1694 71 -1276 -242
1638 -242 736 880 901 -750 -1975 -893 547 359 5 -622 -1635 -627 747 302 159 -313 -848 -149
1656 -149 1182 1087 300 -360 -690 309 1297 830 -471 -569 -631 59 912 537 -218 -503 -701 -285 664 569 -487
$$ packed form
1526d13Q62O24j43j145r96J010J152l42Lr20j185J289J513j07p01q28j273J299
1544c01J676P7j696m00j88J11J771l28j015m58j53O9J546j75j110l98M51K92J096
1563H67N32j285j77L38M66Q00j75j165o24n1M14O50P2j402j001N61N03O87O49
1582F59j503p37J009Q88J73M76p74j008J189P80m2Q1j009j117O18J421l33j102
1600c31m52q33O97J561O5q95m70j84L98J112M70j208k91l58M89J145j82o27p52
1619f46m13N02J200L3j331o05N61M65P43O86j458j77L84O55R15J80j623j347J034
1638b42R78J44K1j651j225J082J440j88l54o27j013J008J374m45j43m72n35O99
1656a49J331r5p87o60l30R99R88m67j301r8o2O90Q53l75p55k85j98M16R49r5j056
$$ plain form
1677 -487 -1130 -921 -454 576 697 -503 -873 -107 129 555 711 -213 -418 33 499 796 857 -253 -908
1696 -908 172 935 795 288 -596 -1168 -262 551 336 67 -653 -1104 -486 357 625 92 -363 -780 -128 872
1716 872 604 -356 -352 -746 29 473 181 -196 -536 -443 235 721 762 159 -239 -367 236 1198 1132 98 -699
1737 -699 -322 219 746 620 -772 -1060 -823 -269 143 401 -609 -1345 -375 75 799 545 -323 -978 113
1756 113 964 861 531 -146 -236 256 791 744 147 -758 -946 -15 218 326 -131 -795 -1043 13 545 423
1776 423 42 -816 -474 109 974 255 -192 -419 -289 132 675 366 -312 -571 -206 146 1007 528 -281 -567
1796 -567 261 661 765 399 -209 -834 -302 282 256 240 -598 -1005 -714 250 330 168 -601 -670 -60 705 921
1817 921 93 -581 -723 299 714 628 35 -513 -410 38 451 474 -368 -608 -383 187 701 245 -221 -482
$$ packed form
1677d87o43K09M67J030J21j200l70P66K36M26J56r24k05M51M66K97O1j110o55
1696i08J080P63j40n07q84n72R06Q13k15k69p20m51O18Q43K68n33m55m17O52J000
1716H72k68r60Ml94P75M44k92l77l40R3O78M86M1o03l98j28O03R62o6j034p97
1737f99L77N41N27j26j392k88K37N54M12K58j010p36R70M50P24k54q68o55J091
1756A13Q51j03l30o77r0M92N35m7n97r05j88R31K33J08m57o64k48J056N32j22
1776D23l81q58L42N83Q65p19m47k27J30M21N43l09o78k59L65L52Q61m79q09k86
1796e67Q28M00J04l66o08o25N32N84k6j6q38m07K91R64Q0j62p69o9O10P65K16
1817I21q28o74j42J022M15q6n93n48J03M48M13K3q42k40K25N70N14m56m66k61
$$ plain form
1837 -482 -552 44 829 310 -42 -455 -424 -107 346 239 -242 -758 -632 303 817 650 -276 -348 295 744 872
1858 872 585 106 -291 -40 453 631 310 -684 -993 -662 181 272 -171 -878 -833 65 407 476 47 -485 -271
1879 -271 575 670 591 399 -330 -458 177 648 412 78 -636 -499 341 616 456 -4 -544 -261 267 642 354
1900 354 -76 -528 -385 284 466 388 -382 -467 -425 252 480 101 -443 -552 -60 453 778 136 -223 -394 117
1921 117 670 679 176 -250 -588 -92 763 571 8 -551 -452 130 713 341 -131 -699 -528 217 626 226 -159
1942 -159 -697 -554 54 584 108 -420 -527 -443 368 746 524 -373 0 187 483 705 470 -80 -313 -347 -66
1963 -66 705 115 -778 -982 -405 -5 8 -286 -798 -763 -403 302 392 169 -492 190 335 880 819 637 -196 -349
1985 -349 390 716 374 96 -570 -705 -28 -132 -125 -277 -611 -517 95 226 146 -287 -76 123 594 803 401
$$ packed form
1837d82p0N96P85n19l52m13L1L17M53j07m81n16J26R35N14j67r26p2O43M49J28
1858H72k87m79l97K51M93J78l21r94l09L31Q43R1m43p07M5Q98L42O9m29n32K14
1879b71Q46R5p9j92p29j28O35M71k36l34p14J37Q40K75j60m60n40K83N28L75k88
1900C54m30m52J43O69J82p8p70q5M2O77K28l79n44j09M92N13L25o42l59j71N11
1921A17N53Rn03m26l38M96Q55j92n63n59R9N82N83l72m72n68J71P45M09m00l85
1942a59n38J43O08N30m76n28j07Q4Q11L78k22q97L73J87K96K22k35n50k33l4K81
1963f6P71n90q93k04N77M00J3k94n12L5L60P05R0k23o61O82J45N45o1j82q33j53
1985c49P39L26l42k78o66j35O77j04Pj52l34R4O12J31q0m33K11J99M71K09m02
$$ plain form
2006 401 -142 -262 -231 -5 710 177 -406 -283 -382 -71 354 270 -253 -154 -137 131 711 362 -67 -182 91 355
2028 355 542 -6 -330 -423 99 292 11 -320 -1036 -769 43 382 118 -84 -714 -632 608 627 336 152 -277
2049 -277 -247 644 842 271 91 -112 -275 355 608 -23 -532 -287 -352 98 226 -383 -790 -613 -172 312 361
2070 361 -296 -672 -193 14 185 437 386 -37 32 178 603 655 316 -140 -422 263 128 392 -28 -785 -274
2091 -274 -77 194 -2 -204 -577 -323 269 293 -59 -226 -256 -95 565 837 131 17 -524 -224 415 569 24
2112 24 -271 -441 -337 -45 542 -47 -181 -148 39 616 573 398 -195 50 78 -23 459 -2 -391 -345 -117 62
2134 62 232 -427 -841 -592 -145 -65 218 249 -441 -416 202 693 566 345 -295 -108 415 384 667 92 -406 -404
2156 -404 250 192 -278 -395 -744 -600 -86 159 -287 -363 -450 -481 540 486 -163 -274 -46 175 675 717 381 67
$$ packed form
2006D01n43j20L1K26P15n33n83J23r9L11M25q4n23R9J7K68N80l49m29j15K73K64
2028C55J87n48l24r3N22J93k81l31p16K67Q12L39k64k02o30Q2J240J9k91j84m29
2049b77L0Q91J98n71j80k03j63O30K53o31n09K45o5M50J28o09m07J77M41M84M9
2070C61o57l76M79K07J71K52n1m23O9J46M25N2l39m56k82O85j35K64m20p57N11
2091b74J97K71j96k02l73K54N92K4l52j67l0J61O60K72p06j14n41L00O39J54n45
2112B4k95j70J04K92N87n89j34L3J87N77m3j75n93K45K8j01M82m61l89M6K28J79
2134F2J70o59m14K49M47Q0K83L1o90K5O18M91j27k21o40J87N23l1K83n75m98K
2156d04O54n8m70j17l49J44N14K45m46p6q7l1J021n4o49j11K28K21N00M2l36l14
$$ plain form
2178 67 -12 -96 267 435 117 -513 -351 -177 206 327 -275 -318 29 -74 72 362 -223 -467 -194 159 291
2199 291 473 -195 -543 -152 158 326 98 110 -114 89 296 385 88 -199 -355 -476 200 381 -160 -165 -181 -103
2221 -103 110 316 -3 15 -36 104 166 184 -84 -466 -54 -64 -61 237 -137 -322 -307 -53 270 500 124 -238 35
2244 35 287 482 496 371 265 126 466 215 517 -268 -350 -429 -126 -81 -54 -392 -546 -237 108 66 -169 -286
2266 -286 -333 -122 74 608 263 -52 -146 -14 192 360 136 -182 -226 25 199 -200 -230 -308 -326 -261 165 236 -56
2289 -56 -385 -245 -38 57 208 123 -234 -186 130 207 173 -34 -441 44 -28 450 210 -35 -11 -98 350 420 412 192
2313 192 -262 -3 368 209 132 -104 -334 -171 231 126 -32 -150 -459 -55 112 59 -41 -221 -152 -224 36
2334 36 413 -5 -214 -558 -163 331 141 35 -271 75 379 399 265 -106 -63 -233 -44 345 264 -31 -379
$$ packed form
2178F7p9q4L63J68l18o30J62J74L83J21o02m3L47j03J46K90n85k44K73L53J32
2199B91J82o68l48L91L10J68k28J2k24K03K07Q9k97k87j56j21O76J81n41nj6P8
2221a03K13K06l19J8n1J40O2J8k68l82M12j0LK98l74j85J5K54L23K30l76l62K73
2244C5K52J95J4j25j06j39L40k51L02p85q2p9L03M5K7l38j54L09L45m2k35j17
2266b86m7K11J96N34l45l15r4J32K06J68k24l18m4K51J74l99l0p8j8O5M26P1k92
2289e6l29J40K07R5J51q5l57M8L16P7l4k07m07M85p2M78k40k45K4q7M48P0qk20
2313A92m54K59L71j59p7k36k30J63M02j05j58j18l09M04J67n3j00j80O9p2K60
2334C6L77m18k09l44L95M94j90j06l06L46L04K0j34l71M3j70J89L89q1k95l48
$$ plain form
2355 -379 -311 70 73 -31 -399 -274 -140 25 71 63 -152 -288 -199 409 189 230 310 -5 44 352 207 89 -356
2378 -356 -285 117 237 165 -184 -291 -343 -77 202 51 -185 -264 -272 -84 193 131 -136 -328 -86 -176 584 191 1
2401 1 -221 -75 -54 269 600 -235 -1 -113 100 162 40 151 -520 -237 78 78 303 -179 -305 -457 50 285
2423 285 241 -375 -379 144 72 136 64 -126 -176 76 358 447 -49 77 -397 276 365 -65 61 -313 -12 -131 341
2446 341 143 -16 -32 -140 -39 77 28 -124 -223 -265 227 204 81 -428 -226 -205 -187 209 137 -18 89 32 -288
2469 -288 443 54 10 -83 -102 55 216 101 -150 -18 -151 122 253 93 -213 -612 -114 -69 -254 -17 -585
2490 -585 -383 149 197 -53 59 -310 -168 -79 473 43 -18 126 76 288 372 5 -314 -135 -279 255 -146 203
2512 203 -94 -239 -315 -142 373 71 30 -210 -182 135 146 89 -146 44 3 15 53 14 -404 -204 -131 65 247
$$ packed form
2355c79O8L81Lj04l68J25J34J65M6qk15j36Q9O08k20M1Q0l15M9L08j45j18m45
2378c56P1M02J20p2l49j07n2K66K79j51k36p9qJ88K77o2k67j92K42r0P60l93j90
2401Ak22J46K1L23L31q35K34j12K13O2j22J11o71K83L15%K25m82j26j52N07K35
2423B85m4o16mN23p2O4p2j90n0K52K82Q9m96J26m74O73Q9m30J26l74L01j19M72
2446C41j98j59j6j08J01J16m9j52r9m2M92k3j23n09K02K1J8L96p2j55J07n7l20
2469b88P31l89m4r3j9J57J61j15k51J32j33K73J31j60l06l99M98M5j85K37n68
2490e85K02N32M8k50J12l69J42Q9N52m30o1J44n0K12Q4l67l19J79j44N34m01L49
2512B03k97j45p6J73N15l02m1k40K8L17J1n7k35J90m1J2L8l9m18K00P3J96J82
$$ plain form
2535 247 86 -155 -303 -180 364 141 -77 -302 -118 157 194 200 -49 -395 -474 -128 254 -22 -345 -137 -284
2556 -284 -81 298 -161 146 95 -219 3 257 177 -37 160 247 143 314 170 -12 -41 296 88 252 98
2577 98 -109 40 -25 -27 186 45 -326 -204 -137 278 7 -33 -3 -83 -75 278 41 -113 -173 -134 346 83 -262 132
2601 132 -139 -128 -47 200 20 35 -194 -57 157 438 -250 -85 -235 -172 37 -39 185 -175 97 -209 -39 -102
2623 -102 123 -163 -112 -96 256 142 263 -155 -53 34 -39 -78 -92 46 48 223 83 -47 178 -68 -377 182 -78
2646 -78 -14 -266 -165 -162 -196 22 11 37 -346 -244 19 260 135 86 -54 -338 374 352 -118 -314 223 -66 330
2669 330 160 71 -20 -87 40 -6 -69 35 -139 98 -262 38 40 117 -234 -160 -97 0 42 10 -74 -237 40 -31 124
2694 124 -51 203 211 -11 235 181 -16 -82 -276 189 43 2 -151 -68 -91 16 64 -162 -132 -420 -51 245 78
$$ packed form
2535B47j61k41j48J23N44k23k18k25J84K75L7Ok49l46p9L46L82k76l23K08j47
2556b84K03L79m59L07n1l14K22K54q0k14J97Q7j04J71j44j82k9L37k08J64j54
2577I8k07J49o5kK13j41l71J22O7M15k71m0L0q0QL53k37j54o0L9M80k63l45L94
2601A32k71J1Q1K47j80J5k29J37K14K81o88J65j50O3K09p6K24l60K72l06J70o3
2623a02K25k86N1J6L52j14J21m18J02Q7p3l9j4J38KJ75j40j30K25k46l09N59k60
2646g8O4k52J01Ll4K18j1K6l83J02K63K41j25m9j40k84P12k2m70j96N37k89L96
2669C30j70q9r1o7J27m6o3J04j74K37l60L00KP7l51P4O3R7M2l2q4j63K77p1J55
2694A24j75K54Qk22K46n4j97o6j94M65j46m1j53Q3k3J07M8k26L0k88L69K96j67
$$ plain form
2717 78 122 -216 -2 51 225 -12 32 -127 -138 101 129 300 -127 -230 245 -134 180 71 -85 -37 -95 39 26
2740 26 -20 19 -90 -172 44 -123 65 -101 -171 -29 117 -128 85 -87 -187 -193 163 274 311 -120 252 252 273 256
2764 256 52 84 -42 -172 28 208 111 -73 -179 -81 93 30 88 -40 -74 96 -79 -10 -15 -252 53 104 328
2787 328 -23 105 -243 250 -25 -143 201 -60 49 -236 -68 139 -68 179 -63 -196 -43 -9 140 84 -7
2808 -7 -4 39 -30 190 -144 -255 -46 2 105 -53 94 -259 196 -14 28 119 72 52 48 57 -23 156 -148 73 191
2833 191 -12 257 52 -74 108 -172 131 109 -259 -116 19 -20 -68 -26 -34 -221 -183 46 -79 165 -68 -112 53
2856 53 -56 95 124 121 -342 47 241 84 -19 64 -145 -27 244 56 -186 111 1 -128 -20 -91 -72 -68 -94
2879 -94 26 -124 14 104 34 -77 100 -80 -30 295 40 27 -29 147 33 -76 -223 131 -49 42 241 -26
$$ packed form
2717G8M4l38K14N3J74k37M4j59j1K39K8J71m27j03M75l79L14j09j56M8n8J34j3
2740B6m6L9j09q2K16j67J88j66p0J42J46k45K13j72j00oL56J11L7m31L72%K1j7
2764B56k04L2j26j30K00J80r7j84j06R8J74o3N8j28l4J70j75O9nk37L05N1K24
2787C28l51J28l48M93k75j18L44k61J09k85J68K07k07K47k42j33J53L4J49n6r1
2808gLM3o9K20l34j11K09M8J03j58J47l53M55k10M2R1m7k0mRq0J79l04K21J18
2833A91k03K69k05j26J82k80L03k2l68J43J35l9m8M2qj87L8K29j25K44k33m4J65
2856E3j09J51K9lm63L89J94j57j03Q3k09J18K71j88k42K97j10j29J08p1J9Mk6
2879i4J20j50J38R0p0j11J77j80N0L25k55j3n6J76j14j09j47L54j80R1J99k67
$$ plain form
2901 -26 -87 -67 40 -67 9 -201 -79 -49 83 -126 115 -8 36 -123 45 239 15 144 -252 -106 236 186
2923 186 -59 -100 2 -57 131 255 -123 191 -148 98 126 52 96 -122 -141 -196 180 60 38 -154 -232 -154 134
2946 134 -244 21 -89 76 46 208 -16 -62 -10 241 208 264 232 37 77 26 -46 232 333 94 -6 -294 127
2969 127 165 -45 -30 -67 39 141 31 -96 -1 -323 -221 136 -17 90 -219 -42 -82 297 44 164 -114 -51
2991 -51 254 71 8 121 -16 70 -11 101 66 86 -117 45 -65 83 115 -74 -192 -174 -96 80 39 107 30 -183
3015 -183 96 199 -46 -83 8 352 -44 -77 -60 147 1 -75 -33 120 171 82 101 58 103 41 98 -254 -161 -116 65
3040 65 118 73 26 89 -8 36 84 198 -183 -174 -15 114 251 410 7 -26 67 247 169 -237 -173 84 -134 -105 128
3065 128 -117 71 -276 70 89 24 -158 -273 -334 64 -160 -101 -160 100 52 -44 -95 111 138 -13 39 222 266 21
$$ packed form
2901b6o1K0J07j07P6k10J22L0J32k09K41j23M4j59J68J94k24J29l96J46L42n0
2923A86k45m1J02n9J88J24l78L14l39K46K8p4M4k18j9n5L76j20k2j92p8P8K88
2946A34l78K65j10J65l0J62k24m6N2K51l3N6l2j95M0n1p2K78J01k39j00k88M21
2969A27L8k10J5l7J06J02j10j27R5l22J02L57j53J07l09J77m0L79k53J20k78O3
2991e1L05j83o3J13j37Q6q1J12l5K0k03J62j10J48L2j89j18J8P8J76m1O8p7k13
3015a83K79J03k45l7R1L44l96l3J7K07j46p6M2J53N1q9J9m3M5o2N7l52R3M5J81
3040F5N3m5m7O3r7M4M8J14l81RJ59J29J37J59m03l3R3J80p8m06O4K57k18K9K33
3065A28k45J88l47L46J9o5j82j15o1L98k24N9n9K60m8r6n1K06K7j51N2J83M4k45
$$ plain form
3089 21 -191 -59 -52 21 -248 53 -256 -100 7 179 -127 -424 133 -25 -110 -124 142 2 -155 -121 -88 -55 114
3112 114 -136 -171 -130 416 -36 -20 -108 -111 40 -105 172 -183 -205 -17 -195 153 -99 -79 -94 -72 58 25 37 -142
3136 -142 51 -156 10 -130 63 -253 -136 -36 6 -129 31 -249 -4 -253 42 18 82 179 89 14 4 149
3158 149 173 225 -138 -24 1 -201 111 -81 9 -179 -53 -40 -278 106 -38 -243 -251 94 -77 59 -114 -61 113
3181 113 123 213 127 -209 -40 135 196 -59 -269 -81 134 -29 -141 -31 48 102 -46 -80 -27 -287 -278 6 129
3204 129 107 113 21 -140 -40 154 196 218 137 -410 156 -229 365 194 -56 -294 -132 363 207 -10 -185 -63
3226 -63 120 89 46 -165 -139 -160 226 -280 -16 52 -258 -158 34 -108 -42 119 -409 -29 -129 -154 -103 -96 -87 -247
3250 -247 -199 178 -67 46 -154 -118 0 214 -43 -31 -111 -136 128 174 -17 2 -236 -47 -41 -126 -138 102 127 29
$$ packed form
3089B1k12J32PP3k69L01l09J56J07J72l06k97N57j58q5j4K66j40j57L4L3L3J69
3112A14k50l5M1N46m52J6q8lJ51j45K77l55k2J88j78L48k52K0j5K2J30l3J2j79
3136a42J93k07J66j40J93l16J17J00M2j35J60k80K45k49K95k4O4R7r0p5j0J45
3158A49K4N2l63J14K5k02L12j92R0j88J26J3k38L84j44k05qL45j71J36j73N3J74
3181A13J0R0q6l36J69J75O1k55k10J88K15j63j12J10P9N4j48l4N3k60RK84J23
3204A29k2Or2j61J00J94M2K2q1n47N66l85N94j71k50k38J62M95j56k17j75J22
3226f3J83l1m3k11K6k1L86n06K64O8l10J00J92j42O6J61n28L80j00k5N1PRj60
3250b47M8L77k45J13k00L6J18K14k57J2q0k5K64M6j91J9k38J89Oq5j2K40K5r8
$$ plain form
3274 29 18 162 -20 -73 115 -9 -12 273 -11 -171 -21 49 26 -232 -145 -317 12 71 268 -192 -198 -88 -81 -69 -55
3299 -55 2 24 -123 -41 67 87 57 81 -320 88 28 98 -80 -9 -70 18 223 111 33 172 153 -150 142 139 -10
3324 -10 71 -24 157 -79 -148 -39 162 -200 76 36 107 226 -86 -106 -61 22 6 43 10 12 -132 309 49 61 -267
3349 -267 111 9 198 -7 -37 -136 158 27 -24 164 -104 169 -11 37 -110 14 -99 -196 -18 12 139 93
3371 93 -48 -191 99 37 123 -1 -215 5 159 251 68 14 -176 -79 48 140 -45 -79 -101 -25 -173 -12 195
3394 195 0 32 -129 -257 56 132 114 -131 -159 -59 -51 -46 -60 -91 -29 273 19 -25 244 -262 173 -6 114 169
3418 169 -63 90 -78 123 -14 60 -113 -216 26 57 137 6 85 123 -43 80 -36 -70 58 -41 60 -59
3440 -59 3 -43 121 79 31 324 223 -41 69 -32 -15 327 188 17 -86 -384 -62 340 -162 -196 -242 9 106
$$ packed form
3274B9j1J44j82n3J88j24lK85k84j60J50P0k3k58Q7j72L29N9J97m60oJ10PJ2J4
3299e5N7K2j47Q2J08K0l0K4m01M08o0P0j78P1o1Q8K05j12p8J39j9l03K92lj49
3324a0Q1r5J81k36o9J09K01l62K76m0P1J19l12k0M5Q3j6L7l3Kj44M41k60J2l28
3349b67L78j02J89k05l0r9K94j31n1J88k68K73j80M8j47J24j13r7J78L0J27m6
3371I3j41j43K90o2Q6j24k14K20J54R2j83n4j90R7J27R2j85l4k2P6j48J61K07
3394A95j95L2j61j28L13P6j8k45k8J00QNj4l1O2L02k54m4K69n06M35j79J20N5
3418A69k32J53j68K01j37P4j73j03K42L1Q0j31P9L8j66J23j16l4J28r9J01j19
3440e9O2m6J64m2m8K93j01k64J10j01J7L42j39j71j03k98L22M02n02l4m6K51R7
$$ plain form
3463 106 161 -49 -74 -234 116 232 -256 -38 241 -40 123 112 -160 -75 44 -50 440 280 14 -43 -139 195
3485 195 -59 8 -139 -40 -209 -32 -38 74 76 -60 -172 -163 -18 169 238 -123 63 59 200 74 38 155 131 311
3509 311 90 128 394 127 -12 -51 46 209 79 -180 -90 217 59 37 32 170 82 -11 114 -37 11 -34 3 -30
3533 -30 -35 -142 41 -67 -142 -76 105 -84 148 -212 -36 34 -83 20 207 99 -96 117 -22 116 -138 9
3555 9 -153 68 0 -16 -138 -243 -215 -127 -154 18 -215 -141 40 -141 100 95 69 -169 86 143 142 -130 -191 20 -77
3580 -77 121 57 24 -91 -256 -180 84 42 35 -51 -133 -62 68 -73 -238 120 -272 -36 159 43 208 -67 -176
3603 -176 232 31 -36 75 2 55 -62 91 -47 11 -46 16 27 89 83 52 28 -327 33 -86 -22 -93 29 -65 -119
3628 -119 16 -14 82 -37 195 -42 -211 -194 -58 -143 -20 294 77 61 238 -283 -124 263 -34 230 -83 70
$$ packed form
3463A06N5k10k5j60L50J16m88K18K79k81J63j1k72Q5J19r4M90j60k66n7r6L34
3485A95k54O7j47R9j69J77oJ12Kj36j12RJ45J87O9l61J86mJ41j26l6J17k4J80
3509C11k21L8K66k67j39l9R7J63j30k59R0L07j58k2nJ38q8r3J25j51M8m5L7l3
3533c0nj07J83j08p5O6J81j89K32l60J76P0j17J03J87j08j95K13j39J38k54J47
3555Ij62K21o8j6j22j05K8Q8k7J72k33P4J81j81K41nk6k38K55N7jk72o1K11r7
3580g7J98o4l3j15j65P6K64m2pq6q2P1J30j41j65L58l92K36J95j16J65k75j09
3603a76M08k01o7J11p3N3j17J53j38N8n7O2J1O2ol1k4l55L60j19O4p1J22r4n4
3628a19J35l0R6j19K32k37j69J7J36q5J23L14k17j6J77n21J59L87k97K64l13J53
$$ plain form
3650 70 8 96 -114 49 -221 -229 -49 268 -127 -158 -160 -5 -157 -149 40 -137 -67 -62 95 183 -24 233 -20 -73 76
3675 76 134 32 -13 47 -186 -100 276 86 -187 -65 -84 -234 -96 -205 5 97 68 41 19 -107 230 -183 -24
3698 -24 254 -115 147 -87 -22 -15 -21 -173 110 -47 -189 -78 101 135 -54 -3 33 38 61 183 21 -108 -133 -35 -71
3723 -71 -81 17 -173 70 159 359 43 74 69 -189 -3 140 -100 -161 115 -87 227 34 -178 111 -82 -12 -228
3746 -228 -28 -103 3 -291 -11 -69 87 -160 80 -143 270 180 37 148 190 -15 -46 -116 135 44 -26 -76 -6
3769 -6 -72 25 36 -252 220 295 26 37 37 -201 192 142 175 76 -108 -152 392 38 98 -102 -106 -68 121 204 -59 4
3795 4 187 -128 70 22 -23 -121 -62 -192 68 254 85 -160 -4 40 30 86 148 8 -158 -92 -300 52 -61 -99
3819 -99 61 -59 243 103 -124 163 -41 -395 -13 218 -82 71 240 98 -48 15 119 -20 -124 -150 167
$$ packed form
3650G0o2Q8k10J63k70qJ80L17l95l1kJ55j52QJ89j77P0NJ57Q8k07K57k53n3J49
3675G6N8j02m5O0k33Q6L76j90k73J22j9j50J38j09K10R2k9k7k2j26L37m13J59
3698b4K78l69K62k34O5Poj52K83j57j42J11J79L4j89N1L6NK3J22j62j29k5R8l6
3723g1j0R8j90K43Q9K00l16L1nk58J86J43k40o1K76k02L14j93k12K89j93P0k16
3746b28K00p5J06k94K80n8J56k47K40k23M13r0j43J11M2k05l1p0K51r1p0n0P0
3769fo6R7J1k88M72P5k69J1%k38L93n0L3r9j84m4N44l54O0k00mL8J89Q3k63O3
3795DJ83l15J98m8m5r8N9j30K60J86j69k45J56M4j0N6O2j40j66O6k08L52j13l8
3819i9J60j20L02j40k27K87k04l54L82K31l00J53J69j42j46O3J04j39j04k6L17
$$ plain form
3840 167 176 -157 -110 -148 -8 -194 207 -138 12 -267 -19 -90 -74 338 42 -97 58 -9 223 -116 27 192
3862 192 -218 390 55 258 -226 -186 -84 162 -113 33 -124 16 -88 -301 217 -10 -11 -123 -23 -194 -122
3883 -122 31 -130 -142 3 137 -301 -95 184 159 -99 -170 22 -156 -138 217 60 -83 -76 66 -59 19 96 108
3906 108 -57 -50 -177 39 158 88 -142 146 94 -76 70 -163 -13 181 60 -166 -73 169 -95 127 99 153
3928 153 56 49 -11 -172 66 -9 228 40 -109 -166 22 214 245 -65 271 64 14 138 187 -21 131 -41 -134
3951 -134 32 -48 66 144 12 49 0 -13 -65 108 103 97 -77 -51 -188 -140 -82 132 -200 8 -68 -66 -199 -73 128
3976 128 148 -10 244 92 -54 76 173 -134 -49 -73 -32 -82 109 -30 -82 156 -54 -23 -165 -26 -104 118 80
3999 80 -67 -19 -69 8 79 220 116 37 -139 71 26 150 -161 -75 -197 105 -72 158 206 95 45 -347 18
$$ packed form
3840A67Rl33M7l8J40j86M01l45J50k79K48p1J6M12k96j39J55o7K32l39J43J65
3862A92m10O08l35K03m84M0J02K46k75J46j57J40j04k13N18k27jj12J00j71P2
3883a22J53j61j2J45J34m38K06K79k5k58p1J92j78J8L55j57j43PJ42j25P8P7J2
3906A08j65Pj27K16J19p0k30K88n2j70J46k33J50J94j21k26R3K42k64K22k8N4
3928A53r7po0j61K38p5K37j88j49n7J88J92L1l10L36k07n0J24M9k08J52j72r3
3951a34J66q0J14P8j32L7m9j3n2J73noj74K6j37M8N8K14l32K08p6Kj33J26K01
3976A28K0j58K54j52j46J30R7l07Q5k4M1n0J91j39n2K38k10L1j42J39p8K22l8
3999H0j47M8n0P7P1J41j04p9j76K10m5J24l11Q6j22L02j77K30M8j11n0l92L65
$$ plain form
4022 18 -53 105 -60 -118 34 207 -62 57 -85 104 -106 -175 3 -200 -246 85 5 -21 -40 -80 -80 -8 -165 163
4046 163 -47 -236 5 79 -80 178 -69 -96 -10 -201 -225 194 147 -249 -71 105 -78 80 -50 -49 -94 -11 -84
4069 -84 -17 -129 160 71 -315 -164 75 107 64 -148 0 243 39 -41 60 165 -209 -46 67 91 0 -135 -9
4092 -9 105 99 -102 -155 7 -153 -215 -202 3 -270 -239 30 136 -94 -102 18 11 165 59 161 185 50 -269 -87
4116 -87 -70 99 -150 -29 31 230 109 290 116 -262 -217 -31 -50 255 -23 -231 68 33 114 -14 -173 -9
4138 -9 -10 -281 104 -33 -121 192 -72 230 -89 -26 51 -15 68 187 66 -14 -30 29 11 31 23 60 24 30 -48 192 -10
4165 -10 -8 -46 -110 -1 -243 88 -23 -34 153 154 -91 33 44 -56 71 95 -299 -232 291 119 51 111 73 -58 304
4190 304 -80 -50 82 162 -49 -70 -60 -220 111 -183 209 -163 -37 -29 -110 169 -26 -216 -105 -150 167 -42 40
$$ packed form
4022A8p1J58j65n8J52J73k69J19j42J89k10o9J78k03m6L31q0k6j9m0%P2j57L28
4046A63k10j89K41P4j59K58k47k7Q6j91k4M19m7l96J78J76j83J58j30Jm5Q3p3
4069h4O7j12K89q9l86J51K39L2m3k12J48K43k04q0J01J05l74J63J13K4r1j35J26
4092iJ14ok01n3J62j60o2J3K05k73L1K69J06k30qJ20pJ54j06J02K4j35l19J82
4116h7J7J69k49J21O0J99j21J81j74l78M5J86j9L05k78k08K99l5Q1j28j59J64
4138ijk71L85j37q8L13k64L02l19O3P7o6Q3J19j21q0j6N9j8K0qL7l6Op8K40k02
4165a0Kl8o4J09k42L31j11j1J87Jk45J24J1j00J27K4l94O7N23j72o8O0l8j31L62
4190C04l84L0J32Q0k11k1J0j60L31k94L92l72J26Qq1K79j95j90J11m5L17k09Q2
$$ plain form
4213 40 36 3 -222 -29 236 -133 -106 -102 159 -9 43 -166 -34 179 -195 -145 17 172 116 213 148 -91 -14 -292
4237 -292 14 248 76 -151 77 -214 299 113 97 -88 207 -22 108 -15 -258 55 -43 304 81 -38 -58
4258 -58 -55 109 -28 -115 284 60 -147 34 -99 355 -98 -2 32 -11 163 135 47 5 41 156 -181 -101 -24 -47 84
4283 84 -169 18 -51 -24 282 56 -14 136 81 77 -6 -123 139 -47 -144 -115 120 -150 133 -24 -38 15 113 -200
4307 -200 73 -43 -110 -68 -349 125 12 -123 140 -1 147 -97 -100 14 -30 -92 -63 -91 -79 204 -220 -42 65
4330 65 17 207 -172 -21 7 25 -265 -186 -10 -111 91 72 164 -103 134 140 -17 -23 -262 65 30 -32 -282 -90
4354 -90 20 -1 115 -13 270 -58 188 -34 111 178 55 28 28 5 -66 -11 31 -176 193 304 37 -87 44
4377 44 13 -255 -353 35 6 18 148 69 -223 -70 278 -218 -229 -15 -97 29 55 132 72 -167 -171 68 -16 -20 -358
$$ packed form
4213D0ml3k25J93K65l69K7MK61j68N2k09J32K13l74N0J62J55n6R7o5k39P7k78
4237b92L06K34j72k27K28k91N13j86j6j85K95k29J30j23k43L13r8L47k23j19k0
4258e8LJ64j37q7L99k24k07J81j33M54m53R6L4m3J74k8q8m2L6J15l37Q0P7k3J31
4283H4k53J87o9K7L06k26p0J50n5mq3j17K62j86r7K9K35k70K83j57j4N3R8l13
4307b00K73j16o7M2k81M74j13j35K63j41J48k44lJ14m4o2K9k8J2K83m24J78J07
4330F5m8J90l79J51K8J8k90P9J76j01K02j9R2k67K37Oj57ok39L27l5o2k50J92
4354i0J10k1J16j28K83l28K46k22J45O7j23k7%k3p1N5M2k07L69J11k67j24J31
4377D4l1k68r8L88k9J2J30p9k92J53L48m96j1K14q2J26K6P7o0k39mK39q4ml38
$$ plain form
4402 -358 -12 -170 -12 10 -95 -15 -100 16 34 60 -224 29 -237 -19 293 179 -4 -99 -56 -129 -50 27 -2 -14
4426 -14 42 96 71 75 -130 -202 -90 37 1 98 -91 -79 -69 -5 208 245 -71 -247 -31 385 48 -197 -70 -61 -153
4451 -153 255 25 39 301 -10 58 -228 153 126 -53 -330 -26 -57 194 95 45 -24 53 228 -37 -115 40 -86
4474 -86 21 29 11 25 214 -199 -104 74 14 116 57 157 52 -105 62 -50 -323 15 -201 -103 -280 -209 -333
4497 -333 -143 82 -1 25 -113 -51 -203 -90 -13 -42 103 158 -79 -23 202 -39 4 182 150 98 16 231 13 -30
4521 -30 -28 146 -139 -25 -131 -222 -233 -99 -155 17 -306 -172 51 49 2 7 -122 -162 10 -105 21 -2 -74 -80 -48 142
4547 142 18 8 -65 6 -234 58 -52 -37 178 3 48 28 70 123 160 -265 62 -214 -12 5 -209 -1 231
4570 231 60 69 -50 -39 26 100 58 76 112 -175 317 -120 171 -103 15 -92 217 44 -133 -183 13 -8 41 39
$$ packed form
4402c58L46j58J58K2j05Q0q5J16J8K6k84K53k66K18L12j14j83r5M3p3P9P7k9j2
4426a4N6N4k5Mk05p2J12J27l6R7j89J2J0O4K13L7l16j76K16M16l37k45J27Rr2
4451a53M08k30J4K62l11O8k86L81k7j79k77L04l1K51r9n0o9P7J75k65p8J55j26
4474h6J07Qj8J4J89m13R5J78o0J02n9J00j05j57J67j12k73L38k16R8j77P1j24
4497c33J90K25q3K6j38O2j52J13P7k9J45N5k37N6K25k41M3J78l2n2q2K15k18m3
4521c0KJ74k85J14j06r1j1J34n6J72l23J34K23km7Nj29m0J72j15J26k3p2oL2J90
4547A42j24j0p3P1k40K92j10J5K15j75M5k0M2N3L7m25L27k76K02J7k14K08K32
4570B31j71Rj19J1O5P4m2J8L6k87M92m37K91k74J18j07L09j73j77n0J96k1M9k
$$ plain form
4594 39 96 208 121 56 -357 -4 13 27 -138 -118 209 74 484 2 182 7 -166 13 -21 43 -99 -147 168
4617 168 4 157 17 11 -150 -63 111 165 -224 147 139 -36 -1 33 -142 -252 121 -22 -80 -79 -116 153 139 2
4641 2 -112 -60 -76 289 -9 122 165 108 -63 28 150 137 36 77 41 226 -61 32 -216 -193 81 -102 -17 -86 12
4666 12 -344 -19 -269 101 167 26 -13 -15 127 198 -107 -113 50 257 42 -2 335 -16 -126 154 172 41 -197
4689 -197 -97 34 -5 -82 -158 40 -82 169 133 14 109 -17 -84 -40 -18 27 210 -59 107 -22 105 87 -51
4712 -51 -151 -155 44 -170 69 103 123 -115 37 -95 -82 -51 158 184 33 365 -202 -23 88 -140 72 -111 39
4735 39 206 132 -128 11 -114 -47 -131 -40 -209 46 -22 -198 -42 212 -107 96 249 4 -186 -192 -106 159 398
4758 398 179 -12 91 -131 298 47 -111 -50 -69 174 -312 -99 155 -28 -125 -40 135 -60 -224 1 -12 -96
$$ packed form
4594C9N7J12q7o5m13L53J7J4j65K0L27j35M10m82J80j75j73J79l4O4j42m8L15
4617A68j64J53j40oj61Q7J74N4l89L71qj75L5L4j75j10L73j43n8Jl7K69j4j37
4641Bj14N2j6L65k98J31M3n7j71R1J22j3j01M1l6J85k87R3k48K3K74j83Q5o9R8
4666A2l56L25k50L70O6j41l9kJ42P1l05oJ63K07k15m4L37l51j10K80J8j31k38
4689a97J00J31l9p7p6J98j22K51l6j19R5j26o7M4K2M5J83k69J66j29J27j8j38
4712e1j00mJ99k14K39L4K0k38J52j32J3L1K09K6j51L32n67J79J11k28K12j83J50
4735C9J67p4k60J39j25O7q4R1j69K55o8j76J56K54l19K03J53k45j90oQ6K65K39
4758C98k19j91J03k22M29k51j58O1j9K43m86K13K54j83r7Q5J75j95j64K25j3q4
$$ plain form
4780 -96 187 -109 46 -152 -128 -157 -158 258 74 -198 -109 -10 96 -59 225 -117 75 -12 66 -47 81 66 133 -3
4804 -3 2 17 169 47 103 59 107 -36 39 -97 -243 -69 121 -90 -55 176 13 36 -2 57 187 28 -35 169 4
4829 4 -107 -81 -173 152 169 75 100 182 -24 -54 94 -340 7 -85 262 -7 -70 -203 -13 -141 215 -125 -18 159
4853 159 -31 252 -303 179 16 -205 200 7 208 -8 -266 -54 -61 111 73 51 -246 -288 -168 -141 13 222
4875 222 51 -31 -215 -126 42 125 81 -329 190 -78 4 -148 246 -41 77 -56 -145 -79 -70 -109 49 -39 -119 62
4899 62 57 -138 -72 46 -137 -20 -18 -14 -172 206 33 -161 -100 109 -276 -134 116 -99 199 -211 42 205 -153
4922 -153 10 79 -20 -36 197 49 -86 179 -136 -111 -44 -57 -45 -284 70 -61 222 80 -108 -93 -110 235 131
4945 131 4 -157 56 44 174 28 108 -247 -222 58 231 114 123 34 94 -201 -45 -96 125 373 179 28 78
$$ packed form
4780i6K83k96J55j98K4k9jM16j84k72Q9R9J06j55K84l42J92q7P8j13J28j5O7j36
4804cNJ5J52j22N6m4M8j43P5j36j46J74J90k11L5K31j63K3l8N9J30j59o3K04j65
4829Dj11K6r2L25J7r4K5Q2k06l0J48m34L47r2L47k69o3j33J90j28L56l40J07J77
4853A59j90K83n55M82j63k21M05j93K01k16k58K12pJ72l8k2k97m2J20K7J54K09
4875B22j71q2j84Q9J68Q3m4m10N19k68Q2j52L94k87J18j33q9O6Rl9J58q8q0J81
4899F2nj95O6J18j83J17KMj58L78j73j94O1K09l85J42K50k15K98m10K53J63l58
4922a53J63O9r9j6K33j48j35K65l15K5O7j3J2k39L54j31K83j42j88J5j7L45j04
4945A31j27j61K13j2J30j46Q0l55K5K80J73j17Rq9O0k95J56n1K21K48j94j51N0
$$ plain form
4968 78 -179 -151 -39 -49 -188 -110 80 154 -38 -44 32 -142 -120 13 -79 107 24 127 -91 58 -124 -146 -40 119
4992 119 -53 -34 49 -51 82 47 -76 -14 365 -37 -352 101 -135 -45 360 21 -115 -37 -79 -38 -212 -40 94
5015 94 54 37 -238 171 -134 -88 10 -182 126 129 99 117 -98 39 56 -71 -118 -2 83 -267 -14 -174 -102 -260
5039 -260 13 -92 -10 -2 78 -53 113 210 -88 -273 23 20 -171 -24 -5 11 -55 -29 191 -137 73 39 -165 77
5063 77 -107 36 309 -118 -75 -257 -31 -57 211 -89 174 105 1 -170 202 -139 -252 -21 -58 71 185 120
5085 120 62 117 144 -96 -99 163 -140 49 -38 -209 126 6 -55 46 270 -226 -90 -30 159 -116 -367 233 13
5108 13 -46 -283 22 78 60 67 137 65 -185 280 177 16 128 -5 -2 136 -75 91 -73 -8 -27 87 164 -77
5132 -77 75 -73 48 43 19 30 -35 -76 101 -76 -46 167 128 -189 9 -235 232 -87 25 146 -28 -60 292
$$ packed form
4968G8k57K8J12j0j39P8J90P4j92oP6j74K2J33r2J86q3J03k18J49j82k2J06J59
4992A19j72J9Q3j00J33l5j23O2L79m02l15M53k36R0M05l39j36P8m2M1j74J72J34
5015I4m0j7k75M09l05M6R8j92L08Ll0J8k15J37J7j27m7J16Q5l50K53j60P2j58
5039b60K73j05Q2QQ0j31J66R7k98j85K96lj91J47J9J6o6K6K20l28K10l4k04K42
5063G7j84J43K73m27M3j82K26k6K68l00K63o9j04j71L72l41j13K31l7J29J14o5
5085A20n8N5K7k40lK62l03J89q7j71L35j20o1J01K24m96J36O0J89k75k51O00k20
5108A3n9k37L05N6j8PP0p2k50M65j03j61J12j33LJ38k11J66j64O5j9J14P7k41
5132g7J52j48J21nk4J1o5m1J77j77L0K13l9l17J98k44M67l19J12J21j74l2L52
$$ plain form
5155 292 -70 -183 -99 47 109 264 5 59 -207 -131 107 -66 78 153 -93 -53 138 -126 -31 4 227 38 -12
5178 -12 -86 -193 24 200 -112 170 165 -156 35 -23 188 -204 73 32 120 110 106 -216 -57 -158 184 -57 21 -51
5202 -51 99 -35 -28 -59 -172 71 95 -348 -82 -51 -31 -8 -111 186 -144 137 -58 -75 114 -173 80 -254 -77
5225 -77 -92 -23 -137 -236 -21 18 104 139 -15 247 -143 65 187 293 -56 118 -10 -246 -41 61 68 35 -50 -55
5249 -55 -240 -27 -164 -12 -53 37 151 -28 -75 -12 -137 -60 -101 -100 236 -65 -51 -23 232 -119 -175 -178 29 -72 -168
5274 -168 290 -8 -117 11 60 -105 -191 -89 106 -117 417 415 73 20 11 -137 178 97 -26 -77 -287 208 -119
5297 -119 -68 -215 -68 140 49 155 -59 163 65 -11 -11 -130 -244 -179 227 144 159 -4 -166 -35 -57 -59 164 -173
5321 -173 -27 211 -267 -141 -35 -214 36 -143 31 -35 137 59 153 95 -162 -5 98 255 133 -55 8 -85
$$ packed form
5155B92l62j13Q4J46O2J55k59N4k66P6K38j73J44P5k46M0J91k64R5L5K23j89n0
5178a2p4j07K17J76l12K82nl21J91n8K11l92K77m1Q8j0ml22J59j01L42k41P8p2
5202e1J50j34Pl1j13K43K4m43K66L1K0K3j03K97l30K81j95j7J89k87K53l34J77
5225g7j5O9j14r9K15L9Q6L5j54K62l90K08J22J06l49J74j28k36K05J02Pl3q5n
5249e5j85K13j37J52m1R0J14j79m7O3j25P7m1JL36l01J4K8K55l51n6lK07j01r6
5274a68M58k98j09J28M9j65q6J02J95k23N34kl42n3rj48L15q1j23n1k10M95l27
5297a19N1j47J47K08r1J06k14K22r8p6%j19j14O5M06q3J5j63j62J31k2kK23l37
5321a73J46K38m78J26J06j79K50j79J74o6J72p8R4n8k57J57J03J57j22j88O3r3
$$ plain form
5343 -85 32 207 -57 49 -75 196 -44 -105 -171 -323 57 126 -66 -95 -78 87 -79 -19 -239 63 -29 -4 160
5366 160 -66 -31 -185 -88 28 -117 -76 -49 -78 225 19 -6 -51 26 -76 86 -86 -235 50 223 -167 -6 20
5389 20 199 5 12 86 -25 -85 -52 66 181 46 -58 96 67 -142 -93 -96 147 153 113 -9 83 -59 -128 158 -166
5414 -166 46 50 103 62 76 -106 145 83 -41 -327 -203 -191 -207 34 61 91 -49 30 -63 72 118 2 33 -97 -148
5439 -148 69 10 160 -101 58 177 97 -194 19 1 -162 -162 -237 99 119 9 45 26 -90 -132 -154 -144 267 -33
5463 -33 273 171 29 34 66 9 -37 -26 -127 -115 -57 -67 0 76 -40 44 125 28 -100 -146 -51 9 -90 100 5 -83 4
5490 4 494 64 238 110 127 16 51 34 -6 271 37 181 428 -59 -160 -136 -196 133 -2 -251 -400 9 -181
5513 -181 -349 -126 -119 -124 79 136 104 -75 -90 -35 98 -68 212 113 185 197 -128 -85 49 -72 -298 -43 -118 26
$$ packed form
5343h5J17J75k64J06j24K71k40o1o6j52L80O9j92k9J7J65j66O0k20L02r2K5J64
5366A60k26L5j54R7J16j45M1K7k9L03k06k5m5P7j02J62j72j49K85J73l90J61K6
5389B0J79j94PP4j11o0L3J18J15j35j04J54k9k09M9lK43Om0j22R2j42o9K86l24
5414a66K12MN3m1J4j82K51o2j24k86J24J2j6K41K7L0j40P9r3J35M6j16L1j30n1
5439a48K17n9J50k61J59J19q0k91K13j8j63%p5L36K0j10L6j9j16m2k2J0M11l00
5463c3L06j02j42NL2n7m6J1j01J2N8j0O7P6j16Q4Q1r7j28m6R5O0r9J90r5q8Q7
5490DM90m30J74j28J7j11L5j7m0K77k34J44K47m87j01K4o0L29j35k49j49M09j90
5513a81j68K23PnK03N7l2j79j5N5J33j66K80r9P2J2l25M3J34j21k26K55p5J44
$$ plain form
5537 26 25 -14 -42 158 65 40 -167 -51 -1 -97 201 62 134 -167 309 -46 -6 54 -141 -14 -242 -78 144 -103
5561 -103 -22 -112 45 203 -238 1 94 47 -188 228 -53 -191 208 -198 -35 -81 319 21 -47 5 -147 -8
5583 -8 -184 -91 -7 -50 158 -61 -180 -209 7 93 188 33 -68 56 89 -59 4 88 -111 226 7 100 -97 -263
5607 -263 -112 19 -127 -105 20 -210 -93 -170 124 14 43 -4 152 223 -16 17 -45 -73 -65 -4 42 -44 -247 13
5631 13 101 -100 3 37 22 11 -67 173 78 -45 -15 -200 -91 -95 79 -15 -211 -35 29 322 6 131 9 -35
5655 -35 32 -22 -84 58 28 61 -147 18 -173 7 -4 -3 -65 97 -53 -14 -37 -73 -27 -121 -64 -51 123 64 -196 -40
5681 -40 260 -36 390 273 -279 53 328 -21 -88 -47 117 -268 -155 182 28 -232 8 -133 245 41 69
5702 69 45 -190 225 -14 179 4 57 96 169 2 97 91 -146 -6 -6 -186 161 -6 164 -64 170 -61 -143 172
$$ packed form
5537B6jl9k8K00r3k5k07J16N0r6K98j39P2l01M76l55M0O0j95J27k28J64K22k47
5561a03Q1r0J57J58m41K39R3m7k35M16k81j38L99m06J63m6M00k98o8N2j52J39
5583hj76R3Q4m3K08k19j19k9K16Q6R5j55j01J24L3j48O3Q4j99L37k19R3j97j66
5607b63J51J31j46K2J25k30J17p7K94j10K9m7J56P1k39L3o2k8QO1M6q6k03K60
5631A3Q8k01J03L4j5j1p8K40r5j23L0j85J09mJ74r4j96J76O4K93l16J25j22m4
5655c5O7n4o2J42l0L3k08J65j91J80j1Jo2J62j50L9k3l6M6r4N7J3J74n9k60J56
5681d0L00k96M26j17n52L32K75l49o7M1J64l85J13L37j54k60K40j41L78k04K8
5702F9k4k35M15k39J93j75N3L9P3j67R5ok37J40%j80L47j67J70k28K34k31q2L15
$$ plain form
5726 172 112 -29 79 -62 -5 -1 198 -259 72 -80 -181 -20 162 19 132 41 149 -40 -91 80 -96 -91 -39
5749 -39 158 -217 52 -13 93 -164 33 231 98 36 97 -26 70 176 -181 -170 -260 71 19 -143 -3 -166 171
5772 171 -110 20 -53 -52 0 121 124 11 65 103 -298 125 184 -51 291 -256 -100 -184 75 120 53 1 344 -14
5796 -14 -156 -32 82 -104 145 165 15 -236 81 0 14 108 -100 -147 66 -203 -113 -4 171 41 92 60 180
5819 180 19 74 36 -15 78 204 133 -19 -78 46 -76 -121 -13 -147 375 167 -153 228 63 171 178 309 135
5842 135 -247 157 -172 249 98 -176 35 -28 -55 -140 -129 -126 -180 83 -33 -6 -154 108 -173 41 34 -253 71
$$ packed form
5726A72o0j41J08j41N7MJ99m57L31j52j01J61J82j43J13r1J08j89n1J71j76NN2
5749c9J97l75K69o5J06k57J97J98j33o2O1j23R6J06l57J1r0L31n2j62J40j63L37
5772A71k81J30p3JN2J21Lj13N4L8m01M23N9k35L42n47J56q4K59M5o7n2L43l58
5796a4j42J24J14j86K49K0j50k51L17q1J4R4k08m7K13k69R0J09J75j30N1l2J20
5819A80j61N5l8n1R3J26p1j52n9J24j22m5J08j34N22k08l20L81j65J08PJ31j74
5842A35l82M04l29M21j51k74K11o3k7q5J1Ln4K63j16K7j48K62k81K14pk87L24
$$ [...]
8191f9
##END NTUPLES=NMR FID
##END=
