##TITLE=1H_3K2510
 CDCl3
 8 sc, 
 26.10.2022
##JCAMPDX= 6.0         $$ Bruker NMR JCAMP-DX V2.0
##DATA TYPE= NMR FID
##DATA CLASS= NTUPLES
##ORIGIN= UXNMR, Bruker Analytische Messtechnik GmbH
##OWNER= root
$$ XWIN-NMR		Version 3.5
$$ Wed Oct 26 13:41:15 2022 Russian Standard Time (UT+4h)  she@DPX200
##.OBSERVE FREQUENCY= 200.1313499994
##.OBSERVE NUCLEUS= ^1H
##.DELAY= (6, 6)
##.ACQUISITION MODE= SIMULTANEOUS
##.ACQUISITION SCHEME= undefined
##.AVERAGES= 8
##.DIGITISER RES= 18
##SPECTROMETER/DATA SYSTEM= spect
##.PULSE SEQUENCE= zg30
##.SOLVENT NAME= CDCl3
##.SHIFT REFERENCE= (INTERNAL, CDCl3, 0, 15.7039)
##AUDIT TRAIL= $$ (NUMBER, WHEN, WHO, WHERE, WHAT)
$$ ##TITLE= Audit trail, XWIN-NMR		Version 3.5
$$ ##JCAMPDX= 5.01
$$ ##ORIGIN= Bruker BioSpin GmbH
$$ ##OWNER= she
$$ F:/spectra/data/she/nmr/H-F/1/audita.txt
$$ ##AUDIT TRAIL=  $$ (NUMBER, WHEN, WHO, WHERE, WHAT)
(   1,<2022-10-26 13:40:11.06 +0400>,<she>,<DPX200>,
      <created by zg, POWCHK disabled, PULCHK disabled
       configuration hash MD5:
       00 E9 B6 7A A2 85 ED C7 34 08 36 98 17 FE 4E 26
       data hash MD5: 16K
       D1 8C 19 EA F4 B0 FA 92 A9 11 05 4F 25 E8 4D 5F>)
$$ ##END=
$$ 
$$ hash MD5
$$ F9 1B 62 25 87 E9 4F A9 D4 F1 C2 DF 32 E4 12 15
##$RELAX= 
##$RELAX= 
##$RELAX= 
##$RELAX= 
##$RELAX= 
##$RELAX= 
$$ Bruker specific parameters
$$ --------------------------
##$DU= <F:/spectra>
##$EXPNO= 1
##$NAME= <H-F>
##$PROCNO= 1
##$TYPE= <nmr>
##$USER= <she>
##$AMP= (0..31)
100 100 100 100 100 100 100 100 100 100 100 100 100 100 100 100 100 100 
100 100 100 100 100 100 100 100 100 100 100 100 100 100 
##$AQSEQ= 0
##$AQ_mod= 1
##$AUNM= <au_zg>
##$AUTOPOS= <>
##$BF1= 200.13
##$BF2= 200.13
##$BF3= 200.13
##$BF4= 200.13
##$BF5= 200.13
##$BF6= 200.13
##$BF7= 200.13
##$BF8= 200.13
##$BYTORDA= 1
##$CFDGTYP= 0
##$CFRGTYP= 5
##$CHEMSTR= <none>
##$CNST= (0..31)
1 1 145 1 1 1 1 1 1 1 1 1 1 1 1 1 1 1 1 1 1 1 1 1 1 1 1 1 1 1 1 1 
##$CPDPRG= <>
##$CPDPRG1= <>
##$CPDPRG2= <>
##$CPDPRG3= <>
##$CPDPRG4= <mlev>
##$CPDPRG5= <mlev>
##$CPDPRG6= <mlev>
##$CPDPRG7= <mlev>
##$CPDPRG8= <mlev>
##$CPDPRGB= <>
##$CPDPRGT= <>
##$D= (0..31)
0 1.2 0 0 0 0 0 0 0 0.06 0 0.03 0 0 0 0 0.0002 0 0 0 0 0 0 0 0 0 0 0 0 
0 0 0 
##$DATE= 1666777210
##$DBL= (0..7)
120 120 120 120 120 120 120 120 
##$DBP= (0..7)
150 150 150 150 150 150 150 150 
##$DBP07= 0
##$DBPNAM0= <>
##$DBPNAM1= <>
##$DBPNAM2= <>
##$DBPNAM3= <>
##$DBPNAM4= <>
##$DBPNAM5= <>
##$DBPNAM6= <>
##$DBPNAM7= <>
##$DBPOAL= (0..7)
0.5 0.5 0.5 0.5 0.5 0.5 0.5 0.5 
##$DBPOFFS= (0..7)
0 0 0 0 0 0 0 0 
##$DE= 6
##$DECBNUC= <off>
##$DECIM= 32
##$DECNUC= <off>
##$DECSTAT= 4
##$DIGMOD= 1
##$DIGTYP= 9
##$DL= (0..7)
0 120 120 120 120 120 120 120 
##$DP= (0..7)
150 150 150 150 150 150 150 150 
##$DP07= 0
##$DPNAME0= <>
##$DPNAME1= <>
##$DPNAME2= <>
##$DPNAME3= <>
##$DPNAME4= <>
##$DPNAME5= <>
##$DPNAME6= <>
##$DPNAME7= <>
##$DPOAL= (0..7)
0.5 0.5 0.5 0.5 0.5 0.5 0.5 0.5 
##$DPOFFS= (0..7)
0 0 0 0 0 0 0 0 
##$DQDMODE= 0
##$DR= 18
##$DS= 0
##$DSLIST= <SSSSSSSSSSSSSSS>
$$ [...]
##$SUBNAM2= <"">
##$SUBNAM3= <"">
##$SUBNAM4= <"">
##$SUBNAM5= <"">
##$SUBNAM6= <"">
##$SUBNAM7= <"">
##$SUBNAM8= <"">
##$SUBNAM9= <"">
##$SW= 18.0517283424941
##$SWIBOX= (0..15)
0 0 2 0 0 0 0 0 0 0 0 0 0 0 0 0 
##$SW_h= 3612.71676300578
##$TD= 16384
##$TD0= 1
##$TE= 0
##$TE2= 300
##$TE3= 300
##$TEG= 300
##$TL= (0..7)
0 120 120 120 120 120 120 120 
##$TP= (0..7)
150 150 150 150 150 150 150 150 
##$TP07= 0
##$TPNAME0= <>
##$TPNAME1= <>
##$TPNAME2= <>
##$TPNAME3= <>
##$TPNAME4= <>
##$TPNAME5= <>
##$TPNAME6= <>
##$TPNAME7= <>
##$TPOAL= (0..7)
0.5 0.5 0.5 0.5 0.5 0.5 0.5 0.5 
##$TPOFFS= (0..7)
0 0 0 0 0 0 0 0 
##$TUNHIN= 0
##$TUNHOUT= 0
##$TUNXOUT= 0
##$USERA1= <user>
##$USERA2= <user>
##$USERA3= <user>
##$USERA4= <user>
##$USERA5= <user>
##$V9= 5
##$VALIST= <valist>
##$VCLIST= <CCCCCCCCCCCCCCC>
##$VD= 0
##$VDLIST= <DDDDDDDDDDDDDDD>
##$VPLIST= <PPPPPPPPPPPPPPP>
##$VTLIST= <TTTTTTTTTTTTTTT>
##$WBST= 1024
##$WBSW= 4
##$XGAIN= (0..3)
0 0 0 0 
##$XL= 0
##$YL= 0
##$YMAX_a= 255807
##$YMIN_a= -174012
##$ZGOPTNS= <>
##$ZL1= 120
##$ZL2= 120
##$ZL3= 120
##$ZL4= 120
##$ABSF1= 10
##$ABSF2= 0
##$ABSG= 5
##$ABSL= 3
##$ALPHA= 0
##$AQORDER= 0
##$ASSFAC= 0
##$ASSFACI= 0
##$ASSFACX= 0
##$ASSWID= 0
##$AUNMP= <proc_1d>
##$AZFE= 0.1
##$AZFW= 0.1
##$BCFW= 1
##$BC_mod= 2
##$BYTORDP= 1
##$COROFFS= 0
##$CY= 11.3945322036743
##$DATMOD= 1
##$DC= 2
##$DFILT= <>
##$DTYPP= 0
##$F1P= 2.36226072786647
##$F2P= -0.459571619588291
##$FCOR= 0.5
##$FTSIZE= 0
##$FT_mod= 4
##$GAMMA= 1
##$GB= 0.15
##$INTBC= 1
##$INTSCL= 1
##$ISEN= 128
##$LB= 0.24
##$LEV0= 0
##$LPBIN= 0
##$MAXI= 10000
##$MC2= 0
##$MEAN= 0
##$ME_mod= 0
##$MI= 1.114404
##$NCOEF= 0
##$NC_proc= 0
##$NLEV= 6
##$NOISF1= 3.799351
##$NOISF2= 2.8
##$NSP= 1
##$NTH_PI= 0
##$NZP= 0
##$OFFSET= 15.70392
##$PC= 1
##$PHC0= -18393.79
##$PHC1= 13.6007
##$PH_mod= 1
##$PKNL= yes
##$PPARMOD= 0
##$PSCAL= 0
##$PSIGN= 0
##$REVERSE= no
##$SF= 200.130013532006
##$SI= 16384
##$SIGF1= 3
##$SIGF2= 2
##$SINO= 400
##$SIOLD= 16384
##$SREGLST= <1H.CDCl3>
##$SSB= 0
##$STSI= 0
##$STSR= 0
##$SW_p= 3612.71676300578
##$SYMM= 0
##$S_DEV= 0
##$TDeff= 0
##$TDoff= 0
##$TI= <>
##$TILT= no
##$TM1= 0
##$TM2= 0
##$TOPLEV= 0
##$USERP1= <user>
##$USERP2= <user>
##$USERP3= <user>
##$USERP4= <user>
##$USERP5= <user>
##$WDW= 1
##$XDIM= 8192
##$YMAX_p= 0
##$YMIN_p= 0
$$ End of Bruker specific parameters
$$ ---------------------------------
##NTUPLES= NMR FID
##VAR_NAME=  TIME,          FID/REAL,        FID/IMAG
##SYMBOL=    X,             R,               I
##VAR_TYPE=  INDEPENDENT,   DEPENDENT,       DEPENDENT
##VAR_FORM=  AFFN,          ASDF,            ASDF
##VAR_DIM=   8192,          8192,            8192
##UNITS=     SECONDS,       ARBITRARY UNITS, ARBITRARY UNITS
##FACTOR=    0.0002768,     1,               1
##FIRST=     0,             0,               0
##LAST=      2.2672688,     0,               0
##MIN=       0,             -174012,         0
##MAX=       2.2672688,     255807,          0
$$ Real data points
##PAGE= N=1
##DATA TABLE= (X++(R..R)), XYDATA
0 0 0 0 0 0 0 0 0 0 0 0 0 7 -8 8 -8 8 -16 16 -22 24 -32 33 -40 48 -57 66 -80 89 -105 121 -137 157 -177 200
34 200 -228 255 -287 323 -360 402 -447 498 -552 610 -675 746 -824 907 -1001 1103 -1216 1337
52 1337 -1475 1627 -1798 1993 -2211 2463 -2757 3103 -3518 4030 -4674 5517 -6672 8365 -11085
67 -11085 16202 -29294 142044 255807 138588 184827 119675 45193 -24464 -97206 -174012 -143248
79 -143248 -128916 -142087 -105161 -17601 9868 20524 35207 45117 42426 41390 6202 -25299 -14456
92 -14456 17308 14724 8979 36818 69445 59781 46819 44261 20063 -13928 -29307 -61968 -93516
105 -93516 -72211 -49790 -71232 -61607 -10503 9453 16551 45944 52692 43574 56220 54977 35089
118 35089 40763 42111 12957 -1297 -15 -19397 -34355 -35797 -54558 -69086 -54396 -43853 -43836
131 -43836 -21640 5983 14041 21770 40702 54654 55659 49563 41533 29173 15995 9563 4528
144 4528 -8010 -20174 -26150 -31929 -34375 -32928 -35978 -37313 -28766 -21450 -10309 12108 23155 22819
158 22819 39457 52944 39489 30347 31886 10477 -15944 -20534 -27098 -38721 -31520 -22521 -23862
171 -23862 -11824 8002 13095 15512 22551 16674 5485 2619 -1985 -7627 -4710 -3743 -7925 31
185 31 14894 17031 11402 11823 9715 -1653 -11469 -15553 -23751 -31055 -26738 -20046 -17226 -3919 14583
200 14583 21059 24382 34292 37565 29910 24134 17033 4821 -4980 -15943 -27810 -28991 -24576 -28550
214 -28550 -28752 -19437 -11410 -4190 6732 11496 11764 18524 24052 19709 16376 16559 10029 1529 -1088
229 -1088 -3492 -7472 -9363 -11667 -13742 -10134 -6651 -7849 -6990 -3416 -2071 -2796 -1502 371 2588 7634
245 7634 8981 5678 8608 17614 17294 9284 8641 9408 581 -5984 -7019 -13248 -20275 -19623 -19116 -20021 -13294
262 -13294 -6610 -6052 -657 9906 14181 15418 19902 20429 17734 18940 14685 4215 1942 2774 -6531
277 -6531 -14829 -13153 -13273 -18129 -15654 -10356 -11737 -10688 -3736 -917 -1019 4084 6953 4417 6088 11551
293 11551 12197 10822 11769 11188 9461 10460 7046 -1336 -3921 -4179 -10688 -17053 -16018 -14191 -14823 -12659
309 -12659 -7937 -4626 1265 6480 7642 9475 12577 11068 7681 8696 8493 3360 376 1166 468 -708
325 -708 -1438 -3110 -5542 -5591 -5493 -6841 -8286 -9000 -7976 -4576 -2610 -2075 1259 6400 8310 8730 11191
342 11191 11981 9433 8089 7134 2707 -1443 -4213 -6982 -9832 -10217 -10901 -12557 -10452 -7016 -4765 -1587
358 -1587 1602 2121 4297 9368 8900 5139 6901 9190 5498 2847 4974 4166 1694 2254 1867 -739
374 -739 -1820 -2910 -6963 -8301 -7862 -11276 -13331 -9247 -5382 -4861 -1497 3725 5653 8475 12497 11833
390 11833 7863 7143 7230 3314 -247 -1114 -2013 -3204 -1951 -1631 -2400 -1628 -1415 -4026 -5148 -4782 -6990
407 -6990 -8809 -5994 -2981 -2731 172 4985 8535 11452 12622 10095 7313 4909 1319 -3021 -7146
422 -7146 -10146 -10679 -8238 -6087 -2870 1708 4393 5855 6973 6457 3474 -331 -4015 -6816 -7887 -7711
438 -7711 -5971 -2472 3216 7509 10694 12133 13191 11348 5506 -651 -6242 -12328 -15326 -14915 -14311 -11796
454 -11796 -5668 781 5508 11813 15086 11173 8250 7514 2411 -3571 -4841 -6249 -8646 -3849 2477
469 2477 3798 5733 8902 7661 3239 549 -4456 -10643 -12059 -12453 -14084 -10496 -2748 2985 6985
484 6985 12306 14370 11713 8847 6664 1055 -5564 -9196 -10097 -9584 -4934 681 3620 7325 13049 13470
500 13470 8738 5864 1542 -7216 -12611 -13669 -15861 -15815 -11047 -5928 -959 6862 12041 13457 14863
515 14863 14184 8607 3191 -1261 -5876 -7627 -8417 -10250 -9503 -4328 399 2647 5366 7191 7276 6127
531 6127 4249 2264 -818 -4727 -7522 -7283 -7478 -7191 -5226 -2454 378 3929 7254 8937 9453 9002
547 9002 7630 5663 800 -3050 -4083 -6319 -10397 -10958 -8571 -7044 -2984 1290 2533 3370 6010 6247
563 6247 5339 5680 3558 -251 -57 1249 -78 424 2206 1363 650 2342 1091 -2844 -4614 -5883 -7964
580 -7964 -8286 -7129 -5891 -3034 987 3297 4337 7303 10044 8710 5399 4241 3080 163 -1228
595 -1228 374 -423 -1910 -454 614 -407 -72 -1252 -4933 -8026 -7578 -7721 -7880 -7562 -6347 -2402 3635
612 3635 6660 8001 12401 14310 11105 8114 7811 5858 1254 -2893 -6059 -8162 -9580 -10149 -8989 -6457
628 -6457 -5722 -5581 -2903 -443 2195 4542 4391 3853 5426 7012 5825 3400 1872 1200 252 -47 -927
645 -927 -2256 -2075 -1835 -2055 -2156 -1252 -1320 -3301 -4938 -4231 -3591 -3587 -1979 308 1781 4497 7220 7944 9669
664 9669 11232 7587 2514 838 -1331 -5348 -7797 -9339 -11340 -9782 -5366 -4208 -3064 940 3075
679 3075 1919 2712 5067 4197 2140 1546 2209 2881 3806 4250 3569 4039 3816 716 -2277 -2961 -4053 -6911
697 -6911 -8310 -7372 -6520 -3974 -866 357 1027 3785 5811 4143 3332 3112 402 -1565 -999 53 388
714 388 1063 1496 1917 3322 4147 2305 -524 -2393 -3585 -4414 -5878 -6010 -4089 -1712 107 1486 3871
731 3871 5920 6156 4602 2711 579 -1305 -2942 -4642 -5122 -4195 -3201 -1591 535 3570 4654 4318
747 4318 3255 3055 2090 810 -2173 -4902 -4362 -3019 -3163 -2565 -56 2022 3339 3862 4104 2841 2216
764 2216 872 -2101 -3336 -3068 -3663 -4253 -2326 84 514 1821 3529 3358 2628 2222 -442 -3940 -3614
781 -3614 -2389 -3466 -4604 -2320 775 2921 4814 6060 6306 6582 5397 1937 -320 -929 -3652 -6712
797 -6712 -6402 -4504 -4361 -3324 -788 915 1712 2282 1270 -222 -305 -124 -2262 -3060 -1290 1158 2703
814 2703 3582 4615 5786 6663 5484 2551 435 -901 -3566 -6595 -6880 -6175 -6041 -5355 -3226 -772 1293
831 1293 2341 2508 3207 4025 3399 2057 1063 1135 1893 2052 570 -177 604 1224 65 -1720 -1936 -2374 -3002
850 -3002 -3700 -3496 -2414 -1454 -1153 -452 1587 3926 3321 1870 3226 3811 2001 684 617 -284 -826 -1167
868 -1167 -1988 -2292 -1694 -903 -2073 -1893 -1190 -1139 -757 -173 -979 -1131 990 1565 877 1420 3194 3357 2572
887 2572 4042 4937 3031 1209 336 -1491 -2718 -3823 -5735 -7284 -5583 -4428 -4122 -2592 98 2865
903 2865 3885 5057 4894 4498 4603 3186 208 -1021 -1317 -2247 -2469 -1433 622 666 1269 1901 2179 1930
921 1930 796 -1899 -3448 -3122 -3337 -4521 -4005 -2342 -472 811 2229 3194 3490 3771 2475 1063 55
938 55 -485 -736 -1112 -874 89 1195 1304 1175 1174 967 -839 -3059 -3195 -2565 -2867 -2938 -1767 283 2990 4551
958 4551 4003 3866 4263 2551 -404 -2219 -3490 -4861 -4716 -3563 -2443 -264 2817 3940 4533 5068 4485
975 4485 1406 -1276 -2846 -4395 -6255 -6021 -4812 -3051 713 3665 4632 5327 7413 7471 4295 2034
991 2034 221 -2533 -4388 -4846 -5025 -4837 -3367 -2941 -2486 -394 734 -100 314 1295 682 487 1993 2886
1009 2886 2830 4514 4731 3107 1964 2364 952 -2120 -3777 -3748 -3881 -3996 -3208 -2663 -1500 -197 19 -103
1027 -103 332 -141 -1284 -1739 -247 409 769 2150 3727 5256 5719 4864 3666 2223 712 -1723 -4547
1044 -4547 -5372 -5659 -5680 -4871 -3250 -1604 -238 2067 3037 2832 2244 1921 1591 1449 1240 1615 1404 586 743
1063 743 1998 1536 -354 -1625 -2975 -4700 -5616 -5006 -4504 -3227 -429 2096 3297 5267 6984 7452
1079 7452 5912 3402 1396 -383 -2415 -4436 -5005 -4122 -3503 -2469 -306 1908 1865 831 1004 947 -840
1096 -840 -2505 -3212 -3941 -3673 -1176 1272 2205 3451 5594 6158 5112 4364 2745 125 -2207 -4097 -5294
1113 -5294 -5506 -4661 -3619 -2162 -322 1814 2535 3629 3674 2883 1989 -119 -1257 -1067 -1204 -2176 -2379 -1165
1131 -1165 438 917 1571 1600 1167 511 99 -168 -649 -1533 -1477 -623 -359 487 1987 2700 2088 1667 2368 1111
1151 1111 -1218 -1883 -2041 -3712 -4996 -3670 -2103 -1532 -519 1375 2231 2636 4108 4222 3237 1923 879
1168 879 -352 -768 -1253 -1985 -2009 -1743 -1032 -443 657 564 -47 353 825 -435 -1160 -687 -988 -1013 -267 840
1188 840 838 1559 3198 2102 819 1118 821 -603 -1720 -2496 -3449 -4038 -2499 -1295 -881 -289 1021 1814
1206 1814 3023 3656 3314 2480 2141 1555 548 367 -320 -1711 -1480 -1459 -2197 -2489 -1717 -1628 -2094 -1642 -527
1225 -527 -830 -613 719 1244 640 896 1946 2388 2160 1724 1934 1639 1626 1285 1082 34 -648 -1109 -1845
1244 -1845 -2308 -2524 -3102 -3267 -2725 -1450 -498 12 1348 2349 2761 2756 2422 2468 1978 1183 339 -190 -679 -1016
1264 -1016 -1041 -581 -853 -1329 -1360 -136 -486 -1155 -616 -399 -635 -38 1315 1564 682 882 1922 1476 894
1283 894 602 -87 -785 -1004 -742 -959 -981 -657 -767 -555 -750 -1113 -892 -825 -805 -869 -64 1234 1510 2234 3138
1304 3138 2881 2284 2057 2048 167 -1205 -1845 -2614 -2933 -2297 -1883 -1620 -557 637 1010 822 668 42 -891
1323 -891 -1232 -1245 -1663 -1041 63 1216 2146 3429 3976 4588 3975 2741 1349 -680 -2939 -4115 -4586 -4556
1341 -4556 -4641 -3648 -1512 606 1886 2533 3162 3438 3159 1946 798 -481 -1566 -1912 -1640 -1516 -1249 -250
1359 -250 874 967 878 1604 1490 159 -289 -449 -825 -1302 -1421 -762 -426 446 466 738 1342 2020 1254 345
1379 345 196 409 -362 -433 -661 -1278 -1380 -830 -1115 -1266 -699 -803 -1188 -553 705 666 993 1638 2187 2386
1399 2386 2579 1890 899 405 546 -1333 -2488 -2452 -2046 -2375 -1985 -1139 -683 92 801 709 1083 1292 1102 703
1419 703 531 604 66 -337 -117 54 169 139 -518 -745 -226 -323 -733 -849 -400 379 1026 991 1111 1643 1748
1440 1748 1253 19 -696 -1607 -1994 -2296 -2186 -1671 -1072 -102 682 1305 2054 1840 1239 402 -199 -1369 -2109
1459 -2109 -2394 -2007 -1250 -87 1052 2174 4085 4287 3878 2757 1406 21 -1753 -3400 -4718 -4914
1475 -4914 -4742 -3715 -2417 -461 1406 2430 3236 4063 3991 3019 1611 598 -599 -1381 -1453 -1924 -2334 -1511
1493 -1511 -415 -23 98 523 646 380 175 -271 -390 -317 -14 -320 -375 676 607 400 627 894 516 -65
1513 -65 -110 -241 -309 -490 -956 -1232 -850 -277 -1020 -1561 -1043 -283 63 71 256 979 1489 2143 2197 2348 2602 2061
1535 2061 710 219 -329 -1080 -2486 -2905 -3070 -2408 -2628 -2478 -1314 -283 514 863 834 1599 2474 2345 2000
1554 2000 1744 1444 992 737 196 -199 -669 -405 -1033 -1263 -1075 -991 -1232 -1528 -490 -263 -503 -815 -31 415
1574 415 587 957 688 1007 1862 1918 643 459 588 -85 -864 -1382 -1307 -1831 -1490 -1134 -1061 -709 -58 541 430
1595 430 1289 1658 1386 706 1215 1458 719 528 129 -39 274 -365 -1132 -1454 -1162 -1412 -2281 -2291 -1549 -1193
1615 -1193 -543 92 832 1093 1631 2692 2260 2346 2298 1429 338 -208 -69 -569 -1587 -1686 -1346 -881 -935 -1298
1635 -1298 -1201 -230 -326 -590 -279 129 520 447 622 633 1281 1519 1723 1161 639 263 110 -540 -811 -1073 -1483
1656 -1483 -1744 -1573 -486 -297 -299 332 615 1213 1596 1534 1092 670 1447 1115 296 -530 -651 -603 -1370 -1482 -1152
1677 -1152 -1042 -1065 -1022 -761 -432 177 344 572 1173 1312 925 976 1260 1221 1269 907 -141 -92 97 -283 -1342
1698 -1342 -1555 -1222 -1363 -1664 -1216 -747 -815 -368 192 197 653 913 1099 577 1018 1655 910 627 581 790 141
1719 141 -270 -615 -669 -637 -1181 -1792 -1592 -813 -474 -147 360 983 1312 2058 1867 1514 689 364 -392 -924 -1000
1740 -1000 -988 -1590 -1874 -1251 -9 78 -45 175 528 348 172 21 352 275 541 599 746 1021 1761 1674 821
1761 821 426 328 -84 -1236 -1696 -1925 -2216 -2260 -1650 -823 -33 135 197 955 1844 1486 1178 859 768 551 740
1782 740 129 71 -3 41 -271 -485 -391 -468 -584 -911 -734 -440 -388 319 592 138 289 339 167 -263 208 310
1804 310 -30 -234 398 669 352 38 93 -323 -344 -228 -1000 -958 -1039 -1105 -378 525 685 998 1617 1640 1252 1041
1826 1041 1038 141 -607 -524 -976 -1578 -1703 -1142 -705 -664 -627 -107 314 807 465 279 141 317 291 542 643 538
1848 538 739 843 1020 608 308 -136 -228 -741 -793 -1027 -971 -1118 -796 -388 -103 -24 32 364 791 313 156 -106
1870 -106 211 571 -17 -216 95 356 -15 137 166 4 -457 19 250 -260 -91 31 -116 -300 -319 -56 -456
1891 -456 -448 166 192 358 564 620 806 946 516 -110 -300 -558 -1049 -1613 -1611 -1487 -1549 -338 388 667 1412 2008
1913 2008 2279 1850 1922 764 16 -567 -988 -1615 -1900 -1671 -1022 -735 46 913 858 1216 1002 547 -77 -344
1933 -344 -691 -1113 -1318 -1340 -934 -108 831 952 1824 1557 1607 1407 728 243 -298 -1083 -1181 -1231 -891 -1166 -768
1954 -768 -288 -33 169 730 364 150 440 504 341 33 222 315 103 100 -167 -309 -302 -446 -581 -543 -632 -318 83
1977 83 438 405 439 772 740 889 462 162 -234 -401 -181 -85 -125 -278 184 4 257 269 -282 -376 -592 -602 -841
2000 -841 -1003 -771 -332 201 228 783 1087 846 902 1257 625 292 298 58 -484 -1 -250 -336 -279 -24 -107 -688
2022 -688 -645 -915 -915 -777 -793 -855 -605 66 333 799 1078 1443 847 1002 731 331 -604 -650 -880 -1186 -1379 -911
2044 -911 -693 -242 583 844 732 626 807 552 456 -203 -415 -745 -311 -133 -439 -173 254 491 542 687 265
2065 265 -99 -391 -604 -940 -829 -1112 -584 -443 -75 557 408 993 1171 1147 1011 728 100 -126 -249 -230 -465
2086 -465 -1042 -638 -433 -457 -529 -301 -12 -180 -119 -9 64 80 336 312 -84 257 672 469 304 383 600 203
2108 203 -134 -33 -262 -238 -570 -698 -236 -84 16 -541 -243 314 68 247 133 117 9 -194 81 -273 -169
2129 -169 -29 203 51 45 493 -251 -136 251 -214 -167 -31 94 100 515 526 357 675 865 573 171 -40 -185
2151 -185 -122 -731 -880 -872 -719 -707 -397 -54 217 282 -139 174 444 352 -91 -36 35 -71 128 132 168 197 103 473
2175 473 326 85 4 74 -412 -741 -506 -468 -537 -318 -55 -74 282 307 517 515 516 198 -169 -57 22 -106 -592 -436
2199 -436 -436 -178 -278 -284 -188 -13 83 172 132 703 473 373 258 315 210 272 149 -273 -574 -203 -241 -674 -375 -285
2223 -285 -220 -681 -782 -326 -431 -241 -205 -155 550 968 1034 1040 1140 1151 1047 588 372 -288 -287 -931 -1092 -1110 -788
2246 -788 -605 -749 87 318 360 440 504 522 248 102 -191 -5 -413 188 -97 4 390 789 813 287 166 16
2268 16 -112 -396 -594 -572 -857 -535 -302 -146 331 484 697 346 521 761 388 11 -84 304 100 -385 -728
2289 -728 -465 -302 -519 -833 -732 -123 -332 77 135 572 565 698 1040 1004 834 705 240 -341 40 -46 -273 -722
2311 -722 -393 -287 -311 -222 -168 5 -151 103 -227 -285 75 -210 -321 -462 3 109 31 679 462 323 331 211
2333 211 157 260 -46 -553 -232 -210 161 98 -38 -18 -132 -10 -239 -111 -453 -68 -24 -471 -88 412 404 225
2355 225 215 247 217 -183 25 -238 -148 -610 -527 -84 -44 234 190 292 57 498 655 228 -189 -135 -262 -147 -421
2378 -421 -593 -548 -203 87 18 344 341 219 69 281 202 5 202 -233 -510 -259 190 -450 -201 -223 -130 81
2400 81 -123 166 554 657 384 302 271 538 752 57 -363 -431 -416 -802 -559 -488 -704 -249 -300 -27 -17 469 312
2423 312 19 455 151 -78 -93 -35 120 -108 84 398 410 529 719 395 148 106 86 -402 -792 -889 -683 -668
2445 -668 -410 -346 21 135 289 479 469 346 285 -207 -258 22 -203 -278 -157 162 194 284 357 165 -33 187 -49
2468 -49 -343 -414 -74 66 -135 -259 368 443 295 600 472 329 206 -254 -256 -501 -375 -634 -369 46 109 256
2490 256 429 631 601 958 168 -108 175 -66 -171 -719 -456 -280 -376 187 1 338 528 583 641 351 35
2511 35 -218 -399 -604 -491 -205 -485 -409 7 86 198 364 313 172 299 33 -113 -189 -108 -93 -234 78 236
2533 236 290 372 389 185 301 93 -52 -282 -544 -804 -934 -822 -648 -464 118 7 4 128 458 626 351 340
2555 340 84 155 67 23 -95 193 166 28 183 -54 110 -15 -207 -491 -612 -583 -714 -682 -389 -225 -7 63
2577 63 449 787 505 606 293 505 125 77 -279 -438 -329 -241 -286 -395 -345 81 -138 269 247 53 -45 8 128
2600 128 214 49 -105 417 284 489 248 83 523 -16 134 -60 -433 -772 -566 -381 -614 -440 -366 -70 185
2621 185 394 462 563 606 714 650 444 404 226 17 71 -120 -98 -432 -101 -372 -296 -294 -405 -350 -253 -321 -753 -188
2645 -188 11 164 54 219 765 489 741 732 587 281 32 -287 -316 0 -203 -546 -830 -355 -75 -495 -283
2666 -283 286 151 121 171 -148 -155 99 13 -137 -87 226 157 307 535 273 133 -104 -141 -286 -363 -430 -273 -506
2689 -506 -224 -55 -118 33 464 439 848 809 599 205 344 47 -124 -182 -727 -463 -542 -352 -473 -387 -132 149
2711 149 339 411 377 172 218 235 165 3 -135 40 -36 116 149 57 290 129 178 314 221 88 -130 -122 -393 -389 -375
2736 -375 -401 -155 -127 -213 5 -187 104 14 44 237 122 -241 -139 -27 -199 -142 68 119 47 -105 -199 -26 170
2759 170 158 270 237 92 231 121 216 -154 -291 -358 -482 -509 -635 -439 -419 -295 -291 52 281 520 777 713 665
2782 665 191 365 548 -5 -184 -435 -760 -498 -272 -361 -204 -59 125 16 398 299 -151 -222 -177 -117 -159 -231
2804 -231 -168 -81 -191 189 221 284 461 65 17 142 -68 -485 -296 -173 -426 -253 -101 62 238 313 284 478
2826 478 221 622 294 116 -21 44 -143 -31 -285 -148 -290 -503 -545 -473 -241 -538 -54 -402 245 75 265
2847 265 253 517 522 660 892 544 570 230 55 -164 -571 -242 -681 -597 -443 -285 -393 -50 221 205 279 325 11
2870 11 138 -209 14 -281 -267 52 261 55 148 335 598 348 201 360 2 -231 -534 -551 -769 -525 -477 -487
2892 -487 2 -26 56 436 806 545 539 499 86 10 -142 -236 -96 -468 -344 -112 -212 119 -10 -32 -72 18 61 -148
2916 -148 -58 86 -36 -101 -33 209 340 282 249 365 386 0 -73 -228 -191 -436 -460 -308 -320 -292 -98 -174 97 96 102
2941 102 69 81 100 42 72 237 46 8 389 494 209 162 189 220 -98 -255 -148 -294 -338 -759 -483 -354 -322 -194
2965 -194 -57 24 36 241 474 419 467 508 58 35 95 244 -230 -337 -63 -91 -76 -128 39 218 59 -269 -209 -42
2989 -42 18 -176 -92 -35 45 209 98 76 433 246 4 -231 -236 -66 229 -214 -146 -6 -45 153 187 62 4 -28
3013 -28 -108 -56 168 308 -60 -1 94 -17 326 184 349 -24 143 205 -89 -163 -295 -288 -372 -410 -368 -325 -161 85
3037 85 172 310 215 230 248 119 78 81 -139 63 -105 -103 -308 198 176 181 -129 -141 113 -223 11 -297 -218 -248 -304 -213
3063 -213 113 149 12 103 104 -71 -94 314 160 -119 -71 -189 -196 -12 -217 52 37 26 180 377 258 288 -6 130
3087 130 -119 -249 -387 -178 -348 -300 -214 -212 141 45 87 121 -20 191 350 -97 -56 161 -99 234 62 158 234
3110 234 -140 -78 5 147 172 -238 -16 -239 -238 -249 -274 -253 78 39 109 226 189 270 267 -50 -20 -191 -264 50 -291
3135 -291 -444 -327 47 -239 -24 -116 308 97 139 54 165 350 127 -84 247 72 132 149 219 343 154 64
3157 64 66 -223 -266 -602 -592 -778 -597 -364 -237 -260 138 274 406 522 594 716 413 359 518 85 -24 113 -204
3180 -204 -326 -227 -152 -400 -328 66 -167 -268 -154 10 -58 108 94 117 239 379 362 414 317 286 355 56 95 -208
3204 -208 -312 -166 -383 -450 -388 164 66 -145 127 128 -112 84 433 72 154 270 150 227 278 228 157 -252 -46
3227 -46 78 -295 -385 -685 -596 -637 -580 -265 21 222 337 345 542 657 412 526 407 33 190 -57 -8 18 -273
3250 -273 -492 -414 -453 -402 -140 -107 -35 -221 -87 -124 32 -103 -186 81 171 127 158 263 182 53 181 227 -49 -203
3274 -203 -74 -229 -303 -471 -235 -97 -247 -87 -153 -212 239 340 16 79 137 -44 -185 94 -35 -79 72 58
3296 58 -29 -23 -104 12 -69 101 -21 182 55 -77 36 119 197 45 357 112 369 95 232 -71 -265 -493 -317
3319 -317 -388 -391 -246 240 224 203 234 557 367 473 228 208 113 -22 77 -558 -56 -418 -284 -116 38 226 154
3342 154 386 356 40 204 41 -146 -125 -223 -319 -63 -162 127 406 -57 179 238 120 -42 -418 -200 -131 -322
3364 -322 -221 -92 -14 4 144 97 278 621 344 273 243 450 -221 -195 -168 -437 -132 -420 -376 -549 -204 -133 -132 -118
3388 -118 -186 -165 191 127 60 223 238 66 366 523 401 218 94 232 31 -56 -271 -364 -443 -354 -177 -23 -210
3411 -210 -84 34 -134 -7 384 203 61 152 73 45 -97 74 77 -144 -76 -37 -23 -2 67 -181 -318 -78 -275
3434 -275 53 -241 -50 -103 -54 77 212 245 127 430 303 391 24 -124 -7 -108 -360 -185 -294 -155 -163 -68
3456 -68 -79 -290 206 233 224 34 -3 31 -135 257 106 178 1 152 273 620 193 -113 -173 -275 -255 -72 -386
3479 -386 -548 -344 -326 -96 6 231 190 301 345 205 236 282 268 150 29 -177 -249 196 120 406 -105 -101 -68 -38
3503 -38 -145 -168 -216 -17 -163 -68 -198 -157 35 334 111 182 194 183 -7 -101 290 50 23 -214 -37 -108 -68 -81
3527 -81 -9 223 -63 -150 -353 -112 282 120 -108 5 -245 2 106 23 69 123 295 -78 -149 -61 -21 -166 -448
3550 -448 -498 -175 -45 -113 42 -40 67 297 100 93 314 212 101 2 36 -14 -97 -226 45 152 87 -120 101
3573 101 -64 -296 -213 -44 -127 -165 -214 -242 -153 -128 99 203 83 239 144 607 -5 242 122 -57 -56 -83 -214 -79
3597 -79 178 117 184 11 151 -204 -109 154 -226 -258 -74 -232 46 45 -63 59 77 8 331 88 -159 38 -163
3620 -163 -119 -252 -171 -42 -226 155 -180 57 247 243 165 -48 -123 -90 44 118 154 -157 -190 80 -136 -67 180 126
3644 126 134 -137 -145 -41 -49 -395 -91 -153 -229 141 -201 38 21 -44 -154 319 128 -107 150 49 102 -127 144 128
3668 128 63 -214 -51 -33 -78 -227 66 121 -261 -73 126 -84 -334 100 -32 -242 -82 149 23 163 -24
3689 -24 9 137 97 33 10 117 216 67 97 100 155 -172 0 1 -395 -92 -336 -396 -231 -289 -142 -189 -70 68 -25
3714 -25 -75 279 219 223 472 319 105 167 180 -141 25 76 245 -163 167 -59 -273 -22 -53 -162 -60 230 -136
3737 -136 -42 -83 -129 -10 -1 156 173 -54 311 166 191 -80 38 -100 137 -359 85 -18 -162 2 -133 70
3759 70 -18 202 4 390 145 -273 -185 -137 338 264 145 50 -74 -19 170 11 -198 -191 -381 -293 -9 -367 -119
3782 -119 -361 338 210 372 86 348 518 280 456 -11 -50 -178 -55 195 -169 -189 -340 15 -50 -140 -255
3803 -255 1 -163 -246 191 -101 130 24 228 202 197 195 427 181 380 237 504 -118 -46 22 -186 -207 -85 -17
3826 -17 -107 17 -134 53 -172 26 194 154 310 17 -98 -113 -2 -67 -278 -78 -88 100 -62 63 88 7 168
3849 168 234 -12 -45 -192 66 17 196 95 265 334 317 89 321 173 145 -56 -164 -150 -349 -207 -137 -468 -70
3872 -70 155 21 133 197 -52 80 10 238 181 -101 156 -23 40 284 281 218 -41 321 95 254 -24 94 -24
3895 -24 -454 -28 98 -167 9 61 31 31 96 371 -67 30 18 152 -66 -152 -343 26 -18 120 -43 180 -44
3918 -44 310 178 -155 315 -39 -222 14 -176 -160 -49 -98 47 -53 -183 -256 163 56 -212 80 -131 -77 -217
3940 -217 -297 -125 10 -25 295 358 158 157 34 -3 -205 2 115 -80 -247 -41 -93 -214 -74 70 -119 256
3962 256 -54 149 -29 122 67 -173 -298 -220 -127 90 -46 95 -25 -50 -6 -8 28 65 65 158 -273 196 -104 -88
3986 -88 -11 83 88 127 117 151 182 142 -100 312 70 -298 132 -250 -214 -151 -76 -101 124 -86 133 -300 -171 187 54
4011 54 -237 -27 -19 55 67 143 265 170 116 38 -26 -19 1 -135 29 -292 4 49 -196 -71 34 -18 50 37 -1 28
4037 28 24 -38 162 -106 42 -10 -39 -84 -51 -186 -90 103 107 -96 38 -106 111 22 115 46 -201 -319 30 184 50
4062 50 126 -141 50 96 -77 -192 -233 -13 -112 70 -13 48 72 -102 237 -120 32 -179 173 261 224 273 17 187
4086 187 164 -295 68 -32 -60 98 61 115 -100 -151 -185 -178 -39 -216 -212 -157 77 -2 119 25 216 393 107 206 148
4111 148 106 89 25 19 203 -5 -289 -80 -331 -237 -332 -377 -129 34 -260 154 185 64 -179 -65 37 -97 124
4134 124 65 176 -125 -105 -223 2 309 321 172 -90 5 159 47 -82 140 -132 -72 -17 -28 -28 -155 -86 -65 112
4158 112 -211 220 246 85 82 -126 143 -22 -349 32 10 -257 133 -214 -13 -18 136 -100 -35 283 115 -81
4180 -81 -219 265 125 -136 -156 47 2 76 -219 -30 -73 105 -22 -135 24 -36 62 -157 -290 37 -171 259
4202 259 -61 -85 -71 61 103 167 144 -78 -15 -8 -50 -135 -21 76 169 113 118 1 -85 -93 123 77 55 44 -78 -13 -63 34
4230 34 -49 183 55 39 241 57 163 98 2 -76 74 6 -49 57 47 98 -18 100 -91 39 -45 -60 -102 -104 -112 34
4256 34 -312 -122 -88 42 187 27 -76 83 176 -197 22 97 -252 121 -216 -138 -205 108 36 193 69 34 181
4279 181 68 163 191 37 -112 -17 -27 -16 19 -140 67 282 67 -193 -142 79 -65 -115 -83 15 -191 -179 -121 -217
4303 -217 -172 216 -148 122 -62 20 -58 -118 165 -74 -40 -11 385 46 240 31 -60 -40 9 -166 -256 -78 -277
4326 -277 -134 9 -81 -39 162 18 111 56 -47 64 387 21 53 365 41 -81 -64 -15 -91 -110 107 -120 -103
4349 -103 -109 154 -96 180 53 -402 -1 -110 -184 106 111 -67 164 37 32 -269 -117 -61 58 -40 46 -142 65
4372 65 -83 42 95 172 -71 97 130 -34 74 -137 -314 -95 -103 -183 31 -108 -294 73 -85 -7 -29 93 -111
4395 -111 110 -43 -41 -82 23 -130 22 35 141 -93 81 348 -48 -51 143 44 101 233 -56 33 -231 -11 -390
4418 -390 -104 13 -23 75 224 95 174 165 -302 -107 369 -110 -118 49 24 5 61 183 110 -37 -72 106 -65 -85
4442 -85 -37 55 -271 120 -102 -114 -152 134 -123 16 -35 -88 135 48 154 -130 -251 127 3 57 84 28 84 187
4466 187 168 7 -227 -80 108 -98 -53 -77 75 -50 -254 282 47 143 -200 -195 76 -25 -188 -170 -30 -227
4488 -227 -22 -67 -57 -68 97 104 183 45 192 63 68 107 -72 -96 142 110 120 76 -32 -138 -162 47 -75 26 -61
4513 -61 -15 121 -90 -28 97 7 13 82 125 -179 166 64 -196 -24 -89 53 -150 217 -121 224 64 102 -155
4536 -155 75 99 -27 216 -30 -34 -53 -63 211 -64 95 185 -53 206 -98 -165 -188 -88 33 -65 76 134 -138
4559 -138 103 96 -31 52 -141 89 227 104 -17 82 -169 33 -96 21 181 -200 200 113 -46 -192 40 30
4581 30 61 -32 32 -93 140 142 106 -35 40 -111 32 243 -48 -99 47 -328 -17 30 -26 -30 -308 -209 -27 281 -49
4606 -49 -59 83 -31 -139 -134 -257 98 151 44 -56 -212 11 -35 -228 32 106 216 -231 -295 -13 -30 -102 -363
4629 -363 204 234 -38 92 -186 198 -112 -25 -130 -1 -50 -71 132 -258 -166 76 96 24 65 -1 206 89 234
4652 234 -66 -37 26 46 99 120 -20 194 134 148 124 41 -55 -311 99 -160 -18 -151 92 -85 -196 -125 -32 -11
4676 -11 -87 226 -198 24 46 207 -118 11 302 -465 -113 -8 -310 33 -50 123 34 97 -181 -128 -236 -53
4698 -53 -84 215 101 -36 21 30 75 -28 -7 -183 185 143 -26 -56 109 85 -225 -97 84 31 -192 25 57 163
4722 163 -23 59 -77 148 208 484 143 -188 -163 195 -48 -22 102 1 176 -77 91 -141 198 192 62 -40
4744 -40 -19 82 -47 -64 31 73 -87 41 111 -34 49 -43 -43 15 -88 -61 103 -137 -37 80 -351 -236 -177 227
4768 227 -164 40 -39 -372 -20 -212 -162 -90 116 -22 -86 -121 -19 82 -289 33 210 -201 -12 -8 117 53 -92
4791 -92 -58 -19 25 -3 85 -30 115 184 97 -21 -4 35 -120 -42 86 186 -218 37 98 14 -56 -57 33 -34 134 279
4817 279 -61 -152 92 -133 -102 155 -22 39 -154 69 -55 181 -183 81 142 -257 -13 24 -54 -9 10 46 204
4840 204 279 39 -167 -42 -404 -174 13 66 -236 -111 25 82 94 75 84 -143 -100 388 -9 26 -126 -19 33
4863 33 -66 165 -83 76 17 -352 -95 10 -100 -194 173 -126 -19 -215 -118 89 19 135 -163 7 121 179
4885 179 -115 -133 -184 -272 188 158 13 43 35 58 115 55 218 -75 20 140 15 -57 -155 -392 -72 83 -367 -23
4909 -23 56 -92 -23 78 -59 124 -162 -4 105 115 115 -32 93 -21 109 31 -38 114 165 -65 -13 135 -138
4932 -138 179 -118 -231 -132 218 -5 -206 -163 -179 12 49 -45 160 -107 18 -226 143 63 -26 79 69 -201 -35
4955 -35 43 110 -8 -30 -213 -154 27 5 -139 -241 -88 208 -138 151 72 58 -117 89 17 74 -79 29 -181
4978 -181 -328 31 102 64 -128 -41 -144 11 62 214 -69 34 54 13 -368 24 -56 -196 6 -48 -122 -18 -56
5001 -56 168 -14 -90 -287 -269 105 -78 -377 27 -267 -47 -45 -31 -195 -3 86 -68 -162 -4 107 -115 46 107
5024 107 93 83 -277 65 -99 -135 85 -204 8 -183 73 -14 -194 138 105 -43 96 108 20 -88 -20 -41 -2
5047 -2 163 -58 160 297 -78 -84 -181 -207 35 30 -193 -219 -26 86 284 202 -175 -183 -50 -74 -2 31 57 54 37 -232
5073 -232 253 263 -52 136 -22 -13 -11 21 -142 16 62 -51 165 232 55 -289 -72 15 69 14 -7 -86 68 -236
5097 -236 149 -106 -74 82 146 8 -241 -49 233 107 -15 168 -82 266 223 -102 -21 74 131 -7 -58 -217
5119 -217 197 10 127 -21 -111 -166 -192 -261 -3 133 -165 21 175 173 288 197 217 47 287 -30 22 -227 -16
5142 -16 17 -314 34 -136 -7 -176 -29 163 -46 -50 -134 -114 -86 -151 -48 -225 -145 32 172 122 -16 110 70 12
5166 12 158 -97 174 101 -42 -109 60 35 3 -332 -48 146 -115 8 -39 338 -183 53 -92 -27 -118 72 28
5189 28 54 110 -138 59 10 101 46 -167 -23 170 209 192 -280 81 -157 83 14 -156 35 39 173 -98 -101 62
5213 62 -189 74 37 -105 -122 -113 198 -11 -179 -60 -184 129 5 39 52 -115 -188 171 18 72 -98 -50 9 -313
5237 -313 -91 53 120 76 168 174 -60 0 75 114 -182 140 -10 -182 -37 64 193 134 9 100 -47 -43 -63 -65 47
5262 47 16 -12 2 -82 -104 82 -173 153 33 -43 91 -94 18 -4 -154 165 -43 -274 -136 17 83 -2 -3 8
5286 8 264 30 -126 81 263 -22 -84 -196 145 173 126 -56 -3 -155 -3 -71 -23 10 13 109 136 -74 -198 -45
5310 -45 -45 14 -24 -245 178 113 -81 -95 35 -39 159 138 -109 -18 -71 42 82 113 263 14 54 -27 -160 -154 110 -145
5336 -145 27 -82 62 78 9 100 -63 89 -77 85 -13 36 -204 1 -111 -87 144 -375 199 59 -19 -136
5358 -136 24 259 -230 -9 334 17 -146 -97 -96 187 31 42 -343 -55 -313 -156 261 -5 181 280 49 -92
5380 -92 210 154 -95 108 164 114 52 -64 59 -49 19 8 -46 -75 -147 -43 0 94 175 -11 43 99 -256 -111 -81
5405 -81 -136 247 -83 27 200 -52 -192 64 19 -50 203 -89 220 -81 -92 145 -304 -16 -324 -100 -167 288
5427 288 41 133 51 -18 188 7 280 103 212 1 -44 224 -151 165 263 37 -65 -99 -21 75 -23 206 -113
5450 -113 -393 -142 96 20 -2 193 47 71 -203 -214 -136 -57 -141 45 58 -47 43 91 -142 38 101 81 210 -65
5474 -65 357 125 186 43 166 335 177 -117 -247 -158 90 90 35 183 -10 -55 -230 -287 7 97 -8 -105 -74 29
5498 29 -211 4 -155 -110 66 -308 96 -44 -120 -122 -136 61 -17 -13 -58 -56 120 184 95 4 -13 -11 -250 23 -19 -187
5524 -187 -49 176 160 124 -52 -117 -288 -43 151 -166 88 -65 -95 90 -248 -2 88 -28 -89 237 -138 -396
5546 -396 -11 101 -80 14 229 -39 -73 -125 -20 -55 54 -21 9 16 97 215 -212 -79 -15 183 -49 -33 -150 -128
5570 -128 -85 71 -88 121 126 -98 190 -2 -224 -28 106 48 -234 109 50 -15 -271 63 -267 -160 117 -74
5592 -74 74 37 122 -258 60 -84 -12 -5 84 140 -81 -56 -20 -173 80 -4 -146 -89 35 123 -95 97 191 -159 -144
5617 -144 -90 -276 -186 -244 -170 60 -41 159 115 -13 -45 -84 -87 -51 258 20 67 -10 86 -18 -39 52 -98 21 216
5642 216 -36 179 121 94 163 -231 60 112 -53 40 -63 -40 66 -16 -9 -163 98 134 3 -38 -38 379 -3 248
5666 248 -39 65 -76 -60 -80 12 -84 -76 -147 116 58 -144 -94 214 12 54 3 -11 -198 -67 180 -133 60 13
5690 13 -135 158 82 295 -104 23 61 3 95 -110 53 128 -96 -126 53 4 -81 -42 24 -164 145 -80 55 22
5714 22 -8 -146 -53 -235 52 168 -187 21 -173 -9 110 -58 -65 -83 26 60 89 85 -58 -29 -38 -163 -8 24 -88
5739 -88 -100 188 -84 20 -255 -49 -64 -117 -61 12 63 62 -325 79 36 5 -148 240 -215 -48 149 -137 47 -160
5763 -160 -212 60 49 72 85 -27 99 -239 50 -111 43 -24 225 -149 -131 -76 -81 257 -276 152 28 -85 -122
5786 -122 -45 -87 58 -64 117 170 189 50 -52 198 -99 -67 82 -97 51 -208 77 -200 -40 -109 92 -100
5808 -100 101 115 -133 -22 13 73 58 -135 42 -42 133 -141 -56 -38 -27 206 112 -110 -229 -56 -3 -2 -12 32 133
5833 133 -105 9 -264 219 17 -124 -62 59 -134 -173 167 -133 -11 -271 154 190 -72 -96 -267 -57 103
5854 103 233 95 -57 20 -311 261 -44 -34 -17 1 149 32 47 -198 -75 138 -28 73 43 68 18 -34 -32 -152
5878 -152 -60 60 62 76 22 -17 107 63 -111 275 -7 3 7 36 6 13 133 -60 117 -28 -77 12 -12 -182 -79 -76
5904 -76 -170 -102 64 25 -48 -108 -161 153 155 -77 71 -112 137 141 168 -190 182 -149 55 -64 -139 281 -158 65
5928 65 25 56 49 -17 -130 -400 55 -105 -29 114 112 85 -72 132 53 -87 -94 66 -88 -136 23 186 -40 160 12
5953 12 -195 53 61 -24 64 64 -132 -24 79 88 -8 132 -290 -38 -145 -266 5 -18 -185 -130 -191 -9 -178 -32
5977 -32 134 -220 268 127 171 34 159 97 -55 47 226 179 8 8 18 -99 -190 26 -13 68 -57 -109 -265 -116
6001 -116 -119 110 -15 -10 -1 7 -183 -285 -171 -146 -21 -172 -153 91 -132 -4 233 84 51 229 46 22 216 177
6025 177 287 342 5 40 7 9 57 -52 237 13 -260 155 7 -86 5 -90 -127 163 49 64 -11 86 36 -148 19
6050 19 -230 345 310 -18 -41 256 149 71 -94 204 -148 -58 -318 -113 164 18 -100 -13 127 38 12 127 -341
6073 -341 114 -151 14 -16 -144 268 251 94 -93 188 -88 70 -21 -45 -176 19 1 448 -119 174 -169 -84
6095 -84 -140 -81 64 -227 -51 -204 -141 -222 -75 105 37 143 177 -116 129 131 55 144 67 190 141 -101 -100 131 -65
6120 -65 30 152 10 -260 242 -84 168 213 99 20 333 -95 -145 10 5 -86 -182 -126 154 33 -5 22 -65 160
6144 160 8 137 -94 -25 -187 54 -191 65 -123 95 93 49 -23 44 -19 -27 41 43 -179 -110 39 -18 -101 170 137
6169 137 -58 14 76 -52 272 -60 -297 -122 -35 -55 -7 -164 -1 -221 45 -77 246 -148 -56 -30 -32 152 26
6192 26 -91 -105 41 -39 90 193 51 -175 -39 65 92 139 139 -113 14 297 -13 -63 128 184 -110 -27 -134
6215 -134 175 -64 135 -191 -42 171 -72 71 191 -14 -166 25 -31 -198 111 -236 -168 181 76 -49 -7
6236 -7 88 1 164 -56 -230 89 -2 -116 -44 -114 79 57 191 -176 -234 192 -26 -194 -31 119 60 -236 45
6259 45 27 -212 -41 -54 -299 73 -115 -160 86 -131 -177 237 -170 -31 -263 105 -18 -302 137 124 -131 -91
6281 -91 102 80 123 75 -82 21 -81 -149 -153 -57 33 172 -186 122 141 -157 149 82 -78 118 -128 -43 -107 13
6305 13 -91 -13 -168 -210 -88 61 137 142 -165 11 -228 -41 82 155 16 -25 -57 -130 -124 -24 27 -13 -212 1 55
6330 55 -79 -263 107 -85 -26 137 -193 5 79 50 60 83 -132 36 -57 85 -4 252 111 146 -61 -35 -46 -205
6354 -205 -148 -117 169 -10 -233 -134 -7 33 -22 -8 175 -209 16 -153 -36 87 120 11 -2 1 65 59 9 -40 26
6379 26 -167 170 273 99 -10 -273 172 128 85 72 61 73 -29 -22 -130 156 -96 -255 -66 -1 1 -88 233 23
6403 23 154 133 82 57 62 -126 -17 31 -60 -170 121 202 138 34 -30 -60 132 22 61 10 -235 -162 -211 112 -67
6428 -67 84 -151 31 158 -96 7 -15 212 -15 -213 -146 -35 60 3 -128 -28 -21 -46 -96 132 18 68 -9 55
6452 55 -42 5 -59 106 37 205 -82 63 154 220 -81 123 -44 -31 -98 -19 -154 99 26 129 -143 -15 28 -99
6476 -99 51 -103 67 78 -86 -87 -51 -116 -18 -91 -69 -142 5 13 33 -319 -102 35 66 -24 -145 -120 59 474 -257
6501 -257 -35 193 -148 -192 62 23 -92 213 117 60 24 -75 -40 85 71 -102 45 -7 -129 -66 -106 -126 93 39
6525 39 -39 -83 37 164 -129 173 -188 148 29 -2 -34 109 116 82 -24 155 -106 113 -65 14 -81 66 -208
6548 -208 54 -22 -95 158 -122 75 -138 -291 -53 -173 -40 -185 17 133 184 -69 -39 -22 69 57 59 -84 93
6571 93 173 -129 -25 -166 230 1 -109 -77 305 -2 22 72 94 -94 218 -38 35 -41 219 -2 24 -38 -134 205
6595 205 36 -32 131 190 -46 176 76 125 -119 -110 -77 -136 127 -137 -155 188 21 71 306 -174 -163 158 179 67
6619 67 337 -169 -45 112 -35 146 -109 -182 313 23 116 -343 -104 12 -40 -87 -4 -29 166 -2 -45 160 68
6642 68 43 -362 49 -63 -205 -205 -74 -81 -134 146 -80 -145 -187 110 41 -33 2 -7 136 -38 -20 -232 -52 -74 -105 281
6668 281 47 69 -132 -177 17 71 213 -176 106 13 14 -18 95 -3 -45 -40 -43 80 84 100 46 -173 318 -60 57 -42
6694 -42 -50 103 60 -69 -56 -246 -258 189 171 88 152 -199 -1 222 -62 -71 -2 -102 129 -153 172 -83 -7 -135
6718 -135 -28 125 -1 133 126 -18 -11 232 -8 50 30 -16 117 -188 33 22 5 -84 187 75 509 65 63 183
6742 183 152 -13 -111 -66 -9 -223 -195 41 66 90 -370 173 53 -45 24 -80 -43 -22 -103 -33 275 -164 -59 -295
6766 -295 53 -131 51 -156 -58 -68 210 9 69 -1 56 -5 -175 161 -120 -54 10 -50 -47 -196 -112 103 243 -37
6790 -37 0 12 -62 -173 56 -133 -132 286 12 108 259 115 -189 35 -110 -238 -14 50 88 -335 -121 221 48
6813 48 18 -88 309 167 -73 310 -28 -23 -22 -78 -248 -151 112 -96 86 -144 186 -29 -39 120 52 111 318 52
6837 52 -172 -49 -43 51 -76 83 -99 -69 -148 -153 -201 -193 125 -94 -125 -91 32 -323 -69 -26 89 41 19 -282 -261 192
6863 192 60 94 270 88 -42 -69 51 116 268 127 -175 -207 -106 156 174 -21 66 -78 -8 84 -9 -76 -127 -172
6887 -172 49 335 238 -125 131 192 -128 5 77 29 58 94 193 -57 112 177 -42 -83 26 45 31 -19 -50 -43 -197
6912 -197 -160 208 125 -221 14 -13 -80 -66 26 -128 254 -286 -84 53 -142 -206 23 -148 13 -34 -290 47 -34
6935 -34 171 296 11 -130 -113 66 144 -54 -118 -150 -75 147 -30 -89 50 -29 144 -12 37 -8 158 -34 322
6958 322 95 -85 29 -82 -192 -36 83 -53 80 19 46 -45 -205 -133 -114 81 -69 -97 -257 25 181 1
6980 1 142 102 51 -98 215 229 -98 6 41 88 104 -199 143 18 -136 288 103 39 -91 -75 -80 46 -111 20
7004 20 -67 30 201 -145 68 67 42 99 74 64 113 190 274 -105 30 163 -346 -73 102 -23 101 176 -37 112
7028 112 -178 22 374 -36 114 -192 -225 14 42 -52 -93 165 -181 28 -100 -214 22 255 338 110 82 220
7050 220 -325 85 91 258 -27 -136 105 -29 -29 -23 99 109 141 -63 -38 -27 35 104 -118 -31 91 53 56 153 -252 49
7076 49 101 239 45 -86 124 -120 -25 -219 271 -49 -223 -200 222 -40 111 -53 326 -8 -86 2 -22 77 -62
7099 -62 114 94 118 26 176 28 79 -5 -142 -39 15 260 -283 -26 17 90 160 -87 46 51 -74 -167 93 -233
7123 -233 -234 -22 -36 -150 -135 191 82 45 -27 185 -207 114 35 74 195 66 -220 64 -183 -171 97 -125 58
7146 58 -7 259 23 -62 453 200 -237 88 109 87 -79 32 108 -11 58 -172 -119 19 259 95 -88 -25 -42
7169 -42 -34 -84 95 -55 -45 114 37 68 -127 191 -122 -98 58 -137 -80 -6 -144 -117 -144 17 -6 -173 -158 -6 71
7194 71 -208 10 120 122 -144 21 -86 -19 83 -171 105 43 175 111 -21 157 -66 129 -41 -10 -27 115 -115
7217 -115 293 -198 241 -23 65 -293 54 -68 -170 177 -115 -146 -141 -67 -232 106 136 119 -49 80 143 84 -22
7240 -22 20 -219 -53 134 155 64 31 -69 -183 -92 54 323 134 98 -49 -20 50 -141 -75 -9 -288 19 -62 144
7264 144 -63 185 -22 -91 208 13 -99 29 -132 166 -60 159 -120 -80 -48 -65 145 308 -143 -94 151 244
7286 244 108 94 -43 -182 -62 78 91 -106 -3 -83 -201 -57 -73 40 -84 -179 -114 46 -3 -26 10 -302 173
7309 173 -28 -55 -43 184 -2 66 83 22 -58 -66 -192 66 -213 -261 -18 -266 203 20 -208 -21 126 19 -127
7332 -127 -4 138 87 -19 23 126 264 -70 -166 -25 -127 -42 -113 -127 92 134 18 133 63 -69 1 -191 121
7355 121 159 110 -54 -22 17 -138 -39 21 89 0 -195 9 -36 13 -148 -1 -96 -66 4 -242 23 -181 -48 4 303
7380 303 273 5 -133 -77 67 79 -6 46 -29 4 8 -49 57 -65 142 206 -139 -181 -121 -54 -341 108 -237 68 42
7405 42 -211 134 19 13 69 142 6 -94 -131 -211 15 89 61 209 86 -18 -255 -39 22 -166 -132 -71 56 -93
7429 -93 -98 -59 -91 -17 346 -45 107 -13 15 107 40 -205 289 148 -131 171 -225 31 -88 7 130 11 338
7452 338 -109 58 -137 49 46 88 -23 14 -328 21 -5 -106 -222 50 1 13 153 142 -63 -88 -147 216 -19
7475 -19 6 150 -68 -86 -84 -99 22 105 40 -131 -56 22 28 108 65 -73 -59 12 64 158 -144 -98 -203 -173 -94 -39 20 125
7503 125 104 -46 145 -34 113 108 231 167 28 -71 -124 -295 6 192 -130 -184 71 -173 85 -75 -15 82 -16
7526 -16 121 181 404 195 -142 183 177 26 -39 -32 28 -220 18 -215 99 17 17 116 32 -134 -37 7 8 -61 -32 57 -39
7553 -39 204 -41 52 -35 170 -155 175 136 -155 -4 119 58 -82 -6 -52 217 56 25 -150 -68 -131 -22 276
7576 276 -98 -71 -55 -27 -75 -112 -106 86 198 -113 -5 16 -85 0 173 -156 113 -23 20 60 -91 8 35 -50 -142
7601 -142 198 216 -60 -147 141 186 107 -231 115 121 -50 -62 49 -94 -16 -42 124 7 -27 -183 -64 115 -42
7624 -42 -45 -83 -64 52 45 221 -21 83 56 -233 143 -62 34 27 -152 359 -131 -141 20 -161 163 -309 -193 59
7648 59 -65 -79 -274 -301 131 140 -215 -154 185 -30 41 -114 93 -67 -248 132 23 313 246 52 135 -81 198
7671 198 176 181 28 95 195 52 -86 61 247 115 72 45 54 0 108 30 -18 7 65 -149 26 -5 87 31 37 -154
7697 -154 -143 196 237 23 -35 -88 -184 113 38 108 21 -16 97 60 6 256 82 -333 -58 -149 158 -72 -129 319
7721 319 93 85 -29 134 52 -161 -128 18 -62 29 220 -228 178 213 -200 -224 -56 -234 4 55 88 89 -83 -21
7745 -21 77 -66 -149 274 19 100 -101 -178 -202 -57 -32 -93 -35 132 101 -162 -103 -52 -74 -232 -111 33 82 86 166 213
7771 213 -31 262 -94 197 -136 36 -239 -77 -46 -158 69 -51 -13 -88 269 126 -168 192 41 98 -141
7792 -141 -56 251 -88 -8 47 62 254 4 71 184 9 -110 -79 -194 68 22 -163 102 -257 132 -23 266
7814 266 -2 -231 108 -147 -57 -81 23 86 43 193 127 -38 245 -56 -13 -158 359 -82 237 13 -245 34
7836 34 -277 148 -209 431 101 -106 19 62 122 137 -119 254 -18 -51 118 -18 76 113 10 -17 141 75 -153
7859 -153 171 164 52 169 -293 -75 184 189 -75 30 64 7 235 -143 -5 -128 36 83 37 -138 -71 -102 -56 174
7883 174 247 -147 -79 -120 -15 184 304 -24 -98 39 -59 116 155 75 -46 -211 -83 184 17 -60 -13 -165 -87
7906 -87 6 221 -75 -19 -152 -489 -205 -159 -75 156 -315 74 80 -33 38 229 -127 91 -59 -131 -117 -28 88 -102
7930 -102 192 -121 -26 178 20 21 -86 -14 -15 70 15 59 -197 -250 28 -146 45 67 92 -134 45 -58 -92 331
7954 331 57 -60 -112 281 37 -137 141 33 153 125 -101 -69 -71 223 2 -101 -56 54 -40 53 246 44 74
7977 74 38 -13 -295 -127 113 -56 143 -14 176 -163 -66 119 -51 86 3 118 -49 -147 165 -8 94 -232
7999 -232 204 74 -42 -93 -1 -145 -283 -194 108 190 44 -79 -77 -197 79 -243 68 -372 284 -147 -148 -143 59
8022 59 193 154 -108 62 169 329 242 -14 -65 -27 -27 30 -229 -193 -93 -159 103 -30 212 -9 141 252 16
8045 16 45 236 -74 -3 52 224 -70 137 -42 3 -72 188 99 -214 -127 -154 48 -243 -134 14 28 -133 88
8068 88 -142 -96 279 64 159 157 134 137 235 -65 88 133 93 -55 93 76 -96 -184 -63 42 280 101 70 51 139
8093 139 267 140 83 -28 -148 -113 -119 -107 108 41 96 -207 59 80 -260 -68 151 303 162 50 69 -45 -56
8116 -56 10 149 83 93 36 -152 -168 123 129 210 10 -137 -18 -172 -132 29 52 140 -122 336 -180 16 95 -44
8140 -44 18 17 17 -221 -112 16 -56 218 62 -131 113 -189 104 -21 -223 -75 116 -96 -232 50 63 -26 -243
8163 -243 -1 -134 -202 1 -39 188 104 28 60 189 67 160 -10 -118 232 -189 -124 -228 23 -107 -72 232 213
8186 213 -122 -38 122 -19 123
8191A23
$$ Imaginary data points
##PAGE= N=2
##DATA TABLE= (X++(I..I)), XYDATA
0 0 0 0 0 0 0 0 0 0 0 0 0 0 0 0 1 -8 8 -8 8 -8 16 -16 17 -24 24 -32 35 -40 48 -56 64 -72 81 -91 104 -116 131
37 131 -147 163 -184 204 -227 252 -278 308 -340 376 -414 455 -502 554 -610 673 -742 821 -908
56 -908 1008 -1125 1260 -1418 1608 -1845 2143 -2531 3070 -3855 5125 -7506 13536 -61026 -66705
71 -66705 115403 144546 140587 209816 243466 144845 76224 46141 -1228 -48524 -79576 -125445
83 -125445 -115411 -54404 -30315 -40500 -11990 22653 20173 -1588 -13178 -23580 -28062 -24562 -23015
96 -23015 -24254 10243 61836 67994 50496 70850 85168 53761 27844 11592 -31523 -56169 -48994
109 -48994 -68196 -84899 -51782 -33163 -47716 -30690 3566 12860 24419 34637 26262 37237
121 37237 63446 54479 37426 45685 39301 12066 -622 -12414 -34597 -42894 -47164 -65392 -68952
134 -68952 -45016 -23860 -18734 -9685 9371 25806 31051 35914 43061 43041 35612 29187 23410 20373
148 20373 18272 4815 -13584 -21103 -25611 -34871 -37741 -42308 -48583 -32287 -8229 -5681 3718 32729
162 32729 41624 32198 38083 39919 22080 9969 -559 -22166 -29715 -20721 -22662 -23900 -9839 -399
176 -399 1378 8941 14160 10630 8418 2263 -10733 -12537 -3257 -2586 -6557 1934 15173 18936 19860
191 19860 23068 18398 6920 -288 -8819 -24057 -30809 -27851 -30793 -33596 -20236 -4747 2967 13328
205 13328 25695 30833 33075 33237 25402 20863 18223 4462 -10488 -14388 -17832 -23765 -23955 -23730 -25190
220 -25190 -17320 -6541 -3905 -353 9256 13227 12596 16111 18645 15300 11840 7919 2785 1607 624
235 624 -3718 -6829 -5622 -5567 -7886 -8518 -7536 -8175 -7489 -7717 -11767 -9156 559 3418 -76 5584 15377
252 15377 15703 14745 19225 17760 9826 7840 4161 -4723 -9120 -11733 -19329 -23550 -18324 -16697 -17558 -11263
268 -11263 -4999 -1512 6207 12440 11746 15816 23307 19418 12270 14111 13028 4303 -72 -101 -6707 -11931
284 -11931 -9599 -9754 -13657 -11715 -9314 -12238 -10499 -5023 -3746 -4532 -1596 2146 4737 9522 12515
299 12515 10955 13347 18247 15245 8451 7852 6012 -1643 -7533 -10124 -13181 -14201 -12919 -13178 -11425
314 -11425 -5957 -2779 -2071 3192 7188 5060 4344 7126 7905 6188 5659 5250 3894 4496 5313 2991 846
331 846 -1629 -3246 -4256 -6744 -10726 -11393 -9039 -8634 -8707 -5084 -986 1094 4474 9105 10356 10366 12072
348 12072 11535 9382 7683 4691 -643 -3612 -4459 -7396 -9676 -10074 -10737 -9997 -5680 -4065 -5687 -2398
364 -2398 3234 2147 680 4143 5525 3242 4369 6361 5831 6489 8034 6847 6272 6545 2876 -2355
380 -2355 -3012 -4052 -9669 -12926 -11892 -11793 -10546 -5748 -3236 -2274 1777 7349 8049 6689 7032 6695 4677
397 4677 3851 3294 1503 2052 3350 2210 2231 3700 1822 -1835 -2547 -3764 -8704 -11370 -10257 -8824 -6981
414 -6981 -4139 -1105 2660 8039 11385 11558 10230 7223 4237 1013 -3296 -6982 -8052 -8046 -7240 -3570
430 -3570 920 3927 5848 6959 6380 4386 410 -4069 -8025 -9659 -10002 -9228 -5859 -72 5847 9396
446 9396 13151 15280 13900 10959 7075 -64 -8154 -12674 -14231 -15668 -13128 -7782 -5479 -688 7341
461 7341 10269 8573 8424 6150 -77 -2775 -2934 -6062 -7432 -2350 2038 4190 9330 12125 10455 8603
477 8603 5683 -2317 -8365 -9980 -13078 -15334 -12469 -6971 -3339 2387 9722 12438 10601 8465 5798
492 5798 619 -4084 -7041 -11048 -11415 -5915 -878 2020 8030 14189 13851 12780 12336 6721 -1618 -6717
508 -6717 -11857 -16725 -16152 -13626 -11185 -5783 1743 5687 8835 12577 12413 11329 7894 1802 -3276 -4561
524 -4561 -5858 -7818 -7978 -5517 -2667 498 3881 6655 7788 6606 5462 4796 2176 -1945 -4925 -6981
540 -6981 -8784 -8851 -7612 -6392 -4134 -856 2827 6762 8353 9016 11086 9934 4949 1534 -449 -3540
556 -3540 -6234 -6998 -8548 -9218 -6244 -2740 -1257 1442 2735 1322 2484 4024 1742 269 842 321
572 321 447 4003 5292 4252 4178 5512 3495 646 -1222 -4405 -7179 -8364 -9500 -10362 -7438 -2921
588 -2921 -917 -217 2572 5682 5174 4249 5303 3895 639 787 2528 2348 3475 4751 4014 3140 4165
605 4165 3348 -939 -4810 -8464 -10437 -10035 -10912 -11900 -8430 -3458 -1788 993 7133 11395 11356 10749 10234
622 10234 9501 6879 3787 1586 -552 -3664 -7044 -7552 -7193 -6491 -6102 -5981 -6081 -3211 447 1111 1044
639 1044 2308 3878 4968 4546 3698 2250 1581 1773 1255 1014 1784 2061 449 -751 -54 -352 -3063 -4652
657 -4652 -5664 -7338 -7619 -6554 -5329 -2352 2173 3819 4771 8956 11967 10626 8374 6275 2385 -783
673 -783 -1637 -4811 -8414 -7485 -6134 -7127 -4982 -1210 -229 -1815 -1270 187 -32 118 679 678 2244 4585
691 4585 4913 5178 7297 7806 5220 2469 551 -1446 -3950 -4997 -6797 -8289 -5586 -2526 -1865 -665
707 -665 1911 1808 743 1759 1948 21 -1758 -2166 -1924 -240 2281 2929 3205 4106 5026 4595 2204 -376
725 -376 -2040 -3562 -5661 -6639 -5439 -3142 -1080 417 2163 4267 5557 5448 3742 1837 -121 -2386
741 -2386 -4297 -4737 -4398 -3660 -3197 -1379 1297 4032 4907 3931 2427 2539 2185 -1126 -3618 -3746 -3521 -3562
759 -3562 -2983 -916 630 2417 4208 3788 3256 3450 2031 -1061 -2018 -1820 -3982 -4117 -2457 -741 884
776 884 2753 3038 2127 3227 4011 981 -3378 -3984 -4179 -5049 -5362 -4296 -2748 470 3196 4275 5776
793 5776 7647 6950 3757 2591 2047 -1351 -4038 -3872 -3684 -3448 -2386 -1438 -578 1231 1895 41 -1932
810 -1932 -1901 -2247 -3621 -4491 -3880 -2070 853 3060 3874 6067 7962 7215 5380 4076 2977 -7 -3292
827 -3292 -4510 -5152 -5468 -5310 -4952 -3087 -1123 -101 -296 397 1136 1913 1614 109 -363 1491 2632 2197
845 2197 1299 2124 2854 1916 695 -31 -959 -1934 -3357 -4339 -2805 -1836 -2648 -2632 -275 2004 1611 1611 2877
864 2877 3001 2622 2309 1769 924 1293 1097 -405 -1323 -517 -651 -1025 -1025 -1998 -2624 -1786 -1435 -2791 -2858 -1461
884 -1461 -1940 -2102 346 2891 2446 2592 4582 5439 5531 5333 4028 1449 642 -584 -3887 -5882 -5494 -5538
902 -5538 -5649 -4414 -2873 -1082 1811 3334 2805 3100 3734 2422 616 -18 -467 -1658 -2377 -1275 614
919 614 1696 2559 2570 2742 3645 2922 -86 -2156 -2688 -3237 -4477 -4549 -3165 -2000 -501 779 1213 2186
937 2186 2488 1970 665 -261 -472 -312 -442 -274 978 2374 2217 1658 2208 2464 254 -2679 -3710 -3916
955 -3916 -3650 -3153 -3484 -1644 1603 3497 4339 4644 4623 3047 1307 -753 -3241 -4572 -4294 -4338 -3562 -614
973 -614 2464 2970 4260 5499 5439 3097 322 -1977 -4354 -5618 -6001 -6729 -5691 -1723 1554 2336 4167
990 4167 6620 6706 5384 4610 2864 418 -769 -2412 -3524 -3017 -1916 -3086 -3104 -1269 -1648 -2712 -2309
1007 -2309 -1697 -2173 -1135 169 549 1533 4200 5753 4324 3728 4114 3044 1170 -625 -1762 -2399 -2247
1024 -2247 -2010 -1730 -484 -172 -806 -1397 -841 -1788 -3175 -3858 -3480 -2355 -1148 439 2118 4175 6086
1041 6086 6295 5324 4665 3351 1033 -1417 -3104 -4577 -4784 -4303 -3386 -2882 -2202 -590 341 774 952 681
1059 681 558 -46 619 2606 3040 2811 3364 4142 3254 2071 947 -1460 -4155 -5305 -6145 -6916 -5877 -3373
1077 -3373 -914 849 2648 4890 6449 6570 5013 2864 1606 -463 -2488 -2809 -2362 -2526 -2153 -117
1093 -117 2253 2264 1677 1336 -206 -2118 -2215 -3407 -5049 -5304 -3485 -1701 160 2486 4765 5562 5877
1110 5877 5599 4148 2352 780 -1524 -3728 -4422 -4200 -3736 -2630 -1031 336 1100 1906 2857 3139 2328
1127 2328 483 -1307 -1310 -1243 -1318 -1689 -1161 -535 152 1053 1378 980 552 -184 -539 -1354 -1932 -1254 -806 -1040
1147 -1040 103 2078 2835 2472 3183 3735 2545 265 -125 -509 -2603 -3852 -4176 -4040 -3656 -1578 -94
1164 -94 19 1002 2371 3048 3295 2685 1709 777 89 -774 -1104 -739 -1024 -1065 -559 1003 628 -117 434 200
1184 200 -976 -1251 -854 -1624 -1534 -139 108 -60 1778 3408 2854 2404 2601 1564 -129 -81 -881 -2753
1202 -2753 -3684 -3534 -3408 -2483 -1448 -680 -336 1033 2010 2251 2619 2721 1765 1818 2002 1198 192 533 282
1221 282 -1208 -1401 -1202 -1636 -2476 -1330 -1213 -2144 -2099 -1238 -188 -415 -746 -151 596 1294 1536 1931 2325
1240 2325 2137 2525 2580 2478 1487 544 -588 -1148 -1441 -2256 -3388 -3332 -2997 -1982 -1682 -696 307 992 1569
1259 1569 1746 1739 1757 1402 1256 1210 313 -56 24 380 190 -728 -965 -561 -1146 -1200 -447 -735 -1311 -952 258
1280 258 1124 381 1404 1536 1205 1289 1112 469 138 222 208 -389 -207 -155 -154 -490 -763 -1645 -1609 -1803 -1889 -2207
1302 -2207 -1395 -870 -173 1182 2764 3206 2790 2593 2487 1826 636 -22 -1747 -2062 -1748 -1175 -1040 -244
1320 -244 504 491 532 593 -224 -1578 -2047 -2712 -3163 -2964 -1733 -308 1061 2118 4013 4835 4669 4292 3238
1339 3238 1411 -893 -2826 -3512 -3731 -4091 -3970 -3168 -1337 523 1500 2328 2437 2018 1972 1221 91 -948
1357 -948 -1408 -1267 -1648 -1393 149 798 431 1006 1661 1292 607 -24 -271 -743 -1161 -1370 -1403 -792 279 355
1377 355 189 1116 1822 1428 913 1096 692 369 464 212 -340 -328 -355 -1286 -1359 -1106 -1593 -2280 -1824 -997 -828
1398 -828 264 952 1089 2341 3051 2910 1821 1931 1581 278 -1018 -1265 -1517 -1947 -1889 -1637 -1398 -1002 38
1417 38 113 376 761 324 128 221 247 429 486 37 -2 354 488 -69 -1041 -793 -605 -1056 -1320 -1136 72 594
1439 594 1222 1696 2139 2022 1804 1270 118 -471 -1430 -2138 -2125 -1635 -937 -394 29 1228 1960 2020 993 370
1459 370 -384 -1248 -2452 -3408 -3685 -2552 -714 454 1430 3344 4509 4443 4453 3327 2048 249 -1593
1476 -1593 -3383 -4027 -4157 -4728 -3906 -2044 29 969 1568 2806 3214 3036 2661 1249 66 -233 -461 -1024
1494 -1024 -1187 -1030 -423 -168 90 134 190 319 183 -513 -714 -411 -328 -678 -203 350 261 158 780 1035 1205
1515 1205 822 357 -1 171 620 -386 -1012 -637 -448 -850 -1608 -1889 -1722 -1289 -1078 -762 -311 490 1680
1534 1680 2178 2265 3133 3228 2341 1599 1505 386 -539 -1856 -1862 -1687 -2538 -2930 -2987 -1960 -973 -512 -514 -110 703
1555 703 1245 1461 1494 1440 1233 1387 978 619 694 681 94 -611 -51 -144 -912 -1407 -1218 -823 -1073 -1382 -1057 -378
1577 -378 -5 429 412 373 1511 1845 1034 1133 1315 870 -300 -295 -921 -1323 -1168 -1302 -1620 -1262 -730 -993 -866
1598 -866 139 1031 569 614 688 1199 1692 1317 893 1059 1285 1349 -89 -456 -562 -1170 -1705 -2150 -2526 -2637
1618 -2637 -2072 -1111 -672 -354 918 1416 1681 1908 2467 2227 1288 1228 939 552 -156 -641 -634 -336 -539 -833
1638 -833 -985 -888 -779 -1046 -1244 -1132 -622 -58 -18 340 782 996 1718 1690 1478 1439 548 -49 -307 -113 -648
1659 -648 -1401 -1400 -1545 -1010 -785 -288 -545 105 1187 950 1261 1252 1794 1437 666 670 634 358 -536 -848 -1088 -1214
1681 -1214 -1068 -1234 -1309 -800 -1065 -668 -515 137 396 762 709 747 1215 1838 1634 859 768 1131 873 -246 -251
1702 -251 -708 -1067 -1401 -1405 -1175 -996 -1248 -731 -968 -336 408 226 162 702 1103 989 842 1069 1221 1261 488
1723 488 -101 -325 -497 -929 -1729 -1953 -1834 -1242 -661 140 156 754 1544 1688 1697 1680 1385 396 -581 -457 -339
1744 -339 -1124 -1326 -926 -627 -620 -298 -82 33 -412 -360 -702 -1090 -503 119 374 198 830 1739 2212 1723 1521
1765 1521 1084 571 -171 -750 -1170 -1548 -2161 -2154 -1690 -846 -707 -412 -239 499 855 756 912 894 723 691 704 509
1787 509 405 702 118 -187 49 -589 -394 -433 -410 -651 -535 -108 -453 -167 212 286 -464 -336 71 365 256
1808 256 -28 -4 618 1022 481 67 -133 -84 -780 -699 -1380 -1316 -1448 -764 -672 -143 625 1032 1442 1380 1704 1818
1830 1818 1085 354 92 -245 -943 -1226 -1044 -758 -601 -595 -348 -242 -178 -52 -174 -732 -385 -237 177 247 503
1851 503 723 906 1009 1060 995 788 388 -58 -78 -506 -607 -819 -654 -510 -192 -195 -72 150 482 307 -72 -176
1873 -176 101 396 86 -157 -80 -15 -258 288 347 -18 -19 136 286 70 141 116 -297 -202 -282 -147 -277 -691 -399
1896 -399 119 304 257 578 1096 1393 781 527 173 -52 -960 -1431 -1685 -2132 -1967 -1497 -725 -116 653 1288
1916 1288 1583 2267 2426 1754 660 122 -345 -1082 -1286 -1353 -1204 -857 -112 517 684 1151 1080 824 28 -411
1936 -411 -949 -1551 -1576 -1550 -1284 -606 -34 643 1153 1699 1393 1281 1116 924 410 -314 -535 -856 -702 -817 -368
1957 -368 -427 -234 -157 274 140 -10 149 182 264 243 377 317 370 357 317 -258 -402 -409 -752 -874 -818 -916 -497 -217
1981 -217 85 514 715 739 465 400 635 340 -291 31 87 400 576 413 542 397 796 360 -331 -615 -640
2002 -640 -1356 -1289 -1064 -798 -608 -327 389 623 475 570 1025 552 349 663 202 -11 510 526 313 184 342
2023 342 89 80 -375 -744 -696 -869 -1387 -1067 -908 -714 -154 14 924 1198 1095 1189 1090 436 -18 -163 -379 -723
2045 -723 -673 -674 -816 -472 171 556 753 822 604 162 686 91 -303 -460 -580 -128 -211 112 422 514 381 473
2067 473 652 359 -156 -363 -574 -885 -869 -934 -718 -558 -225 225 570 808 817 1106 1094 702 536 429 391 -201
2089 -201 -518 -22 -347 -594 -187 -114 -59 -628 -543 -178 -651 -357 -30 -51 -4 346 410 115 319 651 547 299
2111 299 397 -80 99 180 -459 -497 -517 -296 114 32 174 127 47 176 140 162 -248 -173 12 -146 52 163 -239
2134 -239 -58 201 243 -48 -181 -170 -307 -340 -396 -613 -127 345 544 340 648 678 1108 761 146 217 -106 -205
2156 -205 -750 -758 -474 -504 -586 -546 -81 77 -356 177 31 86 302 143 -354 -372 -107 321 280 193 847 666 378
2179 378 155 307 240 -545 -420 -599 -674 -663 -356 -254 -225 528 186 286 547 657 406 174 70 -106 -211
2200 -211 -125 -448 -578 -477 -573 -197 -464 -124 -129 -164 170 37 444 461 586 344 268 680 428 291 361 425 352
2223 352 -186 -184 30 -232 -649 -787 -733 -694 -940 -650 -807 -316 238 467 808 1100 1204 1292 1113 669 410 67
2245 67 -195 -824 -629 -872 -766 -497 -179 -90 256 83 232 220 149 157 -279 -569 -307 -198 -76 14 432 833
2267 833 533 591 685 330 51 -403 -475 -419 -782 -618 -375 -355 -27 333 128 395 368 736 382 403 280 366 407
2290 407 310 -544 -361 -148 -414 -828 -695 -491 -1040 -545 -208 10 -141 325 620 606 659 980 615 461 70
2311 70 346 151 -94 -312 16 -93 58 -220 -121 60 -158 -392 -408 -437 11 -311 -394 -140 -213 262 27 344
2333 344 460 571 259 12 193 299 -119 22 -172 179 212 218 -39 -56 -106 -237 -204 -391 -541 -145 -560 -238
2355 -238 -165 279 236 246 220 535 43 -17 -121 -443 -338 -650 -250 -38 278 411 374 143 399 653 518 338
2377 338 25 -454 142 -358 -164 -32 -90 56 -117 60 223 199 -42 17 144 -136 -125 -34 -166 -140 -187 -322
2399 -322 -189 -264 -81 -112 94 -169 288 450 488 508 470 632 891 581 377 6 82 -551 -387 -626 -507 -238
2421 -238 -570 -177 63 539 115 25 332 35 -314 -587 -144 -435 -54 280 -18 320 640 733 444 394 272
2442 272 162 -307 -569 -604 -624 -645 -672 -452 -332 150 -86 -55 253 279 286 -190 -139 -133 -100 -313 -170 158 289 421
2466 421 461 38 170 344 156 -170 -249 -246 -513 -450 -160 71 470 322 261 455 549 506 34 -508 -114 -606 -684
2489 -684 -712 -280 -153 -127 153 19 584 575 453 333 27 -35 -165 -275 -280 -318 -78 58 54 309 397 545 538 224
2513 224 416 67 -74 -418 -347 -405 -352 -525 -465 -14 93 277 -2 -78 222 -82 -222 -68 -189 74 -122 130
2535 130 440 255 420 673 700 729 555 363 161 -295 -225 -358 -958 -631 -527 -328 -363 -363 -196 0 122 126 118
2558 118 237 -37 -189 -99 201 48 369 475 722 313 466 216 -75 -199 -449 -594 -827 -922 -740 -383 -617
2579 -617 -344 -14 623 548 603 520 443 664 408 -209 54 -240 -570 -371 -34 -180 -270 36 -94 -75 35 -138
2601 -138 -121 -227 -74 -2 -71 385 -25 587 460 412 516 271 714 356 -177 -276 -232 -471 -697 -625 -818 -578
2623 -578 -573 -120 41 331 290 410 645 637 778 512 330 514 159 150 -128 -65 -62 46 -373 -177 -460 -528 -326 -897
2647 -897 -941 -647 -400 -88 78 34 569 615 654 803 664 454 166 -198 -65 -98 -260 -341 -372 -69 -112 14 23
2670 23 -75 92 235 -391 -222 -180 -196 -155 169 7 157 277 172 331 222 295 -47 -100 37 -95 -646 -528
2692 -528 -491 -419 -375 -360 33 329 488 728 440 524 618 375 437 -10 -237 -289 -379 -433 -593 -281 -308 -354 94 40
2716 40 153 289 111 336 -5 -281 -206 192 -278 -199 400 394 72 467 286 376 14 189 169 -35 -320 -220
2738 -220 -59 -142 -280 -142 -165 -270 -32 -60 64 203 -51 -81 -151 230 -101 -22 -237 -422 -110 98 258 -160
2760 -160 47 302 159 291 523 506 569 488 345 102 39 33 -344 -506 -656 -731 -631 -699 -250 -254 -149 282 742
2783 742 665 503 453 215 183 489 121 -318 -326 -415 -648 -464 -12 -61 153 77 447 164 124 35 -384 -122 -241
2806 -241 -133 -134 -83 162 -1 48 48 550 163 302 160 -118 -394 -327 -310 -470 -550 -189 -441 -123 212 -42 6
2829 6 -47 446 561 423 315 447 61 124 232 -27 -105 -365 -292 -477 -516 -480 -454 -683 -660 -336 -213 25 291
2852 291 275 575 817 511 415 663 395 -110 13 -153 -307 -361 -84 -294 -412 -74 -48 338 61 -4 -29 -161
2874 -161 -386 -118 -286 -514 -198 -118 -106 157 218 201 483 523 649 289 205 -106 -125 -485 -758 -639 -404 -404 -306
2897 -306 -88 -46 42 267 784 463 270 43 46 -14 -194 -360 -137 -128 -377 -164 171 45 -52 12 -245 -281 -355 -199
2921 -199 92 -147 10 -138 333 415 526 498 399 415 117 221 -4 -254 -429 -432 -338 -101 -245 -163 -200 -215 5
2944 5 -198 -389 -172 -129 -338 111 -106 155 251 371 272 437 376 365 423 176 122 40 -170 -139 -295 -457 -345 -375
2968 -375 -297 -48 -44 -107 198 132 234 185 -18 155 10 -116 -92 -119 274 -11 3 16 248 -9 157 -46 -239
2991 -239 -33 -104 -223 40 -54 -175 -48 209 12 -1 314 353 88 62 70 -63 -169 -107 0 -259 -30 -234 -327
3014 -327 39 -73 22 -167 -124 164 57 -206 170 206 113 137 339 20 8 319 195 56 -10 -205 -299 -539 -194
3037 -194 -280 -469 10 29 -45 83 96 142 118 87 -49 -31 -87 282 -199 -155 115 99 361 292 138 -47 -36 43 -203
3062 -203 -443 -183 -259 -349 -435 51 -104 188 55 168 260 201 -92 -128 163 84 85 -325 -419 -96 174 53 93 297
3086 297 218 410 279 107 130 30 -441 -133 -247 -213 -318 -417 -38 -276 -119 79 -47 238 290 -58 -326 59
3108 59 24 -116 -174 -94 38 246 154 91 149 217 86 -168 76 -386 -176 7 -8 -94 -54 345 66 332 320 149
3132 149 346 -154 -10 46 -330 -565 -348 -337 -100 -282 -16 -250 106 146 -30 -263 18 15 -71 -163 -73 164 420
3155 420 294 394 456 311 284 181 111 -342 -301 -627 -729 -823 -561 -533 -295 -277 101 105 -32 281 413 391 407 492
3179 492 427 171 428 134 -96 140 -146 154 -175 -242 -134 -497 -290 -844 -269 -312 -249 -278 -179 348 360 233
3201 233 156 400 323 248 242 206 81 -107 -212 -109 -392 -235 -127 -291 -80 -367 -36 118 135 -153 106 494
3223 494 165 327 402 439 229 109 218 247 118 -222 -526 -800 -324 -708 -663 -511 1 -201 -47 317 436
3244 436 445 471 872 345 101 230 -125 95 208 -315 -157 36 -62 -35 -94 -114 -261 -223 -93 -41 -248 276 103
3267 103 -209 -11 278 328 425 524 285 353 93 -101 -189 -134 -238 -279 -306 -95 265 -50 -178 -246 149 131 192 274
3291 274 62 -247 168 394 -191 -144 20 -18 79 2 96 134 -89 -94 -8 44 -222 33 -25 76 275 290 358 71
3315 71 444 362 363 -74 -121 -237 -51 -385 -298 -190 -289 196 176 269 120 353 286 443 448 135 -235 -235 -216 -300 -337 -315
3341 -315 -138 -102 222 -69 128 285 394 263 168 -35 -294 20 -17 -165 -128 -223 -11 217 145 177 -17 49 27
3364 27 -19 -85 -318 -602 -437 -80 -264 21 106 451 343 138 483 557 123 367 155 178 -186 126 110 -294
3386 -294 -289 -32 -25 -581 -82 -191 -232 -168 7 107 75 -44 -16 -5 219 429 539 209 284 348 74 231 -346 -309
3410 -309 -153 -288 -406 -219 140 -244 148 -184 80 367 -117 361 77 -3 114 -64 94 368 110 62 -182
3431 -182 89 193 173 20 -41 -172 -327 -391 -43 -258 -106 48 155 232 409 304 304 337 232 106 379 187
3453 187 -41 -250 -300 -73 -574 -252 -38 185 -143 -63 -291 -290 49 -223 -69 -234 102 2 217 268 185 202
3475 202 192 -22 108 -11 -14 -154 -111 -276 -136 -409 -278 -189 -253 -141 290 246 -73 141 -189 14 20 154 127
3498 127 -39 -58 174 415 52 -86 355 303 183 -298 -182 -144 -145 -89 -295 -287 68 132 117 109 52 145 10 102 149
3523 149 103 130 166 -173 55 -75 -132 -136 218 151 -8 -89 -201 -169 -233 147 -6 -6 -220 332 272 254 412 292 -12
3548 -12 176 88 -135 19 -156 -205 -375 -295 -138 -144 -165 73 -187 -72 -94 96 14 -53 77 -156 -52 -75 254 127
3572 127 155 28 176 216 193 134 -105 -126 -80 -244 -451 -197 -265 -110 92 -89 -208 106 180 76 -39 -87 144
3595 144 -225 160 -117 -33 74 -123 91 195 176 -89 -162 129 37 64 -80 -127 -406 -37 76 -36 225 271
3617 271 340 196 75 105 70 109 57 -189 -31 -110 -388 -67 -78 26 56 99 126 219 230 126 117 -73 -89 -185 48
3642 48 206 -189 48 115 86 120 -26 321 -322 97 42 22 -213 -62 -201 54 36 -143 100 -179 -405 49
3664 49 339 184 -17 -93 80 15 45 133 191 53 48 -45 -51 -26 -113 -41 -133 132 79 -166 -303 -142 -177 109 84 291
3690 291 -235 107 -122 165 127 -147 -188 168 111 76 35 61 83 414 326 156 -98 160 -4 -61 -143 -303 -152
3713 -152 -88 119 111 -157 38 110 146 287 206 172 -108 34 362 -38 -232 98 62 69 165 114 3 -39 23 -75 -24
3738 -24 94 -151 -392 -149 -106 -12 90 106 -127 74 160 179 29 -130 177 73 -123 136 -73 -199 -21 -105
3760 -105 -344 119 -92 230 47 18 27 12 174 96 389 181 436 133 93 126 75 171 168 -322 -332 -170 -533 -40
3784 -40 -47 -300 -182 75 191 163 395 495 337 228 290 57 109 200 110 -130 -94 -139 143 -65 -77 -62 -202 -32
3808 -32 -418 -13 -9 -97 -69 -168 6 110 53 186 271 284 61 58 129 -127 -27 110 35 -149 -170 -260 -69 -244 -165
3833 -165 -46 177 312 168 123 232 271 110 -126 219 -79 79 -38 150 149 -24 -54 -176 91 -69 -220 -91
3855 -91 -74 -249 224 -164 -28 54 -124 237 91 93 200 110 281 -75 156 41 -128 -95 -190 -433 85 -304 -322
3878 -322 -25 77 224 -29 -291 80 38 171 -40 130 240 137 128 287 -34 112 231 242 -157 -52 -92 -317
3900 -317 -168 118 -80 100 13 54 54 197 9 213 235 -42 -257 -249 -108 -84 -69 -249 -156 323 67 173 168 68
3924 68 318 -9 148 109 -10 -129 -252 88 7 -71 -186 88 -14 46 -160 -85 -19 -170 -9 182 48 132 120
3947 120 141 -47 270 169 242 104 52 29 -279 8 -145 -183 52 -5 -134 77 -123 170 231 21 -20 55 276
3970 276 -111 -17 143 -36 84 209 4 -144 -51 275 -24 -91 88 -132 -235 -79 7 81 -203 158 73 237
3992 237 208 237 255 237 227 -86 172 120 97 136 120 125 -167 -143 -104 -168 68 101 -125 -84 -215 -235 137 -39 195 84
4018 84 -72 142 290 481 280 325 44 -176 72 130 75 -109 -15 -26 -400 -8 -63 -182 -378 53 86 -232 100
4041 100 420 -58 -123 16 -42 154 -48 37 -20 154 -76 131 -45 -219 80 48 208 13 34 -64 73 72 -85
4064 -85 22 108 295 152 91 219 270 110 172 -374 -184 38 67 -21 -43 -5 -136 -378 134 114 104 78 280 115
4088 115 62 84 47 187 341 24 0 -25 96 117 -75 -232 -110 -110 -361 -46 -82 46 -150 -85 173 -72 -37 -160
4112 -160 -19 -60 222 14 -128 8 30 12 -187 11 -106 9 -291 -6 -250 -4 136 -7 8 -40 -193 60
4134 60 29 -120 -48 -154 37 -67 90 -74 -47 291 -99 111 137 -64 -68 60 62 94 -281 -15 -274 -5 -54 -77
4158 -77 3 203 188 217 207 49 21 198 -42 -41 24 -87 -131 -101 -376 -152 -35 -140 18 98 147 24 215 214 -20
4183 -20 81 -64 86 -21 139 -63 121 5 87 71 -98 154 42 209 -2 131 -49 -166 -64 -34 -290
4204 -290 27 -67 -191 19 2 102 87 118 91 207 76 -46 19 33 94 -134 257 -87 -73 -118 189 121 23 27 -30
4229 -30 -63 -80 -68 -38 22 -129 73 149 163 -5 58 56 -24 -377 -450 86 -218 87 -14 154 73 355 235 349 55
4254 55 -92 -127 -252 -22 -28 -285 -128 -81 -111 204 166 69 186 -7 -268 192 -43 -289 30 -233 -88 78 -97
4277 -97 214 -10 176 107 225 -115 22 197 241 221 -77 22 -130 17 -58 82 -13 98 236 22 -224 -242 -137
4300 -137 -189 -232 -300 -120 -150 -122 -124 161 -176 13 99 17 -208 -380 -58 52 61 53 -53 120 24 179 209 -68 75
4325 75 52 -234 -91 -100 -312 -378 154 -221 42 -151 53 -2 62 131 239 162 42 -128 -91 53 32 133 -52 11
4349 11 -13 -51 43 -157 -75 74 53 176 42 -78 -215 -208 -193 -100 134 -251 195 62 137 301 -42 12 89 -2 86
4374 86 -26 -48 14 -156 -34 194 61 34 161 144 -66 -69 -248 387 100 246 -88 -321 -219 67 -128 107
4396 107 23 197 175 -170 -18 -122 52 -104 -78 -61 -65 -54 -18 -29 248 205 192 77 265 161 0 -132 -146 -11
4420 -11 12 -160 -100 -181 68 90 37 53 -3 -120 79 -56 -68 -215 -3 99 -113 -39 -110 163 -36 107 -28 -54
4444 -54 -85 -72 50 -28 -95 -89 -202 -99 218 -1 -196 -3 -91 198 194 -24 -21 -113 24 -105 54 42 -76 205 -258
4469 -258 35 -36 -76 -100 -48 49 97 196 156 63 128 -13 159 171 -113 276 16 159 -199 -146 -51 -148 -79 -110 -137 -96
4495 -96 -34 23 -92 -31 343 127 45 -159 -93 28 138 -24 4 116 -35 -192 -160 33 -157 176 124 274 -59
4518 -59 30 103 -40 156 58 -39 40 -337 -68 77 -115 114 77 -41 185 72 -208 -83 -34 -231 22 -101 39
4541 39 -212 -51 26 243 133 165 108 120 101 -81 -263 -113 -15 -108 -127 -206 -228 -105 131 -9 -110 18 -67 -120
4565 -120 9 203 80 -105 -29 34 56 123 -193 7 211 -41 -110 228 145 -2 -100 -43 -140 -350 -5 65 -328
4588 -328 159 -112 -204 -12 65 63 88 -279 -400 -37 -59 -5 -139 34 -127 -152 -83 -78 -201 238 -27 59 284 106
4612 106 -19 294 -30 149 -206 135 -97 -241 76 -36 17 139 210 -107 194 -1 -59 -111 70 -145 93
4633 93 -4 195 -48 -106 154 63 69 171 -4 156 68 -53 34 -2 -34 52 -103 -87 92 -375 -66 -147 -63 -47 119
4658 119 58 -114 -38 -263 -169 102 38 -109 -84 110 -61 -228 -11 -271 -240 115 -2 -174 163 -55 -77 108
4680 108 3 -91 -30 101 -2 -51 -94 -82 174 8 -150 49 118 -147 113 138 -130 -89 44 32 -8 29 14 137
4704 137 190 -94 -116 -32 119 25 264 202 -49 4 -281 -200 8 -282 249 -179 36 -85 33 129 -136 -5 0
4727 0 -91 87 126 191 27 45 76 -72 49 126 -112 82 262 -15 105 81 196 55 -24 -84 -44 121 -241 99
4751 99 114 215 -174 14 99 -146 -127 -121 -85 -149 -5 141 121 -179 171 -2 125 -157 -153 -40 26 -55 -24 101 -234
4776 -234 -55 -27 16 31 7 58 -136 -35 -14 -139 -105 117 71 -1 -289 124 -27 -140 92 -91 -19 -25 177 -89
4800 -89 -9 42 125 -104 119 -150 80 -112 -81 172 51 -118 -96 -46 -106 -118 -3 -282 16 19 -77 171 40 140
4824 140 197 -37 -112 -21 -85 148 41 -123 -46 -24 -17 -329 -260 78 17 -46 150 129 90 80 -205 -111 -20 135 -286
4849 -286 -29 -300 -70 -39 -140 -1 -118 -51 -63 86 255 -58 123 -65 70 -24 -21 117 140 110 113 -53 -130 17
4873 17 -255 -163 -234 48 -19 22 -147 11 61 -10 192 230 225 -47 -8 -42 -114 -4 -196 131 -84 66 -130 14
4897 14 161 374 -257 -114 310 136 86 105 60 155 -150 -288 -76 79 -58 173 -2 -78 -123 -95 -35 91 192
4920 192 61 -139 -84 38 -35 34 51 44 86 -28 -14 45 123 4 -128 -80 27 -61 138 0 -311 161 184 -80
4944 -80 -80 -258 54 15 -284 6 -131 91 -35 253 -118 -102 210 53 284 -79 -221 -212 215 49 -199 59
4966 59 5 -83 343 -115 4 -89 -72 -15 25 -116 -103 -60 -8 -79 -137 71 -199 126 -68 195 286 -24 74 -75 42
4991 42 -51 -183 87 13 -17 12 -26 -169 1 121 -325 -96 225 -21 -62 -75 -382 -226 258 -87 -23 -5 -29 -56
5015 -56 -206 -158 -216 166 158 52 -116 236 -174 -69 108 206 205 -139 149 312 -107 -13 -19 -64 26 36 190 -38 -189
5040 -189 -26 70 19 -128 -187 -137 -29 141 151 125 41 164 313 -41 84 -64 31 -102 -2 -10 -256 -173 160 21
5064 21 -196 52 -12 -73 -173 229 39 16 -120 -131 -156 42 -231 362 -143 -169 34 77 -270 93 47 -130 -135 -35
5088 -35 114 -361 145 -179 40 172 111 -219 63 -100 98 -107 -148 -113 -159 -159 -354 -303 -286 269 -34 -5 -179
5111 -179 10 -14 113 25 -114 153 -77 275 -310 288 -91 251 -128 -33 -51 50 170 40 -136 -154 -29 96
5133 96 -120 45 -21 -69 44 -219 -21 116 -81 -50 -101 -217 149 89 -179 60 -54 -141 -62 -51 181 394 115
5156 115 -195 -150 111 -12 131 -61 -121 -13 26 -24 15 90 -116 -93 56 183 -44 -75 -225 -151 -270 168 -176
5179 -176 -11 33 -127 -117 -274 86 17 -184 135 25 73 86 66 113 -81 -267 -68 39 -87 -251 -74 77
5201 77 -33 -52 -59 -311 18 -166 69 38 190 108 -55 240 -6 106 233 81 -103 37 50 220 -4 12 5
5224 5 52 111 15 -212 75 19 -162 -13 7 162 194 -57 29 29 -268 -103 -291 154 -14 33 39 -75 -205 -26 -157
5249 -157 258 -158 443 100 49 -33 -204 -66 212 116 21 -89 146 125 44 40 123 -265 57 -49 -168 -42 -10
5272 -10 141 179 -18 -120 -1 76 60 -167 -34 232 41 -199 136 186 -73 -231 274 118 54 -114 70 -44
5294 -44 98 77 -133 -73 -40 121 -154 24 -72 15 -13 -45 157 -100 182 248 -96 -8 -60 55 -114 14 1 -13
5318 -13 202 54 116 377 246 -152 97 135 30 -134 16 -5 -92 36 5 38 -161 0 113 -62 -77 -54 51
5341 51 -20 -44 284 114 169 198 -11 148 -335 -27 51 142 115 -191 -64 203 -62 7 -174 31 116 -50 1 16
5365 16 55 139 203 88 105 35 65 114 -80 -72 -129 11 -159 -56 -218 73 284 16 -22 202 98 63 -117 -8
5389 -8 141 -6 42 -219 -293 215 -70 -204 194 165 -70 116 47 -112 -254 89 51 99 -42 206 193 80 89 20
5413 20 262 -101 -71 -25 37 20 207 -60 -26 -99 181 -5 253 112 46 151 179 -136 40 -17 -242 -70 140
5436 140 -72 -181 239 -85 99 143 249 -50 94 -83 161 -204 179 -320 31 19 94 -132 64 117 -63
5457 -63 29 247 44 -49 -98 105 31 30 145 57 52 139 -234 -145 -125 -232 35 -170 111 -81 0 4 296 -42 -81 98
5483 98 91 -161 -209 86 125 107 -121 1 49 -328 132 115 -118 235 -388 140 -113 84 4 137 -56 176 -38
5506 -38 78 13 126 -83 -40 189 42 126 -243 222 40 -130 -148 -37 53 -203 160 142 19 35 127 -30 -98
5529 -98 -34 -4 69 31 70 -205 -88 147 382 41 50 -29 -24 152 -57 -61 -231 -302 138 -73 75 6 120 66 -42
5554 -42 -39 -44 146 -129 141 -54 -37 -11 114 58 -209 -47 -111 96 45 -222 20 -65 -227 -37 109 19 -116 23
5578 23 316 43 42 87 148 147 139 -145 16 -194 -209 -23 -1 188 30 -170 -224 -106 -121 123 101 -41 24 80 -68
5603 -68 -73 -252 109 31 -101 -141 -356 158 -123 78 99 64 110 -65 110 -323 13 -195 -212 -114 -146 -36 151 12
5627 12 -74 -138 -147 -83 -55 -155 -21 -2 -89 -41 21 -48 223 -34 -25 119 -6 -95 -9 -1 -24 -112 -24 237 5 -6 -163
5654 -163 -140 -25 -83 -269 -73 -224 146 -95 142 -25 -29 288 77 292 -145 69 158 83 4 149 -4 -146
5676 -146 117 6 -30 -71 118 263 28 22 -63 -82 -272 -53 -125 -68 -11 197 142 78 -115 -56 230 45 -26 -56 -16
5701 -16 103 -260 105 57 24 -4 81 83 -114 58 8 28 50 -127 126 -186 101 -184 -58 -90 -87 -177 -186 -83 -52 -233
5727 -233 92 130 -36 -4 -84 -118 -87 -62 43 -20 -134 71 94 342 -317 208 282 -21 -119 -181 30 -22 204 43
5751 43 -188 67 7 106 -74 -329 87 175 112 95 -102 -24 -79 -172 -49 -25 287 12 -29 151 309 -19 184 71
5775 71 59 75 -38 135 49 -25 17 -140 229 105 -42 -94 -24 -55 -195 21 -244 102 28 -76 42 60 12 197
5799 197 77 -7 -50 -51 -72 -35 123 16 20 -186 -143 -167 80 -6 285 -23 -26 57 -29 -151 243 -26 -210 -80 246
5824 246 223 -124 -192 -68 -45 -122 460 145 -212 -26 181 -186 -71 254 186 94 -5 34 -28 -73 107 -50 -204
5847 -204 101 31 -6 121 -98 2 -5 44 256 77 186 26 120 47 128 11 15 176 -290 76 -19 46 111 67 1
5872 1 -78 114 -123 -48 -57 -157 -76 -56 -41 -62 41 -159 -2 117 93 -193 136 82 25 -169 38 -4 -97 -82 84
5897 84 -94 109 -138 77 -40 30 74 -81 40 46 14 -259 -79 -8 -224 221 120 294 -49 -92 185 -46 -64
5920 -64 -180 -37 -133 8 17 -123 -73 -19 -97 -40 -7 0 35 212 54 16 -189 -46 183 -91 -180 0 206 75 32
5945 32 -94 -177 78 -265 -125 12 -39 -122 159 -78 -59 455 110 131 33 67 64 -14 80 113 206 81 -3 -189 -193 -4
5971 -4 99 119 -9 116 28 -14 31 -195 -239 -167 167 -86 84 -53 -7 -325 87 58 257 16 -194 -120 61 89
5995 89 51 8 73 -142 51 -28 -82 -113 -47 62 -71 34 18 -36 -328 -92 -26 -71 -165 64 -211 -203 123 105 -130
6020 -130 42 215 139 -27 -134 -142 -118 -244 196 -151 -80 -91 -17 165 -205 -132 85 -85 -37 286 -45 94 95 -59
6044 -59 -168 129 -68 -222 88 97 -53 121 -43 82 -148 190 129 135 179 180 221 -34 -17 -138 181 -3 6 -21 -36
6069 -36 56 -124 -110 -199 -343 -127 95 99 101 109 -103 -67 -247 -193 -177 -24 18 -57 119 -55 396 148 -200 91 -140
6094 -140 20 -65 -68 64 133 168 -175 -150 -52 143 161 226 -29 68 -49 17 -35 -9 -22 -70 -49 2 131 -5 -114 120
6120 120 287 164 -83 -166 -10 -97 -35 12 225 -8 -187 100 348 -323 -209 -199 167 50 -200 -136 107 -203
6142 -203 188 -203 65 -105 57 64 -115 -47 22 225 -91 152 -18 -47 17 214 -171 -291 69 -13 15 155 -149
6165 -149 71 -136 235 213 -101 -248 -67 152 -7 79 -35 -91 -36 115 15 51 96 -40 44 -167 -79 165 -17
6188 -17 167 132 -147 69 -51 183 68 82 -188 -250 -91 -23 10 -272 142 -5 -99 -127 -20 0 -136 187 155
6211 155 10 -47 78 22 94 90 -13 218 -40 76 229 -77 -43 -18 40 -10 36 149 -3 5 14 55 -129 -134 324 -118
6237 -118 220 -128 -14 65 -189 -205 -103 -125 -72 103 -143 -183 70 -119 -41 -43 -273 2 190 -103 184 -3 79
6260 79 -148 240 -56 16 -49 90 -159 -26 -136 -70 356 -12 -26 -111 107 251 -134 117 101 -208 112 -267
6282 -267 451 -208 -41 -73 -32 -68 -13 196 40 153 59 71 133 -70 62 -40 159 287 -141 -5 -143 333
6304 333 -19 -82 -164 23 -205 -26 -50 -110 19 -38 244 -73 157 -29 72 -22 66 -75 -199 -206 285 49 189
6327 189 -15 153 29 -4 -86 61 66 95 161 85 -57 -115 -298 191 -49 34 147 -103 -237 61 -166 -39 36
6350 36 235 -92 -198 -25 -42 195 19 103 157 -136 -18 254 213 55 210 111 197 -118 -94 55 -126 -151 261
6373 261 52 13 143 321 -20 -116 -76 -119 -21 -154 64 -11 159 -7 133 85 -96 -210 -207 10 308 -125 -129 -192
6397 -192 164 4 -40 -69 91 53 -34 22 -114 123 -57 -95 65 9 -95 106 -24 62 -74 207 -164 -88 22
6420 22 37 44 53 119 -368 -138 55 -144 -78 -86 -172 -92 37 85 17 -13 155 39 -161 59 -40 217 90 18 87 -50
6446 -50 -179 124 102 84 -55 -16 7 11 229 -24 44 -34 -22 -200 145 430 -77 13 222 373 92 56 93 54 -91
6471 -91 91 253 35 65 -15 -110 174 188 17 -6 48 -337 12 237 38 -287 49 -126 31 -83 85 126 -75
6494 -75 198 -105 -101 73 223 36 30 -4 -189 43 -223 258 -161 -7 -187 -88 280 -141 46 -90 -47 -6 -137
6517 -137 91 -44 -108 -161 -78 300 277 330 -26 -122 116 126 -75 -38 -184 26 45 -12 33 -377 221 191 72 -127
6541 -127 90 39 -57 56 -54 179 178 -10 11 36 -164 540 77 44 -200 -130 -191 -217 -174 -221 -62 -57 -13 137 -120
6566 -120 160 -159 163 81 -102 83 -50 -58 -74 -22 135 -124 -122 65 120 -31 -4 -23 141 -378 -5 -117 -129 107
6590 107 -233 -270 -23 -1 -153 -66 231 -42 176 -157 128 20 -41 -344 -15 -21 235 -115 -50 107 76 184 105
6613 105 94 253 137 322 151 -128 9 -172 156 -114 92 32 -14 87 59 -27 126 -217 39 -116 76 -186
6635 -186 52 -15 128 88 -26 141 -215 -15 90 104 175 -29 66 -187 -302 -51 104 -10 46 61 -53 79
6657 79 40 1 -378 -229 -140 222 -141 95 -150 55 76 -82 -96 -60 2 41 121 -99 130 4 -11 -142 -111 -81
6681 -81 -265 -122 -31 -139 -210 -39 175 -272 107 257 75 -102 36 46 -23 141 -1 276 -99 -130 0 90
6703 90 -80 -8 167 -133 -38 -43 -129 180 -50 -315 218 -68 74 -169 -23 -11 -139 -88 177 -6 -62 25 -166
6726 -166 168 143 28 6 -115 32 -47 100 -186 -114 -162 -5 235 -20 -77 -154 174 49 148 30 -93 116 -173
6749 -173 393 256 -75 -158 13 -58 -248 -153 187 17 223 73 -195 -171 -27 14 66 90 -133 47 78 -76 -3
6772 -3 -76 105 -112 -163 115 -81 -177 51 57 211 247 143 124 104 96 6 38 -34 44 -169 -53 103 -19 -187 271
6797 271 37 -239 -15 -25 -34 -98 -136 32 -73 69 -76 100 12 -44 97 -229 -56 250 12 -208 44 19 -45
6820 -45 200 -242 186 -85 -20 -62 -71 68 -90 -173 -223 -14 160 215 52 -291 132 97 -219 -213 -111 -72 106 36
6844 36 -41 15 -275 21 80 88 44 84 -21 56 -112 -82 12 -67 38 -41 53 -25 32 -21 -185 -139 40 7 217 -32
6870 -32 -109 166 -23 39 92 42 -119 -97 -141 -316 -53 -41 -77 47 64 -266 -121 -21 -133 -108 20 81 154 53
6894 53 75 -138 -154 108 5 140 -209 -92 -301 201 -17 179 70 2 166 53 129 234 185 -28 -59 -199
6916 -199 -29 44 115 -44 41 -15 -69 -144 38 52 -42 -50 -79 -95 -75 150 -92 45 -58 0 51 -211 -14 29 45 -48
6942 -48 -6 213 -102 -29 -205 -1 -65 49 -117 -55 -95 -96 53 -220 86 -3 -124 -27 -22 65 -147 42 80 135 -29
6967 -29 26 298 -42 -4 -13 157 -37 25 -34 -79 -174 -113 62 -173 -69 127 39 -129 41 103 -106 158 200 -18
6991 -18 -4 148 -89 -45 175 -110 -199 -16 14 -31 -121 131 -70 -58 -53 36 -8 -52 69 -239 -21 144 64 105 5
7016 5 -39 -81 -52 64 286 -140 -28 75 307 301 -41 -171 -129 239 126 -181 3 -232 3 -1 9 -57 160 103
7040 103 -33 177 -80 -27 96 -96 3 130 287 -111 24 194 158 121 -51 12 48 -41 161 -61 -158 227 -54
7063 -54 -101 -20 134 -4 -28 37 94 125 29 -103 -48 15 -104 36 -94 176 235 -84 -59 -167 -370 115 -343 -120
7087 -120 40 -390 73 196 -254 83 19 52 -26 95 -121 54 151 -195 -64 -195 -121 -145 -169 22 59 144 70
7110 70 -123 -45 -168 127 -48 -108 96 79 -60 -87 115 5 181 -129 -31 106 -38 222 66 191 -31 -50
7132 -50 -331 4 -121 -82 81 -80 -64 34 196 51 67 21 237 -170 27 -231 13 205 -14 80 111 22 -2
7155 -2 98 274 58 17 -29 -247 -299 -135 249 3 73 38 -53 143 -129 31 16 -46 -23 29 47 16 -227 258 -81
7180 -81 58 30 117 -23 19 53 -125 -115 140 217 -20 37 24 -14 271 -57 -100 38 -117 83 138 -42 -35 -135 -259
7205 -259 -34 -130 -224 19 68 -41 26 60 -174 -60 -10 82 -144 -148 16 -150 23 -53 39 113 -169 124 -106 -202
7229 -202 112 106 -25 64 93 -40 -112 -100 -14 284 53 182 286 81 71 4 -99 242 2 160 -31 131 51
7252 51 37 -151 66 -142 58 -5 -68 62 49 2 133 -18 99 -162 -235 253 -198 -112 -134 -245 -44 -34 -34 -42 198
7277 198 270 15 119 69 24 182 146 -142 -73 -127 -70 108 183 -69 40 325 127 -78 -343 75 40 -8 -74 26
7301 26 -26 80 -143 -141 -19 58 -16 192 66 86 -163 16 -12 59 -147 124 -129 116 -107 -184 228 152 56 120
7325 120 -40 14 -139 -168 218 -130 91 -95 40 -209 -65 -84 286 -47 -1 -164 -203 61 40 130 -101 -12 -183
7348 -183 71 8 116 33 -42 -244 77 135 132 -122 198 172 -221 -7 -25 -18 -84 10 -63 72 -170 213 76 163 -89
7373 -89 -165 -36 169 60 165 -147 -144 -22 5 -116 -101 -97 78 166 120 -33 -50 7 -13 40 194 -27 -150 43 -5
7398 -5 -81 20 20 -260 -154 17 -20 125 78 -130 101 73 -11 -22 20 95 -99 -132 -109 -38 22 86 -69 -13 43 51 265
7425 265 12 63 12 3 176 -48 -40 -170 28 -169 -179 289 -38 52 -71 130 146 68 -78 -111 -23 285 -74 -94
7449 -94 -107 -382 -137 23 200 -116 53 -35 -79 26 -164 93 -61 -119 -79 -27 4 -275 46 86 85 -1 -94 296
7473 296 168 23 15 -76 24 -5 -55 -196 79 -17 47 80 121 -103 -96 251 252 166 -101 29 317 -21 -148 192 -169
7498 -169 -140 -92 9 47 -44 -234 -103 35 -121 151 -238 -190 92 102 142 62 113 99 -130 -130 -72 -32 -82 108 271
7523 271 -156 -19 -32 88 -127 -125 247 -181 -13 -45 308 -72 -38 154 -198 -191 78 277 70 98 -11 102 -57
7546 -57 144 71 149 183 -94 -97 -167 -183 65 140 232 29 291 -8 187 -233 -143 -129 8 -166 24 -27 54 -57 -208
7571 -208 -187 157 244 17 -80 39 168 148 -55 73 -82 -47 32 -47 -163 -62 141 126 108 -76 24 -224 46
7594 46 -264 -52 -250 24 -34 -146 216 244 -125 -11 109 -101 28 181 69 112 -7 -107 207 209 64 31
7616 31 -179 122 -74 -47 -118 36 -5 -255 -9 -35 65 9 176 -66 43 21 139 -177 -218 280 54 157 86
7639 86 -91 69 -234 -42 -259 -178 172 41 51 -79 -283 -19 62 126 113 32 32 -85 49 3 -76 39 40 100 -30
7664 -30 319 -102 -63 -50 -45 58 -255 229 12 289 84 56 233 -179 -59 -98 16 -29 215 78 -83 71 -325
7687 -325 77 49 -178 338 -3 21 -102 54 -49 -159 -13 2 -163 -46 -21 1 112 -47 -33 -199 -124 40
7709 40 -134 244 137 -64 168 118 98 -20 99 -92 35 88 -37 -41 -36 -117 -155 198 88 208 1 -246 191
7732 191 -53 -4 -72 -89 19 -110 94 129 134 27 -85 -149 -79 76 76 73 -153 83 63 -159 191 -107 -39 -21 135
7757 135 -122 85 -197 330 -118 -158 89 -99 75 63 48 79 11 218 256 -80 -205 37 71 180 47 52 -85
7780 -85 48 -172 -32 -46 -89 -56 -74 -215 -143 202 53 27 15 -43 -30 -221 93 225 165 -26 20 246 17 -162
7804 -162 -159 -31 -195 -290 251 137 -93 -255 -128 113 -168 -155 -114 166 67 14 -121 -92 15 -286 120 36 259
7827 259 71 -179 -309 163 81 -196 172 -246 -54 30 -137 3 164 273 -58 32 22 185 59 -250 -102
7848 -102 269 -18 -110 139 2 45 -160 -32 -29 43 -55 9 -107 110 -7 90 68 268 155 -167 237 36 76
7871 76 161 30 54 -10 436 216 -57 69 -198 -76 68 30 -56 70 -3 107 -2 -179 94 70 -258 -50 186
7894 186 -198 93 -147 138 12 161 -420 -21 134 11 -330 98 23 122 174 -163 -32 -66 123 -16 -21 -251
7916 -251 67 319 -78 137 -195 -4 282 237 129 -182 68 188 -173 35 222 59 96 -117 163 55 321
7937 321 226 -155 10 34 -52 180 162 -241 -112 -20 -86 186 166 166 95 -53 -145 -86 204 -263 227 -41 -164 28
7961 28 -131 -161 -180 -20 -200 128 287 42 -8 68 -34 -115 42 -193 36 -19 39 -313 173 -71 16 83 -297
7984 -297 19 -124 -60 144 -12 -155 -17 264 44 -160 142 -162 -1 -62 98 -80 -111 -152 -155 -97 -7 111 173
8007 173 12 -88 139 -13 21 -29 -109 155 -118 69 4 79 -20 -22 62 -183 -63 -81 -66 -58 -2 -295 33 77 30
8032 30 20 -336 69 -32 -12 -66 -164 -2 192 60 -13 96 -13 -13 -64 -8 -150 37 45 -341 26 34 -63 137 62
8057 62 30 12 -85 13 288 -36 210 474 198 -204 -89 66 149 134 -192 86 152 -135 -101 -11 45 211 156 149 -58
8082 -58 126 165 39 -36 -6 -53 -284 59 -128 -64 144 21 24 8 -89 -122 -243 2 -88 -122 37 -160 406 -232
8106 -232 -55 7 -44 15 -175 -3 -142 -292 -139 -111 65 -157 17 155 -71 -58 33 -71 52 239 -305 60
8128 60 -188 -129 -64 109 40 -246 -29 168 15 9 -26 -78 -181 105 -118 -174 27 176 -4 -266 67 -7 -69 -145
8152 -145 104 161 58 -115 88 -63 -98 46 30 11 -70 -82 -23 -152 121 73 107 -190 -26 157 65 173 80 -92
8176 -92 159 64 104 14 -68 20 -2 -135 31 120 -94 -82 -118 -121 -101
8191a01
##END NTUPLES=NMR FID
##END=
