##TITLE=1H_2TFAMO906
 CDCl3
 8 sc, 
 10.06.2022
##JCAMPDX= 6.0         $$ Bruker NMR JCAMP-DX V2.0
##DATA TYPE= NMR FID
##DATA CLASS= NTUPLES
##ORIGIN= UXNMR, Bruker Analytische Messtechnik GmbH
##OWNER= root
$$ XWIN-NMR		Version 3.5
$$ Fri Jun 10 14:03:38 2022 Russian Standard Time (UT+4h)  she@DPX200
##.OBSERVE FREQUENCY= 200.131
##.OBSERVE NUCLEUS= ^1H
##.DELAY= (6, 6)
##.ACQUISITION MODE= SIMULTANEOUS
##.ACQUISITION SCHEME= undefined
##.AVERAGES= 8
##.DIGITISER RES= 18
##SPECTROMETER/DATA SYSTEM= spect
##.PULSE SEQUENCE= zg30
##.SOLVENT NAME= DMSO
##.SHIFT REFERENCE= (INTERNAL, DMSO, 0, 15.7039)
##AUDIT TRAIL= $$ (NUMBER, WHEN, WHO, WHERE, WHAT)
$$ ##TITLE= Audit trail, XWIN-NMR		Version 3.5
$$ ##JCAMPDX= 5.01
$$ ##ORIGIN= Bruker BioSpin GmbH
$$ ##OWNER= she
$$ F:/spectra/data/she/nmr/H-F/1/audita.txt
$$ ##AUDIT TRAIL=  $$ (NUMBER, WHEN, WHO, WHERE, WHAT)
(   1,<2022-06-10 14:02:16.45 +0400>,<she>,<DPX200>,
      <created by zg, POWCHK disabled, PULCHK disabled
       configuration hash MD5:
       00 E9 B6 7A A2 85 ED C7 34 08 36 98 17 FE 4E 26
       data hash MD5: 16K
       9F 63 C0 00 D7 0B 3F 21 6B 72 63 C8 B2 89 97 95>)
$$ ##END=
$$ 
$$ hash MD5
$$ 65 3C 07 23 88 DF 3F A0 04 1E 6D C2 F0 19 99 68
##$RELAX= 
##$RELAX= 
##$RELAX= 
##$RELAX= 
##$RELAX= 
##$RELAX= 
$$ Bruker specific parameters
$$ --------------------------
##$DU= <F:/spectra>
##$EXPNO= 1
##$NAME= <H-F>
##$PROCNO= 1
##$TYPE= <nmr>
##$USER= <she>
##$AMP= (0..31)
100 100 100 100 100 100 100 100 100 100 100 100 100 100 100 100 100 100 
100 100 100 100 100 100 100 100 100 100 100 100 100 100 
##$AQSEQ= 0
##$AQ_mod= 1
##$AUNM= <au_zg>
##$AUTOPOS= <>
##$BF1= 200.13
##$BF2= 200.13
##$BF3= 200.13
##$BF4= 200.13
##$BF5= 200.13
##$BF6= 200.13
##$BF7= 200.13
##$BF8= 200.13
##$BYTORDA= 1
##$CFDGTYP= 0
##$CFRGTYP= 5
##$CHEMSTR= <none>
##$CNST= (0..31)
1 1 145 1 1 1 1 1 1 1 1 1 1 1 1 1 1 1 1 1 1 1 1 1 1 1 1 1 1 1 1 1 
##$CPDPRG= <>
##$CPDPRG1= <>
##$CPDPRG2= <>
##$CPDPRG3= <>
##$CPDPRG4= <mlev>
##$CPDPRG5= <mlev>
##$CPDPRG6= <mlev>
##$CPDPRG7= <mlev>
##$CPDPRG8= <mlev>
##$CPDPRGB= <>
##$CPDPRGT= <>
##$D= (0..31)
0 1.2 0 0 0 0 0 0 0 0.06 0 0.03 0 0 0 0 0.0002 0 0 0 0 0 0 0 0 0 0 0 0 
0 0 0 
##$DATE= 1654855335
##$DBL= (0..7)
120 120 120 120 120 120 120 120 
##$DBP= (0..7)
150 150 150 150 150 150 150 150 
##$DBP07= 0
##$DBPNAM0= <>
##$DBPNAM1= <>
##$DBPNAM2= <>
##$DBPNAM3= <>
##$DBPNAM4= <>
##$DBPNAM5= <>
##$DBPNAM6= <>
##$DBPNAM7= <>
##$DBPOAL= (0..7)
0.5 0.5 0.5 0.5 0.5 0.5 0.5 0.5 
##$DBPOFFS= (0..7)
0 0 0 0 0 0 0 0 
##$DE= 6
##$DECBNUC= <off>
##$DECIM= 32
##$DECNUC= <off>
##$DECSTAT= 4
##$DIGMOD= 1
##$DIGTYP= 9
##$DL= (0..7)
0 120 120 120 120 120 120 120 
##$DP= (0..7)
150 150 150 150 150 150 150 150 
##$DP07= 0
##$DPNAME0= <>
##$DPNAME1= <>
##$DPNAME2= <>
##$DPNAME3= <>
##$DPNAME4= <>
##$DPNAME5= <>
##$DPNAME6= <>
##$DPNAME7= <>
##$DPOAL= (0..7)
0.5 0.5 0.5 0.5 0.5 0.5 0.5 0.5 
##$DPOFFS= (0..7)
0 0 0 0 0 0 0 0 
##$DQDMODE= 0
##$DR= 18
##$DS= 0
##$DSLIST= <SSSSSSSSSSSSSSS>
$$ [...]
##$SUBNAM2= <"">
##$SUBNAM3= <"">
##$SUBNAM4= <"">
##$SUBNAM5= <"">
##$SUBNAM6= <"">
##$SUBNAM7= <"">
##$SUBNAM8= <"">
##$SUBNAM9= <"">
##$SW= 18.0517599122864
##$SWIBOX= (0..15)
0 0 2 0 0 0 0 0 0 0 0 0 0 0 0 0 
##$SW_h= 3612.71676300578
##$TD= 16384
##$TD0= 1
##$TE= 0
##$TE2= 300
##$TE3= 300
##$TEG= 300
##$TL= (0..7)
0 120 120 120 120 120 120 120 
##$TP= (0..7)
150 150 150 150 150 150 150 150 
##$TP07= 0
##$TPNAME0= <>
##$TPNAME1= <>
##$TPNAME2= <>
##$TPNAME3= <>
##$TPNAME4= <>
##$TPNAME5= <>
##$TPNAME6= <>
##$TPNAME7= <>
##$TPOAL= (0..7)
0.5 0.5 0.5 0.5 0.5 0.5 0.5 0.5 
##$TPOFFS= (0..7)
0 0 0 0 0 0 0 0 
##$TUNHIN= 0
##$TUNHOUT= 0
##$TUNXOUT= 0
##$USERA1= <user>
##$USERA2= <user>
##$USERA3= <user>
##$USERA4= <user>
##$USERA5= <user>
##$V9= 5
##$VALIST= <valist>
##$VCLIST= <CCCCCCCCCCCCCCC>
##$VD= 0
##$VDLIST= <DDDDDDDDDDDDDDD>
##$VPLIST= <PPPPPPPPPPPPPPP>
##$VTLIST= <TTTTTTTTTTTTTTT>
##$WBST= 1024
##$WBSW= 4
##$XGAIN= (0..3)
0 0 0 0 
##$XL= 0
##$YL= 0
##$YMAX_a= 655550
##$YMIN_a= -581925
##$ZGOPTNS= <>
##$ZL1= 120
##$ZL2= 120
##$ZL3= 120
##$ZL4= 120
##$ABSF1= 10
##$ABSF2= 0
##$ABSG= 5
##$ABSL= 3
##$ALPHA= 0
##$AQORDER= 0
##$ASSFAC= 0
##$ASSFACI= 0
##$ASSFACX= 0
##$ASSWID= 0
##$AUNMP= <proc_1d>
##$AZFE= 0.1
##$AZFW= 0.1
##$BCFW= 1
##$BC_mod= 2
##$BYTORDP= 1
##$COROFFS= 0
##$CY= 11.3945322036743
##$DATMOD= 1
##$DC= 2
##$DFILT= <>
##$DTYPP= 0
##$F1P= 2.36226072786647
##$F2P= -0.459571619588291
##$FCOR= 0.5
##$FTSIZE= 0
##$FT_mod= 4
##$GAMMA= 1
##$GB= 0.15
##$INTBC= 1
##$INTSCL= 1
##$ISEN= 128
##$LB= 0.24
##$LEV0= 0
##$LPBIN= 0
##$MAXI= 10000
##$MC2= 0
##$MEAN= 0
##$ME_mod= 0
##$MI= 1.114404
##$NCOEF= 0
##$NC_proc= 0
##$NLEV= 6
##$NOISF1= 3.799351
##$NOISF2= 2.8
##$NSP= 1
##$NTH_PI= 0
##$NZP= 0
##$OFFSET= 15.70392
##$PC= 1
##$PHC0= -18041.57
##$PHC1= 11.20069
##$PH_mod= 1
##$PKNL= yes
##$PPARMOD= 0
##$PSCAL= 0
##$PSIGN= 0
##$REVERSE= no
##$SF= 200.130013532006
##$SI= 16384
##$SIGF1= 3
##$SIGF2= 2
##$SINO= 400
##$SIOLD= 16384
##$SREGLST= <1H.CDCl3>
##$SSB= 0
##$STSI= 0
##$STSR= 0
##$SW_p= 3612.71676300578
##$SYMM= 0
##$S_DEV= 0
##$TDeff= 0
##$TDoff= 0
##$TI= <>
##$TILT= no
##$TM1= 0
##$TM2= 0
##$TOPLEV= 0
##$USERP1= <user>
##$USERP2= <user>
##$USERP3= <user>
##$USERP4= <user>
##$USERP5= <user>
##$WDW= 1
##$XDIM= 8192
##$YMAX_p= 0
##$YMIN_p= 0
$$ End of Bruker specific parameters
$$ ---------------------------------
##NTUPLES= NMR FID
##VAR_NAME=  TIME,          FID/REAL,        FID/IMAG
##SYMBOL=    X,             R,               I
##VAR_TYPE=  INDEPENDENT,   DEPENDENT,       DEPENDENT
##VAR_FORM=  AFFN,          ASDF,            ASDF
##VAR_DIM=   8192,          8192,            8192
##UNITS=     SECONDS,       ARBITRARY UNITS, ARBITRARY UNITS
##FACTOR=    0.0002768,     1,               1
##FIRST=     0,             0,               0
##LAST=      2.2672688,     0,               0
##MIN=       0,             -581925,         0
##MAX=       2.2672688,     655550,          0
$$ Real data points
##PAGE= N=1
##DATA TABLE= (X++(R..R)), XYDATA
0@%%%%%%%%%Qj6J6j6K4l2M0m8N8p4Q8j12J36j60J92k24K63l09L57m09M71n40O15
$$ 0 0 0 0 0 0 0 0 0 0 8 -8 8 -8 16 -16 24 -24 34 -40 48 -64 72 -88 104 -120 143 -166 191 -218 253 -287 328
32C28p00P95q98J010j136J274j426J593j775J974k191K427k688K971l276L615
$$ 328 -372 423 -475 535 -601 673 -753 840 -935 1039 -1152 1275 -1413 1558 -1718 1897
48A897l985M390m838N332n875O482p161P920q785R774j0921J2266j3868J5821
$$ 1897 -2088 2302 -2536 2796 -3079 3403 -3758 4162 -4623 5151 -5770 6496 -7372 8449
62H449j8266K1424k5684L1785m1312N8438r8896L78150L41462n14563l85990k28067
$$ 8449 -9817 11607 -14077 17708 -23604 34834 -64062 314088 655550 140987 -245003 -473070
74d73070J30443K00901J68150o7396j88818j93302L6948K34124L15222J74403
$$ -473070 -342627 -141726 26424 -40972 -229790 -423092 -386144 -152020 163202 337605
84C37605J1503j06284r0180m1230L3126M1554l600j12482j66090j36082l2588
$$ 337605 349108 242824 152644 111414 144540 186094 182494 70012 -96078 -232160 -264748
95b64748K5009K2100m881K8070R3373J36946R8175J1879n5728k5097Q2418J63224
$$ -264748 -239739 -217639 -222520 -194450 -101077 35869 134044 145923 90195 65098 147516 310740
107C10740Q7923j23677k95547k47349j4967J76975J49128m2468j89967j59033
$$ 310740 398663 274986 -20561 -267910 -282877 -105902 43226 758 -189209 -348242
117c48242J305J60368K25174J80417N6394p6996j30536n9095P3607J40565O7890
$$ -348242 -346937 -186569 38605 219022 275416 198420 67884 8789 82396 222961 290851
128B90851r1558k12924k05261p6929P3049J33069O4614n6821j03093k1215J12380
$$ 290851 199293 -13631 -218892 -295821 -222772 -89703 -25089 -81910 -185003 -206218 -93838
139i3838J70649J09886O428m2990k0610J6867J3018l4128q1742q9140n2119o268
$$ -93838 76811 186697 193125 150135 129525 146392 159410 125282 43540 -45600 -97719 -103987
151a03987K458l0387n6755k6076N1147J08230R9355M9824J3268O386Q375N778
$$ -103987 -101529 -131916 -188671 -214747 -163600 -55370 43985 93809 107077 113463 121838 127616
163A27616J0040J8842j544o6840j30246j22413l6005N5765O9180P602n2167m2604
$$ 127616 137656 156498 154954 88114 -42132 -164545 -200550 -144785 -75605 -68003 -120170 -162774
175a62774L3222J08193J21148O6148n829l7935j9305Q668L546l2540o1442n9708
$$ -162774 -129552 -21359 99789 165937 160108 122173 102868 111536 115082 82542 21100 -38608
187c8608l9895k6965k4768j5356P341L0492M1707M2980M1589L9472L1236J9883
$$ -38608 -78503 -105468 -130236 -145592 -138251 -107759 -66052 -23072 18517 57989 89225 109108
199A09108R392j60r637k0585k9035m0647n4548n8131l4986P230L3461K0618q814
$$ 109108 118500 118340 108703 88118 59083 18436 -36112 -94243 -129229 -121999 -88538 -67920 -76734
212g6734j0261K6785O6900O7478L2977R75p394k879q711k6929l8372l0829j6255
$$ -76734 -86995 -60210 6690 74168 107145 108120 100726 97847 89136 62207 23835 -6994 -23249
225b3249j3574k7665m0131k7503J0635M9303N8415L4310L322m688J4440L4046
$$ -23249 -36823 -64488 -104619 -132122 -121487 -72184 -13769 20541 23863 19175 33615 67661
237F7661L3434J2322j4360l4913m6336m3005k5092m377L342n647j7156j5470L392
$$ 67661 101095 113417 99057 64144 17808 -25197 -50289 -54666 -51324 -56971 -74127 -89597 -86205
250h6205K7755M5825M6511L0591O788q494m277R493R446j3316l7962l9840k0582
$$ -86205 -58450 -12625 33886 64477 71265 62771 58494 67987 77433 64117 26155 -13685 -34267
263c4267o592j3645k5131j7141J2773L9951M0536J8107k983k952J6946L5883L3059
$$ -34267 -40859 -54504 -79635 -96776 -84003 -44052 -3516 14591 11608 8656 25602 61485 94544
276I4544O114k8006m7438m2225k0161L839J2856L290k0330l5754k3395J6275N5834
$$ 94544 100658 72652 25214 -17011 -37172 -33333 -20477 -17187 -37517 -73271 -96666 -80391 -24557
289b4557O1029K8313j4044k9301j0330J9116L0599J4396j8370m3744m5992k4342
$$ -24557 36472 64785 50741 21440 11110 30226 60825 75221 56851 13107 -32885 -57227
301e7227M683J9123R039q889j2671L718K2734K6240J5519N370M726R354P792k676
$$ -57227 -52544 -33421 -24382 -33271 -45942 -42224 -19490 6750 22269 27639 32365 41719 49511 46835
315D6835j6345k3589j9045o765M099N019m889j7183j8297m227J9688L5804L1663
$$ 46835 30490 6901 -12144 -18909 -14810 -9791 -14680 -31863 -50160 -54387 -34699 1105 32768
328C2768P281j8172k3838l916K3036K9262Q172k2460l9267k9123m662J6122K0719
$$ 32768 40049 21877 -1961 -5877 17159 46421 54593 32133 -7134 -36257 -40919 -24797 -4078
341d078P740j0331j9375j0053J2007K7909K3948M899j1180j1709k970L906R39
$$ -4078 3662 -6669 -26044 -36097 -24090 3819 27767 32666 21486 9777 6807 10713 11652
354A1652m489o097m091j944m505o370m440J938Q976J1120O789O0n293n470o45
$$ 11652 7163 1066 -3025 -4969 -9474 -15844 -20284 -18346 -9370 1750 8539 8599 3306 -2164 -2809
369b809O213R939O055m316j3583j4106m279Q606J2962O357n624j1584q783J586
$$ -2809 3404 13343 19398 15082 1499 -12607 -16886 -8280 4682 11039 5415 -6169 -14952 -13366
383a3366J0341J1508M783m578j0414o485J199O924L645k150l851J408N205J251
$$ -13366 -3025 8483 13266 8688 -1726 -8211 -7012 -88 3557 1407 -2444 -1036 4169 5420
397E420o247o164M251J3578R493o373j8573j4503J721J3070J0119j359j0397q903
$$ 5420 -827 -6991 -2740 10838 20331 13958 -4615 -19118 -17397 -4327 5792 4433 -5964 -14867
411a4867j204P793J2014J1258N024l224q833o893R50O872M441o188j5329j4125
$$ -14867 -16071 -8278 3736 14994 20018 16794 7961 1068 2018 8890 13331 7143 -8186 -22311
425b2311j330J0787J0108j363j1113n381J1773K3246J7063l819j9363j4896M715
$$ -22311 -23641 -12854 -2746 -4109 -15222 -20603 -8830 14416 31479 27660 8297 -6599 -1884
438a884K1619J6941q573l2550l3334p857K0609K7285Q364j5581k1890p696J4085
$$ -1884 19735 36676 28103 -4447 -37781 -45638 -25029 2256 10620 -4961 -26851 -34547 -20462
451b0462K7311K6426J2586p161k1869j9761j240J6763J5426o358l0189l2785j1164
$$ -20462 6849 33275 45861 38700 16831 -2930 -4170 12593 28019 21661 -8528 -41313 -52477
464e2477J5388K3744J0103q639r354Q334K6790K4122K363j6188j3438N816J7382
$$ -52477 -37089 -13345 -3242 -11881 -21235 -12901 13889 38011 40374 24186 10748 16564 33946
477C3946N777k2044l9167k9989j361K3612K5891M297k0180k4628j779L1128M6938
$$ 33946 39723 17679 -21488 -51477 -52838 -29226 -3335 962 -19218 -43846 -45625 -14497 32441
490C2441L3909J296k8817l5624j6371J3616L1304J7274k3510n7219n2001m999
$$ 32441 66350 67646 38829 3205 -13166 450 31754 49028 25518 -31701 -83702 -88701
502h8701M3961N3197J7301k6334l5868l413L9194N2456K6311j3672l4147k4587
$$ -88701 -44740 8457 25758 -576 -36444 -39857 -663 51793 78104 64432 30285 5698
514E698k119P830j560j6287k1699j4376l017L737P159Q181R391J0701J4775K0243
$$ 5698 3579 11409 9849 -6438 -28137 -42513 -45530 -41793 -34634 -26453 -17062 -6361 8414 28657
528B8657J7913M171j2969j9142p903R672J3123o722l4907m7198k6792J4942M5156
$$ 28657 46570 50741 37772 18630 10727 20399 33522 26800 -8107 -55305 -82097 -67155 -21999
541b1999L7226l311l6828k8635J7766N9551N7884J3344l5795m9926k5116J1460
$$ -21999 15227 11916 -24912 -53547 -35781 23770 81654 94998 59203 9277 -15839 -4379
553d379K6769J1111k0825m2322l8001j1599J8189L3384K7309Q385q134p446R490
$$ -4379 22390 33501 12676 -29646 -67647 -79246 -61057 -27673 -364 8021 -113 -7559 1931
566A931K8513L0876R833j7888l0366j8682j164J040j4062k7760k1594J315J9464
$$ 1931 30444 61320 71153 53265 22899 4217 3053 4093 -9969 -37729 -59323 -58008 -38544
579c8544J8384J753q010K598K6884M1096K8634l090k8563k7583m896J3519R029
$$ -38544 -20160 -18407 -26417 -23819 3065 44161 72795 69705 41142 13559 8663 22182 31211
592C1211j4659l6046l8073j8504Q271K5920K6209J3062k078o259N591K4706L4700
$$ 31211 16552 -19494 -57567 -76071 -67800 -41880 -15671 -2609 -4687 -10946 -5355 19351 54051
605E4051K3491m363l0487l5252j7071N246Q425r833k9897k8791n483J9418K6118
$$ 54051 77542 73179 42692 7440 -9631 -4385 4040 -5793 -35690 -64481 -69964 -50546 -24428
618b4428J4398L928O398J7182K2049J3847j103j0548j0018n170n759j2741k1712
$$ -24428 -10030 -6102 296 17478 39527 53374 52271 41723 31705 26535 20776 8035 -13677
631a3677k3063j4560j252Q283J0709Q925O567P283J0838J6056K0533J7747N620
$$ -13677 -36740 -51300 -52552 -44269 -33560 -24635 -18068 -10785 53 16109 36642 54389 60009
644F0009j1396k1659j7403n486N62n713j9147k5053j5259M162J8791J8526Q940
$$ 60009 48613 26954 9551 4065 4627 -1086 -20233 -45286 -60545 -56383 -37592 -19066 -10126
657a0126K535P893J8748K1468J0699l513j0478o922l174p403j7182k2084j8226
$$ -10126 -7591 302 19050 40518 51217 47704 37226 30304 27130 19727 2545 -19539 -37765
670c7765q500J263M857O231N640O895J0718J5763J8877J7378J0256o16r889j3844
$$ -37765 -46265 -45002 -40145 -33914 -28274 -21379 -10661 5102 23979 41357 51613 50997 41108 27264
684B7264j1255o307o773j3188k0147j8418o032Q063J3974J0739P004Q950J6186
$$ 27264 16009 9702 2929 -10259 -30406 -48824 -54856 -46793 -32819 -22080 -15076 -6126 10060
697A0060K0446J5241K882p463r316m567j384q244k0064k6428j8809k717R582J0877
$$ 10060 30506 45747 48629 41166 31850 27283 25899 17655 -2409 -28837 -47646 -50363 -40781 -29904
711b9904M738J426L866J2195J8438K1449J6360M245r683j6087j3102m352m3o103
$$ -29904 -25166 -23740 -19874 -7679 10759 32208 48568 52813 43130 27043 13941 9589 9546 3443
725C443j6828k1853j5901J15J3451J7107J0545L522M449J1234J6809J3551L053
$$ 3443 -13385 -35238 -51139 -51024 -37573 -20466 -9921 -6399 -1950 9284 26093 39644 42697
738D2697o078q128o295o912j0612j5409j5715j0145p76N891O779K588J021M970
$$ 42697 36619 28491 22196 15284 4672 -10737 -26452 -36597 -37373 -31482 -24703 -22115 -21094 -16124
752a6124J4156K0048J7387O996m628j1052r933m224Q99m62j0153k0345k1619r518
$$ -16124 -1968 18080 35467 42463 37835 26783 16850 12626 13525 13063 2910 -17435 -39054 -48572
766d8572P499J7828J4370L679l357N83J0908J8332J6788N787p257j3286j1651
$$ -48572 -41073 -23245 -8875 -5196 -8553 -7970 2938 21270 38058 43845 36588 23302 11651
779A1651o922m804o328q978q998o657k076J876O203R701J1269J1677J1201Q351
$$ 11651 4729 -75 -6403 -15381 -24379 -31036 -33112 -31236 -25033 -15332 -4063 7614 18815 27166
793B7166L235k483m082l222j537l921j0084j5515j5782j0261L24Q635J1790P256
$$ 27166 30401 27918 23836 20614 19077 15156 5072 -10443 -26225 -36486 -36162 -27527 -15737 -8481
807h481n1j215N269J5147J7624J0778j801j1649j3182q636k935q77m054q460j0762
$$ -8481 -8532 -9747 -4478 10669 28293 39071 37270 25621 12439 3803 868 -9 -4063 -12523 -23285
822b3285p950o87O869J0896J0822Q309N506L163K483L328L132N39k881o468q610
$$ -23285 -31235 -31922 -25053 -14157 -3335 4974 10480 13643 16126 19454 22586 23125 20244 13776 5166
837E166j0542j0565o302n45M100M105J122J33J953O460J0456J1132P555J543n544
$$ 5166 -5376 -15941 -22243 -22788 -18688 -14583 -13461 -13328 -11375 -4915 5541 16673 24228 25771 20227
852B0227p852n381j592j78k877p531r435p569j752L619P192P367M786K745K592
$$ 20227 12375 6994 5402 5224 2347 -5184 -14619 -22188 -23940 -20321 -13129 -5762 -976 1769 4361
867D361L493M093L632K490M8k848o372q378p851m632l30J634P31j836k838q75
$$ 4361 7854 11947 15579 18069 18117 15269 8897 519 -7332 -11964 -12294 -10660 -9929 -11765 -14603 -15478
883a5478M545R690J1179P307o6m700m814j068K770J849k231p139j0735q851k011
$$ -15478 -10933 -1243 9936 17243 17177 12477 7663 6595 9365 11214 8983 1844 -8891 -17742 -19753
898a9753L853O927M811K39j273J196N370O854N540J615j137k797l301m356n309
$$ -19753 -15900 -8973 -4162 -3923 -5196 -4000 1370 8224 13764 15379 14242 11445 8144 3788 -1521
913a521m359k050N67R52o53l083k789J009O518R985Q041J124m645o584k404L298
$$ -1521 -5880 -7930 -7363 -6411 -7064 -10147 -12936 -11927 -5409 4576 12617 13741 9096 2512 108 3406
929C406O516K853m468j0758j0469m126M692Q986N867m48n905n256O31P967J0078
$$ 3406 9922 12775 8307 -2451 -12920 -17046 -12354 -3368 2499 2051 -3854 -9110 -8479 -512 9566
944I566N137k349p004n303q02J689J201r04k065k238j927j799j365P06L445N030
$$ 9566 14703 12354 5350 47 -755 934 2135 1231 -834 -3072 -4999 -6798 -8163 -7457 -4012 1018
960A018M077M70k493l923j563K941N543M073j165o526q108m445J901P825P074
$$ 1018 5095 5565 3072 -851 -2414 527 6070 10143 8978 2452 -5656 -10101 -8200 -375 6699
975F699r2p247r684l109O078J1268P302j128p911q090j802N699Q702M323k915
$$ 6699 6607 -640 -10324 -13433 -7355 3913 11215 10087 2176 -5914 -7716 -2017 6685 11008 8093
990H093p606o231j425K697L797K369O83k276l283k839K5L842M255L099O01j712
$$ 8093 487 -5744 -7169 -4472 -675 1694 2377 101 -3182 -6021 -5996 -2154 2101 5200 5801 4089
1006D089l178l103j155K600N069L814j654o729p526l186L282Q172O974n62p809
$$ 4089 911 -2192 -3347 -747 4322 8136 6482 -247 -7773 -10959 -7677 495 7469 6907 -902
1021i02r465k051P081J1736P202j451q490q317k732N271P989M506l101r101p838
$$ -902 -10367 -12418 -5337 6399 13601 12150 3660 -4657 -7389 -2118 5871 10377 7276 -1825 -9663
1036i663k403L629N831M424P82k235l119j173K365M885M283J753j043l034m023
$$ -9663 -12066 -8437 -2606 1818 2600 365 -2754 -3927 -1562 3323 7606 9359 8316 5282 1259
1051A259m109k451J270L105K626j497n667n624j181M985R580Q156J153n842p695
$$ 1259 -2850 -5301 -4031 -926 1700 203 -5464 -11088 -12269 -7284 2296 10452 11605 5763 -1932
1066a932k070M896Q884M608m193j0184r847m149L580P667N138j957o638m785K149
$$ -1932 -4002 894 9778 14386 10193 9 -9838 -13987 -10407 -2740 2398 441 -6197 -10982 -8833
1081h833P895Q471M104q56l133l716j340O82L37j309l269l343k568j644j529p54
$$ -8833 -938 7533 11637 10781 7648 3932 2592 3274 3611 2302 -967 -4310 -6878 -8522 -10051 -10805
1097a0805K464N296N899L153k79j904j007K108M618M353j297p693j0697p075J363
$$ -10805 -8341 -3045 2854 6007 5728 3824 2817 4925 9543 13896 12599 4906 -5791 -12866 -11503
1112a1503O610M372j597o813n227J027Q683J1279P011k14o168m426L34L711K990
$$ -11503 -4893 -521 -2118 -8931 -14158 -13131 -4448 6831 13842 13628 7460 3034 3368 7079 10069
1127A0069k243o066p297n094j804R14K711J855P73J619L241M604L802J768j06
$$ 10069 7826 1760 -5537 -10631 -12435 -11521 -8810 -6955 -6182 -4563 -1322 3282 7084 8852 8746
1142H746R47J471O46l339p026p692m554O72L972K344k763n851k401N253J0619
$$ 8746 9693 11164 11810 8471 1445 -6247 -10801 -10129 -6157 -3813 -6576 -12427 -14828 -9575 1044
1157A044R853L288k837m907j925J421L678R73l653p985p840m455L23K990K810
$$ 1044 10897 14185 11348 6441 4516 5937 9615 10588 6935 -1050 -8890 -13345 -13022 -10032 -7222
1172g222J014N81P84K344M504N641L884N18j152r72m17k703n657o630l101N26
$$ -7222 -6208 -5627 -4843 -2499 2005 7646 11530 12048 10896 9924 9507 6804 1147 -5483 -8584 -8058
1188h058J663r54l646l352J037O980J0367P406J332m104l319J057L834K672k104
$$ -8058 -6395 -7349 -10995 -14347 -13310 -6330 4037 11443 12775 8671 5352 6409 10243 12915 10811
1203A0811o465q286o911l671O76L897L400R08j667n34L982P411P483M155J2l102
$$ 10811 4346 -3940 -10851 -14522 -13846 -9949 -6549 -5641 -7308 -7842 -3860 3551 11034 15189 15201 12099
1219A2099l855k677j456k567m045m015k465j942j720k203J079N681Q745O611K123
$$ 12099 8244 5567 4111 1544 -2501 -6516 -8981 -10923 -12643 -14846 -13767 -8086 659 7270 9393
1234I393j991j457J880L906K924j273o725r064p486l228J089K359J709O5p39n68
$$ 9393 7402 5945 7825 11731 14655 13382 6657 -2407 -9893 -13121 -12032 -9673 -7964 -7899 -8638 -9206
1250i206K753O736R149O961L45m631n244k247L65K37k841m912n588m407k538J130
$$ -9206 -6453 283 9432 16393 16738 12107 6863 4616 4981 5218 2377 -2535 -8123 -12530 -15068 -13938
1266a3938L173M357M660M210K506q6o0K474M435L710j153o879q322o097j567R23
$$ -13938 -10765 -6408 -1748 2462 4968 4882 4822 7296 11731 15441 14288 7409 -913 -7010 -8577 -7654
1282g654J136n12k154k221k71L604O611P304N422J555j996l426j416P35J614j065
$$ -7654 -6518 -7030 -9184 -11405 -11676 -8072 -1461 5843 11265 12820 10824 7398 5982 6717 8331 7266
1298G266n734p733n670j786J249K228K326K342K774K441K313K721L275L677K507
$$ 7266 1532 -6201 -11871 -13657 -12408 -10180 -7854 -5512 -2738 -297 2016 4737 8012 11689 14196
1313A4196o71l782n888n741l141l19J82j633l671k442L11L794N338N646M898K695
$$ 14196 13525 9743 3855 -1886 -5027 -5346 -5164 -6797 -10468 -12910 -12599 -8805 -3467 2179 7077 9772
1329I772j41j179l87N45R66j961m352o189n733l232n0J639J915J680J103K499
$$ 9772 9631 8452 8065 8610 9576 7615 3263 -2926 -8659 -11891 -11941 -10302 -8387 -6707 -5604 -3105
1345c105L495L632L357L030K107J0k391m467m580l047j520j277j843k546k264
$$ -3105 390 4022 7379 10409 12516 12526 10135 5668 1088 -1959 -3479 -4756 -6599 -9145 -11409
1360a1409l37K357M319N473M193J688P96L62O58M06J5j457k756m269m805l359
$$ -11409 -11746 -9389 -5070 403 4596 6284 7080 7442 8100 8506 8521 7064 4308 39 -4766 -8125
1376h125j519K24J370J889J102J590J189K322L309L776L278Q24j386l519m078
$$ -8125 -9644 -9420 -8050 -6161 -5059 -3469 -2280 42 3351 7127 10405 11229 9843 6324 2246
1391B246k667r07Q8q48l185m043k824O42M613N779M154J621o65n88J199K985K373
$$ 2246 -421 -1328 -1240 -2088 -5273 -9316 -12140 -11498 -6885 -1106 3048 4669 4004 3416 4615 7600 9973
1408I973K33l346n177m801k425p79p2K2m57J50R78J296K332L124L560K903K317
$$ 9973 10206 6860 1683 -3118 -5543 -6322 -6394 -6372 -6829 -6679 -5701 -4405 -2073 1051 4611 7514 9831
1425I831n22k274l630k306q64M67o28k889l774l853j402K914N746N380K509j553
$$ 9831 9309 7035 3405 1099 235 702 74 -2815 -6589 -10442 -11844 -8930 -3184 2196 4705 3152
1441C152k651K22L977N369K485k846p031o655k867J871K644O77k829l547j092
$$ 3152 501 723 4700 10069 12554 9708 2677 -3978 -6845 -4974 -2330 -1653 -4482 -8029 -9121
1456i121K119M890M429K513J017P4m34l94o70j15r51j533k196k699k082j785n63
$$ -9121 -7002 -2112 2317 4830 5847 5921 5487 5093 4423 4308 3357 1824 -372 -3071 -5153 -6938 -7501
1473g501J056K348L248K192M51j154p02J574M427L901J12m970p320l810J197M550
$$ -7501 -6445 -4097 -849 1343 1794 640 -62 1512 5939 9840 9952 4982 -2338 -6148 -4951 -401
1489d01K770k435n544m213N11N333O032L526l93k695k222N0K435L084J265k217
$$ -401 2369 -66 -5610 -9823 -9312 -3979 2053 5579 5186 2491 269 319 2754 5838 7103 4886
1505D886m274m636j782Q94K125J423q59j746J89J597K280J290P24J016J895J287
$$ 4886 612 -4024 -5806 -4912 -2787 -1364 -2223 -3969 -3780 -2183 97 1387 2111 3127 5022 6309
1521F309j002l543l880r08K468K815m15m309n170j526L320O134L759L39k725k962
$$ 6309 5307 1764 -2116 -3024 -556 2259 1844 -2465 -7635 -9161 -5841 293 4052 4391 1666 -1296
1537a296k65J955L886K993j86m257n567l617Q99M046L431l08l765m164n12M011
$$ -1296 -1561 394 4280 7273 7087 2830 -2737 -6354 -5455 -1409 2022 1714 -2051 -6215 -6727 -2716
1553b716N306K541j180k668r42R25R82N3j322q44L57O6j756k563j269J401L182
$$ -2716 2590 5131 3951 1283 341 1266 2248 2301 979 135 492 558 -1198 -3761 -5030 -3629 -447
1570d47K116K12j760j478j66J939K243J256L16j490k507l244p49J769L919J522
$$ -447 1669 1881 121 -1357 -1523 416 2659 3915 4231 2741 234 -3010 -3759 -1990 1929 3451
1586C451k189m864l040J930N379M058j29l603l634l64L150L046N23j466k393r20
$$ 3451 1262 -3602 -6642 -4712 667 4725 4596 993 -2641 -3005 145 3191 3714 2248 -145 -1065
1602a065j7Q1j73J59Q09P80n62j653p98R16K134J240n3o86l92J97l69j034k72
$$ -1065 -1082 -1001 -1174 -1015 -206 574 12 -1641 -2439 -1523 611 1851 1798 1112 720 917 548 -486 -758
1621g58J102J974M69k271m043j487K418M629K084j881m637k361J809M376K355
$$ -758 344 2318 2787 516 -3527 -5014 -2596 2033 4117 2236 -2401 -4762 -2953 1423 3778
1636C778m38k485j691K52M66P61l41P79K39p74j833j523j21J945J892N65j298
$$ 3778 3340 855 -836 -584 -118 643 302 1081 1320 546 -1287 -2810 -2931 -986 906 1471 173
1653A73j614K14J621R96l83m30P05J711k30k594l194n47K824L341K31l377m149
$$ 173 -1441 -1227 394 1390 1007 577 1282 2993 2763 169 -3025 -3572 -748 2593 2824 -553 -4702
1670d702j147L495M534K025j516l101j114P86J789J231K36m19n70k106k226j076
$$ -4702 -5849 -2354 2180 4205 2689 -412 -1526 -740 1049 2280 2516 2097 1527 -579 -2805 -3881
1686c881J693K505J377j299k922j371J722L239K113k24j222p16L92J43r57j424
$$ -3881 -2188 317 1694 395 -2527 -3898 -2176 1063 3176 2952 1730 1014 1406 1549 592 -832
1702h32m1J780R57k117l774k154J894M416L221l65l270k316Q47L199L230L53j578
$$ -832 -873 907 1864 -253 -4027 -6181 -4287 129 3350 2985 -285 -2601 -1754 1445 4675 5028 3450
1719C450k171k339j038k20P94J370Q89j100k703k308J025M203M488O40k240l184
$$ 3450 1279 -1060 -2098 -2318 -1524 -154 735 -365 -3068 -5376 -4351 -148 4340 4980 2740 -444
1735d44l23J868K325R3j818j674j253o46j310p31N19J870K400L17k338j721J005
$$ -444 -767 1101 3426 3519 1701 27 -1226 -1872 -3182 -3913 -3394 -1524 876 1193 -1145 -2866 -1861
1752a861L545L849N42k501l218j277M16R31j61n95o31j220j421r10L72K809L361
$$ -1861 1684 5533 6075 3574 356 -921 -505 426 265 -330 -961 -2181 -3602 -4512 -4140 -1331 2030
1769B030J942j034k464j416J469L357J600j681l535k330o20L40K90k87L05N05
$$ 2030 3972 2938 474 -942 527 3884 5484 3803 268 -2062 -2682 -2342 -2052 -2339 -2034 -1529
1785a529K79o45o80J206K926K703J204j615l018j487P67K010k4j652k768j392
$$ -1529 -1250 -1895 -2575 -1369 1557 4260 5464 3849 831 -656 111 2121 2097 445 -2323 -3715
1801c715o3M84P27O94J329J206P46n78n81J044J612J434k75j930k391j235r2K23
$$ -3715 -3778 -3294 -2567 -1873 -544 662 1408 830 249 1293 2905 4339 4064 2134 -257 -1492 -1584 -1361
1819a361n02n79j24M63K51m12K0J633K715K404K86k397k141l51J696J569k02k781
$$ -1361 -1863 -2442 -2566 -2103 -1852 -2264 -2244 -611 2104 4508 4794 2397 256 -95 1601 3170 2968 187
1837A87l364j587M08J898J569rk26K6J1J212J417J642Q32j43j126j838r71r3J0
$$ 187 -3177 -4764 -4356 -2458 -889 -898 -1124 -1098 -1087 125 1542 3184 4016 3873 2747 909 -62 -155 -145
1856a45q20j117j022j09N88J54J88P13J790K352J490n57k090j260L46K445J231
$$ -145 -965 -2082 -3104 -3213 -2625 -2471 -2283 -1570 220 2572 4062 3505 1415 155 501 2946 4177
1873D177j462l902l297j239J786L035J711p10k082j265P13L075L149J934q36k137
$$ 4177 2715 -1187 -4484 -5723 -3937 -902 809 99 -1983 -3248 -2535 540 3689 5623 4787 2650
1889B650k564p05R44J266j1j801k325j672J17J558J214Q47N8M50J505N36j02l52
$$ 2650 86 -619 325 1591 1580 -221 -2546 -4218 -4101 -2543 -1329 -482 -424 26 1531 2067 1965 1613
1907A613j55Q08P98l60j774l038j916M87J728J691M40j843k129j94K195M092K578
$$ 1613 1458 2266 3064 2704 930 -2108 -4024 -3537 -1809 -118 322 -1521 -3650 -3844 -1649 2443 5021
1924E021L11k777k959p49J533K208R79j852l571k594m42J735K720J027o51j059
$$ 5021 5332 2555 -404 -1153 380 2588 3567 1715 -1856 -4450 -4892 -3157 -437 590 -61 -1120
1940a120n30J023K184J456M49n52j051k30q80n63r17o94m55M06M73m37j196o26
$$ -1120 -1650 -627 1557 3013 3462 2910 1859 1629 749 186 -731 -1425 -1880 -1474 -1001 -1438 -2634 -3260
1958c260N50K667K847J305j192k608j242R95K382J898j071l657l098j452J636
$$ -3260 -2710 -43 2804 4109 2917 309 -933 62 2444 4342 3271 -386 -3484 -4936 -3300
1973c300K279J445l61j760j073N74J815K824J603k52j807j526l72N29R14m59j463
$$ -3300 -1021 424 63 -1697 -2770 -2196 -381 2443 4046 3794 1987 461 89 618 1532 1073 -390
1990c90j680o17N20M04j02k35Q97J774J471J17r35j359L05J846J635J09k812k983
$$ -390 -2070 -2687 -2167 -1763 -1865 -2100 -1203 571 2042 2159 1224 -135 170 2016 3651 3760 948 -2035
2008b035j690R06K192J381o28j889j401l34K319K379K025L88j478k023j265J239
$$ -2035 -3725 -2819 -627 754 126 -1763 -3164 -3498 -1179 1200 3225 3613 2135 112 -1153 86
2024H6K235R95j315l069k135k90J542J530J5o97n40O93J528P57k38k85M40J386
$$ 86 2321 3316 2001 -1068 -3203 -3493 -1951 -421 -406 -1103 -1643 -950 578 1335 1097 812 1252 2638
2042B638M24j222k189j436J91J214Q41n69j457j403l26J023K162J732M90k38j596
$$ 2638 3062 1840 -349 -1785 -1594 -380 461 -108 -1565 -2968 -3294 -2271 -109 1623 2113 1875 279
2059B79r14N57K049J743m4k828l195j531J364K611Q45p96k586j012J320K657J343
$$ 279 -635 -78 1971 3714 3670 842 -2353 -3884 -2520 91 936 140 -2446 -3458 -2138 519 1862
2076A862O8o91j88M66O02o27j298n44O9J53o0j297j072j10P19J039Q14N12L81
$$ 1862 1930 1239 1051 1517 2119 1492 194 -350 -281 -128 -188 -1485 -2557 -2667 -1948 -909 -95 417 798
2095G98L85n17M3J99J162J217p01k356k524q35J977J764K93k277k169k09K031
$$ 798 1183 666 709 908 2070 3287 2586 230 -2294 -3129 -1152 612 905 -1372 -3541 -3750 -1719
2112a719L000J267q54r74n96Q59J039k14p55m02n18o10q22o77j59O53N18J45J09
$$ -1719 1281 2548 1694 720 124 983 2022 1808 1053 651 133 -477 -1299 -1976 -2135 -1482 -964 -819 -710
2131g10j05J096J003l7k37O6P45Q66r31j529k161l39J768J218j27k302k044K80
$$ -710 -815 281 1284 1247 1010 1076 1821 2687 1756 227 -1934 -2273 -505 713 586 -1716 -3760 -3480
2149c480K764K418O63j244j203L1J094Q69J34o10p58m84r55j127m11J001Q58M42
$$ -3480 -716 1702 2365 1121 -82 -51 1043 1912 2046 1436 678 194 -761 -1888 -2299 -1298 -440 2
2167Bj044o74K47J694J208K80m85m47L15Q01n54r30j505J66R84M98j269k285p88
$$ 2 -1042 -1716 -1469 225 1433 1713 1228 781 1096 1897 1343 413 -1092 -926 58 556 -713 -2998 -3786
2186c786J518K944J215k99j415p80N34J799R61m66q28j186q75p56l10K19J023
$$ -3786 -2268 676 1891 1592 177 -603 -69 1730 2691 2225 1397 211 -664 -1420 -1730 -1511 -488
2203d88O76n88j248n70R29K350J668k91j236r03l7P52L57q89j221j17L58J16j200
$$ -488 188 -400 -1648 -2218 -1289 1061 2729 2438 1202 299 262 1014 1371 482 -739 -856 -498 -382 -1582
2222a582j031J40J908J855N61j430j310K40J616J632J67j511j608o90O4K64k85
$$ -1582 -2613 -2473 -565 1290 1851 421 -889 -649 967 2599 2766 1255 -353 -1043 -979 -715 -1000
2239a000M71j8m9o14r18O03J699J946M05j212j180n26P77J351j89j270j279n42
$$ -1000 -529 -547 -596 -1210 -2128 -1525 174 2120 2525 1313 133 -393 384 1735 1546 276 -1003 -1545
2257a545N87K19k33m63M31J049J122l36j177l67Q86J786O12p11j925r11k77Q28
$$ -1545 -958 -739 -972 -1435 -1004 45 1167 831 -346 -713 173 1959 2571 1860 -65 -976 -1253 -425
2275d25M66k9m49o27n3l97O74R22J282O54m44j183r19K17J688M40o34j731j303
$$ -425 41 12 -437 -1064 -1117 -1514 -840 82 1364 2018 1574 391 -528 -311 1377 1817 1183 -548 -1851
2294a851%R51M87k1k65j2Q25M62p9k20R6Q15Q41l17j339j404l77M32J163K20p94
$$ -1851 -1851 -900 -413 -434 -699 -711 114 576 497 277 373 1188 2029 1712 373 -1031 -1408 -976 187 407 -387
2315c87r54p6n2R19J078R67M15o23p81p81q4O85J426j52j553k052o79O70J745
$$ -387 -1341 -1417 -1469 -550 528 1495 1910 1287 506 -275 -359 326 1752 1600 47 -2005 -2684 -2014 -269
2334b69P07m33n51l23O39P70L91L9J04M15l94n09j037q09O1O73O34n23q05p40
$$ -269 438 5 -546 -869 -230 540 931 970 1074 1489 1095 586 -451 -1260 -1199 -526 108 -415 -1220 -1960
2354a960N10J294J100N73M27n72r28m06j2N01Q73m03o26j948j114O61J315J280
$$ -1960 -1450 -156 944 1517 1944 1372 444 38 26 527 1400 997 371 -1577 -2691 -2030 -715 565
2372E65m4m78q08J78J244R75K92k17o21l50p88k52n57m05L79J00p1n28m26N92
$$ 565 521 43 -765 -587 657 1632 1924 1707 1086 736 -52 -304 -861 -1266 -887 -787 -858 -1386 -1812 -1220
2392a220J083J026J133J17o44r89L3j70P89K23p28j048j592q43P25J118R41N84
$$ -1220 -137 889 2022 2139 1495 506 539 369 1158 1381 653 -395 -1987 -2830 -2105 -987 -46 538
2410E38o98o48L91R14J601N13n21r52o25r11L0k41J49m83n73j25jK19M71P81J004
$$ 538 -160 -808 -417 497 2098 2611 2090 1138 513 -398 -368 -609 -460 -943 -1516 -1641 -1642 -1423 -952 -171 833
2431H33P12K60j55m03n58K16J93L18p04j111j580r49K57J245J219L39o16p05K01
$$ 833 1545 1805 1650 1247 689 905 1098 1416 712 -399 -1979 -2928 -2671 -1426 -207 132 -484 -1189 -988
2450i88J217K063R08J48j840j294o56N18K00k28o93j193p49O7N71R49Q71M64J73
$$ -988 229 2292 3200 3348 1508 214 -442 76 276 48 -645 -1838 -2587 -2520 -1949 -1000 -129 335 508
2469E08J061L9L67j96m46j09k1m95j027j051j340l59P92J060P43q1j99j37R06
$$ 508 1569 1608 1975 1779 1333 1224 1203 708 -319 -1370 -2710 -3069 -2277 -1217 -474 -555 -754 -891 15
2488A5J941J345K19q07j275j184m62L74J89q02j429j562j90Q42J688J306M09k30
$$ 15 1956 3301 3520 2713 1438 254 -208 166 355 -447 -1876 -3438 -3628 -2786 -1098 208 617 387
2506C87M63N39R03L59nr86r86p53j00r23q43q18o9O80Q39K65K97K97P87J044J219
$$ 387 850 1389 2292 2651 2646 1660 674 -79 -179 -1102 -1945 -2763 -2832 -2152 -1313 -1048 -751 -454 333 1377 2596
2527B596P79n87p91j219p62m1K71k96j170j801m24k1J592J530J035r2m91M12Q12
$$ 2596 3375 2788 1997 778 16 -25 246 -50 -1220 -3021 -3445 -3466 -1874 -344 691 599 108 520 1332
2546A332J603L11l22j449j290p74j88l48k90o88k09k33O82M99M81R98Q27Q63P78
$$ 1332 2935 3246 2924 1475 185 -589 -777 -1125 -1415 -2103 -2312 -2545 -1863 -1364 -883 115 942 1805 2583
2565B583K77m92q47l39n52k2n86p18j042j139m22M41J582J166N67m35j27O77J799
$$ 2583 2860 2368 1521 1182 630 608 22 -696 -1738 -2877 -3299 -2858 -1276 -110 457 22 -105 572 2371
2584B371J220K76j040j797j306m98P6k39o41q95m52P0M52J053J201J236P95M07
$$ 2371 3591 3867 2827 1030 -276 -774 -698 -937 -1578 -2473 -2925 -2855 -2403 -1350 -149 1087 1882 2289
2602B289P9M7k1j49m30r26j125r75o81o37l61kP17J091R81M39j09L50J168J474
$$ 2289 2368 2415 2394 2245 1815 889 -236 -1211 -1892 -2529 -2890 -2892 -2175 -1084 -103 336 227 577 1745 3219
2622C219N60n98j535j616p52K19j12m43j042j073o7N67J255J306R41O44o0J64
$$ 3219 3779 3181 1646 30 -722 -503 -615 -1058 -2100 -3173 -3240 -2673 -1418 -112 829 1473 1413 1577
2640A577K61M58M27j97j288j397j159k62l75j9l23L1J30R32R28O65m2R80P28R97
$$ 1577 1838 2296 2723 2526 1238 -159 -1318 -1580 -1955 -1974 -2297 -2266 -2136 -1204 -276 389 347 1327 2055 3052
2660C052p3q91j327p73l39L14k20r25j201o30J45Q73J287J190J33j12N91J08O98
$$ 3052 2979 2088 761 -12 -351 -37 -257 -1182 -2383 -3013 -2868 -1995 -708 482 615 503 1094 1202 1900
2679A900O81K67o43j731j426m12j33K63p8o13n94K49Q83J176J065L89L68J70L65
$$ 1900 2581 2848 2205 474 -952 -1364 -1497 -1234 -1312 -1925 -2519 -2270 -1387 -211 854 1243 1611 1781 2146
2698B146K66n22q29p36l28m08n68m71r49p35N89J124J379P65J63j31J75N38N21
$$ 2146 2412 1890 1061 325 -3 -411 -979 -1450 -2399 -3134 -2545 -1421 -42 723 886 755 930 1468 1989
2717A989O90j22j319j424j262j02J79M08K5j045n53L50J436J759P26j51j35J2
$$ 1989 2679 2557 1238 -186 -1448 -1550 -1371 -963 -938 -1983 -2536 -2186 -750 1009 1735 1584 1449 1461
2735A461J73J77j58q46r69n78k02j76l09o37R5K71P66R96P36L64j36k65J83N76
$$ 1461 1634 1811 1653 807 -162 -740 -942 -1118 -1427 -2064 -1969 -1698 -932 64 800 1164 1028 763 946 1522
2755A522L35r6j100j205r22Q1M71L84l02q08k93N10J274J101O85o59l11j34M17
$$ 1522 1857 1761 661 -544 -1466 -1385 -914 -530 -832 -1640 -1933 -1423 -149 952 1637 978 667 533 950
2774I50L69r6n80j015p51l4Q1m1J94j63J24L95Q15M6M69M2K12p6J46K26l18o68
$$ 950 1319 1223 643 -372 -1123 -1157 -1076 -1117 -923 -1086 -962 -567 248 294 763 805 1017 941 1087 1313 995 327
2796C27q48m37J26L34K91m36n75k64M59J092J048N00m73q46o66Q41P95K51r02
$$ 327 -521 -958 -832 -498 -207 -643 -1218 -1482 -1023 69 1117 1617 1144 298 -368 473 1268 1519 617
2815F17p94r02m68L28O93N64O2n54k36M96M20O98K14r2o5n63k33k67j11l57j67
$$ 617 -177 -1079 -1547 -1219 -526 38 100 -454 -690 -194 226 924 1138 1046 981 418 185 -82 -193 -550 -717
2836g17%J24M16j32n11K4P54R49N02m71p48l89N3N86j8J16n19r06n89O78N09Q10
$$ -717 -717 -593 -177 -309 -820 -796 -42 907 1409 938 190 -199 -146 440 422 538 19 -887 -1476 -798 -289 521
2858E21K57l64m88j54J7M32O95k64o06k86n20J63N47q9M9k1k37k16O12K55QJ98
$$ 521 778 414 -74 -228 -211 221 916 652 46 -240 -760 -597 -50 -139 -90 -111 -348 -564 48 303 311 509
2880E09L28m69n3l71j03l16j30K75K35l44k14k12K95Q67L40L45m94l7m21L27J95
$$ 509 837 368 315 -56 -159 -475 -605 -330 -95 -439 -653 -865 -570 297 637 982 488 451 30 357 552
2901E52K60m83o58l58k59J69K52L56K24j96k15P0M45P35J79q2pn12l37p1j33n5
$$ 552 812 329 -329 -687 -946 -777 -525 -169 55 -141 -356 -286 159 894 1073 991 984 472 135 64 -69 -124
2923a24l99j42j62k18J30J38L20O55L58K80J96k09j30p8K89j79l30o64p21l18
$$ -124 -523 -665 -827 -1045 -915 -777 -457 198 556 836 1032 823 693 615 904 725 395 -269 -990 -1308
2943a308m1M29J84L39j33M5M37M05N05N26K48o6p47j89m58l63l28k17l77l26N3
$$ -1308 -1349 -920 -736 -397 -530 -485 -48 357 862 1388 1636 1570 823 634 176 -187 -515 -732 -1109 -1435 -1382
2964a382o4K92L20N89R39L91J97O4j47j2j10j20m69o79q16n03k30n7M69L10M00
$$ -1382 -1446 -1154 -834 -245 694 1085 1282 1346 1199 1187 1077 957 488 -191 -1007 -1510 -1740 -1797 -1328 -1018 -618
2985f18R2K87L81R27P10L23j66k07o59p18n45j21n44n05k78k98qJ70P26P91R92
$$ -618 -526 -239 142 1069 1779 2102 1936 1729 1070 352 -193 -314 -858 -1363 -1641 -1939 -1947 -1777 -1051 -260 732
3006G32O91K09o1J27P6K02m11n64j040p64q87o6q7K47k7L18J20P92O05Q14P48
$$ 732 1423 1632 1571 1698 1774 1976 1565 1001 -39 -803 -1690 -1756 -1843 -1596 -1623 -1305 -1185 -393 212 1026 1774
3027A774M42R5m18k27n50o76m50m91p47m33r62j9K86J045P89J024L77K17L28M70
$$ 1774 2216 2311 1893 1666 1116 440 -10 -501 -1248 -1681 -2643 -2662 -2376 -1331 -542 482 859 1076 1404 1874
3047A874N47O5j15r98j105j102r12N3J68p8m42K55k10R92Q50J428J171l9m48N0
$$ 1874 2421 2486 2371 1373 268 -834 -1746 -1693 -1525 -1603 -2045 -1790 -2000 -1008 -158 1270 2441 2402 1954 2004
3067B004m70m0k93n75n64j450p45k56m30N60O28M24O63R09N25M64M01Q07K98r1
$$ 2004 1534 1494 1201 626 62 -1388 -2133 -2389 -2819 -2259 -1631 -1207 -544 365 890 1354 1755 2562 2860 2769
3087B769p90j151r05p76o90j96o8n72k04j0P42J000J387R97Q85O3k46k54j3j9
$$ 2769 1979 828 -77 -853 -1543 -1739 -1807 -2379 -2583 -2593 -1851 -851 536 1533 2418 2481 2235 1981 1968 1949
3107A949j60j178j274j556p13J18N68j1P15J33L54J175J245R83N81k86j03m00
$$ 1949 1789 611 -663 -2219 -2932 -2814 -2246 -2257 -1542 -1409 -1055 120 1365 2348 2929 2643 2540 2140
3125B140m49q03p76r09p97r78j20l8M11L94O67R93R51Q04P22O30l30J29l74n33
$$ 2140 1691 888 112 -797 -1594 -2572 -2692 -2730 -2319 -1925 -1258 -265 686 1490 2212 2842 2512 2641 2267 1734
3145A734q13j162j255j072l17K16K61M46M9N17Q48J370J137P63L90m68l17o62
$$ 1734 921 -241 -1496 -2568 -2885 -2669 -2408 -1962 -1913 -1396 -548 822 1959 2722 3112 2644 2327 1665
3163A665p01q3o37j172j074r87L2M3J021O59N92M63P62R25J083M45J3o65p45p47
$$ 1665 964 881 244 -928 -2002 -2989 -2957 -2914 -1893 -1234 -642 -179 583 1508 2591 3036 3049 2384 1639 892
3183H92l74p48j046j006l87P4L67K60O24K95R85N96J290R14P2r2q96j24p71o11
$$ 892 518 -230 -1276 -2282 -2669 -2595 -2228 -1968 -1344 -1049 -64 532 1822 2736 2808 2716 1820 1696 925 314
3203C14p32o32j223n09k10M63O52O41M62Q26O88O70J275N5J88p50o54m17p29q44
$$ 314 -418 -1050 -2273 -2782 -2992 -2529 -1877 -1236 -774 52 740 1410 2685 2740 2928 2178 1524 1107 378 -466
3223d66r21j248n03K57O69N03M44N51N15J199J162L54N73k15q78r61m96m48m30
$$ -466 -1387 -2635 -3138 -2881 -2212 -1709 -1265 -714 -199 1000 2162 2516 3089 2874 1996 1035 539 91 -339
3242c39q73r24n91l19M12J047P68R40K18K25J100O70M71m39m63m86q69r88q46
$$ -339 -1212 -2136 -2727 -3046 -2634 -1587 -819 121 339 564 1664 2334 2805 2366 1903 1417 548 -440 -1286
3261a286n90l88p6k25N23P14J04R04Q50Q94P07L90j65m17n50n30l03q12l68o93
$$ -1286 -1876 -2264 -2340 -2565 -2042 -1328 -1224 -320 530 1424 2131 2521 2356 1939 1389 859 556 -256 -624 -1317
3281a317j015l40L4J128O73N56J95K69M07J213P83J90n67r75r13n12k36k93l57
$$ -1317 -2332 -2672 -2638 -1510 -837 -281 -86 183 590 1803 2586 2776 2209 1234 321 -191 -427 -720 -1077
3300a077p74l38P1RQ40O84J037K65M19L42o2K59O5r2m37r36m26p23q35l8j03M10
$$ -1077 -1851 -2189 -2118 -2109 -1269 -585 452 717 1136 1478 1416 1675 1740 1648 1211 275 -151 -874 -1709 -1747 -1850 -1440
3322a440K75L80J01K78N00J055O57R12m62r87q03k01J64p2k89j306q47l51K13
$$ -1440 -1165 -785 -684 -406 94 1149 1806 2718 2256 1269 466 265 429 357 68 -1238 -2085 -2436 -2223
3341b223R31R03O02J38p8K76P42N63K55k95p75p37m77m90k37j39l71l08J10N11
$$ -2223 -1292 -389 213 351 273 549 1291 1854 2109 1814 1039 302 -175 -665 -902 -1041 -1412 -1720 -1610 -1099
3361a099P36N83o8K92P18L95K49l81p20m63K3l0k70p70n02n54P5P75R38K37o9
$$ -1099 -363 220 152 444 1162 1557 1806 1425 705 242 265 235 -35 -805 -1307 -1861 -1786 -1011 -73 164 95
3382I5j24L8N34R45J78j99p22q76K8J29L0m8n46o44k53L38M96Q93J19l44j84M26
$$ 95 -29 9 543 1488 1666 1467 745 -131 -103 26 56 8 -538 -1182 -1435 -1097 -601 292 411 67 -117 309
3404C09O73J79m5l85n20l93L6J15q3o06n46K82M72L46M0J3j60K10N23M08K52p1
$$ 309 982 1161 1116 731 211 -182 -146 -31 -114 -720 -1266 -984 -512 -166 -126 -113 -273 -63 460 868 1120 1049
3426A049p08j79k13Q1M0j93k62o15m4L16O28L31k71n7j26L13M49M64l02l23m24
$$ 1049 341 162 -51 30 70 -123 -385 -1000 -1044 -728 -100 231 -40 -97 -223 90 539 1003 701 378 -46
3447d6j25K13J34j96n07l36L52Q6L72M47n9n12J04J60K26L50k05l28l04k37L02
$$ -46 -171 42 176 -20 -527 -863 -511 -425 -53 394 335 -177 -73 87 313 663 458 130 -174 -411 -109
3468a09p9M49k31m41N0kK87L18K64k78m91j1N34J02p5l22j92J01O8M80k36Q8k61
$$ -109 -188 261 30 -411 -361 -363 -76 242 506 228 -263 -274 260 362 287 -35 -227 -126 -58 422 186 274 13
3491A3J05R5O1j80J2m05o4q0K88M9J49M3l82m1O83J61PPr3j88j12jj03q2q2j97
$$ 13 118 213 274 94 106 -299 -363 -443 -155 -106 43 86 -296 -337 346 507 514 521 428 240 128 127 24 -58 -140 -337
3517c37q1k15L90L1p5j52O32J05k08M96p6L95n72j01k03k25k3m8k73q9k05J17
$$ -337 -418 -633 -243 -212 -287 -439 193 298 90 586 510 905 333 232 29 -196 -219 -267 -540 -629 -834 -717
3539g17K21N38Q7J08P9L8K35L32l29jj41l36p0m76q0n4j12j41L04Q9q9K59N46
$$ -717 -496 42 129 237 316 354 589 921 592 591 450 114 44 -432 -512 -566 -678 -819 -515 -426 -515 -256 290
3562B90L31L60M8l3j61k21l87q2l33R3m77l59k76N53n9J04K60N70R1N86j84J09
$$ 290 621 981 1029 996 835 614 227 145 -188 -95 -572 -931 -1207 -654 -713 -609 -349 221 312 898 714 823
3584H23K6K67k46k20l74n71l59k25j61K13k57R9J46L49N06M16K69M35Q8k21J58
$$ 823 849 1116 870 650 276 -295 -654 -879 -1040 -827 -1084 -985 -839 -490 16 432 701 1136 1224 1003 1161
3605A161k30k07m83l98o45l57k4OJ08N7J25M11N17M36P35O5r0N1n4j59j45r12
$$ 1161 931 724 241 -157 -802 -1159 -1183 -1177 -1069 -1012 -887 -476 41 477 1212 1277 1187 1238 1184 1025 880 -32
3627c2m05m58k88j09j51j11O21K60J79M25O60M47M35j08q1j11k04m33m63n24l18
$$ -32 -437 -895 -1183 -1292 -1443 -1554 -933 -673 -494 -69 591 1038 1473 1365 1284 1173 969 536 73 -451 -769
3648g69l57m08Q6K4K86J13P35O29M61O59m1r1J0l73k1j43p47p05m14m52Qo9K59
$$ -769 -1126 -1534 -1448 -1424 -1138 -1025 -290 339 800 1459 1418 1327 1337 964 943 800 53 -652 -1066 -1518 -1510 -1579 -1320
3671a320Q1M88L20N49O72P61M19mp33l73l74J78n15q15j82o51m63K82M54K07K75
$$ -1320 -1239 -751 -431 118 790 1551 1970 1966 1233 860 486 664 149 -666 -848 -1499 -1962 -1680 -1226 -1019 -744
3692g44N92R19N3J85M33J32R1l98l72o96r41j41j83l15n1j35n9L94O32L56Q33
$$ -744 -152 767 820 1005 1438 1570 1661 1263 891 195 -746 -887 -1070 -1385 -1436 -1571 -1630 -1236 -604 -248 585
3713E85R19J83J08k52m10k0l37J32p42q08q74l41JM51L14M20J39N10J81O94M78
$$ 585 1504 1687 1795 1543 1133 1113 776 908 166 -642 -1516 -1857 -1856 -1405 -1091 -671 -532 -22 159 853 1331
3734A331L40K71l33k14o99q27l33j51l96l1o77k10R3N21J018Q31L88J05J84N1
$$ 1331 1671 1942 1609 1395 696 -131 -464 -615 -1011 -1042 -1719 -1929 -1836 -1315 -297 534 922 1027 1211 1262
3754A262J84L0Q6n54m48j056p01m52J60j09L50j64q6P48J014O41M74K08R3k76
$$ 1262 1446 1476 1562 1008 560 -496 -1197 -1649 -1489 -1598 -1248 -1412 -1498 -750 264 905 1379 1587 1680 1404
3774A404J17l36p57m46n80j16n08n95j37L70L89L12O96N09K92K95M30J87J35p8
$$ 1404 1521 1185 428 -18 -598 -714 -1222 -1817 -1954 -1584 -1195 -883 -187 322 614 909 1339 1526 1661 1583
3794A583k52j023o78n32k53l20M28k55j26K16n4R13Q48Q75J72o0m38j04M76j67
$$ 1583 1331 308 -370 -902 -1155 -1475 -1047 -1302 -1428 -1212 -1266 -353 495 1370 1542 1482 1044 940 1416 1249
3814A249n67p86r57k01j58qJ00k25M15M09O24M18O91K37J50J7J28k28j19r39m88
$$ 1249 682 -104 -1061 -1262 -1420 -1428 -1328 -1553 -1138 -729 -105 313 1004 1241 1391 1408 1536 1308 1189 250 -238
3835b38n27k97l59QR8P1P7J06P87P88P77J24k97j74K19kp9n23j026p17j46J94
$$ -238 -765 -1062 -1421 -1413 -1315 -1244 -1167 -1061 -274 514 1291 1415 1118 944 1163 1161 1082 559 -467 -1184 -1330 -1136
3857a136O0K2l26L61KO98Q81M11N40j47j51k02j8r2l52q09o99k91r3J4M61N5N1
$$ -1136 -1076 -1054 -1380 -1019 -1017 -319 562 973 1513 1366 1215 1013 995 903 551 -258 -957 -1248 -1341 -1327 -866 -811 -760
3880g60N0L95J142O52j7k31n87L8J65o5k95r77m26l72m9K09L64j35L14N6N47M63
$$ -760 -710 -315 827 1479 1462 1231 644 682 847 782 487 -490 -916 -1288 -1337 -1128 -764 -899 -585 -529 18 481
3902D81N05N8K4j49m79K68q1m65l33p22k69L9J92K82L52m21L39J25P92M31L52
$$ 481 986 1044 1068 919 440 708 627 162 -171 -893 -1162 -1123 -931 -649 -297 -718 -379 -254 538 969 1321
3923A321n25m7o0N9J21o82l36r64p1M25q2N94j62o6K2M98O29K30K36j02n23l21
$$ 1321 796 749 689 748 869 187 -149 -1113 -1184 -759 -841 -247 -409 -475 -453 45 674 904 1140 1038 515 194
3945A94M05k63Q1k39r14m43r5L12O49J1j00K3K99N42j7N41k48L6q0m08M7p2k30
$$ 194 599 336 417 178 -736 -1179 -1274 -962 -313 -302 -402 -379 -80 462 445 986 738 774 694 286 333 261 31
3968C1n69m5l01L89K7Q0J2j77M81O11M14k68j59j65k62R7K15m1k61q66j6m1N2
$$ 31 -538 -583 -884 -495 -468 -388 -376 -553 -72 539 953 685 526 361 99 196 411 370 109 -757 -773 -814 -762
3991g62M71J16k02j7P2M24P94j25j65j86k62o0o0J22j35l67l08K36p5L30k6m2
$$ -762 -291 -175 -377 -394 -322 102 896 771 606 420 158 98 38 160 25 -342 -650 -414 -489 -159 -185 -227
4013b27N0J28K01K40Q1J8k63J87k84j42J03j0l22j66L58k63N2K6l27J24K36N7
$$ -227 -177 -49 152 392 473 491 228 415 131 -11 92 82 -240 -406 -48 -311 -259 -233 -560 -436 -200 -143
4035a43L77R7l02M23n18J93r5K23j53l68j55O2J86J80j28j24M3P7J36J00L95q1
$$ -143 234 331 29 452 -66 127 32 255 102 -266 -421 -359 -173 7 -121 -245 -202 -125 11 111 506 425
4057D25l63J09J10J24j17q6l11l8k60M71k00j80J42j15j14J47K60J23L63l16p3
$$ 425 62 171 281 405 288 202 -109 -147 -407 64 -136 -316 -174 -289 -403 -256 4 127 490 174 101
4078A01O0m6MR0j70p2j56K9K3rq2L7k06K78k9L20m71L58L26k13J25J26l94L0q5
$$ 101 161 115 119 209 39 -33 -189 -160 -137 -146 -228 -191 -397 -119 -148 172 -299 59 385 172 297 423 29 59 -26
4103b6K89k59K12k82m03O3M8l23M62Q8J4P2r8O0L31N7J81K19o12Q2j88k12M24
$$ -26 263 4 216 -66 -469 -406 -358 -681 -219 -131 -117 -45 -143 -83 248 305 486 705 93 175 -13 -225 199
4126A99j80n04kj9M9M4R3O12J02j41j14Q8j8J24J57ql71j24n10k4K39j42J96j09
$$ 199 19 -485 -487 -506 -457 -413 -320 292 394 253 139 227 209 333 490 482 111 -13 -523 -547 -308 -450 -254 -363
4150c63J88j25j08K94L62P9M50j97l20l6j0J5j36k41l17k26J56j7N3K96Q9p2M38
$$ -363 -175 -300 -408 -114 248 327 777 580 260 224 214 229 93 -148 -465 -691 -535 -552 -499 -203 -114 -186 252
4173B52K3K30k3J35o1K11n15m12j25J38j61j8k27k01J69j13N27J41N55Kk5J2m5
$$ 252 275 505 482 617 556 767 252 -160 -285 -147 -308 -326 -553 -754 -585 -698 -171 -30 525 527 502 514 469
4196D69J15J17P9n02n78k27k74r7m8L88L2k5J2L02M54K30P7L68k00L33m09k08
$$ 469 584 701 780 278 -300 -527 -801 -898 -946 -558 -526 -551 -539 -237 217 447 524 892 692 1025 616 408
4218D08o27M62m83j36k33k76N5J20R0M00M01K40O4Q3OL34o4k74j59k31l49l68
$$ 408 -219 243 -240 -376 -609 -885 -830 -710 -620 -220 181 421 485 568 574 908 844 570 411 180 -169 -537
4240e37q5J45m2j14p0j4L49M12K81K92j6J25O1j26n7l15k35l49k70j9J28n39K88
$$ -537 -622 -477 -519 -633 -703 -717 -368 44 325 617 601 726 787 661 604 289 54 -295 -565 -584 -456 -995 -707
4263g07K43Q5J01M24K38J67KJ29J32q0rn74p8k34m80J10O0l53M0J86N9J78O87
$$ -707 -464 -379 -278 146 384 551 553 682 814 734 725 151 73 -161 -641 -531 -471 -824 -784 -598 -539 -361 326
4286C26L08J8j47J00J8M18l22n22m6m71j74k12l10qJ88K97L31R0M33J97J03L36
$$ 326 634 652 505 605 623 1041 719 197 151 -320 -494 -706 -1016 -1024 -836 -539 -208 -118 315 512 615 951
4308I51j24M67l71l15l62m16m95m5n3K03k02j18l5N10M56M02L72kl20q9K61O3
$$ 951 827 1294 923 608 246 -170 -665 -710 -763 -560 -762 -880 -915 -405 51 453 825 823 503 414 675 738
4330G38j55k75o08l21j2j26l26M02M1J44K53K31K36L6M02K00J25O3m89k50r9n68
$$ 738 583 308 -300 -621 -633 -759 -1085 -683 -642 -498 -245 -14 222 258 660 860 985 1048 559 309 210 -358
4352c58l2j23m4K8j87k30K0M99O11M79r8j54J02J04J64l6p7m79o40j47l52K40
$$ -358 -390 -513 -557 -529 -716 -946 -926 -427 184 663 565 411 513 617 781 745 668 189 -451 -598 -950 -710
4374g10n5RK9j5L00L20L13N74j08J82l2k21k00j95j6n95J46m85j09j1L82n3J0
$$ -710 -765 -756 -727 -742 -442 -122 191 765 657 839 807 586 386 191 175 -420 -274 -759 -868 -879 -497 -550 -540
4397e40L85P02K30k15j47RK96M9L7l55n33l15m25O1K7K89Lk07l1O34K29J35O76
$$ -540 -155 547 777 562 415 424 720 769 806 451 -82 -397 -822 -761 -734 -445 -442 -649 -680 -46 183 318 994
4420I94j31k67j17q1k5J45k10l50n69l58j00N48R3n0K23K27q8K82K63Q8J94l69
$$ 994 863 596 479 398 373 518 308 -42 -611 -969 -1069 -521 -428 -478 -255 -28 -116 166 429 517 711 342
4442C42K13j17n05l06J8o9J05J1m4m48j45K20N69L68L58L43l48j27k10j00K58
$$ 342 555 438 -67 -373 -355 -424 -319 -308 -352 -800 -945 -725 -156 212 570 913 565 438 228 128 386
4463C86L12n20n26n58j23M08K31K46J04k60j06J73M83M10k2K30m12k48j39k90
$$ 386 698 178 -348 -906 -1029 -621 -390 -144 -40 -300 -406 -233 250 660 638 868 456 208 69 -221
4483b21J19l3j66J80l83m0p6J22L13J81J31K25p2J7J96L4l81J37k39k67j79j04
$$ -221 -102 -135 -301 -121 -504 -544 -620 -498 -185 -4 127 352 280 297 493 527 146 283 44 -223 -402 -506
4505e06j05N05n5j23m2l6K45L35K61J91M3k55l24l41L12K19n4l48l64j58lL05
$$ -506 -611 -106 -161 -284 -326 -362 -117 218 479 670 713 458 134 -207 105 324 270 -78 -442 -600 -603 -298
4527b98K64j65L80j43k29K58K83J74j37J2j92j99k9p5k77J98q5l75L61P0J54j14
$$ -298 -34 -199 181 38 -191 67 350 524 387 399 207 8 -21 -96 -373 -175 -260 -635 -274 -204 -50 -164
4549a64Q1K05J0M51j7m90QMj04M8J30k17j23m44K71J26lK27j47K77k02J32L91
$$ -164 -83 122 132 583 566 76 84 88 -16 32 162 -55 -178 -622 -351 -225 -228 -1 -148 129 -73 59 450
4572D50r1o5J94n21M6r2R4O8l33L9J95m39L03o1K66J66j40m3J91k69K71J2k63
$$ 450 359 294 488 -33 13 -79 15 83 -250 -211 -16 -455 -152 -213 53 219 79 36 227 -42 229 241 -22
4595b2J47M1j07j23J24k70J60j12L09J2J26l59m51L17K84L82k8j53m00L49l96
$$ -22 125 166 59 -64 60 -210 -50 -162 147 159 285 -74 -525 -208 76 458 430 277 -123 226 -170
4616a70J26J72l2Oj54m38K39K58k2J27l7k76r9L8K11L34m1r4n1k36K4k8J11J53
$$ -170 -44 128 96 102 -52 -490 -251 7 -15 112 75 -201 -300 -262 -51 283 242 148 97 -139 -115 -143 -32 121
4640A21O6l60M8l3k25K27L2J63n8n6O3P8j6N0K68j3j71l10l27J39K53l6L10j85
$$ 121 187 -173 -125 -158 -383 -156 -124 39 -19 -75 -12 66 50 100 368 355 184 -126 -453 -314 -61 -97 213 28
4664B8n56J13R8k7M32K42R5m35R1k71K93J00K90l3p79O6l9K2j36O31j12k80J14
$$ 28 -528 -415 -317 -344 88 330 425 -10 81 -190 103 203 493 460 -319 -253 -292 -270 -406 225 113 -167 -53
4687e3o7p6K00N42l31K71j62l20Pl5K73l21N9k55k38n4L37p5K44M98m18K36l77
$$ -53 -120 -196 4 546 215 486 324 4 11 -24 249 -72 -13 -268 -506 -560 -223 -298 -54 444 26 262 -115
4710a15K56K05o0Q4j26Pl48k71K20j78K40J42j94m10J18M29j1L72K16k29k62K49
$$ -115 141 346 286 370 244 251 -97 -368 -148 -326 -86 56 -138 -548 -430 -1 -12 360 576 347 85 334
4732C34N8r6J18l58k47j60j79J3j2J32O8K26o9j3L20J66M9pJ65m1m02Q2p7j50
$$ 334 392 296 414 56 -191 -351 -530 -517 -529 -397 -329 -103 -172 -185 135 301 350 343 508 467 65 147 70 -80
4756h0r9J08J24m69k02K5L89J52N14j15r4n7N6K72j35M3m45l5l49J06k83L36p8
$$ -80 -179 -71 53 -416 -618 -593 -204 -52 462 347 253 196 252 524 389 432 -13 -48 -397 -291 -574 -238 -316
4779c16J32K73k53kM32J13N9J79K5L6l61o8k75j09j38L19j70l31k76J74qQ38j92
$$ -316 -184 89 -164 -166 266 379 438 617 642 678 317 249 -26 -135 -273 46 -124 -455 -731 -557 -565 273 81
4802H1L86k1J1k29M2K69K03m09m50N4m39J75l51K75K7L4O5j51N71K48j58K80K3
$$ 81 467 446 457 228 270 539 742 333 -117 -63 -502 -327 -678 -403 -376 -342 -277 -428 143 391 233 513 536
4825E36J24n11J98k26k14j48k58P8k53L3R4J92j56L78M16Q1K1r8K83j49M92m65
$$ 536 660 149 347 121 -93 -241 -499 -421 -674 -641 -547 -355 -511 -133 283 364 385 287 570 421 913 448
4847D48m3m52o21J30r3J5J47j74K56j90L46M04M51k50l5J87j37Kj92p5q0k47k64
$$ 448 405 -47 -668 -538 -631 -616 -469 -643 -387 -577 -231 173 624 374 339 526 389 391 199 124 44 -203 -467
4870d67j56K56l9j23J05K42J70K94Q7j00L59K9l22N3K03m11n85j85R2L3Q0N9j86
$$ -467 -623 -367 -406 -529 -424 -182 -12 282 369 269 628 657 335 388 591 180 -405 -590 -498 -465 -385 -326 -512
4893e12On6L45M18L95L21m14k32J52k5J4j2k28q10J9q2J59J30q2K25J18Q7ON28
$$ -512 -506 -562 -217 201 596 917 503 271 423 398 412 400 172 -638 -619 -701 -542 -412 -494 -269 -151 -64 -58 470
4917D70m2J05j3j48K3k87l7k54n4j07q1p0Q0j81L10J10K29L81QK29j60j38K02
$$ 470 428 533 520 372 395 108 71 -183 -237 -344 -425 -495 -415 -596 -286 -176 53 434 442 671 511 373 575
4940E75l77J16k61n19J23k44M3J25K18J8k44j5L46J75M03K23N5l20k51m14K47
$$ 575 198 314 53 -466 -343 -587 -544 -419 -201 -183 -427 -442 -96 79 482 705 760 440 189 -225 22
4961B2P1j46j34n00J51m1J75J3L24k1M06o8M1L24l52J48j07J7m71J46k53J39l44
$$ 22 93 -53 -187 -687 -536 -577 -402 -389 -65 -86 320 252 293 617 265 413 306 323 -148 -2 -255 -116 -460
4984d60r4M19j61K44j13O9L59R7L50q2k5n17J26r4O1j87q6k33m02J9%K13M08k8
$$ -460 -554 -135 -296 -52 -165 -96 263 360 710 628 603 86 212 118 179 -8 -94 -327 -729 -710 -710 -497 -89 -117
5008a17L31K35k49M7K46J58l12J40n38k34l1m2J12n4k35J19o6L33M0L41k0K45
$$ -117 214 449 200 247 493 651 339 479 -59 -293 -324 -366 -254 -308 -543 -424 -490 -157 -117 224 204 449
5030D49k73M98k47m3j4k13k43j4k63J07Oj52R3JL20J13l3J44M3M2n9J37J51l81
$$ 449 176 674 427 384 370 157 -86 -100 -363 -256 -250 -402 -309 -308 12 125 92 236 279 321 262 399 550 169
5054A69q6l29k59J55n0J06O0o7J96O0K85k19J56K72k31o0J63l25J62j49r2M8k81
$$ 169 83 -246 -505 -350 -400 -294 -234 -301 -105 -45 240 21 177 449 218 158 321 -4 158 9 -83 -35 -316
5077c16r2J39P2q1M25j07J97J64J55p3o14N19p7L6l75l9j82j72n3K43J60j20O7
$$ -316 -408 -269 -197 -278 147 40 237 401 556 483 -131 388 311 347 -28 -67 -249 -421 -474 -231 -71 -191 -124
5100a24J88j38J37L81L4J52k95L0l21J8k17Q6k3k34j08N9O9L22J92j48J39R6l13
$$ -124 64 -74 63 444 478 630 335 365 44 62 -155 -69 -92 -326 -434 -375 -306 16 208 60 199 295 -18
5123a8K86J42k17O0M4l29q2N7l90K06J97j69P3J4j6nL43L98m5m27J25j90O6K02
$$ -18 268 410 193 253 297 -32 -114 -57 -447 -241 -44 -213 -140 -126 -142 -147 196 594 549 122 247 57 123 325
5147C25p3j25j62k61j56K86jJ02L14m19K14r3Q3J35K37J29k31n67N49m06m44M85
$$ 325 252 127 -35 -296 -452 -166 -167 -65 249 -170 44 -49 34 169 406 535 304 -263 286 -120 -564 -79
5169g9n4j33Ko1K18l5J13K96K0Jk3n03K2MK72J57k93R1m02J1L27P7k4M26k08K2
$$ -79 -133 -266 -264 -325 -107 -142 -29 267 287 288 265 -238 -216 -212 60 217 -76 15 -387 -376 -49 28 4 430 222 244
5195B44n7J6R7r1J05j03j80k69n1j77K99j18Q2k8l1O8K53K51l38K64O1M0l20L2
$$ 244 187 203 300 209 314 211 31 -238 -289 -466 -167 -285 -203 -231 -262 -194 59 310 -28 236 297 337 17 49
5219D9J45k18l1n3L2l10k07K34J57M4K25K23l07M5K46K16j61J10l46p5j72J48
$$ 49 194 -24 -55 -108 -76 -386 -593 -359 -202 -158 67 290 -17 28 274 490 329 439 93 18 -154 -6
5241fJ3k91J29k38n8j8L80K1K79K56j11l89J20j82L56j25k22j32j00l7k2Q7q3
$$ -6 7 -284 -155 -393 -451 -469 -89 -68 211 467 356 -33 87 -95 261 136 -86 -218 -318 -355 -377 -290 -373
5264c73P8K08j03K82K7q7J36J57Q8j33j8l61o9r6J37j0J9j9J76m71K43L76K45
$$ -373 -295 -87 -190 92 119 32 168 325 413 280 262 -99 -168 -264 -127 -137 -118 -137 39 -432 -189 187 432
5287D32J86n0m72j97K58MJ31l22k17n4j84J45K27k45K02l2K29J80K1j34J45K6
$$ 432 618 568 96 -101 157 161 292 -30 -247 -301 -485 -340 -113 -358 -156 -188 41 221 242 108 253 279
5309B79r9r1r6r9r3k66J44j22K11p3L03j77J68J26l2N91j59L2k92m52K76J19j70
$$ 279 180 89 -7 -106 -199 -465 -321 -443 -232 -305 -2 -179 -11 115 83 674 515 547 255 -197 79 198 28
5332B8p9j69j47j64M64J10k9j91K30J18J44K22l70J18R1k34P5l34R7l99J8j60
$$ 28 -51 -220 -367 -531 -67 43 14 -177 53 171 315 537 167 285 376 142 217 -117 -20 -419 -401 -561
5354e61M13k80L05J1J72J13J4M02j67j50k63%p9K7K9o7k48J5o1M8J10K15n8M20
$$ -561 -148 -428 -123 -112 60 173 187 589 422 272 9 9 -70 -43 -14 -81 -329 -314 -375 -327 -217 -2 -60 360
5378C60l67K57N22j43j44m6l40j94J07l81M2L58k41j53n7L8K94K78j62J22R2J61
$$ 360 -7 250 772 629 485 439 99 -95 12 -369 -327 31 -210 -363 -420 -382 -88 190 28 150 242 403
5400D03l4K4j60l65J77q3j56j12k59oJ63L30K84J0o0k38J62L99J04j14k3l64r
$$ 403 369 393 233 -132 45 -38 -194 -306 -565 -571 -408 -78 206 216 156 -82 80 479 583 469 446 82 73
5423G3j26l83q1L5K17j14o7l0L02J41J77J59j1N3M9j6k02j65O0j13l07J18l6k90
$$ 73 -53 -436 -517 -482 -265 -379 -446 -476 -174 -33 144 303 292 345 394 378 176 11 71 -42 -349 -231 -267 -557
5447e57K92%K17J00O0K53j40J0J16J34rl55j69j04j16K89m66j64K05j63J96J41
$$ -557 -265 -265 -48 52 112 365 225 235 351 485 476 121 -48 -152 -268 21 -445 -609 -404 -567 -371 -230
5469b30Q3N13pr8J65q3j61O9m0r7j25k93m5j63p2PJ37L23K7K27L45j9j13L57j60
$$ -230 -147 366 359 261 426 343 182 251 211 114 -11 -304 -349 -512 -584 -577 -440 -117 -90 137 482 463 350 707 547
5494E47O8l38k17k27j08k70J87J73l21m6LM21M91J51K9Q8l73l5j7K82k02j40k68
$$ 547 615 277 60 -167 -275 -545 -358 -185 -506 -552 -549 -128 363 514 543 631 258 223 206 488 286 146 -122
5517a22k43j89j28R0J66n4P9K07M60l0L23k08J42k5N2J59o26k31M8q8M2j34k44
$$ -122 -365 -554 -682 -592 -426 -480 -401 -194 266 236 559 351 493 468 520 679 53 -178 -130 -218 -176 -310 -554
5540e54r6L31k34J57O30K83j16K7J63l21K1p2L0k34m28j68j21J00J52mk6M00J78
$$ -554 -650 -319 -553 -396 234 517 401 428 591 270 291 219 249 15 -413 -581 -702 -602 -450 -454 -480 -80 98
5563I8N5K55K12j27K20l67j35K29n37N9k22l29Q5m3j23L44jK39L41j04K93K97
$$ 98 153 408 620 493 713 346 211 440 -97 -38 -260 -589 -504 -547 -670 -326 -327 -88 253 149 442 739
5585G39j21j13k2q5k54r5k01l67l2O5j04J01K7J87J61J65J81L88r0M0J52k20j88
$$ 739 618 505 483 398 144 49 -152 -519 -551 -486 -590 -489 -462 -275 -114 51 232 620 530 570 722 502 314
5608C14k20j51l9l19j47k25N9O7J73J94J55J81L27J49J46k53K04J03k08m2m44
$$ 314 94 -57 -96 -415 -562 -787 -728 -661 -488 -294 -139 42 369 518 664 411 615 718 510 468 24
5629B4l57k29j17J1J23J1J63P1J89K33K57L82k05J86k85R9j58n00k04M3j4k43
$$ 24 -333 -562 -679 -668 -545 -534 -371 -300 -111 122 379 761 556 742 457 556 398 -102 -306 -263 -277 -520
5651e20j12j48L46Q5L80J24J03K43m7K64k99L72l83j35k10k12m92J45q8L18j18
$$ -520 -632 -780 -434 -349 31 155 258 501 454 718 419 791 408 273 63 -149 -641 -496 -584 -266 -384
5672c84l42K80L99L30K14M3K84k59j28Mk16Mk34k55m06kr8J73M1J62L01K61O9
$$ -384 -726 -446 -47 283 497 540 824 565 437 441 225 229 -5 -260 -666 -668 -766 -593 -552 -390 -89 172 241
5695B41O1L03M7k22L54k15j06k76m62j49k2J55j8m3j39J81m9M01M44J20L6j28
$$ 241 302 605 652 430 784 569 463 187 -275 -424 -446 -291 -309 -352 -491 -310 -359 42 486 606 642 514
5717E14k64J50K01l26j8o16j00k32j55L13J96J11j80K43J57J67J94M08K2l75J11
$$ 514 250 400 601 275 257 -359 -459 -691 -846 -533 -337 -226 -406 -163 -6 161 355 763 785 410 521
5738E21o5j47m53Q9l71J42l51j0K37j19L53J33K45J55j4L01m6k66r7K14l23j47
$$ 521 456 309 -144 -55 -426 -284 -635 -645 -408 -527 -174 -41 204 359 345 646 600 334 237 451 128 -19
5760a9j87l71j82K22N6J27J31j18M1K33K88L47j05m8K04k46m8k55l2m47k17J65
$$ -19 -206 -577 -759 -537 -481 -354 -223 -341 -300 -67 221 568 463 415 619 373 325 70 38 -409 -626 -461
5782d61l36M98j41M3L52K26J16K00m0m8J91l11q4J83k46j0l03o44J19J94L28P
$$ -461 -797 -299 -440 -397 -45 181 297 497 457 409 600 289 205 388 142 132 -171 -815 -696 -502 -174 -167
5804a67K3j11K55L86J18r0L7j83j5m2j24O2k80j58k13J61k56J12N82k06M8O8K59
$$ -167 -144 -255 0 386 504 414 451 268 253 211 87 149 -131 -289 -502 -341 -597 -485 97 -109 -61 7 266
5827B66K10Kj90o9J81N9j95l83k22P4j98j75K76M35k63k65N60J30j37K71L53n19
$$ 266 476 478 288 219 400 459 264 -119 -341 -267 -465 -640 -364 71 -192 -457 103 233 96 367 720 201
5849B01M1j46L7j52J01k51k61j08P8K0RK74P3K34q5q7K74j3K17j07k7k11k75J66
$$ 201 242 96 133 -19 82 -169 -430 -538 -460 -440 -431 -157 -84 150 65 -22 252 239 456 349 322 111 -164 2
5873Bk21q1m2N5J09N4k59J40J24J74L71R1k43j00r4o5J06l2j32k09l30J52K12
$$ 2 -219 -300 -342 -287 -178 -124 -383 -243 -119 55 426 517 274 174 80 15 121 89 -43 -252 -582 -430 -218
5896b18M1J01J86n3L1oj51K39K39j08K2k44Qm68J90j45QJ12R1J97p7K0J74j49
$$ -218 -177 -76 110 57 88 82 -69 170 409 301 323 79 87 -381 -191 -336 -328 -216 -125 72 -5 15 189 40
5920D0L18K00l41Q6n91M02J14j85r9j09j01K7j18L79j24k7J37N7O4j24O4J88k74
$$ 40 358 558 217 303 -288 114 228 43 -56 -165 -266 -239 -357 22 -102 -129 8 65 129 5 69 257 -17
5943a7J27J1l35N1OK59j81O5j02J59j38J96N0l8K3l53M24r4M2l00q9K90r0k4J10
$$ -17 110 121 -214 -163 -157 102 -79 -14 -116 43 -95 101 151 113 136 -217 207 113 155 -145 -234 56 -34 -58 52
5968E2l97L54k05K90nmj29m0J76k54J79J09j97J68j30j89j78M38k2J9l41r1M75
$$ 52 -345 9 -196 94 89 85 -44 -84 92 -162 17 126 -71 97 -33 -222 -400 38 16 35 -306 -397 78
5991G8J03L22m56J45k33Q6J04K29m48j5o6k36N0L90j44PK33J09n8J21N2k02k86
$$ 78 181 503 47 192 -41 45 149 378 -70 -85 -151 -387 -337 53 -91 -84 149 258 200 321 373 171 -115
6014a15J85J0j66Q1j20K7k25p8J45J83K02k22O7K05K48jLM8n56J17r1RO0j25j83
$$ -115 70 80 -86 -5 -125 -98 -323 -401 -256 -73 129 -93 -26 179 427 426 429 477 -79 38 -53 -44 16 -109 -292
6039b92R5j2j8P5K10M44q8M4j33j20J25j94j04J20l13O7r7k64L38k18K1K35QJ38
$$ -292 -197 -209 -227 -152 58 502 414 458 325 205 330 136 32 152 -161 -94 -191 -455 -117 -335 -314 -79 -71 67
6063F7J99q2Q8K69k11j05l3k36j91J37l43K38p9K07k53r9M98k58L42qM59j99j8
$$ 67 266 184 272 541 330 225 192 -44 -235 -98 -441 -203 -282 -75 -328 -427 71 -187 155 147 606 407 389
6086C89p2K73l87N2k79k97l0R7j11K71j12j37M53o2J05J01R2j06J63R9k28j80
$$ 389 317 590 203 255 -24 -321 -351 -254 -365 -94 -206 -343 110 48 153 254 346 240 403 502 274 94
6108I4n5m99K45p0j78J21l23L60P2M03R8m5K0j0R6o0m7K95l79J5m22q1j38j76
$$ 94 39 -460 -215 -285 -463 -342 -665 -305 -233 170 268 223 243 233 329 269 222 517 138 153 -269 -350 -488 -664
6132f64K65j02K33p2L11p4J07M72m5K21n3l06n9k19Nl78R8J51k77k93L3K58R4
$$ -664 -399 -501 -268 -340 -29 -103 4 476 431 652 599 293 234 15 20 -358 -260 -109 -386 -679 -646 -388 -294
6155b94L11K10L8J83j42j6M33j92l15j71l37n7j82M0n9K54Q4m2K34J08J91P6K87
$$ -294 17 227 265 448 306 290 723 531 216 45 -292 -349 -531 -491 -550 -296 -212 -254 -20 88 279 355 642
6178F42l15J92J11j75l08j27Nm34k5k84J29J2K67kM19Q1J15P1J72j38R6K41o6
$$ 642 327 519 630 455 147 20 25 -409 -434 -718 -589 -577 -310 -312 107 188 303 374 546 408 504 745 679
6201F79n53j90l14L3j80M4kj49O2N14Q4J76kL95J60j58Q4j72l0k64l15j39o7l07
$$ 679 126 -64 -378 -345 -525 -481 -483 -632 -570 -56 28 204 202 597 757 599 683 511 481 217 -98 -237 -304 -611
6225f11p0J14k5N95k27L16J22M1K69J61L8m6j5m30j95k33k05n2J70l05k13L17
$$ -611 -681 -567 -592 3 -224 92 214 255 524 685 723 677 662 232 37 -196 -401 -453 -283 -588 -801 -484
6247d84m3M17K55p6M03J90m3Q9P3m44j87l8q0l80o0m1l47K27k11N33K67J94M0
$$ -484 -527 -110 145 69 472 662 619 708 781 337 150 112 32 -348 -408 -449 -796 -569 -780 -247 20 214 254
6270B54J08L24K9l1J60j86m42j46m69M8j85J51j64j51l2M14Q3L71M56pM4J81k65
$$ 254 362 686 715 684 844 658 216 70 -399 -351 -536 -385 -549 -700 -732 -318 -235 136 592 585 629 810 545
6293E45K13k30l06l40P6n81r5J08k89M11j16L42J74L99r0K13J22O7m80M64k22
$$ 545 758 528 222 -118 -42 -623 -718 -610 -899 -488 -604 -262 -88 311 221 434 556 623 143 607 385
6314C85j76n24l9Pj06P9j85oJ71M9L2M00L45L3R5p1K32k47j86p8n24q1j69j23
$$ 385 209 -315 -354 -347 -453 -374 -559 -565 -394 -345 -313 87 432 465 560 489 721 474 288 210 -314 -395 -564 -687
6338f87R0Qq3J69J76M54K45J66J41o1j13j20m2j80j62j46j77r0j56m6q2N6N74
$$ -687 -597 -589 -672 -503 -327 127 372 538 679 618 505 385 343 163 1 -145 -322 -412 -568 -614 -696 -640 -66
6361f6P4k5L4L67j03L06K9j08J51n10j85Nl81j89J35L4j82o5K56J55J71L58L43
$$ -66 8 -17 17 384 281 587 616 508 659 149 -36 -31 -412 -601 -466 -432 -614 -679 -423 -268 -97 261 604
6384F04qj46j83L73j61k00j33l11J5k01k42n7j16K35J77M37J08r9J78L86j50J29
$$ 604 596 450 267 640 479 279 146 -165 -150 -351 -593 -650 -766 -531 -354 83 191 92 270 656 506 635
6406F35qk00j58k78k79N1k33Q0j61J70m0J81J84K99N48k42l8J54k43k3J58l17
$$ 635 627 427 269 -9 -288 -237 -470 -390 -551 -381 -421 -240 -56 243 791 549 511 665 422 399 557 240
6428B40k36q7J20n56P0J01N6OK36m7J38j29K95q1K83j03K48k76k61Rj63o7k77
$$ 240 4 -83 37 -519 -449 -348 -292 -286 -50 -97 41 -88 207 126 409 306 554 278 17 26 -137 -204 -481
6451d81J82k76J96K27J99J2J90K7J11M45o76J29K47j48j77k32k25l91K79jK68
$$ -481 -299 -575 -379 -152 47 59 249 276 387 832 156 285 532 384 207 -25 -250 -641 -362 -363 -95
6472i5k03k7J23jK65J46J62j07L80l07k97O3j73PNk6j09k19j65K95K57K11O4J54
$$ -95 -298 -325 -202 -203 62 208 370 263 643 336 39 102 -71 -64 -59 -85 -194 -413 -578 -283 -26 185 249 403
6496D03n9l67L68j89Q6JJ10m04j82r3m9K50O5j18J17j14P3J16L96k20P1J19P4
$$ 403 344 -23 345 156 242 243 353 -51 -233 -326 -375 -125 -60 -178 -61 -175 -102 14 410 190 261 380 454
6519D54m43P2o7pJ37m13j6N1j69L17M3p8O3J95R8N1o2k13R9K58k43k50j87j31
$$ 454 11 83 16 9 146 -267 -283 -232 -401 -84 -41 -119 -56 139 237 288 226 13 112 370 127 -123 -310 -441
6543d41L57j45K35j77J70j93j24J95K47P6j13L9j89K77l36j5L12q8o0pl22M04
$$ -441 -84 -229 6 -171 -1 -194 -318 -123 124 200 87 126 -63 214 -122 -137 175 87 27 20 -302 102
6565A02l43L15o2k25L27N2k25R2m4K86l40K2K0o0r5J58K8k17M19n9k17kJ57k7
$$ 102 -241 74 12 -213 114 166 -59 33 -11 275 -65 -43 -23 -83 -178 -20 8 -209 210 151 -66 -68 89 62
6589F2Q2j42O9n7k2K4K18m1j35j52J50J58k23OJ35n9Jp5k28J58m8j7K3N4l7j31
$$ 62 144 2 71 14 -8 16 234 193 58 -94 56 214 -9 -3 132 73 74 -1 -229 -71 -119 -136 -113 -59 -96 -227
6615b27L28lmK6k24rr1J5L55j44J70j25pl0l34P4J04J24J6k42J46J90k7k02L26
$$ -227 101 98 94 120 -104 -113 -204 -189 166 22 192 67 60 30 -304 -230 -126 -2 14 -228 -82 108 81 -121 205
6640B05jj05p6k0l9K62j51m8k64J85n8M5m8K95l57J25O6J70jL8r1L0q1k84J13
$$ 205 204 99 23 3 -36 226 75 27 -237 -52 -110 -65 -113 182 -175 -50 16 186 185 223 132 162 81 -203 -90
6665i0j07R1m16M88j97R5J13M1l3k94L12N57k99J43q3m3m62J47N4J98l82j69K2
$$ -90 -197 -106 -522 -34 -231 -136 -23 18 -15 -309 3 560 261 404 321 278 -184 -37 17 215 -167 -336 -314
6688c14j47J56J15J41J07j67J41J55J05Q0q4J65n11M9k72J23J3r4j15J23K50k94
$$ -314 -461 -305 -190 -49 58 -109 32 187 292 372 288 453 -58 -9 -281 -158 -145 -239 -354 -231 19 -275
6710b75L1L56rK30L0q0R4j39J21k74K3l09J22k29l5N4k03M53J09J10l34jL01J5
$$ -275 -244 112 103 333 363 283 377 238 359 85 108 -201 -79 -308 -343 -289 -492 -39 70 180 -154 -155 146 161
6734A61L23L5J00k68k76o6k48j94L0J65j25J92l04J71K47K47k87L52J79r0j48
$$ 161 484 519 619 351 75 9 -239 -433 -403 -238 -363 -171 -475 -304 -57 190 -97 255 434 344 196
6755A96K17l83L31l81j91P2o9k08j59q0K35M80L5p6K17k6L65q0j35q9N7j69k76
$$ 196 413 30 361 -20 -211 -139 -208 -416 -575 -655 -420 60 95 19 236 210 575 495 360 271 328 159 -117
6778a17n0k61N5m3J02P5J7j01J85L30k2J91k39K27J27l12K95n10r8K6j30j36o0
$$ -117 -167 -428 -373 -416 -314 -239 -222 -323 -138 192 170 361 122 349 476 164 459 -51 -149 -123 -253 -389 -449
6801d49k94K98J63J89K7L1L47J14K62k20L3nk92j86j15j34n6j26k20M7K35K05
$$ -449 -743 -445 -282 -93 -66 -35 312 426 688 468 501 496 204 18 -97 -231 -287 -413 -633 -586 -351 -146
6823a46k85L24K56J98k1j0K04m3k74q6J30k64j8m99q9L61k48K19J0J98J3N0M84
$$ -146 -431 -107 149 347 326 316 520 477 203 117 247 -17 -35 -534 -623 -262 -510 -291 -281 -83 -70 -20 464
6846D64j98K69m1K7l19k80Q9j22j17j09j48k59J11K75J69J45L06J03j52K17J35
$$ 464 266 535 494 521 202 -78 11 -111 -228 -337 -485 -744 -633 -358 -189 -44 262 365 213 430 565
6867E65J31K1j74l32k88j89k04q4K9R5m3Q1K18l6J24L43L61R8j46j34K1j62K8
$$ 565 696 717 543 211 -77 -266 -470 -554 -525 -430 -473 -392 -174 -210 -86 257 618 716 570 436 457 295 323
6890C23l35j82M6k61l72J92J20J79L26l49N89K8K53j14N00n75K06k43j40j86m44
$$ 323 -12 -194 -148 -409 -781 -589 -469 -290 36 -313 276 304 557 443 943 368 574 331 191 5 -439
6911d39pl0k8j75j9J37J99L53K42J27J08K61r8M2j61j55j96J18l77k58o2q4J11
$$ -439 -446 -476 -504 -679 -698 -561 -362 -9 233 360 468 729 631 673 512 357 161 279 -98 -356 -418 -502 -391
6934c91k04L03k5L35O2K88P4K25j55j08j63L9k32M4j19k34k44j13l2N0K03K47
$$ -391 -595 -292 -317 18 80 368 442 667 512 404 241 280 48 92 -27 -261 -505 -618 -650 -600 -397 -150
6956a50J33K50R1J72J08K4q3j57K8k74j70j74jo13J27L97k62J85K27K12J12K89
$$ -150 -17 233 324 496 604 628 545 388 416 142 -28 -202 -203 -816 -689 -292 -554 -369 -142 70 182 471
6978D71p6R9J24k70o7k94m1p7j09k10j74RJ73O8J42J93n0K44j6K50m2M0M6k19
$$ 471 395 494 618 348 281 -13 -54 -131 -240 -450 -624 -615 -442 -374 -232 -39 -89 155 139 389 347 387 433 214
7002B14J13l32j21J46l79j25K6K51l93M97N0K76O1j46L24P8j13jk73J27k12j3
$$ 214 327 -5 -126 20 -359 -484 -458 -207 -600 -103 -53 223 284 138 462 540 427 426 153 280 68 55
7024E5j37k39J27k62r3J85K8K05J68J20K09j18K93j51O7m04J8qj18k7k95oj71
$$ 55 -82 -321 -194 -456 -549 -364 -336 -131 37 157 366 248 541 390 457 53 71 63 -55 -82 -377 -383 -554
7047e54J49j1J44N5L37J56MJ14J88Oj32j69k00m2L8j30m81K9Q7p4J73Q4J13J84
$$ -554 -405 -416 -272 -217 120 276 280 394 582 588 456 287 87 45 83 -47 -528 -499 -412 -486 -313 -229 -116 68
7071F8j31L56MK88j69k30j25J23j23k40M6l10M7o0J65Q9K2K85r9K83P1j34J98
$$ 68 -63 293 297 585 416 186 61 184 61 -179 -133 -443 -396 -456 -291 -202 -180 105 6 289 360 226 424
7094D24k18L21j99j57l30R3j33l28J70%K56J36r2J3J25m3J19K85k68J24j75O0
$$ 424 206 527 328 171 -159 -66 -199 -527 -357 -357 -101 35 -57 -44 81 38 157 442 174 298 123 183
7116A83k23l1J14k90j20pq9M21j00Q9j9K84K5J73n5p1N%j60K21k51j20k9j91J39
$$ 183 -40 -71 43 -247 -367 -374 -463 -42 -142 -53 -72 212 237 410 355 284 289 289 129 350 99 -21 -50 -241 -102
7141a02k44J55K73j19J71j83P3L61Nj66j33P6k80J93Q5j63r8nq9j88J48K25k59
$$ -102 -346 -191 82 -37 134 -49 24 385 390 224 91 167 -113 80 165 2 -96 -101 -190 -378 -230 -5 -264
7164b64K78k5N2J8l6J80R6J15j39k00j54K8J87p4k66PJ57o8N7J46k05K94k25K46
$$ -264 14 -11 41 59 23 203 299 414 275 75 -79 -51 136 62 -204 -197 -40 -108 -51 95 -110 184 -41 205
7188B05O0l7J39m92M59l96J67j54k29P2J57j84J46P9q5K36j1j43o1L91n5r0l8
$$ 205 265 228 367 -125 334 -62 105 -49 -278 -206 -49 -233 -87 -8 -93 143 132 -11 -72 319 264 174 136
7211A36j93p0J93j43Nj78J24k10K35m7K8J15kQ0j22L03j43j16L32m16L43j8m20
$$ 136 -57 -127 66 -77 -72 -250 -126 -336 -101 -148 -120 -5 -7 73 -49 254 111 -5 327 -89 254 236 -184
7234a84K67m58M18k59k2J70j55J05P9k38K73n6M51k3j92l9j40K46l11M5p0M9q4
$$ -184 83 -375 43 -216 -238 -68 -223 -118 -39 -277 -4 -60 391 368 176 137 -3 243 -68 -23 -93 -44 -128
7257a28Q1q5n0j9L05k09NK04l3J13Ml2L1l12J34Q8k11K11j28j07k57L63p7L24
$$ -128 -47 -132 -182 -201 104 -105 -100 104 71 184 188 156 187 -125 9 97 -114 97 -31 -138 -395 -32 -109 215
7281B15k03M3J64q6J80j38l5N2l36L24j26J8j99J6j13L07L0j76p9N2L4J30N7j1
$$ 215 12 55 219 133 313 175 140 192 -144 180 54 72 -127 -111 -224 83 113 -63 -142 -90 -56 74 131 120
7305A20LP0k09N9J08n0j3n3Nl15R1m3R7R3o6n6j98N03J34l14P5L41k66l4j63J59
$$ 120 123 193 -16 43 151 101 88 35 40 -275 -184 -227 -130 -37 -103 -159 -357 146 280 -34 41 382 116 82 -81 78
7331G8j46J85k40j41j80J55k11K87L63k05L71l00K12j67J53J10n3L7m00Q1j31
$$ 78 -68 117 -123 -264 -444 -289 -500 -213 150 -55 316 16 228 61 214 324 271 308 -92 -11 -142
7352a42j08oK12r2N2j13K75j85Q9L25J98o3k06R7l60L38k01o6j59J14k61k2J97
$$ -142 -250 -256 -44 -136 -84 -197 78 -107 -18 307 505 442 236 333 -27 311 110 44 -115 -1 -262 -284 -87
7375h7l48K38J3J66p8Q9pk4K75R0n5R2l90l3K36m15qJ13j68j85R9L01R4R3MP7
$$ -87 -435 -197 -184 -18 -96 -7 -14 -38 237 327 272 364 -26 -59 177 -238 -246 -133 -301 -486 -387 -86 8 101 105 182
7401A82O0l4K23k27P7O2j92J4n78L74k38k69L85k08J45k1L05j93J47L73j96L43
$$ 182 242 208 431 204 281 343 151 165 -413 -39 -277 -546 -161 -369 -224 -245 60 -133 14 387 191 534
7423E34k43k41L5K1k48J89k46q0j35J45k64L21J96p8L09l23L14J2oRK76nn76R6
$$ 534 291 50 85 106 -142 47 -199 -279 -414 -269 -533 -212 -16 -94 215 -108 206 218 212 221 497 492 -84 12
7447A2rk59j95M02k43K45n3N7l7Q8K40R1m6N6j92Q1Q5k21oj26k06q7n4jJ34K21
$$ 12 3 -256 -451 -49 -292 -47 -100 -43 -80 8 248 339 293 349 157 238 323 102 96 -30 -236 -323 -377 -378 -244 -23
7473b3j04J85n4J78Q7pJ85m79M94l31k49K12j49m56K50k79J99J57j92J39M76J03
$$ -23 -127 58 4 182 269 262 447 -32 462 131 -118 94 -55 -511 -261 -540 -341 -184 -376 -237 239 342
7495C42k92m1K19J4P9k3j0k92j7j33o7P7j11j55J80o0J07L8L04J65nJ80j96R3
$$ 342 50 9 228 242 321 298 288 -4 -21 -154 -221 -144 -255 -410 -230 -290 -183 -145 159 324 319 499 303 396
7519C96J24l36l8r9j0k17p0o8k22L91J64l48L90J62j77J65K64Pp9l94L3J19k41
$$ 396 520 184 146 47 37 -180 -250 -318 -540 -149 15 -333 57 219 42 207 471 478 399 5 38 157 -84
7542h4q6j63r1M6L9J2j88J42M34J36J63p4k6j40J29K7j16p7k3j07j42j77j80L30
$$ -84 -170 -333 -424 -378 -339 -327 -515 -373 61 197 360 286 260 120 249 276 160 83 60 -47 -189 -366 -546 -216
7566b16n6N6o7M65R2J73k02Q0k5j91L00l08Q2j22k47n7j7o3R5k62J08M52j27J80
$$ -216 -272 -216 -283 182 274 447 245 325 300 109 409 101 183 61 -186 -243 -260 -323 -228 -490 -382 70 -57 123
7590A23L32j78q1l4j41O0J09j03j66Q5n49J31K26n4K42k89oL66r7k9L35J07P2
$$ 123 455 277 196 162 21 81 190 87 -79 6 -543 -412 -186 -240 2 -287 -293 73 -24 -53 282 389 461
7613D61j61l2j98J04k83J29n7k89L16j99m0L41m15K39Q9M71k58o8K36q9l14J50
$$ 461 300 268 70 174 -109 20 -37 -326 -10 -209 -249 92 -323 -84 5 476 218 150 386 297 -17 133
7635A33J06m09J32r8l92K08K05k6J23k34L01j06L28N2qk26k5K34N4l08O0k35j80
$$ 133 239 -170 -38 -136 -528 -320 -115 -141 -18 -252 49 -57 271 323 315 89 64 298 352 44 104 -131 -311
7658c11q5j7J15J20j49L06J69m0J14k74N22k87J81q4l3k89J11l23J79k27n7L05
$$ -311 -396 -413 -298 -178 -327 -21 148 108 222 -52 470 183 364 280 247 -42 69 -254 -75 -302 -359 -54
7680e4jP2k09J61o7M78j14j22O0q8J16J53p9k02k86j59j27j03J71J33J34k1J98
$$ -54 -55 17 -192 -31 -98 380 266 144 204 116 232 385 306 104 -182 -341 -468 -571 -400 -267 -133 -154 44
7703D4j46K54o3L79k59O2j57j77L43j22p5k21k79J41k62L18J24K39r3l7k63J94
$$ 44 -102 152 89 468 209 271 114 -63 280 158 83 -138 -417 -276 -538 -220 -96 143 50 13 -250 -56
7725e6M39r6q3j62K9J83l94J63j86j23P2K19k93K04j50J12jJ43k31M67j39K2J47
$$ -56 383 287 204 42 71 254 -140 23 -163 -286 -214 5 -288 -84 -234 -122 -123 20 -211 256 117 139 286
7748B86j75k24J2J9l5k48J65n5k07L29j8L27k60J73J11j49J63P2k25J33q4j83
$$ 286 111 -113 -101 -82 -117 -365 -200 -255 -462 -133 -151 176 -84 89 200 51 214 286 61 194 110 -73
7770g3o4Q1k4l26J59l0J82J1K45k24N4KK39r2K20l65J76P6k69j00K24k51k17R0
$$ -73 -137 -56 -80 -406 -247 -277 -95 -84 161 -63 -9 -7 232 140 360 -5 171 247 -22 -122 102 -149 -366 -276
7794b76R4j67L03K9j05J28K68q4J4J0Q6k3l00n8J77k42J79m22J36J02K0J55j65
$$ -276 -182 -349 -46 -17 -122 6 274 190 204 214 300 277 -23 -81 96 -146 33 -389 -253 -151 -131 24 -141
7817a41K22k33L55P1l3MO9k68L9l17J48k3j02Ln0%K46k03J21J60P5l28L19K0J38
$$ -141 81 -152 203 274 241 245 314 46 85 -232 -84 -107 -209 -206 -256 -256 -10 -213 -92 68 143 -185 134 154 292
7842B92k07j59J93r9J9m08J61K17j31j9p8J43j92J18J17K42p3L6o2J13j00j3j19
$$ 292 85 -74 119 20 39 -369 -208 9 -122 -141 -219 -76 -268 -150 -33 209 136 172 110 223 123 110 -9
7865iK3K6m57J39J48j6l7l05K56J58K56RJ37k40K44j11j29J03J45k18m31J70J0
$$ -9 14 40 -417 -278 -130 -146 -183 -488 -232 -74 182 191 328 88 332 221 92 195 340 122 -309 -139 -129
7888a29N8q3M7q1lnK28j07K67J12M8j04Lk78L6J30K5l07k1K26n7k82K42q2K26
$$ -129 -71 -154 -107 -188 -191 -196 32 -75 192 304 352 248 251 -27 9 139 164 -143 -164 62 5 -277 -35 -117 109
7913A09j75K75N8J24l21k43M96N1j06j51k18J17r9j38P9J33k23k9L72j35J53m6
$$ 109 -66 209 267 391 70 -173 323 374 268 117 -101 16 -83 -221 -142 -9 -232 -261 111 -24 129 83
7935H3P6j47J50J25k45J71l00P2k39R8m9J72J35j52K76k70J45j52K30l27M34l10
$$ 83 159 12 162 287 42 213 -87 -15 -254 -156 -205 -33 102 -50 226 -44 101 -51 179 -148 286 -24
7957b4O9J50j5r8Lk51J97k70J91j44j17J77j14L15J49j07J26K14k16l8p9L35q9
$$ -24 45 195 180 82 85 -166 31 -239 -48 -192 -309 -132 -246 69 218 111 237 451 235 197 118 453 364
7980C64k29j29L7j46K5j33J12J20j85P8K7J3K67j88L8J65j01j29M9K32l87j82
$$ 364 135 6 43 -103 -78 -211 -99 21 -164 -86 -59 -46 221 33 71 236 135 6 55 287 -100 -282
8002b82K84j54K26J51l42N1J45n5j73M71Rj34r9J66Q3k20j01K31m80L01j91P3
$$ -282 2 -152 74 225 -117 -66 79 24 -149 322 331 197 98 264 347 127 26 257 -223 78 -113 -40
8024d0J17k70J4K40N6j99K09L8p0L9j75J30j62j18N22l32j06k42L22q4K2j65J81
$$ -40 77 -193 -179 61 117 -82 127 165 95 134 -41 89 -73 -191 331 -1 -107 -349 -27 -111 -89 -254 -73
8047g3J73q6P6MQ4K1q2Q4O8m2j95j20M5J15l61K62j28j9J48P7j2J03k9q0m6Q9
$$ -73 100 14 90 94 178 199 117 201 269 227 32 -88 -43 72 -289 -27 -155 -174 -26 51 39 142 113 33 -13 76
8073G6O1O6l18J35J33j57Q8k23n5K4J87l05J74J65O4O1J3j22K82l39O5R3j13J9
$$ 76 137 203 -115 20 153 -4 84 -139 -194 -170 17 -288 -114 51 115 176 189 67 349 10 75 168 55 74
8097G4o7j04l3M0J63j57k7K13j29J41k35M67l0l04J63q8p3J3J16n3n3k58J74l13
$$ 74 7 -97 -130 -90 73 -84 -111 102 -27 114 -121 346 316 12 175 87 14 27 143 90 37 -221 -47 -360
8121c60K32N8m2lL53m23L99k03J1O7j51J78j82J65J49l18k65J78mM1Q5q5L3J71
$$ -360 -128 -70 -112 -115 238 -185 214 11 22 89 -62 116 -66 99 248 -70 -335 -157 -161 -120 -35 -120 -87 84
8145H4j03K15q4k03k3M69k62N8l38L34l89J20Q9j66p1J54J83k15J3K51J48m17
$$ 84 -19 196 112 -91 -114 355 93 151 -187 147 -242 -122 -33 -199 -270 -116 67 -148 -135 116 264 -153
8167a53K10P6J40k76K53J15n8k07k11oj09L17K04k80j41l5K33k1J44J7J57m52
$$ -153 57 133 273 -3 250 365 307 100 -111 -117 -226 91 295 15 -126 -161 72 51 195 212 369 -83
8189h3K38j40
$$ -83 155 15
8191A5
$$ Imaginary data points
##PAGE= N=2
##DATA TABLE= (X++(I..I)), XYDATA
0@%%%%%%%%%%Qj3J3j6J6k4L2m0N3o1P2q8J04j25J49j74K04k36K71l11L56m07M63
$$ 0 0 0 0 0 0 0 0 0 0 0 8 -5 8 -8 8 -16 16 -24 29 -32 40 -48 56 -69 80 -94 110 -126 145 -166 190 -217 246
33B46n26N96o72P56q51R51j061J182j312J459j618J791j980K187k410K658k931
$$ 246 -280 316 -356 400 -451 500 -561 621 -691 768 -850 941 -1039 1148 -1262 1396 -1535
50a535L227l555L918m323M774n279N850o506P264q153R210j0488J2086j4138J6887
$$ -1535 1692 -1863 2055 -2268 2506 -2773 3077 -3429 3835 -4318 4892 -5596 6490 -7648 9239
65I239k0784K6781l7337O1400k21449n347L44221r0528l20195l27926O8555L66272
$$ 9239 -11545 15236 -22101 39299 -182150 -187497 156724 66196 -253999 -581925 -513370 -147098
77a47098M12619J47861p7292j70153q5019N220Q6820P7900Q413j30686k11489
$$ -147098 265521 413382 336090 165937 80918 86138 172958 250858 259271 128585 -82904
88h2904j91164o0211N5675J00578N2271l281j5571M7168J14141J18966M1069j9211
$$ -82904 -274068 -334279 -278604 -178026 -125755 -129036 -144607 -97439 16702 135668 176737 157526
100A57526P755Q5862P3113o8276k20429k14149n0670J12448J19997j5779j57706
$$ 157526 165281 251143 324256 255980 35551 -178598 -229268 -116820 3177 -12602 -170308
111a70308j73649m1277J53764K71126K17290K6240j41014j44558R02J42226J47720
$$ -170308 -343957 -385234 -231470 39656 256946 283186 142172 -2386 -1484 140742 288462
122B88462K3988j24403k05507j86611q1649N5191J34782Q9360m4763j34124p7183
$$ 288462 312450 188047 -17460 -204071 -285720 -230529 -95747 -6387 -51150 -185274 -262457
133b62457Q6084K09094J86418M8624p9365r9487k1368N7573M9018m1211j21539
$$ -262457 -176373 32721 219139 267763 188398 88911 67543 125116 174134 132923 11384
144A1384j13051l7686J4441l365m3440l1258L6316R2397R0197M9727J9812J4237
$$ 11384 -101667 -139353 -124912 -128277 -171717 -202975 -166659 -74262 15935 65662 85474 99711
156I9711J7799K1149K4446J6937k0882p9385j15764r4911l1499K4963L8683Q929
$$ 99711 117510 138659 163105 180042 159160 79775 -35989 -130900 -162399 -137436 -98753 -89824
168h9824l0279l9255N498Q5164J37161J09590J7254n9332n8942O09M2155J5629
$$ -89824 -120103 -159358 -153860 -68696 68465 178055 195309 135977 77035 77644 119799 135428
180A35428n2320r7202q5747l8538R13R537J739M950K7397N1572N3433L6637K2581
$$ 135428 83108 -14094 -99841 -138379 -137466 -127929 -126190 -121240 -93843 -42271 11162 47799 70380
193G0380K6805L2832J6068j8076l9817l5585k7940m0191n7275m6679o618K4742
$$ 70380 97185 130017 146085 128009 88192 52607 24667 -15524 -72799 -119478 -126096 -101354
205a01354K0869m608r155K2371O1429P2736M8925J0981j5032j9914j0776l911
$$ -101354 -80485 -85093 -94248 -71877 -10448 62288 111213 122194 107162 87248 76472 72561
217G2561j2281l1781m5705m2368k7444j7160j1133L090K7752M6549M0926J6893
$$ 72561 60280 28499 -17206 -59574 -87018 -104178 -115311 -112221 -84469 -37920 3006 19899
229A9899o18Q761L3367M4767K4542j6714n0440n4878l2526p831q52j3032k3733
$$ 19899 19281 28042 61409 106176 130718 114004 63564 8686 -23840 -31671 -32523 -45555 -69288
242f9288j9623n841P699K2005L9748N1070L9334P996j5355q400J5220K1857k796
$$ -69288 -88911 -94752 -87053 -65048 -25300 25770 65104 73100 57745 49345 64565 86422 83626
255H3626l7525m9606l5164j5118p476r466q196J980J7342K7401K6319J6423R245
$$ 83626 46101 -3505 -38669 -53787 -61263 -70729 -78925 -76945 -59603 -32202 -5883 10540 19785
268A9785J4339K6575K9162J0130k2237m5359m1631j6845N802Q130j0000l1069
$$ 19785 34124 60699 89861 99991 77754 32395 -9236 -26081 -20279 -12149 -22149 -53218
280e3218l4142j1313K4759N0226M8820K3614n517j8172r012J4298L1564K4035
$$ -53218 -87360 -98673 -73914 -23688 25132 48746 43229 25057 16045 30343 61907 85942
292H5942j1682n0833o0195l0850J2393K9838J1784j7626k4418l267K2858L4363
$$ 85942 74260 23427 -36768 -67618 -55225 -25387 -13603 -31229 -55647 -58914 -36056 -1693
304a693K7270J4465L871j011k029k896n250j1652j6227j4230p185k820n763j2845
$$ -1693 25577 40042 43913 42902 40873 37977 32727 21075 4848 -9382 -16567 -19387 -25150 -37995
318c7995j3050NJ9293L1197K5287M917j3587j4314K811K1553K3277N043k1652
$$ -37995 -51045 -51040 -31747 -550 24737 29654 16067 1753 4564 26117 49394 54437 32785
331C2785l6498l0509q037J6130K4326Q732j6096k6865j1789J7812L5966K7594
$$ 32785 -3713 -34222 -42259 -26129 -1803 6929 -9167 -36032 -47821 -30009 5957 33551
343C3551M152j4609j5957m948N677R081L429o754j4770j4408p278J527N219M141
$$ 33551 37703 23094 7137 2189 7866 16947 20376 13622 -1148 -15556 -22834 -21307 -16088 -11947
357a1947L307M613N659L453k034l475J923Q998Q996R69r847j3698q527P82O678
$$ -11947 -8640 -4027 1632 5085 3051 -424 1499 10497 19493 20462 10615 -3083 -11610 -10828 -4150
372d150O933J642l821p927p456m16R841J4022Q652n432j4290j0040L406J2526
$$ -4150 2783 4425 604 -7323 -14779 -15195 -5354 8668 17320 11888 -2402 -12442 -9036 3490
386C490Q274l138r167n427J371L388L41n09K636O370L710l978j0512q574J29Q240
$$ 3490 11764 8626 -541 -5968 -4597 -1209 -868 -1377 1259 7629 11339 7361 -3151 -11725 -11596 -3356
402c356R267J311r241j3719n496R124J8337J2981k78j0868r026K45P518O585n52
$$ -3356 5911 7222 -2019 -15738 -21234 -12110 6227 19208 18930 8062 -964 -719 6799 13384 12832
417A2832p241j1088r776m974L086Q342N406k194o330L89J1903J7797Q605q031
$$ 12832 5591 -5497 -15273 -20247 -17161 -8819 -3413 -5607 -11937 -11548 355 18152 26757 18726
431A8726j6008n188J3638J8046r74k7147l2539j0689J8167K7026Q836j6566k4604
$$ 18726 2718 -2470 11168 29214 28240 1093 -31446 -42135 -23968 3058 11894 -4672 -29276
444b9276r174J6466L1149K7257P389j4347k2035j2355O388J7574J0838q523k6467
$$ -29276 -38450 -21984 9165 36422 43811 29464 7429 -4926 1462 19036 29874 21351 -5116
457e116k9902j4965Q198K3505J8693m32j4465p985J4183K9508K1964j577j7190
$$ -5116 -35018 -49983 -41785 -18280 413 -19 -14484 -22469 -8286 21222 43186 41609 24419
470B4419j1518N081J0120n632k7596l2036j1336J6532K4142N088j9979k3465K150
$$ 24419 12901 17982 28102 22470 -5126 -37162 -48498 -31966 -7824 -2736 -22715 -46180 -44030
483d4030L3385M3541K5876l709k4744k5118q123J4068K3958R864k3410n0649m5453
$$ -44030 -10645 32896 58772 55063 30319 5201 -2922 11146 35104 44968 21558 -29091 -74544
496g4544o504L5757M7957K0287k1055l7083j2758L2136N8733M1447n279m2231
$$ -74544 -81048 -45291 2666 22953 1898 -35185 -47943 -15807 42926 84373 79094 36863
508C6863m0464q511J9428J7705q769l2591l2104j2229J0010J8426J2606N254N873
$$ 36863 -3601 -12112 7316 25021 16252 -16339 -48443 -60672 -50662 -32236 -19630 -14376 -8503
521h503J2732J8071J3797M407l168m884l345k396m318j1069k0760k8605k3342
$$ -8503 4229 22300 36097 40504 37336 32452 29107 26711 22393 11324 -9436 -38041 -61383
534f1383Q84K7233L1678O087k4715k5794R507N0968N8295K1078k9903n2679l1347
$$ -61383 -60499 -33266 -1588 4499 -20216 -46010 -36503 14465 72760 93838 63935 11256 -20091
547b0091J1839L5973J9153k2789n4198m6550r278K7965L9182K4003o89j4157q008
$$ -20091 -8252 27721 46874 24085 -30113 -76663 -85941 -57976 -18794 5209 4520 -9637 -17645
560a7645J3054L1261L3479J4893j3342l1367k8076r351N011J483j4805k6212j9905
$$ -17645 -4591 26670 60149 75042 61700 30333 2257 -7094 -2083 -600 -15405 -41617 -61522
573f1522K317K0873J9939N568k066J0460L0369L2910R927j9473k7681j0361J1327
$$ -61522 -59205 -38332 -18393 -12825 -14891 -4431 25938 58848 68775 49302 21621 11260 22587
586B2587J1686j1507l7244m0993k0123J0043K7032K2874O813o410l894J0834K7914
$$ 22587 34273 22766 -14478 -55471 -75594 -65551 -38519 -15645 -8832 -15242 -19136 -8302 19612
599A9612L3539K1937k482k6109l3100j8915J595R745l675k6391l4795j7358J1662
$$ 19612 53151 75088 72606 46497 13397 -5518 -3923 5822 2147 -24244 -59039 -76397 -64735
612f4735L0829K7373R983j660L177J7156K3826J4423m605j6768j4874p113p159
$$ -64735 -33906 -6533 3450 1790 4967 22123 45949 60372 55767 38999 24125 17012 9853
625I853j6451k3873j8784l521P941R965N261L694Q126J5674K0424J9413J2993
$$ 9853 -6598 -30471 -49255 -52776 -44835 -34870 -29609 -25915 -17789 -2115 18309 37722 50715
638E0715L617p241j4101j4705r133m007o069j4646k2912j9804k958J6276K3368
$$ 50715 54332 47091 32990 18285 9152 5145 -924 -15570 -38482 -58286 -61244 -44968 -21600
651b1600J4829K036Q77J2149K2270J9611N173r179j3569r598o552j0119j6994
$$ -21600 -6771 -4735 -3858 8291 30561 50172 55345 46166 32597 22999 16447 6328 -10666
664a0666k0160j4238k530O589O861L367L285J0594J9486K1884J5758O830m41n673
$$ -10666 -30826 -45064 -47594 -41005 -34144 -30777 -27492 -16898 2588 24472 40230 47060 46619 40946
678D0946p916r845r204q809j2482j7710j8945j0803K777J3538J5346R598N811
$$ 40946 33030 23185 13981 5172 -7310 -25020 -43965 -54768 -51991 -38453 -23107 -13509 -7698
691g698R558J6893J9743J2288j701j0449r298m792o368j5960k3413k0402o997
$$ -7698 1860 18753 38496 50784 49083 38634 29336 24544 18176 2216 -21197 -41599 -48596
704d8596N659R158N159R99L090J1801K1414K3311J6495K346r390j2637q454l191
$$ -48596 -42937 -33779 -28620 -27621 -24531 -12730 8684 31995 48490 50836 41446 28809 20355 17164
718A7164l172r352j6925k0983j6112l236J0884J7376J3684M232Q51P449J6706
$$ 17164 13992 4640 -12285 -33268 -49380 -52616 -41732 -24356 -10672 -6440 -5589 1860 18566
731A8566J8999J0410l158j2090j2127p947o907r903j4906j3927n687L098O197
$$ 18566 37565 47975 44817 32727 20600 12653 5746 -4157 -19063 -32990 -38677 -35579 -29382
744b9382L844J685O844J4448J9389J5558O352k451p535p362l332m34l219j2245
$$ -29382 -25538 -23853 -17009 -2561 16828 32386 38738 36287 28752 21390 18058 17624 14405 2160
758B160k0147j9665q607O432J5214J2485L729k538l41J0804J9685K0247P701p914
$$ 2160 -17987 -37652 -46259 -39827 -24613 -12128 -8399 -10937 -11278 -474 19211 39458 47159 39245
772C9245j6512j3326m274l10l609j0412j4024j1288l782M105R374J0002R910R318
$$ 39245 22733 9407 5133 4823 1214 -9198 -23222 -34510 -38292 -34187 -24813 -14811 -4901 4417
786D417R340P722N135J589q3j109l520p686j1772j4167j3107q989j137N781Q395
$$ 4417 13757 21479 26614 28203 28120 27011 23491 15805 4033 -10134 -23241 -32230 -33367 -27586 -19191
801a9191N166l40Q66P920J6630J7711J0078j772j0918j2500p858j179j24m169
$$ -19191 -14025 -14365 -13499 -5579 11051 28762 38840 37068 26150 13650 5792 4613 4489 320
815C20j1455j4615r731N99R012J2211J0168O184L343L269M928O852N403N82l868
$$ 320 -11135 -25750 -35481 -34882 -25870 -13659 -3491 2693 6036 9305 14233 21085 26488 27070 23202
830B3202q106j0116j0903q367m388n20J262J52o75R22M189Q251J0973J1117P091
$$ 23202 15096 4980 -5923 -14290 -18678 -19198 -17936 -17784 -18459 -17537 -13348 -5097 5876 16993 24084
845B4084K13n078o646k956K20m67n566r530j0720p240r37M535P268O051L730J581
$$ 24084 24297 19219 12573 9617 9837 9370 3804 -5726 -16446 -23686 -24623 -20088 -12820 -6769 -3039 -1458
861a458K586N352O860N616K048j815m867o882o698n646l607j701q54j231j782
$$ -1458 1128 6480 13340 18956 21004 19189 14322 7440 742 -4904 -8511 -10212 -11066 -12297 -14079
876a4079k366L33N144J0278J0724N468o67m050k783R61L236J634l171r208j1380
$$ -14079 -16445 -16112 -10968 -690 10034 15502 14835 10785 8002 8963 12199 13833 10662 1454 -9926
891i926q247q13M877O430K383j354j880J599O508R053P423K132l002n152m326
$$ -9926 -18173 -18986 -14109 -7679 -5296 -6650 -8530 -6931 -423 8630 16053 18185 15183 10031 5705
906E705k107j820k818l765l591j431q32j389p92J971O107Q778O543J130m042m521
$$ 5705 3598 1778 -1040 -4805 -8396 -9827 -10659 -12048 -12840 -10869 -4762 4016 10559 11689 7647 3126
922C126o13M621N364Q11o691j1038r342j973N320P660M915k392o854m703K697
$$ 3126 2513 7134 12498 13309 6618 -4420 -13762 -15735 -10415 -2755 2160 -232 -7086 -11789 -9092
937i092J0263J1236M659m749q349o019O47M257L128j171n616n599l391P1K731
$$ -9092 1171 12407 17066 12317 3968 -2051 -1404 2853 5981 4810 -806 -6405 -9796 -9725 -6994
952f994L147K103J790K017J171j291j924K21L136M715J906l309o874o433j993
$$ -6994 -3847 -1744 46 2063 3234 1943 19 240 3376 8091 9997 6688 -186 -6619 -8612
967h612L289O545M093j651p609p009r67O885J0408O483k110q502q361j283P326
$$ -8612 -5323 1222 5315 3664 -3945 -10954 -11921 -5036 5372 11855 9745 1243 -7118 -8401 -1075
982a075J0305L943n516r892o975M54N735N913J939k969m955m078J07L696M842
$$ -1075 9230 13173 7657 -2235 -9210 -8756 -3021 2892 4831 1862 -3093 -7171 -7064 -3368 1474
997A474L254N37j292k601k415j437J618L996K942k9l860n407m282o28L953O035
$$ 1474 4728 5265 3973 1372 -1043 -2480 -862 3134 6076 6047 2187 -3220 -7502 -8130 -4177 1858
1013A858M066j613p188p153k63P617J0511N594l123r402p988q32P697R334L034
$$ 1858 5924 4311 -2877 -10030 -10293 -2676 7835 13429 10306 904 -7084 -7916 -219 9115 12149
1028A2149o290j0610p467M35O043O529L664k073m804m093M02N380O980M133n81
$$ 12149 5859 -4751 -12218 -11783 -5740 789 4453 2380 -2424 -6517 -6115 -735 6245 10378 9797
1043I797m108m044k740j008N38J579Q89r03l656l946k823J005N132P656N648l78
$$ 9797 5689 1645 -1095 -2103 -1565 14 903 0 -3656 -7602 -10425 -9420 -4288 3368 9016 8638
1059H638n960n982K79O485P636L086n027j0609r236k719N361Q095L750l992q287
$$ 8638 2678 -3304 -3025 3460 11096 14182 9155 -1454 -10690 -13409 -8048 47 3797 -195 -8482
1074h482m786L399R255R407M507k426n634m633K48L700K854j677n462o097l026
$$ -8482 -13268 -9869 -614 8793 13300 10874 5240 607 855 4555 7409 5732 270 -5827 -8853
1089h853j016M48J405K190L091L013J830J029N00P95K552L604K319j997p303q349
$$ -8853 -9869 -9421 -8016 -5826 -2735 278 2108 3137 3637 4432 6984 10588 12907 10910 3607 -4742
1105d742n179Q87M740L369k062o227n242P70Q643J1652P455r68p089m680J271
$$ -4742 -9921 -9034 -4294 -925 -2987 -9214 -14456 -13686 -5043 6609 14064 13096 6007 1327 2598
1120B598N921M035j995p575r044o206r00L073L763R26j170o13K586N528M739L631
$$ 2598 8519 12554 10559 2984 -6060 -12266 -13166 -10093 -6330 -5404 -6574 -7187 -4601 927 5666 9297
1136I297J423L41k51j371k579m019n358m653j595J424J605k038m664j586M120
$$ 9297 10720 11061 10810 9439 6860 2841 -2517 -7170 -8765 -7341 -5736 -7774 -12438 -14024 -9904
1151i904R901R433L831k538n080k260L188N177J854n414r988q497l544K143L380
$$ -9904 -3 9430 13261 10723 5643 3383 6571 11748 13602 8188 -1800 -10297 -13841 -11698 -8318
1166h318K237j28j181k79K571N977O834M788N86j956k487j607j289k524m334m120
$$ -8318 -6081 -6209 -7390 -7669 -5098 879 7713 12501 13087 11131 8644 7037 5748 3224 -1110 -5230
1182e230k288j249p61j415j856Q30N080Q542P653J878l303l042J369M960L605
$$ -5230 -7518 -8767 -9528 -10943 -12799 -11969 -6889 1653 9306 11184 7881 4839 6208 11168 14773
1197A4773k357p387r717o788j770K523L124Q84j367j773P07M984P122P580M617
$$ 14773 12416 5029 -4688 -11476 -13246 -10723 -7599 -6715 -8082 -9855 -9148 -4164 2958 10538 15155
1212A5155L92m139m852j649O51k46m018o025n761k710o55O85J911L946N662N220
$$ 15155 15547 11408 6556 4907 5558 5312 1294 -4731 -10492 -13202 -13857 -13172 -11261 -7315 -1653 3567
1228C567K622O46l9J726L579L368p61p258r856p490j251K259J886r53k921j533
$$ 3567 6189 6835 6796 8522 12101 15469 14708 7450 -2406 -9896 -11147 -8888 -7002 -7955 -10876 -12409
1244a2409J406M735P661Q398M897K18l872l604j697O14Q73k134n827q234o254
$$ -12409 -11003 -6268 1393 9791 14688 14906 11034 7430 5733 6347 7220 5086 -741 -8975 -15229
1259a5229j082L338M573K907J620K295L224K580K058K917L703K690j765o482p524
$$ -15229 -16311 -12973 -8400 -5493 -3873 -1578 1646 4226 6284 9201 12904 15594 13829 7347 -177
1274a77n956j214J520Q22j529m451l365Q85O085P641O585L156J38j388j146m43
$$ -177 -6133 -7347 -5827 -5005 -6534 -10985 -14350 -13465 -7380 261 6846 10002 10140 8752 7606 7163
1290G163J637J159j779o280q094n983j526K118L173J872M15L75J731M461N400
$$ 7163 8800 9959 8180 1900 -6194 -12177 -13703 -11585 -8412 -6540 -6125 -5750 -4019 442 5842
1305E842M360K419L23n60l120m314n075l095n15m25k489m332l317N43M189O453
$$ 5842 10202 12621 12944 12384 9264 4950 -125 -3220 -3735 -4160 -6649 -10981 -14298 -13755 -9566 -3113
1321c113N816L513J291j96M69J329J625L97k656m798o233n710l007K06J944J235
$$ -3113 2703 6216 7507 7311 7780 9109 10734 11131 8475 3677 -2556 -8266 -11273 -11067 -9123 -7888
1337g888l2J95J809M514N197M332L154R73m11k418l057l201k773k737k059k098
$$ -7888 -7920 -7725 -5916 -1402 3795 8127 11281 12254 11843 9425 6368 3167 394 -2343 -4402 -6500
1353f500l001k544q75K373N178N631L535J242P83Q09K151J323K33j608m036n059
$$ -6500 -9501 -12045 -12920 -10547 -5369 262 3797 5039 5822 6631 8782 10105 10338 8730 4694 -365
1369c65m509k987n49K15L91L45M44J190K653L520L850L683K030L67j464k483k739
$$ -365 -4874 -7861 -8410 -8195 -7804 -7459 -7015 -5825 -3172 348 4198 7881 9911 10278 8814 6331 3592
1386C592k079j402l57k229l472m092j930J287L870N001L791J219m84n0J536L928
$$ 3592 1513 111 -246 -2475 -5947 -10039 -11969 -10682 -6812 -1811 1980 3199 2715 2665 4201 8129
1402H129L189p1l927o129m635k180L15Q37m02k027k012M96K560M119M056K940
$$ 8129 11318 11247 7320 1191 -3444 -5624 -5309 -4472 -4874 -6901 -8913 -8417 -5857 -1738 2318 5258
1418E258J731J053J59j436j722j582r73r30j781l570l718l099m14L069M335M334
$$ 5258 6989 8042 8201 6765 5043 3461 2488 1558 -223 -3793 -7511 -10610 -11024 -7955 -3620 714
1434G14J279p82r47J114L846N170K363k797o595p057k810K106L473M91l734n305
$$ 714 1993 1211 264 1378 5224 10394 12757 9960 3365 -3692 -6502 -4396 -923 -432 -4166 -9471
1450i471k111K925O552N735K336o48j510k62R47J869L54j650k841l516k789j914
$$ -9471 -11582 -8657 -2105 3630 5966 5318 3808 3546 4493 6362 6716 5066 2225 -1291 -4080 -5994
1466e994p97K72Q94J197J611K088N82P82P67K066K614K575K25l781n702l894M17
$$ -5994 -6791 -6519 -5625 -4428 -2817 -729 -147 635 1402 3468 6082 8657 8882 5101 -601 -4495 -4078
1483d078L789K267j944n762n099J78N952P636L863j613m520k156J719M440L619
$$ -4078 -289 1978 34 -5728 -10827 -10649 -4697 2939 6802 5189 669 -1487 232 4672 8291
1498H291R0m042m983l998j139J486K849J003j456k696j354J673L740L695J309
$$ 8291 8381 4339 -644 -4642 -5781 -4295 -1446 -443 -1899 -4595 -5949 -4276 -536 3159 4468
1513D468n26o60J64O05q08k290j508k10J211J6k674m394j648K471N145M738J21
$$ 4468 3942 3282 3446 4051 3243 953 -555 -765 446 462 -2212 -6606 -8254 -5783 -638 4100 4221
1530D221l344l433K39M395M658J635k328n278m208j760J471L161K799j148l601
$$ 4221 877 -2556 -2317 2078 6736 8371 6043 765 -3443 -5203 -3732 -571 2228 1080 -2521
1545b521m610j55L728O493L598j120m189k855J025L342J951p48k956k476q01O5
$$ -2521 -7131 -7286 -3558 2935 6533 5413 1224 -1631 -606 2736 4687 3939 983 -1493 -2294 -2229
1561b229J54j210J01J743K090P14j268j795n2K820L077J097j485k661k448q13
$$ -2229 -2075 -3285 -3184 -1441 649 1363 95 -1700 -1752 1068 4145 5242 3757 1096 -1352 -2165
1577b165M32J442J764P8j753l247k274J139M213M646R35l370m745j416L292N163
$$ -2165 -1733 -291 1473 1551 -202 -3449 -5723 -4584 -371 4275 5210 1840 -2905 -4321 -1029 4134
1593D134K436l016m600k627J140K535J171p94j274n18L16j50l43K03J732J495
$$ 4134 6570 3554 -1046 -3673 -2533 2 1173 379 -895 -1413 -1097 -1247 -1590 -1387 345 1840
1609A840N53j262j307k88O66J370l16m68m80Q8p77j221j626Q59K796K375o56l434
$$ 1840 2393 1131 -176 -464 202 1572 1256 788 308 396 -381 -1602 -3228 -2369 427 2802 2146 -1288
1627a288k749K35M251M270M02l480l889p73K379K697J006j662k440o96m7K98J05
$$ -1288 -4037 -3802 449 4719 5121 1641 -2248 -3021 -642 2055 3061 1399 -1041 -1737 -1784 -1486 -1381
1644a381L59J343P90p66j475q19J271K337J316p12j337q37K76J71j181q63L40
$$ -1381 -1022 321 1111 345 -1130 -1949 -678 1659 2975 2263 926 89 365 536 -645 -1508 -1168
1661a168J600J648k040l312j909J974M762L291r34m261k903Q19L995L000m1k926
$$ -1168 432 2080 40 -3272 -5181 -3207 1555 4846 3912 -349 -3252 -2433 1562 4562 4521 1595
1677A595k662j293L48M71O06Q78L77q70j728j152M97L490L124O13j993k772n40
$$ 1595 -1067 -2360 -2012 -1541 -935 -57 320 -550 -2278 -3430 -2933 557 3681 4294 2301 -471 -1011
1694a011J875J169P2j590j290J44l62j349j627M9K931L438N55k508l159m46L892
$$ -1011 864 2033 2105 515 -775 -631 -993 -2342 -3969 -3920 -989 2449 3004 496 -2663 -3109 783
1711G83M581J260k496m810k243N54J936R65j94r75j525j351q18Q46L343L397J246
$$ 783 5364 6624 4128 -682 -2925 -2371 -435 530 336 -639 -2164 -3515 -4333 -3487 -144 3253 4499
1728D499j909l000j562K096L539J748j969m035k845m4J522Q08n67l46N43O06K81
$$ 4499 2590 -410 -1972 124 3663 5411 3442 -593 -3438 -3482 -1960 -1152 -1719 -2065 -1522 -916 -635
1745f35p02M1K480L406J513k033l595k547Q81K403J210j355l156k400n09J476
$$ -635 -1337 -1296 1184 4590 6103 4070 475 -2072 -1191 1212 2422 1067 -2089 -4489 -4998 -3522
1761c522J435J495J529Q10M9j103j050J110L003J978q16m089l863q44J394K125
$$ -3522 -2087 -592 937 1747 1796 693 -357 753 3756 5734 4918 829 -3034 -3878 -2484 -359
1777c59J72j342j812k78J125J785R50R66K069R46m68j768k182J76J893J061j122
$$ -359 -187 -1529 -3341 -3619 -2494 -709 241 1207 3276 4222 3754 1986 -196 -20 1873 2934 1812
1794A812l816k882j59J806K135P78m95k15K96J371P78P77R36P90J1j649k267j594
$$ 1812 -2004 -4886 -5045 -3239 -1104 -326 -821 -1036 -740 631 1409 2186 3122 3912 3923 2274 7 -1587
1812a587k10J200M10j447j700p09P76J546J207Q46J036J481R00r58j627n06O31
$$ -1587 -1797 -597 -187 -1634 -3334 -4043 -3267 -1721 -514 332 1368 2849 3749 2791 1164 658 1289
1829A289J613L51k490l907k106M73K406K178K33j417r96P20J795K331J316M83
$$ 1289 2902 3253 763 -3144 -5250 -4777 -2371 -193 40 -1377 -2373 -1653 142 2473 3789 4272
1845D272n30j687j355p91K5M97o61j048j859j115L29J417J487P99N24R14J357
$$ 4272 3742 2055 700 -91 -66 431 -230 -1278 -3137 -4252 -3923 -2506 -1019 -220 304 1218 2575
1862B575L57n63j048J49J148J117j128l319l183j289J533K649J666q01k375j436
$$ 2575 2932 2369 1321 1470 2618 3735 2607 -712 -3895 -5184 -3651 -1002 664 -137 -2512 -3948
1878c948J252L554L465J654j798k325k508O1J397J290J8k231l031k029M03K243
$$ -3948 -2696 858 4323 5977 4179 1854 -654 -593 804 2094 2112 -119 -3150 -5179 -4776 -2533
1894b533K331P30j84r40J35J463J535N69o7m28m62m71j109j865j360j70J032J160
$$ -2533 -202 528 344 -596 -461 1002 2537 3106 3039 2611 2149 1678 569 -1296 -2656 -2826 -1794 -634
1912f34j69j590r14k27K482L370K447j11k435k579n18J568K525P48j928l887l299
$$ -634 -803 -2393 -3307 -3534 -1052 2318 4765 4654 2219 -360 -878 690 3215 3963 2035 -1852 -5151
1929e151j78K548K744J393j106k378p52J388L044K248M65j045j988r70k48O74
$$ -5151 -5329 -2781 -37 1356 250 -2128 -2880 -1492 1552 3800 4265 3220 1232 262 14 688
1945F88k99n04j308p40k84J53J51k59N81J560K126J078l76j401j157P74J835J484
$$ 688 389 -115 -1423 -2163 -2447 -2294 -2143 -2402 -1821 -261 1865 2943 2567 1166 9 783 2618 4102
1963D102q57l160l447j429J504K789J463q36k498j391Q12K889K876J648p27k459
$$ 4102 3245 85 -3362 -4791 -3287 -498 965 129 -2369 -3760 -2948 -59 2817 4465 3738 1279
1979A279j434k09J521R17J3j875k346j455L10J293J015K37j97L35J052J032M65
$$ 1279 -155 -364 1157 2074 2087 212 -2134 -3589 -3279 -1986 -971 -734 -931 -596 456 1488 1953
$$ [...]
8191a38
##END NTUPLES=NMR FID
##END=
