##TITLE=1H_24TFAMO906
 CDCl3
 8 sc, 
 10.06.2022
##JCAMPDX= 6.0         $$ Bruker NMR JCAMP-DX V2.0
##DATA TYPE= NMR FID
##DATA CLASS= NTUPLES
##ORIGIN= UXNMR, Bruker Analytische Messtechnik GmbH
##OWNER= root
$$ XWIN-NMR		Version 3.5
$$ Fri Jun 10 13:59:49 2022 Russian Standard Time (UT+4h)  she@DPX200
##.OBSERVE FREQUENCY= 200.131
##.OBSERVE NUCLEUS= ^1H
##.DELAY= (6, 6)
##.ACQUISITION MODE= SIMULTANEOUS
##.ACQUISITION SCHEME= undefined
##.AVERAGES= 8
##.DIGITISER RES= 18
##SPECTROMETER/DATA SYSTEM= spect
##.PULSE SEQUENCE= zg30
##.SOLVENT NAME= DMSO
##.SHIFT REFERENCE= (INTERNAL, DMSO, 0, 15.7039)
##AUDIT TRAIL= $$ (NUMBER, WHEN, WHO, WHERE, WHAT)
$$ ##TITLE= Audit trail, XWIN-NMR		Version 3.5
$$ ##JCAMPDX= 5.01
$$ ##ORIGIN= Bruker BioSpin GmbH
$$ ##OWNER= she
$$ F:/spectra/data/she/nmr/H-F/1/audita.txt
$$ ##AUDIT TRAIL=  $$ (NUMBER, WHEN, WHO, WHERE, WHAT)
(   1,<2022-06-10 13:58:31.92 +0400>,<she>,<DPX200>,
      <created by zg, POWCHK disabled, PULCHK disabled
       configuration hash MD5:
       00 E9 B6 7A A2 85 ED C7 34 08 36 98 17 FE 4E 26
       data hash MD5: 16K
       0A 26 41 2B A8 5A E5 26 70 3D AE 5C B5 E3 BA 1C>)
$$ ##END=
$$ 
$$ hash MD5
$$ E3 F9 AF F7 AA DA A2 2E 5D 67 3F 45 6D 80 0B BF
##$RELAX= 
##$RELAX= 
##$RELAX= 
##$RELAX= 
##$RELAX= 
##$RELAX= 
$$ Bruker specific parameters
$$ --------------------------
##$DU= <F:/spectra>
##$EXPNO= 1
##$NAME= <H-F>
##$PROCNO= 1
##$TYPE= <nmr>
##$USER= <she>
##$AMP= (0..31)
100 100 100 100 100 100 100 100 100 100 100 100 100 100 100 100 100 100 
100 100 100 100 100 100 100 100 100 100 100 100 100 100 
##$AQSEQ= 0
##$AQ_mod= 1
##$AUNM= <au_zg>
##$AUTOPOS= <>
##$BF1= 200.13
##$BF2= 200.13
##$BF3= 200.13
##$BF4= 200.13
##$BF5= 200.13
##$BF6= 200.13
##$BF7= 200.13
##$BF8= 200.13
##$BYTORDA= 1
##$CFDGTYP= 0
##$CFRGTYP= 5
##$CHEMSTR= <none>
##$CNST= (0..31)
1 1 145 1 1 1 1 1 1 1 1 1 1 1 1 1 1 1 1 1 1 1 1 1 1 1 1 1 1 1 1 1 
##$CPDPRG= <>
##$CPDPRG1= <>
##$CPDPRG2= <>
##$CPDPRG3= <>
##$CPDPRG4= <mlev>
##$CPDPRG5= <mlev>
##$CPDPRG6= <mlev>
##$CPDPRG7= <mlev>
##$CPDPRG8= <mlev>
##$CPDPRGB= <>
##$CPDPRGT= <>
##$D= (0..31)
0 1.2 0 0 0 0 0 0 0 0.06 0 0.03 0 0 0 0 0.0002 0 0 0 0 0 0 0 0 0 0 0 0 
0 0 0 
##$DATE= 1654855111
##$DBL= (0..7)
120 120 120 120 120 120 120 120 
##$DBP= (0..7)
150 150 150 150 150 150 150 150 
##$DBP07= 0
##$DBPNAM0= <>
##$DBPNAM1= <>
##$DBPNAM2= <>
##$DBPNAM3= <>
##$DBPNAM4= <>
##$DBPNAM5= <>
##$DBPNAM6= <>
##$DBPNAM7= <>
##$DBPOAL= (0..7)
0.5 0.5 0.5 0.5 0.5 0.5 0.5 0.5 
##$DBPOFFS= (0..7)
0 0 0 0 0 0 0 0 
##$DE= 6
##$DECBNUC= <off>
##$DECIM= 32
##$DECNUC= <off>
##$DECSTAT= 4
##$DIGMOD= 1
##$DIGTYP= 9
##$DL= (0..7)
0 120 120 120 120 120 120 120 
##$DP= (0..7)
150 150 150 150 150 150 150 150 
##$DP07= 0
##$DPNAME0= <>
##$DPNAME1= <>
##$DPNAME2= <>
##$DPNAME3= <>
##$DPNAME4= <>
##$DPNAME5= <>
##$DPNAME6= <>
##$DPNAME7= <>
##$DPOAL= (0..7)
0.5 0.5 0.5 0.5 0.5 0.5 0.5 0.5 
##$DPOFFS= (0..7)
0 0 0 0 0 0 0 0 
##$DQDMODE= 0
##$DR= 18
##$DS= 0
##$DSLIST= <SSSSSSSSSSSSSSS>
$$ [...]
##$SUBNAM2= <"">
##$SUBNAM3= <"">
##$SUBNAM4= <"">
##$SUBNAM5= <"">
##$SUBNAM6= <"">
##$SUBNAM7= <"">
##$SUBNAM8= <"">
##$SUBNAM9= <"">
##$SW= 18.0517599122864
##$SWIBOX= (0..15)
0 0 2 0 0 0 0 0 0 0 0 0 0 0 0 0 
##$SW_h= 3612.71676300578
##$TD= 16384
##$TD0= 1
##$TE= 0
##$TE2= 300
##$TE3= 300
##$TEG= 300
##$TL= (0..7)
0 120 120 120 120 120 120 120 
##$TP= (0..7)
150 150 150 150 150 150 150 150 
##$TP07= 0
##$TPNAME0= <>
##$TPNAME1= <>
##$TPNAME2= <>
##$TPNAME3= <>
##$TPNAME4= <>
##$TPNAME5= <>
##$TPNAME6= <>
##$TPNAME7= <>
##$TPOAL= (0..7)
0.5 0.5 0.5 0.5 0.5 0.5 0.5 0.5 
##$TPOFFS= (0..7)
0 0 0 0 0 0 0 0 
##$TUNHIN= 0
##$TUNHOUT= 0
##$TUNXOUT= 0
##$USERA1= <user>
##$USERA2= <user>
##$USERA3= <user>
##$USERA4= <user>
##$USERA5= <user>
##$V9= 5
##$VALIST= <valist>
##$VCLIST= <CCCCCCCCCCCCCCC>
##$VD= 0
##$VDLIST= <DDDDDDDDDDDDDDD>
##$VPLIST= <PPPPPPPPPPPPPPP>
##$VTLIST= <TTTTTTTTTTTTTTT>
##$WBST= 1024
##$WBSW= 4
##$XGAIN= (0..3)
0 0 0 0 
##$XL= 0
##$YL= 0
##$YMAX_a= 878253
##$YMIN_a= -766904
##$ZGOPTNS= <>
##$ZL1= 120
##$ZL2= 120
##$ZL3= 120
##$ZL4= 120
##$ABSF1= 10
##$ABSF2= 0
##$ABSG= 5
##$ABSL= 3
##$ALPHA= 0
##$AQORDER= 0
##$ASSFAC= 0
##$ASSFACI= 0
##$ASSFACX= 0
##$ASSWID= 0
##$AUNMP= <proc_1d>
##$AZFE= 0.1
##$AZFW= 0.1
##$BCFW= 1
##$BC_mod= 2
##$BYTORDP= 1
##$COROFFS= 0
##$CY= 11.3945322036743
##$DATMOD= 1
##$DC= 2
##$DFILT= <>
##$DTYPP= 0
##$F1P= 2.36226072786647
##$F2P= -0.459571619588291
##$FCOR= 0.5
##$FTSIZE= 0
##$FT_mod= 4
##$GAMMA= 1
##$GB= 0.15
##$INTBC= 1
##$INTSCL= 1
##$ISEN= 128
##$LB= 0.24
##$LEV0= 0
##$LPBIN= 0
##$MAXI= 10000
##$MC2= 0
##$MEAN= 0
##$ME_mod= 0
##$MI= 1.114404
##$NCOEF= 0
##$NC_proc= 0
##$NLEV= 6
##$NOISF1= 3.799351
##$NOISF2= 2.8
##$NSP= 1
##$NTH_PI= 0
##$NZP= 0
##$OFFSET= 15.70392
##$PC= 1
##$PHC0= -18041.45
##$PHC1= 10.60069
##$PH_mod= 1
##$PKNL= yes
##$PPARMOD= 0
##$PSCAL= 0
##$PSIGN= 0
##$REVERSE= no
##$SF= 200.130013532006
##$SI= 16384
##$SIGF1= 3
##$SIGF2= 2
##$SINO= 400
##$SIOLD= 16384
##$SREGLST= <1H.CDCl3>
##$SSB= 0
##$STSI= 0
##$STSR= 0
##$SW_p= 3612.71676300578
##$SYMM= 0
##$S_DEV= 0
##$TDeff= 0
##$TDoff= 0
##$TI= <>
##$TILT= no
##$TM1= 0
##$TM2= 0
##$TOPLEV= 0
##$USERP1= <user>
##$USERP2= <user>
##$USERP3= <user>
##$USERP4= <user>
##$USERP5= <user>
##$WDW= 1
##$XDIM= 8192
##$YMAX_p= 0
##$YMIN_p= 0
$$ End of Bruker specific parameters
$$ ---------------------------------
##NTUPLES= NMR FID
##VAR_NAME=  TIME,          FID/REAL,        FID/IMAG
##SYMBOL=    X,             R,               I
##VAR_TYPE=  INDEPENDENT,   DEPENDENT,       DEPENDENT
##VAR_FORM=  AFFN,          ASDF,            ASDF
##VAR_DIM=   8192,          8192,            8192
##UNITS=     SECONDS,       ARBITRARY UNITS, ARBITRARY UNITS
##FACTOR=    0.0002768,     1,               1
##FIRST=     0,             0,               0
##LAST=      2.2672688,     0,               0
##MIN=       0,             -766904,         0
##MAX=       2.2672688,     878253,          0
$$ Real data points
##PAGE= N=1
##DATA TABLE= (X++(R..R)), XYDATA
0 0 0 0 0 0 0 0 -8 0 0 8 -8 16 -16 16 -24 32 -40 48 -56 71 -88 96 -120 138 -164 192 -224 256 -296 340 -386
31 -386 442 -500 569 -641 721 -809 907 -1015 1131 -1260 1397 -1550 1716 -1900 2097 -2313
47 -2313 2552 -2811 3098 -3414 3762 -4145 4577 -5057 5601 -6220 6931 -7762 8741 -9921
61 -9921 11373 -13212 15624 -18950 23840 -31779 46900 -86245 422029 878253 179280 -342669
73 -342669 -658934 -498173 -229393 26812 -10107 -223852 -493401 -497491 -230509 194149 468805
84 468805 518361 367172 201309 94484 104761 159635 193633 103225 -82557 -282600 -373351
95 -373351 -351656 -269970 -211946 -174605 -119008 2403 149299 236311 197978 106412 109839 274462
107 274462 450509 408656 89516 -282409 -422940 -274572 -52717 4609 -139863 -329633
117 -329633 -397797 -285658 -43931 220958 385583 373284 220730 69667 49508 159618
127 159618 270480 243544 47339 -219435 -399112 -392304 -230788 -61618 -21648 -115655 -206159
138 -206159 -150626 57627 278954 360433 271865 123413 55986 108656 186347 157120 -10451
149 -10451 -208099 -294977 -239325 -140059 -106351 -143975 -174349 -134922 -35670 81466 188632
160 188632 263351 272092 202529 105373 63064 95464 123784 52424 -118187 -282238 -330759 -252052
172 -252052 -131188 -62784 -70985 -96678 -59928 63053 213462 296900 267716 169078 87624
183 87624 70754 84409 56503 -44287 -175520 -258135 -246605 -167726 -91400 -65306 -73645 -62035
195 -62035 3092 102875 190662 231289 218314 158530 74265 7143 -6965 20233 21553 -58840
207 -58840 -191481 -276888 -241549 -117237 -5168 24751 -5136 -21060 25760 117181 198377
218 198377 222866 182831 107157 36076 -6414 -28782 -55733 -100019 -147605 -173043 -162655 -126388
230 -126388 -82791 -42104 779 52243 107858 151734 168593 154461 118828 74328 30766 -4056
242 -4056 -27386 -49308 -87622 -144344 -189181 -177926 -101327 -6401 44152 35951 14922 34464
254 34464 97490 157138 169950 132096 71942 17264 -22326 -47725 -64704 -80922 -102067 -123865
266 -123865 -130441 -110641 -68470 -20410 20733 55290 88425 117860 133252 126816 101457 68578
278 68578 34478 845 -34151 -69505 -101972 -128086 -141605 -132302 -93085 -32442 23106 51988
290 51988 57316 66086 95555 130235 138035 104312 47162 -2949 -35478 -59065 -81907 -100091 -104685
303 -104685 -96621 -81241 -60803 -31610 5410 41492 68700 86687 98681 101791 88368 59116
315 59116 25405 2106 -11464 -27394 -55168 -88647 -109657 -105455 -79408 -43519 -10724 13228
327 13228 28990 40723 56904 81345 106205 110424 81240 28223 -19969 -42292 -44120 -48361 -67958
340 -67958 -92128 -100595 -82988 -46811 -6147 28195 52023 64470 69322 72746 76237 72949 53533
353 53533 18691 -17370 -39846 -48090 -54910 -68495 -80458 -74599 -47129 -11585 12693 20998 23723
366 23723 31953 49145 67489 77533 71057 44760 5601 -29255 -41199 -30100 -17259 -26954 -59332
379 -59332 -89172 -86441 -45779 9018 47235 54522 41270 29185 33880 54002 72706 68968 34891
392 34891 -15199 -55897 -67846 -56944 -44138 -43695 -50261 -46154 -24483 4648 26399 37259 45035
405 45035 54414 61069 55903 38158 14056 -9420 -27823 -36890 -33322 -23179 -21385 -37040 -58956
418 -58956 -60319 -26564 26506 62326 57004 21489 -8457 -3602 31806 67837 69757 31222 -25382
431 -25382 -64311 -65080 -34026 -1604 3694 -20763 -52243 -58476 -28767 20421 58718 68132 52007
444 52007 28300 12215 9435 16123 20002 10154 -16448 -48130 -64182 -54542 -30413 -11806 -6294
457 -6294 -3272 9112 27986 37433 30259 16812 14664 26657 36380 24985 -7603 -42050 -54229
470 -54229 -36991 -5447 15100 9015 -16873 -40813 -39138 -7847 34897 59851 50250 14504 -19520
483 -19520 -26020 -2091 31471 45950 26702 -16806 -56815 -65352 -35847 8196 32984 18614
495 18614 -17254 -38225 -21176 20270 52111 50768 24057 -1090 -8980 -4826 -1712 -6416 -13333
508 -13333 -16459 -15323 -13502 -12090 -9363 -3989 2441 8805 14936 19708 19389 9888 -4993 -14239 -9357
523 -9357 6191 18237 14266 -4628 -25032 -29871 -14539 9502 23279 15023 -8790 -27875 -23163
536 -23163 1893 26210 29364 11916 -7640 -10485 2278 15283 13668 -835 -14635 -17811 -11717
549 -11717 -4126 242 -671 -4484 -7204 -3839 7815 22272 27350 15510 -7677 -24426 -19959 1062
563 1062 19083 16028 -6440 -29625 -32436 -10299 20501 37880 28751 1957 -21351 -24069 -7308
576 -7308 12292 17543 5676 -11956 -21070 -17758 -5693 7348 16341 19226 14450 4158 -6086
589 -6086 -8931 -3791 3815 5484 304 -7557 -11649 -11853 -10960 -8854 -880 11996 21011 17037 48
604 48 -15144 -13538 5467 25361 28345 10300 -14966 -30523 -26304 -7294 11843 16577 2469
617 2469 -18841 -29908 -19630 5469 28917 35869 25186 5932 -8102 -9382 1111 12721 13988
630 13988 122 -22662 -38282 -36255 -17890 4046 14884 12169 4176 1903 8528 18592 23031
643 23031 20490 13110 4105 -5844 -16504 -23108 -20909 -12741 -4599 -2576 -5971 -8665 -7107 455 10353
658 10353 19395 23065 19236 8824 -1648 -4741 -243 6570 8349 2453 -9357 -21191 -26970 -21930
672 -21930 -9303 3006 6439 1049 -6302 -4755 7990 23937 33014 29315 17033 4059 -4673
685 -4673 -8663 -11098 -14392 -18107 -21901 -24984 -25357 -19219 -6408 8615 19619 23876 24053 24171 24123 21205
701 21205 13008 2955 -5329 -11427 -16877 -22540 -26463 -27123 -24168 -17511 -7369 4277 13746 18199
715 18199 18524 18526 21523 24615 24337 17916 7577 -3997 -14780 -23289 -27786 -27817 -24517 -19810 -16200 -12608
731 -12608 -6192 4404 17811 29817 36119 36122 31094 22522 10935 -2007 -13308 -19621 -23076 -27135
745 -27135 -32906 -36440 -32793 -20270 -3091 13977 27232 33991 32650 26581 20511 18483 18368 14326
759 14326 2894 -13822 -28996 -36672 -35931 -27352 -16369 -7691 -3799 -3339 -1580 5697 18618 30650
773 30650 36609 33059 22659 10783 1624 -3199 -6738 -11189 -17515 -25326 -31898 -34920 -31143 -20280
787 -20280 -4745 9875 20303 25760 29282 31313 31170 28577 23719 15775 3406 -13085 -29212 -40011
801 -40011 -42121 -37376 -29247 -19884 -9934 -464 8394 17993 28931 39045 43551 39026 27126 12044
815 12044 -1353 -11092 -18465 -24734 -29665 -34125 -35356 -32357 -24408 -12008 2300 15957 26024 31559
829 31559 33800 34364 32891 27622 18278 6666 -6020 -17903 -29875 -39121 -42966 -39919 -31436 -20571
843 -20571 -8493 4335 17058 27960 36030 41665 43598 40195 29470 12524 -5378 -20010 -29712
856 -29712 -35620 -39053 -39772 -36984 -29887 -18465 -3156 13202 27929 36987 39713 36800 31481 26254
870 26254 19639 9911 -3409 -18291 -30020 -36279 -37140 -34073 -28479 -21259 -12966 -3224 7058 18426
884 18426 29243 36967 39141 35982 28992 20108 8992 -3445 -15268 -25522 -32980 -38073 -40090 -38222
898 -38222 -29688 -16804 -947 14654 27318 36222 40123 39699 36208 31062 23103 11009 -6367 -24751
912 -24751 -38588 -44646 -42496 -36246 -28608 -20372 -11570 -43 13704 28059 39497 45140 43289 34097
926 34097 22036 10572 497 -8785 -19178 -30158 -38866 -42194 -39252 -31460 -20082 -7851 5373
939 5373 17492 27671 35917 41304 41936 36278 26025 14105 2541 -9812 -23366 -36404 -45590
952 -45590 -47249 -41487 -30887 -17485 -3559 9468 21300 31775 40000 45274 45759 39219 25150
965 25150 7622 -9738 -22941 -32113 -38147 -40316 -40218 -35082 -26076 -14592 -1621 12814 26666 38612
979 38612 44334 42645 34110 22971 11616 2249 -5276 -13294 -23558 -35616 -45235 -46593 -36680 -19591
993 -19591 -2453 9340 15229 18794 23995 31922 40472 44869 39613 23407 1239 -18891 -29816
1006 -29816 -32571 -31720 -32316 -34728 -35829 -31007 -18084 1125 21518 37143 44479 43538 37305 28713
1020 28713 20872 13673 4509 -7599 -22360 -36147 -44527 -45630 -39062 -27068 -12579 1951 12324
1033 12324 18733 23753 30087 37221 40398 36567 25169 9173 -7727 -21398 -29044 -30404 -29355 -30476
1047 -30476 -32427 -31839 -23363 -7386 11192 26791 34953 36539 34473 31660 28625 23963 14738 382
1061 382 -16070 -30747 -39594 -41772 -37789 -30968 -23411 -14540 -3744 10309 25383 36258 40687 40045
1075 40045 35092 26655 16075 3326 -9232 -20537 -30232 -36725 -38350 -35341 -28041 -18290 -7504
1088 -7504 4976 17283 27396 33169 34893 33474 29546 22991 13664 1961 -10454 -22103 -31198
1101 -31198 -34890 -34398 -30316 -24960 -18341 -8976 2387 15279 26884 34975 38032 34851 28704 21042
1115 21042 11912 1225 -10980 -23183 -32158 -36937 -37420 -33318 -24903 -13541 -1828 9052 19767
1128 19767 29844 36423 37898 32706 24508 15004 5106 -5594 -16459 -25987 -32816 -35082 -32571 -25972
1142 -25972 -16935 -6717 2583 11295 19471 26366 30572 31367 28502 22080 13081 2967 -7053 -15554
1156 -15554 -22808 -27752 -29674 -28550 -24724 -18685 -10375 -369 10271 19614 26496 31234 32193 28591
1170 28591 20970 11584 3134 -5238 -14302 -23744 -31122 -33938 -31429 -24752 -15828 -4922 5916 15024
1184 15024 22273 27546 30293 29932 26101 19259 9815 -851 -11775 -21778 -27528 -29161 -27816 -23850
1198 -23850 -18532 -11484 -3501 4716 13469 21836 27908 30300 27920 22060 14183 5059 -3213 -10080 -15321
1213 -15321 -21487 -27445 -30486 -27918 -20787 -10913 -1220 7910 16558 23387 27087 27452 25555 21710 15282
1228 15282 6271 -3943 -14253 -23180 -29351 -30916 -28023 -20756 -12641 -4164 3656 11534 18140 23681
1242 23681 27377 28550 25241 16877 5872 -4739 -12844 -17647 -19736 -20841 -21185 -21221 -18834 -12433 -2918
1257 -2918 6398 13746 18596 21461 22030 19544 15569 10681 6658 2302 -4174 -12012 -19277 -23538 -23919
1272 -23919 -20631 -14464 -7011 -785 4022 8272 12751 17957 22352 24301 21750 14635 4369 -5733
1286 -5733 -12572 -15965 -17105 -18252 -19655 -20042 -17322 -10515 -1230 8893 16423 20214 20469 19504 17488
1301 17488 14277 9173 2983 -3224 -9206 -14944 -19164 -21324 -19579 -15501 -10111 -4453 1148 7003 11639
1316 11639 14973 17241 18668 18095 15175 9660 2500 -4820 -11139 -15625 -17649 -18190 -17629 -16009 -12262
1331 -12262 -6095 1564 8836 14773 18732 20533 19746 16839 11811 5602 -1593 -8122 -13135 -16711 -19008
1346 -19008 -19698 -17804 -13050 -5829 1528 7717 12551 15788 16865 16124 14447 11816 8387 2979 -4018
1361 -4018 -10527 -14508 -15653 -14336 -11653 -9075 -6999 -4429 -884 4318 9423 13615 14962 13654 10484
1376 10484 7149 4580 2014 -422 -3988 -8627 -12774 -15226 -15006 -12083 -7281 -1883 2435 5026 7107
1391 7107 9014 11942 14468 14801 12135 6302 -432 -6839 -10860 -12428 -11408 -9667 -9170 -9822 -9522 -5612
1407 -5612 1089 8636 13696 14776 12495 8615 5380 3700 3474 2286 -708 -5596 -10907 -14069 -14003 -10328
1423 -10328 -5557 -1234 1268 2454 3360 4947 7388 10412 12660 12724 9209 3192 -3361 -7984 -9613
1438 -9613 -9218 -7806 -7543 -9033 -9808 -8595 -3587 3501 10830 15191 14613 11365 6749 3860 2409 1361
1454 1361 -831 -4697 -9519 -13426 -14977 -12311 -6687 -733 3616 5244 5888 6581 7687 8343 8406 7185
1470 7185 4987 1679 -2398 -6545 -9089 -8925 -7067 -4207 -2241 -1860 -2400 -1984 200 3546 7468 9574
1486 9574 8998 5958 2276 -92 -755 -259 -441 -2425 -5520 -8114 -9523 -8173 -4691 -481 2790 4004
1502 4004 4203 4703 5901 6820 6626 5175 2517 262 -2183 -4872 -7259 -8688 -7659 -5028 -1992 337
1518 337 1022 1279 1827 3343 5852 7302 6737 4253 1051 -2182 -3600 -3646 -2427 -1737 -2322 -4461 -5901
1535 -5901 -5033 -2262 1328 4039 4088 3344 2352 2707 3710 4581 3774 1366 -640 -2492 -3879 -5371 -6464
1552 -6464 -5944 -4021 -1835 -159 684 1489 2973 5239 6686 6987 5503 3207 -18 -2991 -4730 -5353
1568 -5353 -4609 -3936 -3471 -3873 -3908 -1838 1854 5848 7618 6375 3485 976 429 968 1353 112 -2498
1585 -2498 -4994 -6217 -5237 -2723 -406 853 1292 1506 1554 1711 2046 3264 4186 4179 2328 -428 -2251 -2572
1603 -2572 -2173 -1545 -1936 -2690 -2696 -2684 -2412 -1358 488 3321 5601 6023 3959 1275 -600 -274 1375 1605
1621 1605 -581 -4369 -7201 -7333 -4920 -990 1968 3256 3084 2457 2175 2791 3575 4223 3922 1955 -1575
1638 -1575 -4447 -6099 -5304 -2760 -860 -679 -1068 -1384 -172 1388 2459 3171 3817 3927 3477 1556 -535
1655 -535 -2356 -2201 -874 63 -969 -3057 -4925 -4722 -2699 -64 2100 2903 3144 3207 2770 2709 2831 3251
1673 3251 2833 1245 -1320 -4340 -6423 -6431 -4874 -3165 -1529 -557 354 2008 3703 4817 5421 5229 4768
1690 4768 3885 1936 -1843 -5026 -6082 -5348 -3516 -2152 -2920 -3307 -2950 -511 2274 4817 5816 5652 4472
1707 4472 2710 1425 324 -104 -74 -916 -2933 -4931 -6198 -5605 -3453 -1518 -110 914 1421 2597
1723 2597 4117 5155 5592 5089 3970 2665 702 -1535 -4330 -6585 -6596 -5632 -4482 -4375 -3397 -1643 1285
1740 1285 4496 6652 7491 6934 6003 4330 2530 351 -2187 -4367 -5787 -6411 -6766 -6441 -4712 -2349
1756 -2349 101 1697 2936 4247 6025 7326 6786 4849 2324 132 -1131 -1587 -2795 -4318 -6305
1771 -6305 -6945 -6214 -4258 -1754 -81 1549 3309 4948 5898 6012 5893 5776 4951 2520 -377 -3630 -5934
1788 -5934 -7011 -7056 -6642 -5918 -4476 -2400 -231 2401 4466 6480 7905 8471 7502 4753 1406 -1539
1804 -1539 -2998 -4185 -5102 -6368 -7346 -7402 -5872 -2845 -325 2734 4299 5235 5878 6280 6077 4943 4021
1821 4021 2117 166 -2180 -4374 -5992 -6552 -6291 -5532 -4868 -3686 -1634 785 3240 4909 6241 7259
1837 7259 7358 7052 5403 2633 -403 -3034 -5214 -6477 -7955 -8422 -7916 -6272 -3487 -671 2410 5211
1853 5211 7316 8841 8977 8228 6062 3660 901 -2282 -4903 -6944 -8523 -8738 -7870 -6474 -4136 -1563
1869 -1563 1115 3977 6501 7592 8134 7565 6219 4537 2474 159 -2453 -4882 -6862 -7728 -8419 -7480
1885 -7480 -5836 -3138 -1005 1800 3859 5778 7097 7900 8392 7386 5578 2858 -805 -3928 -6539
1900 -6539 -7902 -8317 -7546 -6729 -5674 -3763 -954 2200 5497 8277 9841 9352 7668 4633 2043 128
1916 128 -1747 -3441 -5533 -7596 -8797 -8864 -7264 -4046 -409 2523 4478 5479 5318 5672 6287 6800 6602
1933 6602 4256 926 -2878 -5620 -7126 -7181 -6228 -5539 -5147 -4562 -3329 -1294 1921 5460 8409 9685
1949 9685 9075 7393 4576 1649 265 -1456 -3148 -5512 -8262 -10125 -10424 -8511 -4347 -252 3438
1964 3438 5739 6696 7130 7544 8058 8046 6494 3431 -944 -5197 -8278 -9470 -9020 -7304 -5728 -4365 -3024
1981 -3024 -987 2025 5348 7923 9425 9481 7820 5341 2453 -111 -2351 -4089 -5268 -6593 -8238
1996 -8238 -9139 -8565 -5940 -2246 1677 4603 6410 7228 7484 7652 7335 6386 4416 1159 -2941 -6554 -8891
2013 -8891 -9314 -8514 -7057 -5379 -3629 -1272 1413 4410 7265 8817 9114 8338 6035 3616 794 -1467
2029 -1467 -3669 -5813 -6990 -7958 -7553 -6773 -5039 -2563 575 2954 4842 6135 6634 6838 6552 5501
2045 5501 4017 1822 -1011 -3247 -5435 -7058 -6970 -6785 -5987 -5218 -3536 -1384 1469 4687 6871 8292
2061 8292 8211 6994 5511 3901 1564 -984 -3839 -6527 -8553 -9172 -8860 -6855 -4370 -1450 1617 4082
2077 4082 5971 7568 8304 8113 7210 5468 2748 -345 -3713 -6178 -7827 -8293 -7804 -6427 -5016 -3245
2093 -3245 -1295 1157 3922 6686 8260 8607 7573 5603 3571 1296 -795 -2600 -4545 -6860 -8143
2108 -8143 -8328 -7671 -5714 -2694 206 2671 5243 6675 7325 7606 7225 5942 4018 1585 -1642 -4605
2124 -4605 -7284 -8875 -8824 -7250 -5085 -2633 -768 815 2597 5096 7109 8701 8650 6891 3733 869
2140 869 -1692 -3213 -4294 -4905 -6057 -6672 -6571 -5610 -3798 -650 2364 4243 5745 5840 5758 5570 5057 3841
2158 3841 2909 939 -1198 -4080 -6542 -7543 -7297 -6013 -4250 -2196 -564 753 2305 4236 6257
2173 6257 8140 8348 6721 3942 480 -2065 -3530 -4622 -5557 -6580 -7073 -6910 -5458 -2681 494 3458
2189 3458 5637 6768 7112 6818 5973 4551 2861 497 -1971 -3921 -5220 -6332 -6993 -7247 -5515 -3429
2205 -3429 -875 1633 3265 3967 4958 5942 6569 6604 4776 2604 -94 -2740 -4494 -5618 -6089 -5930 -5760
2222 -5760 -5055 -3705 -1453 1162 3774 5599 6713 6755 6641 5543 3944 1722 -957 -3306 -5253 -5974
2238 -5974 -6098 -6310 -6292 -4746 -2129 604 3209 5015 5736 5629 5458 4971 4321 3191 778 -1798 -3961
2255 -3961 -5630 -6080 -5760 -4965 -4074 -2836 -1525 218 2083 4124 5268 5548 5006 4507 3852 2433 903
2272 903 -1363 -3611 -5053 -5612 -5439 -4762 -4171 -3310 -2069 -31 2603 4706 6143 6186 5288 4598 3292
2289 3292 1900 348 -1914 -4010 -5785 -6201 -6335 -4818 -3643 -2187 -620 1520 3192 5036 5916 5736
2305 5736 4592 3178 2241 1193 -176 -2326 -4489 -5547 -5940 -4922 -3165 -2019 -911 -252 1020 2662
2321 2662 4513 5396 5356 4747 3080 2097 529 -1161 -2492 -4102 -4747 -5455 -5095 -4293 -2602 -1234 346
2338 346 1992 3775 5353 6157 6001 4487 2735 926 -295 -1350 -2971 -4564 -5756 -6435 -5369 -3423
2354 -3423 -1349 615 2038 2992 3650 4476 4693 4746 4141 2348 624 -1292 -2676 -3723 -4282 -4359 -4384 -3472
2372 -3472 -2706 -1256 334 1484 2631 3591 4622 4998 4673 3389 1305 -251 -1592 -1900 -2582 -3625
2388 -3625 -4950 -5284 -4728 -3193 -918 1558 3192 3688 4020 4172 4181 4131 3258 1898 21 -2230 -3895 -4925
2406 -4925 -5118 -4435 -3627 -2525 -1063 214 1213 2630 3512 3984 4412 4142 3458 1844 -158 -1720 -2710
2423 -2710 -3126 -3023 -3056 -3396 -3187 -2913 -1484 -11 1690 3037 3602 3591 3383 2872 2829 1867 1031 -350 -1680
2442 -1680 -2979 -4324 -4500 -4168 -3147 -1980 -930 254 1664 2476 3419 4369 4307 3845 2831 1113 -542
2459 -542 -1870 -3147 -3862 -3793 -3537 -3236 -2523 -1624 -265 1370 2690 3386 3927 3996 3437 2592 1369 430 -695
2478 -695 -1829 -2909 -3246 -3442 -3604 -3185 -2306 -1336 266 1560 2498 3437 3432 3191 3032 2445 1959 446 -1162
2497 -1162 -1997 -3035 -3747 -3950 -3492 -2764 -1700 -340 914 2258 3118 3407 3849 3592 3312 2313 825 -979
2515 -979 -2398 -3516 -3876 -3510 -2866 -2355 -1757 -949 -4 1498 2827 3595 3470 2910 2259 1548 754 74 -807
2534 -807 -1793 -2655 -2925 -2816 -2654 -1919 -1070 -530 406 1460 2095 2806 2780 2270 2227 1696 1194 807 -200 -1991
2554 -1991 -2909 -3304 -3093 -2617 -1486 -923 -652 216 1476 2370 3130 3710 3375 1981 1249 317 -530 -1294 -2107
2573 -2107 -2772 -3056 -2951 -2493 -1419 -588 400 997 2069 2785 3146 2823 2344 1456 392 144 -478 -1196 -1795
2592 -1795 -2833 -3493 -3007 -2082 -444 192 535 966 1573 2179 2911 3016 2747 1760 534 -306 -1439 -2004
2610 -2004 -2660 -2959 -3078 -3041 -1948 -580 650 1452 1551 2514 2919 3354 3024 2321 1329 -941 -1956 -2524 -2163
2629 -2163 -1964 -2461 -2637 -2312 -1463 344 1509 2437 2649 2714 2463 1920 1655 1017 134 -707 -1625 -2004 -2211
2648 -2211 -2340 -2351 -1930 -1121 -348 700 1714 1780 1755 1623 1714 2190 2071 1675 518 -989 -2155 -2394 -2161
2667 -2161 -1832 -1274 -1374 -1477 -1552 -382 1036 2489 2984 2617 2405 1552 1155 641 1 -688 -1772 -1959 -2648
2686 -2648 -2937 -2369 -1727 -865 313 1194 1945 2294 2260 1899 1480 1493 1208 439 -139 -1284 -2600 -3134 -2748
2705 -2748 -1869 -792 -139 -407 -656 239 1437 2436 3236 2899 1979 1191 159 -306 -691 -1150 -1813 -2504 -2924
2724 -2924 -3009 -2259 -1207 -261 921 1706 2433 2979 2888 2630 1840 995 -19 -555 -1070 -1867 -2976 -3390 -3165
2743 -3165 -1792 -684 553 836 1051 1697 2143 2642 2648 2249 986 108 -1004 -1475 -1516 -1882 -1961 -1802 -1902
2762 -1902 -1676 -784 369 1283 1570 1606 1590 1559 1739 1995 1331 265 -912 -1451 -1836 -1673 -1687 -1875 -1709 -1667
2782 -1667 -725 -42 963 1616 2043 1936 2303 2149 1432 729 32 -1074 -1588 -1839 -2057 -2367 -2180 -1989 -1245
2801 -1245 -87 769 1857 1901 1818 1444 1378 1573 1430 948 -323 -1400 -2066 -2295 -2168 -1548 -828 -915 -1155 -602
2821 -602 342 1303 2124 2485 2381 2053 1636 680 93 -377 -748 -1416 -2119 -2208 -2186 -2107 -1726 -771 152 1421 2116
2842 2116 2582 2402 2144 1839 1313 895 277 -378 -1833 -2732 -3298 -2986 -2069 -957 -102 418 483 1004 1705
2861 1705 2511 2708 2649 1767 617 -379 -1363 -1669 -1762 -1772 -1922 -1697 -1844 -1480 -544 262 1322 1866 2193 2409
2881 2409 2094 1454 1044 398 240 -276 -735 -1490 -2587 -2555 -2249 -1549 -485 339 695 1173 1372 1784 2097
2900 2097 2311 1976 1269 158 -597 -1599 -1932 -2207 -1958 -1761 -1412 -1281 -975 6 933 1735 2062 2302 1984
2919 1984 1768 1060 582 -204 -641 -1195 -1581 -2018 -1950 -1890 -1444 -992 -90 353 978 1292 1524 1716 2015 1453
2939 1453 1330 721 15 -642 -1138 -1842 -2168 -1955 -2053 -1356 -1009 -102 226 926 1672 2075 2327 1954 1534 1166
2959 1166 363 -525 -1112 -1589 -2173 -2503 -1764 -1523 -942 -499 368 850 1317 1891 2140 2308 1975 1274 113
2978 113 -447 -1030 -1183 -1175 -1804 -2120 -2064 -1585 -1090 -266 658 1229 1448 1509 1808 1647 1499 1083 573 369 -555
2999 -555 -1235 -1821 -2011 -2052 -1952 -1297 -363 153 650 831 1310 1681 2184 2362 2014 1305 -146 -859 -1756 -1774
3019 -1774 -1539 -1537 -1655 -1670 -1546 -1034 107 1160 2117 2213 1740 1526 894 794 463 160 -419 -1339 -1725 -2069
3039 -2069 -1951 -1663 -1180 -381 175 550 766 1189 1189 1412 1580 1652 1268 567 -288 -1174 -1885 -1613 -1572 -1182 -975
3060 -975 -1214 -1300 -604 464 1357 2050 2161 1821 1427 800 664 170 -58 -511 -1429 -2065 -2123 -1817 -1494 -460
3080 -460 -12 383 792 1017 1631 1773 1544 1493 944 396 -140 -865 -1093 -1191 -1574 -1707 -1204 -1203 -735 -271 265
3101 265 851 1097 1556 1408 1419 1168 621 524 -6 -455 -1003 -1614 -1880 -1867 -1547 -1093 -351 -208 328 799 1384
3122 1384 1790 2042 2016 1278 563 -8 -433 -1335 -1193 -1328 -1546 -1857 -1611 -1008 -286 546 1415 1690 1520 1312
3142 1312 1321 1258 738 401 -144 -520 -1266 -1580 -1742 -1623 -962 -663 -200 237 325 580 796 1292 1650 1650 1323 783
3164 783 183 -739 -1088 -1093 -1112 -1293 -1044 -1179 -1033 -740 -154 664 1678 1717 1620 1535 1056 792 509 14 -265 -765
3186 -765 -1475 -1596 -2135 -1916 -1123 -86 234 836 507 547 837 1117 1696 1171 1106 405 -311 -1021 -1302 -1510
3206 -1510 -1043 -922 -717 -898 -632 -765 -204 604 1488 1946 1639 1083 804 353 331 -60 -376 -355 -1032 -1454
3226 -1454 -1953 -1823 -1194 -69 297 953 1090 565 1035 1401 1665 1610 973 -225 -660 -1246 -1587 -1531 -1416 -980
3246 -980 -718 -468 -263 -87 542 1227 1894 1880 1349 893 328 -146 43 -566 -1065 -1349 -1437 -1509 -1372 -916 -389
3267 -389 512 846 1301 1152 874 1421 1184 1181 665 177 -731 -1264 -1461 -1507 -903 -1144 -906 -746 -504 177 1121
3288 1121 869 1682 1661 1526 973 332 62 -92 -134 -902 -1452 -1549 -1628 -1123 -483 36 432 625 785 954 1199
3309 1199 1171 1102 832 570 157 -476 -818 -1017 -1097 -791 -681 -959 -872 -571 159 385 868 1242 1183 1084 1184 847
3331 847 534 410 31 -27 -471 -1055 -1682 -1464 -1074 -261 171 240 495 771 1150 1221 1223 1212 996 496 -76 -979
3353 -979 -1443 -1625 -1372 -1178 -880 -859 -668 -136 531 873 1305 1512 1819 1177 904 355 -258 -683 -706 -926 -750
3374 -750 -1355 -1512 -1316 -714 -13 741 1245 894 1100 700 979 1078 837 508 133 -387 -896 -1435 -1608 -1272
3394 -1272 -752 -502 -550 -78 232 878 1346 1466 1554 1218 966 396 113 -827 -907 -998 -1035 -1171 -1050 -1168 -1015
3415 -1015 -404 413 1063 1379 1085 957 807 864 596 369 -21 -263 -805 -1017 -1184 -1161 -756 -591 -188 66
3435 66 196 455 745 1117 1232 1185 481 559 473 106 -229 -719 -1187 -1448 -1153 -940 -834 -402 -114 311 778
3456 778 1092 1228 1208 1296 987 636 203 -220 -798 -1131 -959 -1365 -1009 -1178 -829 -184 208 592 1296 1446 1542
3477 1542 1338 845 388 159 17 -453 -682 -1366 -1638 -1623 -1101 -826 -298 26 348 899 571 1057 1320 1336
3497 1336 1025 882 102 -334 -906 -1473 -1141 -1097 -1045 -987 -744 -680 -64 551 936 1433 1727 1443 1285 720 -43
3518 -43 -545 -461 -655 -1006 -1286 -1207 -1386 -799 -410 228 653 1205 1084 1192 940 1168 1005 688 582 -341 -778
3539 -778 -1047 -1327 -1109 -850 -799 -462 -586 -88 190 504 996 1260 1353 1087 927 584 12 -194 -544 -583 -959
3560 -959 -1095 -1257 -1430 -879 -382 -16 621 969 1241 1242 1304 1010 1164 771 144 -464 -1112 -1434 -1485 -1243 -1149 -782
3582 -782 -513 -35 312 804 1309 1532 1215 1172 1144 403 173 -275 -525 -498 -1113 -1374 -1346 -1221 -869 -166 43
3603 43 601 736 927 1299 1501 1316 759 910 318 -399 -1076 -1482 -1405 -1084 -1054 -950 -1011 -496 -169 324 913
3624 913 1330 1886 1350 868 663 237 -359 -132 -691 -1021 -1288 -1633 -1697 -935 -456 -22 627 694 810 796 1032
3645 1032 1718 1129 1101 643 -190 -764 -1181 -1222 -1184 -841 -551 -653 -644 -331 116 1007 1430 1294 1523 1118 803
3666 803 289 -65 -136 -286 -502 -1251 -1357 -1700 -1571 -1172 -354 711 991 1138 810 1176 1087 1501 1159 779
3686 779 109 -574 -1401 -1646 -1452 -1027 -835 -756 -325 -348 24 686 1300 1403 1523 1136 815 445 -97 -29 -783
3707 -783 -497 -855 -1029 -1221 -1194 -1114 -571 -52 516 1048 1265 1100 754 840 890 790 743 105 -572 -1169 -1644 -1493
3729 -1493 -1242 -698 -443 -342 -63 64 421 1302 1643 1589 1200 465 122 -40 -319 -810 -900 -1339 -1179 -1246 -1033
3750 -1033 -818 -539 364 757 1223 1129 946 703 1138 946 633 301 -388 -815 -938 -1572 -1400 -855 -700 -267
3770 -267 -51 -172 253 669 1350 1979 1410 1097 439 58 -119 -225 -558 -1120 -1360 -1694 -1511 -914 -595 93
3790 93 626 1098 1325 929 1018 1149 937 860 541 -301 -848 -1192 -1330 -1292 -835 -685 -570 -150 187 188 460 1056
3812 1056 1367 1514 885 648 238 -279 -215 -199 -421 -1029 -1337 -1655 -1081 -787 -411 506 758 670 645 484 775
3833 775 828 739 909 329 -307 -847 -1227 -984 -684 -603 -473 -624 -565 -188 503 1181 1246 1546 1097 920 650 64
3855 64 -396 -202 -409 -624 -1134 -1024 -1082 -1021 -538 226 618 557 625 800 791 748 608 839 764 126 -512 -1192 -1068
3878 -1068 -1284 -594 -677 -224 -466 -173 133 399 756 1244 1276 1022 677 356 72 -414 -442 -329 -895 -704 -1127
3899 -1127 -1042 -718 -136 411 911 842 796 821 601 519 406 487 233 -300 -736 -1133 -1102 -961 -751 -397 -268 -58
3921 -58 -95 85 437 788 901 1172 967 348 -24 -458 -252 -175 -369 -525 -807 -978 -662 -626 -127 230 211 402
3943 402 576 913 527 676 542 227 21 -239 -559 -703 -1009 -772 -772 -238 -120 -40 -91 571 546 870 750 693
3965 693 473 396 169 -38 -297 -671 -915 -537 -540 -721 -462 -508 360 481 457 511 636 652 659 477 176 -166 -307
3988 -307 -337 -305 -561 -687 -898 -777 -460 -193 -26 388 397 636 703 505 567 314 342 -97 -85 -429 -694 -610 -569
4011 -569 -657 -92 -178 88 294 689 224 547 513 409 362 250 99 -156 -426 -680 -347 -493 -549 -482 -201 -308
4033 -308 45 226 329 357 407 346 305 382 268 33 -24 -123 -459 -513 -879 -440 -489 -558 -317 -119 360 389 536 500
4057 500 583 644 361 366 369 -15 -185 -532 -549 -465 -565 -449 -383 -266 -156 105 102 328 437 432 240 497 -36 -89 -114
4082 -114 -165 -392 -384 -213 -283 -400 -370 -161 -11 123 380 546 401 303 235 231 424 37 -304 -109 -334 -232 -413
4105 -413 -524 -282 -45 20 17 -4 565 399 295 100 315 292 72 147 -288 -387 -344 -305 -381 -103 -73 41 -179 -78
4129 -78 108 172 321 369 216 25 -114 -146 -253 -41 59 -110 -301 -199 -362 -219 87 289 175 353 202
4150 202 -64 107 86 6 100 409 -42 -333 -491 -603 -309 -180 47 -19 -135 -100 -253 -26 292 336 130 272
4172 272 -57 -190 -355 -147 245 321 -11 -230 -311 -451 -312 -17 388 129 220 179 188 186 185 385 315 43 151 -159
4196 -159 -385 -376 -529 -158 155 -9 80 -265 -206 -18 433 332 138 351 -86 -364 -299 -143 -45 39 49 12 -232
4219 -232 -361 -223 92 167 111 -12 52 -107 49 -74 157 344 251 20 -507 -157 -302 -38 162 305 155
4240 155 -81 -151 77 -98 187 176 180 -82 -28 -30 -86 -197 30 -4 -38 95 -234 -39 -32 389 201 328 40 291
4264 291 -409 -104 183 223 13 -20 91 -65 -196 -168 -85 394 88 -28 -96 -358 135 -24 408 190 44 -70
4286 -70 -163 -255 -242 214 234 3 -48 3 -102 125 0 86 267 180 -125 -379 -239 -249 -205 -187 72 58 -281 -130
4310 -130 -45 167 375 400 94 -205 -166 -281 -36 5 15 80 -157 -71 -82 -249 42 382 409 354 67 -77 -104 87
4334 87 167 74 354 -179 -448 -255 -483 -90 92 -94 78 -36 -260 -90 92 348 173 149 278 6 -218
4355 -218 -259 -284 92 -272 194 -213 -350 -402 -19 36 351 542 262 278 -104 137 270 305 625 251 -67 -317
4377 -317 -642 -166 -112 20 144 333 58 246 -14 155 109 240 377 286 -67 -314 211 -83 -144 -136 58 78
4399 78 -447 -197 -119 161 343 381 87 256 -55 125 45 182 -177 35 -80 -419 -596 -527 -135 104 115 113 80
4422 80 -26 178 423 659 532 336 210 4 -343 -229 -378 -38 -327 -240 -208 -83 -134 -31 154 414 460 191
4444 191 403 -36 11 72 171 -108 230 -354 -548 -597 -233 -198 81 112 129 329 105 374 388 453 215 358 40
4467 40 -305 -372 -681 -113 -252 -246 -191 -169 -343 -60 186 365 505 178 186 171 227 80 -46 64 -178 -145 -384 -473
4491 -473 -114 -74 -91 -104 120 11 112 243 182 450 390 250 274 119 -260 -395 -514 1 -156 -121 -377 -625
4513 -625 -168 100 390 312 441 347 -6 111 178 339 -105 -52 -297 -640 -385 -402 -298 -330 -183 -49 326 123
4535 123 222 184 597 509 285 74 269 -64 -278 -320 -360 -591 -400 -422 -241 -243 59 191 353 567 205 229 414
4558 414 -2 257 103 32 -193 -26 -366 -522 -240 -156 61 -112 401 24 175 263 229 220 286 -48 191 -122
4580 -122 -161 -398 -466 -278 -687 -153 -340 -322 -38 10 -164 333 544 560 315 176 282 -50 -241 -51 101 -303
4602 -303 -627 -433 -429 -240 54 105 53 156 159 351 168 504 275 204 17 -93 -200 -70 -298 -350 -638 -185 -183
4625 -183 -280 -50 25 -5 292 477 420 359 169 443 65 -34 -251 -182 -520 -428 -534 -399 -74 -235 24 217 418
4648 418 312 373 501 391 415 236 -90 -415 -62 -318 -572 -415 -222 -423 -89 70 -28 173 258 455 421 439
4670 439 418 181 138 237 -256 -333 -450 -163 -189 -265 -266 -510 -267 -11 319 338 637 518 498 43 217 -79 -63 48
4694 48 -538 -453 -570 -410 -458 -54 -1 -15 -94 74 168 162 244 141 308 184 -23 -345 -121 -400 -295 -420 -243
4717 -243 -209 -314 -223 42 137 296 26 268 715 229 180 110 183 192 -142 -242 -241 -646 -343 -225 -220 93 110 171 495
4742 495 195 140 616 678 462 241 78 -152 -350 -355 -388 -373 -263 -458 -322 -176 -7 375 525 499 384 575
4764 575 173 60 8 83 67 -128 -176 -694 -531 -591 -302 31 -161 133 153 100 384 190 513 387 315 139 -131
4787 -131 -189 -441 -263 -340 -396 -465 -288 -437 -88 322 471 421 481 327 220 122 271 -187 236 -65 -182 -367
4809 -367 -397 -453 -106 -92 -91 41 135 116 50 313 348 481 445 115 278 33 -337 -82 -317 -294 -373 -243 -222 -234 -141
4834 -141 473 352 390 603 593 149 60 244 232 144 -54 -544 -390 -700 -354 -73 22 -158 -101 -127 135 212 231
4857 231 646 120 241 35 10 -164 -222 -447 -13 -314 -291 -11 -331 -202 -246 195 313 353 416 190 63 -17
4879 -17 -89 354 262 -72 -100 -459 -354 -428 -66 128 14 -56 168 210 221 154 420 456 177 -89 -190 -159 -353 -123
4903 -123 -316 -106 -145 -34 -18 -66 -23 277 82 406 315 398 -2 -145 -226 -82 69 -53 24 -438 -524 -148 -131
4926 -131 -7 -7 142 179 121 347 167 327 204 180 184 21 -107 -309 -337 5 -83 -317 -196 -105 10 154 26
4949 26 237 137 299 341 222 219 302 -40 -9 -43 -432 -443 -255 25 -1 -41 -38 44 -158 112 308 273 227 246 76
4974 76 -149 -243 -493 -166 -232 -215 -5 -143 -199 -44 107 164 144 236 211 61 28 -285 -51 -45 47 80 -482 -223 -462
4999 -462 -326 -9 24 5 117 66 -33 113 138 325 370 280 240 -152 -396 -4 -173 -110 -176 -157 -258 -177 -183 151 342
5024 342 418 318 73 -1 90 117 -110 213 -173 22 -358 -339 -501 -287 -150 -134 78 147 112 167 231 299 330 175
5048 175 363 126 -82 -343 -476 -180 -80 -201 -288 -116 -159 -254 76 161 377 363 219 236 92 -9 146 17
5070 17 6 -18 -228 -321 -158 -139 -35 -75 303 154 242 209 148 114 337 134 -31 -280 -130 -253 -374 -289 65 -218
5094 -218 36 -87 -70 -53 -2 348 164 151 213 193 -28 195 84 -92 -157 -267 -147 -133 -503 -273 -282 229 53
5117 53 388 195 305 165 246 363 269 61 235 -51 -380 -180 -184 -376 -263 -281 73 -22 58 157 82 134 223 269
5141 269 -56 15 -166 10 -153 82 -180 -39 -295 -251 -259 -142 -59 71 125 71 110 215 97 255 68 337 -24
5164 -24 -125 -256 -243 -53 49 -120 -275 1 41 90 304 80 -15 165 -10 216 -29 -139 -15 -128 -402 -451
5186 -451 -85 -292 -376 55 -85 22 -23 294 158 436 84 -2 232 -110 -189 179 -153 -241 -175 -543 -278 -317
5208 -317 262 -4 87 -71 -93 76 514 271 -21 237 27 -89 -214 -110 -78 -109 -23 32 -96 -86 126 135 118
5231 118 -5 464 259 103 208 159 -45 -261 -102 -185 -354 -264 -153 -163 55 137 -339 55 74 -103 69 266
5253 266 150 102 -214 -53 -188 -171 -62 -93 -156 -246 133 -125 -152 -25 275 205 92 481 108 74 212 -65 249
5276 249 -18 -107 -251 -207 -177 -100 -62 34 -131 -4 -3 -17 178 254 415 34 137 -220 -107 -209 -135 40 18 -79
5300 -79 105 -159 -171 218 166 8 262 91 -105 -32 -161 95 26 -73 147 -292 -237 -28 -211 -32 -145 -167 229
5323 229 -149 114 115 29 266 412 204 -144 -295 15 -217 -230 -180 -13 -68 45 -333 -69 -26 -29 258 -92 211
5346 211 -162 14 190 3 152 -94 -81 -221 -300 94 -157 -120 163 -218 131 -77 160 27 119 286 198 107
5368 107 133 -198 -166 -218 -167 -417 49 252 -110 -223 -196 14 82 -66 240 111 -63 -288 -56 -35 153 -28
5390 -28 -277 -67 -65 -204 3 235 28 216 -4 -76 229 98 17 6 236 -84 176 -180 -236 -238 -135 -27 98
5413 98 -40 -191 29 1 -228 -38 111 185 283 -95 -24 -63 2 75 -73 -82 -130 -2 -60 -257 88 135 24 99 223
5438 223 -59 132 57 -161 -21 -43 -230 -31 44 -160 155 4 -25 2 -59 -18 25 -181 111 4 -244 -43 -14
5461 -14 -29 189 372 -146 156 80 -334 186 160 -42 3 41 -13 112 105 97 -107 -6 185 227 115 -171 -149 -67 -185
5486 -185 -1 -9 95 72 -221 77 -15 315 -23 176 -28 -40 -71 51 275 -209 -223 18 -143 -162 -226 104 193
5509 193 11 -185 70 -28 218 -38 96 218 99 56 45 154 -98 46 117 -129 57 -18 30 104 -221 -240 -82
5532 -82 19 238 96 -111 20 -27 74 198 156 -5 -137 94 5 9 135 -220 -30 13 41 -27 59 3 338 235
5556 235 152 -117 -317 10 -130 -160 244 -41 -33 -90 -122 -127 -172 102 -61 152 -62 146 -219 -80 79 161 181 -50
5580 -50 64 -46 -30 -36 217 99 -218 61 -282 6 -127 -31 53 201 42 -52 46 -106 54 122 10 118 56
5603 56 121 73 -377 23 124 140 -75 32 3 215 -120 42 6 24 65 -203 -25 35 8 -212 259 115 -146
5626 -146 -177 32 -182 -114 181 218 82 -326 209 -140 258 -199 250 97 -124 96 -19 107 67 -64 167
5647 167 -168 -167 128 39 -124 -161 30 140 210 20 120 181 -64 -53 77 189 18 103 8 -184 -122 37 -93
5670 -93 23 121 -77 113 -101 -163 -86 -24 100 -61 -8 -102 127 -163 57 116 45 39 -160 -155 -62 171 -70 39 -57
5695 -57 -83 5 -126 77 300 102 13 69 -82 205 219 147 -137 -194 -91 -48 -185 -14 -31 -17 82 95 -8 96
5719 96 -287 -90 144 122 14 135 -118 61 -16 9 35 -96 37 -220 47 136 -53 23 110 -57 208 -62 -157
5742 -157 83 -167 -133 28 39 74 170 178 42 57 219 365 -28 1 54 -196 9 -98 -1 19 60 -35 -114 295 222
5767 222 388 354 113 -55 -153 -61 -18 -79 49 65 -71 -217 -156 -191 -45 -6 84 119 -10 66 106 287 -15 -138
5791 -138 187 152 -177 -165 -65 123 38 77 -158 49 226 87 -151 316 101 104 112 -194 -10 66 -38 14 -269
5814 -269 288 -61 -239 -187 -125 148 375 90 225 231 -136 6 269 5 201 -14 166 15 -211 -333 -298 -185
5836 -185 -74 10 -116 -170 -44 -126 295 117 151 5 21 43 -138 -60 63 -257 1 -228 -46 4 75 65 83 74
5860 74 -74 35 -125 34 -92 199 88 -11 -138 -180 -112 -114 -145 -149 32 20 25 65 -30 -50 119 71 306 -78 -88 36
5886 36 74 -39 -59 99 0 -88 -167 -91 -125 9 145 202 -87 -42 12 -3 36 50 -1 -47 -56 13 -279 -143 -131 -111 -170
5913 -170 -302 -59 -272 -170 -10 100 94 -190 -150 -139 -272 -208 3 -118 24 -36 -56 -240 -334 -31 128 212 303
5936 303 234 69 146 221 184 54 -26 -90 56 68 -142 -184 63 -53 -14 -12 -67 31 229 353 178 218 66 21 241
5961 241 50 194 -16 -24 -252 22 184 -247 -120 -26 -210 69 147 -59 -3 -64 -54 -69 107 313 5 -147 -174
5984 -174 -216 -163 19 -5 -72 -109 160 -27 56 62 203 141 15 233 -147 87 -203 -110 -166 -175 19 -102 -20 146 81
6009 81 -79 1 229 110 -57 -46 177 242 1 -60 -162 -129 -249 -39 -174 24 -43 -174 114 5 27 94 147
6032 147 181 263 127 -21 -8 41 -48 -90 -129 -94 -69 -97 -94 -83 20 -139 277 280 139 25 -135 61 269 181 71
6057 71 -170 -147 -160 -155 -404 -467 -124 -365 81 148 124 67 105 308 165 142 -148 20 -104 -138 -293 -97 -392 127
6081 127 -246 126 -103 50 171 -30 183 243 119 20 83 -47 -74 -14 -194 -165 -68 -409 -326 -176 -116 -3 79
6104 79 142 7 78 113 165 -30 58 142 28 -190 123 -102 -93 -40 -41 -132 -335 -42 -142 176 36 -81 -36 184 54
6129 54 39 173 55 238 -180 -161 92 -193 -271 -50 -69 298 -62 -227 2 -69 -67 -21 206 24 -3 -193 -190 -47
6153 -47 -108 20 -175 -30 -109 11 25 27 103 299 407 247 11 107 -126 -159 -244 115 -143 -60 -45 -101 34 -97
6177 -97 -19 -94 315 -170 480 125 236 291 73 138 -337 -300 -105 -56 -63 -291 -30 -300 -49 52 15 140 220 161
6201 161 98 178 120 138 135 219 -134 87 -249 -339 -185 -40 -163 -85 125 -15 36 50 78 320 -149 278 -29 71
6225 71 -117 -247 -118 -103 -151 -156 -16 -132 -53 28 -69 245 169 14 165 230 255 19 51 217 -74 -218 -206 -305 -37
6250 -37 -269 -101 75 128 -20 -32 252 73 163 -86 -83 -218 191 -111 -31 -36 -244 -154 -166 68 -154 16 256 258
6274 258 117 -30 113 -114 -107 91 -173 57 -177 54 -236 -126 -196 -240 -107 -14 200 -133 21 -91 93 90
6296 90 97 69 137 -237 -307 -70 -184 -112 -60 -265 -235 -73 -84 60 -39 288 13 339 166 136 1 105 165 62
6320 62 -106 -59 -38 -7 -7 -81 -116 105 306 177 7 17 -16 -156 346 73 -25 -159 -25 86 -236 -94 -332 -99
6344 -99 -101 -218 87 -25 190 272 388 121 94 -159 10 -5 17 -35 -109 30 -155 -253 -176 46 134 134 -58 43 366
6369 366 54 88 243 -118 31 199 -84 53 -39 -97 -94 71 -222 124 -11 123 -114 135 189 243 208 129 271
6392 271 31 -61 -92 145 44 109 -223 -153 106 -201 167 91 155 85 0 161 156 168 369 376 125 61 -134 -109 -202
6417 -202 -114 -164 -148 -222 10 47 9 -155 38 174 87 102 9 -114 101 169 5 -201 47 -200 -74 22 -96 -109
6441 -109 193 208 135 -270 -143 28 64 -23 132 -152 -89 -108 22 -112 -62 15 240 -79 -18 206 -149 71 -149
6464 -149 -158 -175 81 124 59 79 194 -69 -224 -2 -70 -25 53 210 -290 72 -131 -120 -98 -171 228 235 21 -36 132
6489 132 53 -175 177 115 35 1 -69 -212 -228 64 43 61 -104 -41 187 97 -166 218 108 122 124 56 28 2 -151
6514 -151 -116 -80 -152 -145 102 -59 121 110 268 132 310 -31 -212 -290 71 -166 -144 -62 22 -87 8 -87 -152 55
6538 55 195 26 59 1 52 -136 -94 -176 -347 3 -207 -238 -134 -200 -89 -16 -290 -45 82 -211 88 3 -29 248
6562 248 -21 -19 204 -263 -200 -241 25 -64 73 -112 -1 34 -148 -38 181 181 -63 -28 61 41 1 -158 18 -116
6586 -116 142 -12 130 -73 112 112 -11 44 -54 61 19 42 77 -53 -30 -110 172 62 158 -109 50 -102 68
6609 68 -12 -189 -201 68 66 -14 85 43 27 -87 -70 93 -276 1 7 -271 -137 -100 -200 -68 -94 53 193 -40 -64
6634 -64 -25 -108 277 197 -21 -135 67 -295 -167 112 17 160 41 139 -11 -95 -102 -8 132 -14 -104 10 208 1
6658 1 129 -234 -42 163 -249 -45 -126 13 3 -18 -247 182 79 184 149 -90 -229 215 43 -65 -143 -7
6680 -7 22 -169 -147 -93 161 164 119 -269 -114 -30 319 -162 99 74 -169 -285 99 -64 191 44 176 -115 -175 230
6704 230 172 150 -74 10 -7 -194 -88 172 -41 -62 -19 -316 -184 -5 270 -186 238 28 34 342 -29 8 -72
6727 -72 178 135 157 -7 -290 -84 -101 155 9 98 395 -219 64 -90 -72 188 186 -7 120 -161 82 298 -171
6750 -171 154 106 -40 96 39 41 -138 240 439 86 1 4 100 -102 -8 151 29 -188 -94 -102 -3 -321 34 233
6774 233 -130 6 3 45 172 10 99 5 164 -193 -4 -354 90 334 51 212 35 -73 -27 -115 -36 170 351
6797 351 90 135 182 -95 326 -54 167 -28 32 -148 -248 -180 172 89 64 300 -44 94 23 -2 20 40 132 -140
6821 -140 -130 -273 -205 37 -77 -127 -38 419 246 25 13 66 22 221 -120 -134 -66 6 -19 129 -53 -6 -121 -49
6845 -49 137 -54 230 -266 -100 178 229 -18 -220 -62 -29 120 -71 -57 86 -140 48 -82 -197 163 250 -263
6867 -263 -45 111 -50 119 328 -183 105 91 -137 91 138 -190 -70 31 -243 -49 -104 4 -13 234 79
6888 79 -36 -27 226 163 -94 209 177 -12 2 -169 -292 -50 79 -10 -10 52 -97 -74 -57 100 65 4 68 132 22
6913 22 92 -75 -224 -15 -54 -378 -61 -183 -60 -14 46 43 158 -38 -57 181 63 149 130 143 150 -44 -123 128 -48
6938 -48 -243 -175 192 -1 -105 -205 74 137 5 276 223 48 36 -83 -47 -37 -67 -245 -223 -67 -251 -99 99
6961 99 38 191 244 35 76 42 240 170 50 -46 -142 -324 0 -47 -323 12 135 18 -180 136 183 -96 73
6984 73 171 -20 -3 -149 -78 -51 -46 -9 214 -159 167 -249 -206 93 -338 209 98 51 246 -56 -205 122 140 53
7008 53 7 313 -52 -234 -147 -172 -210 78 119 62 -37 48 -184 253 154 225 237 -30 102 -92 -276 -103 115 -80
7032 -80 -56 -160 26 -141 -283 116 -11 -31 103 7 21 -114 56 -75 -207 62 -44 -138 34 -43 -77 169 75
7055 75 111 -81 38 126 166 4 405 -94 -97 -69 -3 -186 92 140 163 -26 154 4 163 69 13 78 176 357 48
7080 48 80 -24 -44 -65 -138 -138 -20 -123 -279 -157 -48 45 -251 47 36 133 -25 233 30 101 -27 -182 -332 -82
7104 -82 -32 53 -206 144 23 -265 78 -40 66 -15 238 3 153 -157 -25 -147 -141 -148 166 77 -439 -307 -303 -3
7128 -3 101 42 156 -29 196 104 -55 181 90 20 -73 -192 -68 -146 36 -143 -75 -125 129 -78 12 102 33 116 16
7153 16 187 261 94 82 -142 -51 70 -103 -211 -120 -139 6 -120 108 70 -140 -263 -266 125 172 127 -7 54 -15
7177 -15 95 -410 -67 -41 46 -247 -87 19 -124 172 90 263 -8 -117 63 -257 -50 -144 74 -14 30 -93
7199 -93 7 -223 -146 -14 -166 -154 -18 128 -250 10 -31 68 28 57 217 -39 -145 -145 26 -67 45 -199 -52
7222 -52 259 -285 -214 111 173 4 251 131 -49 37 -175 -115 -162 -52 -230 -222 15 -163 -2 149 224 -117 -219
7245 -219 -86 -99 -83 -28 266 -258 124 51 -166 215 -117 127 17 19 -35 7 -23 134 -107 100 158 -9 -127
7268 -127 -44 108 -167 36 -146 104 -84 -38 82 -67 -168 -156 -27 22 -259 -159 -153 207 4 -87 93 109 -87
7291 -87 2 -153 -251 -113 -50 -254 5 15 -138 -28 2 33 -5 60 90 -107 19 203 89 188 79 -37 -92 -140
7315 -140 -101 -79 111 262 -118 71 235 81 -51 -53 6 13 -168 -13 -142 -75 211 -151 248 149 -213 2 -81
7338 -81 109 90 99 46 -56 82 20 -118 175 -211 93 -42 -115 -50 -98 -158 -84 31 -72 235 30 146 42 81
7362 81 139 -42 25 35 -13 -268 76 -38 -289 239 99 -189 65 184 -152 98 135 -68 64 -193 -171 9
7384 9 49 -160 128 357 -8 5 -54 29 380 -65 -14 -109 2 218 168 257 69 107 187 80 -59 -134 174 226 82
7409 82 -119 -69 -301 -269 -97 21 -106 13 213 -131 -89 -17 140 -83 -129 136 -102 -140 84 107 -21 218 -83
7432 -83 -177 116 -130 12 -79 -39 91 128 193 -39 -159 -35 -229 209 21 -326 -115 -79 -64 -136 23 89 113 -134
7456 -134 74 -5 -135 -51 -11 -1 -38 -103 -155 214 15 68 44 225 -58 -208 48 -118 139 -8 199 287 179
7479 179 -29 -13 65 49 80 -33 -147 -64 66 -222 -89 85 176 111 -48 89 -13 -230 123 -107 -29 -136 -197
7502 -197 110 93 115 171 58 45 -15 -337 70 -4 -67 298 145 -190 -340 115 62 16 -116 -19 66 -115 41 -67
7526 -67 -140 -89 3 -106 324 -58 -73 -71 -32 140 -47 222 259 40 -113 -22 -8 -21 -121 451 -137 -5 -138 187
7550 187 148 11 210 48 -35 10 89 197 127 44 -149 -25 -113 -169 39 -81 -303 248 -22 53 -60 -36 72
7573 72 67 275 109 -92 101 64 -87 130 -26 99 115 97 47 -37 -152 -22 -123 187 181 46 80 -282 206 -65
7597 -65 234 -111 -104 72 -177 -46 -21 -31 -81 -166 -39 59 62 -175 -181 182 -92 27 -13 -71 -177 -52 15 -114 -86
7622 -86 -253 -34 42 131 0 350 64 -10 -139 248 -110 271 205 -34 188 47 -136 -301 -85 -186 -213 140
7644 140 328 -109 -200 -150 193 -82 71 46 65 35 223 -155 58 159 -28 38 -16 117 -103 109 155 213 130
7667 130 219 67 7 -93 -405 97 -228 97 -33 8 -213 205 -190 123 223 50 126 -318 44 88 -119 34
7689 34 51 -82 29 -313 13 80 63 16 -51 -222 -93 0 -152 73 251 103 110 -139 28 -176 211 74 -90
7712 -90 -65 61 190 -57 58 -26 79 122 117 24 48 -50 194 182 -98 202 78 -152 98 -93 -211 -13 79 -147
7736 -147 -194 -203 127 -10 106 301 12 54 -120 -150 32 -162 116 112 57 -181 -179 25 -63 -69 45 69 185 -227 -165
7761 -165 -6 64 239 167 310 105 -74 166 8 162 -70 -78 85 -76 -230 -152 -50 45 -241 8 -103 -4
7783 -4 118 111 182 141 62 -92 -77 -127 -52 -45 131 -29 -149 121 66 -72 6 246 217 167 103 -71 -198 -215 -240 44
7809 44 33 -73 -90 -273 84 -21 70 128 -121 185 16 -23 42 2 430 60 108 -204 -78 -116 -122 -34 57 4 32
7834 32 64 -131 -39 219 187 4 181 81 -183 72 -173 -63 -61 88 137 -206 -180 -210 -140 37 195 199 62 -4
7858 -4 -6 -90 102 75 116 99 -190 -238 -163 -35 93 34 88 13 126 -150 -34 1 200 191 11 43 159 76 86 168 -47
7885 -47 -45 16 -113 -124 -226 -113 47 431 141 130 83 26 17 44 -126 125 -265 -34 -29 -223 -26 -39 102 218 -110
7910 -110 -21 -6 -89 -172 169 94 -35 21 -285 25 -247 -60 -68 -52 -110 -49 -129 -115 -24 -22 125 -12 -125 112 -83
7935 -83 179 191 93 132 73 -94 -258 -100 93 193 -79 -9 42 203 88 -106 64 320 131 328 88 -13
7957 -13 -88 -126 -88 69 6 -22 -152 -115 -29 -81 140 49 230 183 -87 -138 22 150 91 118 51 -269 -18 83 -180
7982 -180 -163 129 39 -100 -130 7 75 -49 -151 41 -73 170 208 -66 -74 -143 -76 42 25 -23 -113 -64 80 83 102
8007 102 83 70 -160 120 218 -7 28 234 87 -119 -235 -25 17 -276 -181 81 44 122 -29 -56 35 145 131 73
8031 73 -120 113 42 300 -166 0 -109 90 -64 -181 -127 -118 173 84 174 128 -99 280 224 64 73 -189 63 6
8055 6 -135 -87 -22 105 143 -139 135 206 -24 -60 16 -145 143 -208 148 103 -183 46 171 69 -230 -85 -199
8078 -199 63 -4 -105 276 -190 158 -14 164 31 72 82 128 -227 -119 -13 -116 -51 105 116 -177 229 -6
8100 -6 -97 -43 166 252 -26 141 35 -72 218 2 -198 47 -19 -2 -141 -197 -313 -59 298 230 194 175 18 60
8124 60 -80 -22 200 213 193 10 122 -232 -205 44 84 144 77 246 85 -92 -43 186 87 123 65 113 -122 -124 30
8149 30 -186 240 40 -33 -371 -152 -119 149 -14 12 -22 -179 268 -100 -118 44 42 9 -96 -45 -60 -4 -88 107
8173 107 -97 116 190 85 -23 60 15 588 35 25 -30 -158 47 -122 222 -314 56 65
8191F5
$$ Imaginary data points
##PAGE= N=2
##DATA TABLE= (X++(I..I)), XYDATA
0 0 0 0 0 0 0 0 0 0 0 0 8 -8 8 -16 16 -24 24 -32 40 -48 56 -67 80 -93 110 -126 149 -171 197 -228 261 -295
32 -295 337 -381 428 -484 542 -608 680 -760 845 -940 1042 -1154 1278 -1411 1557 -1716 1893
49 1893 -2083 2296 -2529 2787 -3079 3399 -3765 4178 -4654 5205 -5860 6640 -7600 8810
63 8810 -10387 12545 -15687 20712 -30068 53546 -247518 -270309 204449 109390 -307460 -766904
75 -766904 -706590 -227827 347219 578868 495507 263916 127112 96595 172769 259337 298028
86 298028 179457 -69236 -347011 -478285 -421621 -246160 -112800 -90032 -138247 -122142 6662
97 6662 178705 259065 232571 200549 261704 350351 318485 104237 -164223 -306601 -254079 -109810
109 -109810 -34712 -118518 -309137 -447123 -371965 -70266 276022 430557 320564 106838
119 106838 15462 113777 276852 339854 241419 28811 -206918 -372673 -392545 -261250 -84258
130 -84258 -12055 -98241 -230734 -228421 -25664 257798 418999 357854 163634 26253 51874
141 51874 166583 199688 64706 -153118 -293424 -282176 -185034 -114885 -118532 -155871 -156257 -81731
153 -81731 55174 196810 271251 246273 163490 105757 114407 148642 132945 36336 -105674 -230998
165 -230998 -291689 -269373 -182445 -88210 -52126 -81804 -100869 -20911 153616 308759 330563
176 330563 221062 92517 48182 80595 93640 13267 -135574 -254284 -270685 -200792 -122495
187 -122495 -91080 -93505 -75698 -5408 97081 187334 231508 219605 161479 86945 37057 30821
199 30821 41695 12884 -80676 -196773 -260289 -230871 -133022 -32855 16195 6218 -22288 -9683
211 -9683 74191 193589 264770 229515 113937 7706 -25853 -7120 -6194 -60735 -140920 -191078
223 -191078 -186337 -145828 -99635 -57035 -8758 48246 102033 137302 151257 149657 136119 107014
235 107014 63997 17964 -18866 -50971 -94783 -150930 -189758 -175755 -108324 -28813 17323 22091
247 22091 16984 36757 89188 149496 181922 161349 92212 9064 -43640 -50443 -37864 -49000
259 -49000 -94539 -141693 -151520 -117384 -66151 -23318 10870 46660 84612 111824 120500 115955 106967
272 106967 91332 61163 17082 -28680 -65077 -93130 -119792 -141483 -140418 -104931 -47168 3893
284 3893 30230 41873 61595 97883 132990 143407 119315 71407 17311 -29498 -61419 -77923
296 -77923 -86589 -98184 -110783 -110445 -83872 -37325 8229 39410 60667 82700 104093 110019 93058
309 93058 62760 35368 15910 -3921 -31917 -64081 -89085 -101008 -98805 -84154 -56514 -21657
321 -21657 9114 26129 34913 50548 79882 109149 112665 82796 35135 -3913 -23612 -32839 -46310
334 -46310 -68083 -90870 -102852 -94647 -64642 -19244 24483 49901 55484 56210 67801 86985 93705
347 93705 72152 29712 -12106 -38143 -50642 -60118 -71097 -77613 -72770 -56095 -32303 -6708 16895
360 16895 34214 45456 54388 65578 75342 71206 44903 6056 -23168 -29359 -20595 -19842 -39383
373 -39383 -68683 -86051 -76156 -41014 2211 36009 46885 36543 21815 25691 54251 85649
385 85649 87928 47349 -14427 -59208 -65880 -47677 -33036 -38270 -54509 -60541 -46086 -16194 17494
398 17494 44875 60327 63785 57970 48477 38241 25534 6001 -16140 -31341 -34453 -32943 -38873
411 -38873 -52830 -61386 -48967 -14684 24185 47064 44537 24316 5326 6327 31084 61952 68867
424 68867 34695 -24612 -68995 -67185 -27356 10725 10287 -26516 -65156 -67619 -29544 23595 59580
437 59580 63817 44574 20446 8426 14074 29765 38301 23569 -13654 -52925 -70274 -57866 -31067
450 -31067 -11843 -7537 -9148 -4373 10523 28270 40164 41652 35437 28396 22630 14093 -2555 -25982
464 -25982 -43348 -40750 -19114 1775 1576 -21237 -41780 -34357 2536 43541 58148 38529 3554
477 3554 -18897 -14267 10418 34955 40247 17697 -22579 -56344 -60170 -28492 15052 34024 13053
490 13053 -27415 -48704 -27947 20574 59412 61506 30891 -5784 -21898 -12335 8136 17094 5351
503 5351 -18075 -35610 -34593 -19946 -4556 2759 4493 8273 15647 19809 16013 6739 124 753
517 753 5081 7141 4438 -2617 -11525 -20160 -22704 -13049 6850 22072 17519 -6769 -28845 -25982
531 -25982 1427 29835 34230 12646 -13078 -20420 -5798 15018 22729 11799 -7768 -20566 -19827
544 -19827 -9396 514 1958 -4210 -9289 -6017 6193 17923 20543 11854 -408 -8172 -5756 3563
558 3563 10318 6727 -9060 -26671 -31403 -13918 15912 35784 28168 -201 -25077 -23256 2201
571 2201 26925 28008 5308 -21982 -32834 -23092 -3217 14427 20932 15751 3761 -6443 -8643
584 -8643 -1950 8622 13833 8642 -3447 -15028 -19716 -15753 -7786 740 7442 10563 9004 3493
598 3493 -3030 -5088 -245 9956 18592 18934 6462 -14159 -28523 -24581 -3152 18267 20660 9
612 9 -25928 -33782 -16000 12684 31562 30765 14962 -2428 -10830 -5791 8077 20578 19602 1797
626 1797 -23761 -39806 -35750 -15095 6185 14221 6695 -4374 -6939 3755 20698 31319 29523
639 29523 17011 1486 -10687 -15886 -15726 -13502 -11929 -11602 -11980 -11630 -9934 -5982 1895 13335 22861
654 22861 24287 15840 4401 -2037 -154 4819 6688 2806 -4392 -12806 -20350 -22166 -16035 -4271
668 -4271 5230 5268 -2910 -9731 -5944 8092 23720 30898 25540 13350 1449 -3976 -3511 -1976 -4399
683 -4399 -12625 -23007 -29914 -29289 -19437 -5732 6816 14031 17464 19889 22505 24029 22770 18714 11674
698 11674 1489 -10577 -20545 -25335 -25650 -24617 -24039 -20005 -10434 1942 11011 14851 16034 18969 24141
713 24141 26925 24195 16537 6260 -4075 -13180 -20225 -23437 -23181 -21811 -21162 -20423 -16423 -8219 3657
728 3657 16413 26491 31870 31862 28361 22283 14348 5634 -2393 -10546 -19787 -29501 -36674 -37667 -32021 -21578
744 -21578 -7134 8070 21159 28376 28688 26535 26886 28731 27125 17706 1058 -16303 -29617 -35942
758 -35942 -34676 -27598 -18091 -11627 -9603 -8571 -2943 9205 24203 34577 35948 28756 17995 8077
772 8077 2467 29 -1988 -7389 -16652 -26946 -34351 -34852 -27653 -15139 -2820 6279 12324 17609 23153
787 23153 28193 31555 32604 29335 20465 5144 -12064 -26286 -33613 -35412 -34104 -30676 -24893 -17391
801 -17391 -8234 2077 15156 30332 41649 45008 38764 27683 14635 3942 -5530 -13890 -21530
814 -21530 -29791 -36462 -39505 -36200 -26022 -11592 3155 14527 21927 26725 30913 33769 33912 29748
828 29748 21667 10174 -2866 -16357 -28205 -35949 -38135 -36135 -31641 -25078 -15055 -1964 11130
841 11130 22883 32764 40889 44926 41997 31426 16376 797 -11857 -22637 -32088 -38548 -41848
854 -41848 -41141 -35347 -24090 -7488 10624 25620 34731 37942 37792 35247 31829 25497 13780 -1080
868 -1080 -16632 -29794 -37315 -38571 -35385 -29169 -22492 -15338 -7123 4270 17781 29772 36624 37632
882 37632 34109 28306 20846 10782 168 -10821 -21035 -29864 -37288 -40342 -38083 -30284 -18351 -5179
896 -5179 8363 21122 30962 36581 38724 38392 35527 28315 14908 -2591 -20627 -34229 -41317 -41898
910 -41898 -38024 -32384 -25640 -16866 -5331 9354 26625 40138 46394 43830 35068 24888 14933 5650
924 5650 -4684 -16845 -28900 -38423 -43155 -41246 -33799 -21697 -8666 3438 13445 23159 32026
937 32026 39502 41774 37630 28402 17861 6263 -6541 -20387 -33126 -41692 -44486 -41488 -34036 -22741
951 -22741 -9251 3487 15242 26924 38148 46767 48546 41669 28311 12079 -3539 -16804 -27190
964 -27190 -34962 -40441 -42744 -40645 -33107 -20678 -4380 12156 26659 36746 41450 41078 36499 28442
978 28442 18765 8166 -1833 -12670 -25011 -37699 -46135 -45008 -34928 -19393 -6092 3311 9502
991 9502 14967 22888 33073 42568 46454 39363 21846 1119 -14708 -22662 -25140 -27226 -31318 -37652
1005 -37652 -41244 -36782 -22395 -478 20635 34724 39744 38150 34358 31428 28640 22794 11880
1018 11880 -4034 -22070 -37098 -45660 -46079 -39149 -27858 -15349 -4240 4366 12663 22570 33792
1031 33792 41591 43239 37848 26409 11002 -5327 -18305 -24927 -26720 -28628 -32576 -36388 -34840 -24810
1045 -24810 -7970 9552 23770 31736 33317 32099 30657 30322 27749 19797 5394 -12986 -28857
1058 -28857 -37991 -39667 -36445 -31397 -26799 -20140 -9599 5172 20726 33792 40550 41631 37642 29619
1072 29619 19784 8542 -2847 -15474 -28033 -37365 -40424 -37621 -31345 -22505 -11639 1181 14313
1085 14313 24716 31747 35533 36031 32967 25366 15680 4270 -8012 -20015 -29442 -34111 -34182 -31382
1099 -31382 -26790 -20632 -11803 -474 12731 24486 33252 36595 34532 29599 23094 15174 5511 -6470
1113 -6470 -18457 -29047 -36453 -38622 -35121 -27407 -17420 -7215 3776 15265 26800 35023 37709
1126 37709 35161 29182 20632 9750 -2306 -13645 -23701 -31563 -36579 -36010 -29334 -19822 -9907 -681
1140 -681 8562 18049 26475 32079 33934 30439 23463 14384 4504 -4915 -13523 -21003 -26436 -29504 -29507 -26819
1156 -26819 -21011 -11945 -1308 8704 17295 24315 29087 31153 28201 22786 15366 7181 -1915 -11750
1170 -11750 -21820 -29440 -33318 -32666 -27389 -18513 -8034 1771 9980 17601 25379 31596 32852 29680
1184 29680 22145 12597 2022 -9542 -19467 -25910 -28427 -28624 -26297 -21917 -15514 -6913 2886 13526
1198 13526 22237 28027 29362 27584 22764 15853 7786 262 -6974 -13902 -21034 -27803 -30864 -28580 -21503
1213 -21503 -12454 -3036 5517 13325 19040 23637 27332 28285 25857 18825 8894 -1036 -11042 -19915 -27044
1228 -27044 -29731 -27855 -23049 -17140 -10256 -2138 7398 16583 24204 29603 30353 26728 18945 8737 -867
1243 -867 -9310 -14980 -19130 -22062 -24504 -25280 -22704 -14962 -3856 6541 14271 18531 20413 20962 19806
1258 19806 17354 14503 9900 3147 -5111 -13165 -19009 -22776 -23067 -19956 -14099 -8065 -3687 -80 5033
1273 5033 11753 18735 23605 24630 21296 14860 6157 -2450 -8686 -12256 -15078 -17879 -21368 -22820 -20563
1288 -20563 -13620 -3031 7901 15418 18599 18915 18702 18686 17100 13059 6628 -1154 -9023 -15992 -20351
1303 -20351 -21839 -19582 -16253 -11647 -6217 -492 5277 10139 14458 18265 20028 19223 14940 9651 3401
1318 3401 -2546 -8881 -13539 -16533 -17407 -17472 -17058 -14259 -8664 -1315 6878 13232 17385 19067 19104 17617
1334 17617 14196 9084 2342 -4782 -11027 -15855 -19358 -21149 -19503 -15176 -8776 -1938 4723 10789 14953
1349 14953 17433 17664 17088 15138 10655 4107 -3390 -9661 -14091 -15922 -15907 -13888 -11285 -9016 -5694 -1846
1365 -1846 4000 10037 14567 15329 13688 10280 7870 5791 3471 486 -4314 -8903 -12867 -14809 -14146
1380 -14146 -11563 -7120 -2956 270 2730 5089 8685 12628 15192 15281 12123 6936 659 -4496 -8352
1395 -8352 -9963 -10124 -10712 -11853 -13081 -11338 -6238 1180 8487 12878 13732 11708 8812 7087 6532 6209
1411 6209 4310 -532 -7294 -13039 -15228 -13549 -9304 -4657 -1917 -622 -283 1526 4754 8699 12226
1426 12226 13687 11844 7507 2137 -2670 -5153 -6152 -6138 -6888 -8970 -11187 -11948 -9658 -3903 3787 10244
1442 10244 13124 12022 9563 7215 6584 6643 5505 2025 -3831 -10463 -15188 -15930 -12442 -6985 -1659 988
1458 988 2352 3514 5460 8340 11134 11924 10370 6031 1038 -3594 -6924 -8194 -8026 -7107 -5936 -5046
1474 -5046 -4312 -3605 -2191 1156 5163 9047 9749 7995 4565 1597 678 1131 989 100 -2655 -6220 -8490
1491 -8490 -9275 -7537 -3846 191 2293 2384 2176 2825 5386 7747 8754 7154 3946 684 -2522 -4966
1507 -4966 -6074 -6960 -6839 -5921 -4073 -2383 -987 174 2127 4408 7063 8976 7198 4388 566 -1804
1523 -1804 -2471 -2376 -2207 -2672 -4177 -5719 -6046 -4791 -1965 1720 4522 4563 3064 1226 2005 3807 4962
1540 4962 4736 2270 -818 -3016 -4018 -4071 -4532 -4383 -3953 -3037 -2135 -931 972 2718 4491 6251 7139
1557 7139 6348 3693 954 -1658 -2517 -3376 -4049 -4842 -5833 -5589 -4525 -2373 1063 4374 6825 6450 4371
1574 4371 2371 1667 2237 2765 1209 -2486 -6223 -7401 -5807 -2521 -199 195 -199 -117 877 2163 3675
1591 3675 4413 4504 3545 1452 -755 -2278 -2349 -1391 -890 -1493 -2773 -3636 -3870 -2204 -470 1775 2872 3555
1609 3555 3442 2853 1767 1109 1291 2084 2093 -186 -3809 -6740 -7251 -4753 -662 1516 1842 435 85 1442
1627 1442 3936 5879 5930 4295 1553 -1544 -4196 -5380 -4186 -2340 -1195 -1706 -2675 -3087 -1223 1534
1643 1534 3932 4970 4534 3363 1788 708 150 -785 -1086 -1321 -990 -1427 -3324 -4866 -4550 -2417 792
1660 792 2558 2816 1766 1065 1541 3073 4123 4063 3083 983 -1079 -3254 -4864 -5371 -4273 -2501 -1928
1677 -1928 -1859 -1781 -652 2190 5289 6471 6103 5018 3779 1732 -649 -3110 -4588 -4688 -4198 -3723 -3921
1694 -3921 -4273 -3605 -1390 2536 5753 6616 5571 3736 2338 1606 1906 1230 -97 -1797 -3864 -5236
1710 -5236 -5874 -4959 -3527 -1085 363 820 679 1019 2691 5057 6383 5305 3671 1940 825 -728
1726 -728 -2534 -4516 -5662 -5226 -4546 -4254 -4070 -2745 -195 3049 5830 7231 7090 6021 4670 3656
1742 3656 2001 -575 -2945 -5111 -6266 -7038 -6956 -5725 -3588 -1273 952 2943 4712 5633 6667 6623
1758 6623 5479 3176 1035 -1047 -1743 -2493 -4242 -6096 -7013 -6629 -4409 -1670 194 1094 2064 3686
1774 3686 5035 6105 6308 5989 4819 2418 200 -2670 -4659 -5992 -6330 -6057 -5731 -5049 -4121 -1838 1462
1791 1462 4156 6162 7615 8113 7355 5551 3013 608 -1640 -3166 -4618 -6255 -7716 -8378 -7285 -3914
1807 -3914 -145 2558 3728 4388 5254 6451 6688 6222 4751 2362 272 -2388 -4371 -5834 -6470 -6111
1823 -6111 -5366 -4740 -3709 -2167 -130 2268 4748 5984 6958 6909 6374 5224 3120 788 -1945 -4071
1839 -4071 -5804 -6998 -7660 -8021 -6955 -4408 -1890 1526 4158 6226 7708 8865 8451 7440 5173 2063
1855 2063 -759 -3546 -6056 -8049 -9157 -8660 -7202 -5228 -2569 142 3272 5711 7707 8133 8380 6984
1871 6984 5345 3227 1008 -2117 -4481 -6706 -8206 -8082 -7112 -5875 -3995 -1787 687 2936 5231
1886 5231 7003 7975 8244 7570 5994 3106 87 -3163 -5010 -6343 -7232 -7958 -7883 -6788 -4975 -2008 1560
1903 1560 4840 7794 9016 9053 7660 5718 4044 2342 -408 -3092 -5826 -8047 -9581 -9565 -7248 -4197
1919 -4197 -1041 1626 3250 4299 5264 6515 7830 7788 6859 4357 421 -2886 -5131 -6021 -5970 -5800 -5933
1936 -5933 -5924 -5581 -4443 -1464 2066 5386 7845 8285 7740 6358 4804 3406 2029 38 -1978 -5356
1952 -5356 -8249 -10538 -10096 -8123 -4723 -980 2096 3711 4642 6119 7843 9662 9563 7543 4087 -682
1968 -682 -4810 -7490 -8368 -8210 -7405 -7026 -5996 -4778 -2365 1683 5340 8729 9688 9328 7794 5555 3046
1985 3046 1314 -854 -2846 -5144 -7342 -8864 -9421 -8371 -5490 -2159 1174 3448 5117 6344 7064
2000 7064 7716 8140 7637 5806 1714 -2359 -5444 -7715 -8534 -8085 -7483 -6252 -4758 -2881 -24 3591
2016 3591 6841 8780 9519 8678 6759 4351 2191 -331 -2893 -5613 -7290 -8542 -8386 -7318 -5253 -2818
2032 -2818 -133 2474 4523 5886 6702 7357 7090 6171 4384 1985 -749 -2984 -5450 -6299 -6995 -6531 -6058
2049 -6058 -5213 -3891 -1538 910 3962 6141 7359 8002 7190 6117 4477 2796 412 -2598 -5722 -7711
2065 -7711 -8885 -8594 -7116 -5099 -2375 -400 2549 5079 7312 8439 8578 7956 6465 3371 418 -2890
2081 -2890 -5060 -6922 -7947 -7962 -7289 -5744 -4146 -1701 795 3824 6568 8224 8502 7317 5682 3813
2097 3813 2101 425 -1870 -3997 -6575 -8160 -8322 -7500 -5821 -3297 -522 1901 3788 5568 6904
2112 6904 7695 7711 7034 4942 2219 -948 -4075 -6316 -7760 -8028 -7570 -6010 -4393 -2431 -529 2165
2128 2165 4974 7519 9063 8808 6994 4287 1829 -616 -2270 -3473 -5063 -6760 -7745 -7423 -6422 -3517
2144 -3517 -463 2195 4173 4908 5146 5581 5690 5314 4975 3249 1023 -1652 -4293 -6101 -6647 -6720 -5624
2161 -5624 -4524 -2758 -1678 -481 1648 3871 6722 7899 8077 6465 3644 1184 -811 -2110 -3303
2176 -3303 -4915 -6634 -7843 -7763 -6276 -3582 -123 2913 4963 5833 6285 6693 6597 6033 4152 1720 -1195
2193 -1195 -3664 -5398 -6762 -7078 -6620 -5633 -4018 -1569 667 2560 3798 4642 6095 7233 6899 5286
2209 5286 2854 101 -2260 -3881 -4893 -5272 -5869 -6486 -5822 -4202 -2082 521 3168 5186 6110 6767
2225 6767 6406 5676 4514 2963 460 -2281 -4594 -5692 -6375 -6603 -6602 -5158 -3188 -493 2300 4292 5725
2242 5725 5671 5864 5571 5104 4031 1866 -1232 -3775 -5335 -5819 -6095 -5064 -4395 -3631 -2388 -364 2003
2259 2003 4023 5178 5782 5138 4429 3761 2629 1219 -563 -2977 -4831 -5709 -5515 -4665 -4061 -3722 -2441
2276 -2441 -607 2061 4251 5596 5989 5660 4594 3762 2512 993 -637 -3100 -5404 -6371 -6092 -5400
2292 -5400 -4110 -2756 -876 634 2778 4684 5642 5931 5333 4053 2996 1486 78 -1750 -3956 -5477
2308 -5477 -6030 -5125 -3710 -2638 -1733 -929 805 2536 4404 5762 5602 4357 3460 1963 631 -295 -1811
2325 -1811 -3250 -4519 -5252 -5482 -4507 -3383 -1835 -210 1451 3157 4523 5581 5841 5182 3559 1777
2341 1777 547 -787 -2212 -4200 -5832 -6479 -5639 -3813 -1713 -93 1314 2419 3158 4468 5421 5762
2357 5762 4625 2911 877 -1054 -2361 -3707 -3945 -3962 -4338 -4013 -3470 -1846 -146 1322 2753 3746 4450
2374 4450 4630 4645 3250 1732 388 -804 -1611 -2334 -3545 -4882 -5383 -4714 -3255 -1234 976 1989 2728
2391 2728 3053 3689 4400 4921 4378 2750 706 -1887 -3472 -4628 -4798 -4420 -3780 -3023 -2198 -794 667
2408 667 2429 3719 4679 4745 4429 3495 2091 240 -966 -2201 -2649 -3087 -3750 -3744 -3611 -3198 -1994 156
2426 156 1868 2984 3480 3235 2999 2883 2930 2386 1619 44 -1781 -3209 -3761 -4113 -3582 -2863 -2138 -1141 -327
2445 -327 839 2074 3223 3950 4502 4211 3262 1647 -96 -1353 -2276 -3223 -3686 -4027 -3676 -3201 -2297 -890
2463 -890 581 2234 3259 3857 3704 3490 2659 1846 940 -480 -1503 -2608 -3470 -3582 -3943 -3511 -2413 -1272
2481 -1272 3 1100 2360 2891 3186 3336 3287 2840 2139 897 -550 -1729 -2837 -3520 -3857 -3716 -3099 -2263
2499 -2263 -1119 -98 1222 2624 3506 3693 3800 3264 2651 1549 -304 -1734 -2887 -3501 -3623 -3161 -2899
2516 -2899 -2402 -1430 -116 1457 2772 3717 3755 3018 2587 1833 1227 570 -577 -1609 -2814 -3496 -3158 -2929
2534 -2929 -2102 -1372 -459 256 1125 1879 2426 2579 2636 2232 2038 1511 510 -558 -1708 -2449 -2965 -2913 -2260
2553 -2260 -1579 -1544 -1069 -343 668 2191 3099 3487 3057 2141 1389 630 61 -833 -1708 -2752 -3354 -3140 -3043
2572 -3043 -1899 -997 64 1047 1874 2666 2791 3052 2850 1801 938 213 -570 -1186 -2095 -2919 -3217 -2920 -2204
2591 -2204 -936 -382 682 746 1287 2140 2979 3194 2868 1670 792 -275 -1020 -1420 -1812 -2786 -2864 -3003 -2246
2610 -2246 -1300 -324 593 1684 2205 2783 3203 3437 2877 1506 -209 -1353 -1872 -1977 -2153 -2623 -3215 -3070
2628 -3070 -2072 -327 1306 2318 2855 2626 2289 2413 2166 1675 795 -260 -1692 -2555 -2691 -2585 -2224 -2068
2646 -2068 -1503 -382 390 1018 1585 1625 1722 2038 2121 2161 1586 465 -891 -1949 -2295 -1842 -1179 -1352 -1737 -2003
2666 -2003 -1654 -746 1179 2808 2793 2742 1835 1095 1336 1039 991 33 -1083 -2236 -2791 -2896 -2600 -1733 -887
2685 -887 -74 612 1399 1717 2159 2354 2050 1909 1579 856 -40 -1369 -2488 -2663 -2604 -1464 -895 -822 -720 -1123
2705 -1123 -160 1257 2393 3288 2938 1798 721 79 85 183 -299 -1129 -2430 -2889 -3064 -2113 -1084 -6
2723 -6 750 1034 1641 2407 2719 2908 2681 1534 948 -210 -1083 -1828 -2740 -3162 -2969 -1944 -1253 -339 286 619
2743 619 1663 2303 2812 3332 2571 1463 370 -814 -1265 -1529 -1716 -1974 -2503 -2305 -1706 -907 272 1115
2761 1115 1678 1631 1692 1838 1863 1706 1709 494 -580 -1463 -1763 -1476 -1649 -1623 -2038 -1949 -1069 -92 1164 1495 1786
2782 1786 1991 2105 2056 1967 1453 437 -580 -1190 -1795 -2184 -2379 -2201 -2186 -1050 -468 697 1417 1802 2143
2801 2143 2006 1911 2223 1655 967 -67 -1207 -2416 -2137 -1761 -1474 -1334 -1460 -995 -902 100 1464 2201 2376
2820 2376 2121 1738 1099 873 400 199 -544 -1410 -2056 -2399 -2436 -2053 -1636 -1024 -124 992 1736 1657 2110 2133
2840 2133 2152 1486 1422 792 -441 -1478 -2874 -3164 -2670 -1771 -1146 -559 -586 79 651 1757 2875 3061 2656
2859 2656 1735 554 -230 -609 -1241 -1513 -1835 -1637 -2000 -1917 -1510 -691 298 1163 1578 1793 1878 1622 1417 1265
2879 1265 1047 448 -31 -860 -1708 -2393 -2561 -2047 -1304 -737 -337 92 451 1052 1718 2611 2686 2593 1532 425
2899 425 -367 -1301 -1554 -1719 -2093 -2022 -2267 -1918 -1317 -495 628 1408 2221 2098 2128 1991 1534 803 291 -242
2919 -242 -1024 -1507 -2069 -2124 -1980 -1416 -887 -404 486 908 1318 1569 1770 1942 1938 1238 874 209 -321 -776 -1596
2940 -1596 -1930 -1994 -1906 -1384 -1056 -461 186 653 1320 2003 2234 2244 1980 1271 454 -6 -953 -1378 -1833 -2212 -2052
2961 -2052 -1843 -1436 -837 -49 815 1402 1904 2032 2226 1812 1416 798 94 -371 -906 -1468 -1872 -2246 -2081 -1919
2981 -1919 -1080 -145 469 1071 1330 1601 1552 1640 1647 1269 699 -11 -454 -995 -1679 -1977 -1872 -1702 -1238 -803 -266
3002 -266 125 756 1215 1854 2058 1983 2000 1158 463 -769 -1127 -1717 -1276 -1749 -1835 -2164 -2013 -1024 -84 1196
3022 1196 1761 2172 1847 1578 1314 1200 946 485 -157 -1332 -1973 -2333 -2001 -1652 -1051 -754 -45 185 567
3041 567 1057 1428 1830 1871 1725 1375 366 -304 -912 -1468 -1256 -1023 -1222 -1388 -1506 -1383 -706 253 1314 2058
3061 2058 2102 1773 1190 941 850 1117 218 -438 -1484 -2203 -2296 -1943 -1364 -529 -193 49 560 1168 1358 1993
3081 1993 1966 1594 1211 451 -111 -484 -1055 -1043 -1863 -1387 -1475 -1155 -851 -339 349 1045 1026 1429 1428 1406 1452 1098
3103 1098 549 -75 -334 -802 -1411 -1755 -1698 -1543 -988 -879 -342 -24 635 1419 1778 2313 2072 1551 625 155
3123 155 -82 -665 -910 -1646 -1856 -2005 -1683 -1442 -481 622 1106 1295 1551 1288 1487 1318 1224 666 63 -743
3143 -743 -1418 -1371 -1432 -1592 -1245 -923 -378 127 248 380 835 1350 1625 1677 1236 795 80 -472 -385 -699 -880
3164 -880 -1156 -1572 -1530 -1380 -1070 -209 407 1497 1383 1258 1014 1094 1131 963 480 279 -908 -1506 -2039 -1669
3184 -1669 -1700 -1050 -175 -37 239 664 666 958 1363 1665 1421 1004 252 -627 -1190 -1193 -928 -884 -1081 -1023 -918 -777
3206 -777 -683 -26 848 1410 1686 1232 993 647 494 641 675 -66 -763 -1523 -1776 -1674 -1444 -845 -287 152 563
3227 563 420 571 1058 1637 2040 1692 1029 235 -835 -1279 -1204 -1316 -1218 -1219 -1347 -1022 -487 22 843 1318 1643
3248 1643 1872 1483 963 289 -25 24 -121 -648 -1277 -1525 -1786 -1458 -755 -349 201 731 745 1096 1111 1078 1161
3269 1161 1172 821 443 -611 -1195 -1157 -1216 -1050 -1357 -1188 -1091 -697 -123 960 1457 1340 1400 1390 1090 756 579
3290 579 35 -105 -577 -1349 -1914 -1649 -1002 -501 -66 216 235 358 934 1158 1351 1339 1186 417 -109 -256 -650
3311 -650 -1067 -1259 -816 -985 -920 -925 -596 -127 421 833 865 1029 828 956 789 610 304 115 -521 -713 -1039
3332 -1039 -1535 -1328 -1172 -410 49 281 156 282 953 1245 1799 1343 921 316 -119 -530 -804 -1138 -1260 -1203
3352 -1203 -1241 -1088 -851 -407 285 845 1506 1652 1263 1225 608 328 170 -115 -570 -897 -1157 -1380 -1624 -1414
3372 -1414 -1129 36 520 863 932 849 905 921 1354 1363 740 -178 -629 -1064 -1375 -1484 -1343 -852 -657 -721 -431 -63
3394 -63 477 1169 1741 1367 1289 790 634 32 -178 -915 -639 -1231 -1334 -1248 -1023 -1036 -463 296 877 1349 1067
3415 1067 1118 915 786 1144 762 247 -317 -987 -919 -1240 -1124 -920 -315 -381 -26 110 177 753 1302 1460 1141
3436 1141 714 443 332 -19 -109 -583 -1106 -1231 -1019 -1207 -678 -629 -421 194 364 931 1204 1372 1176 1021
3456 1021 803 336 -288 -620 -878 -1314 -1263 -1120 -920 -980 -541 -27 389 1071 1400 1481 1203 1335 865 494 11
3477 11 -13 -568 -1257 -1292 -1658 -1172 -1088 -266 101 337 232 663 1120 1391 1630 1161 540 304 -216 -792 -758 -1032
3499 -1032 -1143 -1110 -1099 -948 -866 -138 275 944 1419 1571 1495 1039 844 479 249 -284 -544 -859 -1144 -1693 -1609
3520 -1609 -1147 -507 -46 434 409 935 950 1249 1393 1173 989 576 -354 -702 -1096 -1096 -984 -998 -814 -640 -674 -426
3542 -426 68 744 1288 1383 1194 1285 651 468 229 -39 -520 -578 -989 -1569 -1397 -1307 -1000 -557 72 403 733
3563 733 1026 1137 1166 1408 958 767 330 -484 -813 -1083 -1083 -1317 -981 -969 -886 -475 118 536 1060 1529 1623 1503
3585 1503 1076 762 274 23 -343 -659 -1173 -1372 -1464 -1159 -775 -575 -146 406 557 728 1084 982 1446 1341
3605 1341 676 321 -88 -652 -1043 -1037 -1059 -900 -943 -736 -766 -194 483 1186 1424 1439 1450 1165 808 514 436 129
3627 129 -664 -1144 -1682 -1702 -1537 -1130 -457 336 551 526 519 930 1207 1432 1660 774 418 -207 -832 -874 -1034 -981
3649 -981 -902 -1031 -1126 -866 -462 139 916 1260 1589 1286 950 596 527 626 341 -243 -818 -1345 -1659 -1770 -1434
3670 -1434 -752 -106 458 674 604 726 922 1471 1548 1479 995 -77 -524 -1237 -1443 -1181 -941 -1061 -848 -963
3690 -963 -543 -109 386 1325 1442 1719 1202 672 407 385 -2 -221 -284 -909 -1432 -1230 -1325 -945 -473 145 465
3711 465 906 905 836 875 965 1455 1104 460 -11 -753 -1215 -1081 -1156 -1023 -857 -846 -673 -314 -22 532 1274 1612
3733 1612 1594 1091 699 224 79 176 -350 -451 -1297 -1195 -1382 -1441 -730 -353 243 862 1124 1229 921 777 1024
3754 1024 1383 1024 568 -218 -888 -1339 -1261 -1132 -877 -706 -543 -671 118 617 526 1286 1513 1435 1044 467 267
3775 267 -123 -337 -482 -572 -1268 -1609 -1518 -981 -537 128 169 823 787 857 1051 1039 952 1128 647 -87 -760 -1172
3797 -1172 -1313 -1013 -617 -928 -812 -672 -356 249 642 1163 1371 1298 979 642 408 -154 -78 -226 -350 -1093
3817 -1093 -1188 -1301 -959 -631 -69 381 469 313 433 715 891 1073 922 1065 320 -209 -951 -1046 -889 -759 -655
3838 -655 -797 -1043 -679 -189 225 723 1154 1442 1019 783 464 92 157 45 -158 -598 -1008 -1459 -1430 -975 -354
3859 -354 114 229 528 496 720 891 1045 1109 945 580 18 -521 -854 -978 -903 -441 -252 -577 -712 -596 5
3880 5 577 928 1259 840 740 559 312 190 16 -334 -524 -757 -1037 -1372 -1203 -805 -235 204 480 616 673
3901 673 789 793 631 750 545 228 -150 -573 -1111 -1073 -914 -863 -562 -134 -421 -157 166 580 1044 1068 1118 685
3923 685 322 97 -125 -6 -298 -462 -767 -1064 -1045 -819 -690 -38 394 481 585 576 623 491 587 470 309 -59
3945 -59 -15 -568 -950 -883 -831 -667 -264 -180 -37 -38 135 737 772 1031 956 534 313 211 -116 -248 -464 -654 -808
3968 -808 -592 -671 -449 -448 -30 496 325 375 854 644 406 772 410 94 -181 -323 -346 -695 -649 -632 -569 -657 -272
3991 -272 -129 214 295 559 737 807 502 538 527 137 -118 -584 -435 -446 -558 -560 -572 -474 -147 -203 435 367 632 696
4015 696 493 712 328 183 68 -708 -588 -571 -765 -479 -510 -394 -273 -230 44 209 377 696 610 407 651
4036 651 247 308 -57 -401 -360 -669 -386 -233 -404 -342 -243 -213 111 381 498 544 373 259 308 383 264 -105 -177
4059 -177 -503 -300 -439 -534 -257 -249 -237 -196 -218 215 497 556 438 349 273 448 242 -250 -3 -283 -299 -457 -437 -337
4083 -337 -512 -80 297 229 521 264 506 539 277 292 275 98 -90 -330 -583 -273 -509 -389 -353 -306 0 -148
4105 -148 133 126 400 460 334 387 430 538 -65 -194 -308 -299 -471 -608 -440 -299 -223 -383 166 139 350 381 448 390
4129 390 83 -193 -99 117 -197 -142 27 -195 -363 -279 -248 208 158 415 -8 -100 157 137 265 50 105 361 -8
4152 -8 -145 -296 -455 -484 -8 75 -114 -195 -270 23 85 261 219 265 30 38 -92 -165 35 140 98 -113 -245 -766
4176 -766 -392 -134 136 363 269 143 123 59 165 260 163 129 0 53 -398 -319 -331 -140 13 27 -26 -102 -166 -10
4200 -10 -23 283 491 15 -34 -89 -135 -299 201 -108 66 -47 -50 -327 -405 -206 -163 523 230 122 -47 -102 -228
4223 -228 124 187 127 -213 -170 -203 -252 -79 4 25 332 -51 -192 -202 12 82 31 340 -87 -174 -149 -11 -21 63 41
4248 41 193 111 -97 -503 -152 -177 104 127 36 81 -285 -413 -68 -107 327 159 27 -391 -206 -125 17 80 300
4271 300 15 -207 11 -197 -54 -32 233 191 34 -264 -144 -20 60 170 376 235 -78 -180 -144 -114 -154 219
4293 219 340 195 -209 -288 -270 6 203 17 -226 1 -196 -129 29 44 280 372 171 -188 -51 -284 50 -137
4315 -137 -19 125 -190 -252 -96 -97 102 192 200 -46 -241 -336 146 187 367 254 -28 -218 -392 -383 -387 -248 94 -142
4339 -142 -105 -175 -72 -75 239 478 235 129 100 -109 -267 -223 203 48 129 35 -446 -526 -348 -111 41 439 420
4362 420 10 42 -50 82 309 298 112 -2 -194 -269 -487 -109 186 194 -34 45 64 -327 -4 -39 561 464 49
4385 49 -147 244 -255 -406 38 -144 -326 -267 -217 -391 -265 -66 18 219 219 -10 -144 120 -208 -4 23 372
4407 372 -302 -298 -427 -525 -129 -109 214 169 -174 -214 -202 182 119 328 496 336 -4 -181 -260 -331 -195 -114 -205 -254
4431 -254 -313 -358 -205 -62 223 431 320 282 404 160 283 -82 230 94 154 -511 -490 -326 -260 -133 60 48
4453 48 50 -7 -15 166 266 367 473 299 -171 -232 -422 -130 -137 -129 -150 -335 -272 -222 3 133 455 306 342 324 50
4478 50 187 319 154 -70 28 -186 -343 -584 -296 -326 127 -35 -83 280 164 261 365 409 171 253 -174 -305
4500 -305 -299 -267 -127 -156 -273 -416 -460 -294 -95 -47 130 371 342 85 -69 349 460 178 114 -144 -375 -418 -478
4523 -478 -455 -81 -132 -263 -178 -203 133 256 212 638 469 344 238 128 -27 -103 -491 -394 -204 -397 -217 -280 -367
4546 -367 49 248 158 220 507 389 123 175 -155 9 88 -249 -121 -468 -444 -611 -750 -174 201 -32 4 281
4568 281 163 476 150 717 314 132 -193 -193 -461 -200 -292 -644 -56 -130 -375 -21 364 -104 604 647 558 368
4590 368 264 167 69 -218 13 -48 -392 -589 -787 -538 -155 -115 338 171 172 379 21 378 491 423 109 181 16
4613 16 -304 -507 -597 -304 -222 -174 -241 -47 51 263 350 211 228 529 335 3 8 -26 10 -199 -39 -258 -662 -476
4637 -476 -292 -189 -63 122 202 299 459 242 357 545 400 210 164 -18 -147 -478 -386 -255 -233 -268 -182 -5
4659 -5 -158 224 284 289 480 570 361 241 256 -58 -108 -182 -295 -131 -382 -463 -193 -536 124 120 5 442 464 317
4683 317 50 524 286 537 111 -39 -205 -470 -671 -470 -307 -274 -189 -66 116 88 368 411 448 390 488 77
4705 77 48 -124 -41 -70 -436 -319 -415 -564 -162 -183 -203 186 253 444 146 47 209 221 139 219 214 -77 -189 -340 -773
4730 -773 -426 -337 -11 36 225 103 -192 9 182 397 522 25 29 61 39 -139 -79 -331 -259 -363 -323 -231 -227 -219 100
4755 100 324 228 423 26 105 269 347 51 -142 -39 -417 -403 -458 -474 -255 -197 -121 -57 -151 201 568 482 323 375
4779 375 152 204 40 -29 -336 -194 -238 -207 -346 -204 -421 -246 348 361 451 392 217 388 151 119 171 267 -45
4802 -45 -350 -455 -340 -367 -333 -127 185 -80 -9 343 245 355 320 432 453 106 54 -114 -170 -220 -94 -225 -411
4825 -411 -541 -461 -263 -146 -66 330 225 229 255 167 149 200 374 333 -121 -286 -487 -445 -244 -84 -73 -146 85 110
4849 110 139 365 188 778 265 169 -126 -131 -38 -117 -131 -29 -77 -119 -343 -469 -220 -88 296 149 178 359 225
4872 225 346 213 263 55 5 -223 -389 -465 -597 -370 -58 -103 122 118 70 162 566 506 253 185 305 28 -269
4895 -269 -270 -70 1 -396 -248 -171 -255 -223 -259 -61 279 359 485 207 191 60 -109 -16 -11 -17 -4 -281 -466 -489 -251
4920 -251 -206 -111 13 247 64 134 143 521 343 216 335 -85 -272 -5 -146 -283 -125 -167 -106 -261 -44 -70 73
4943 73 478 335 125 195 53 93 -162 70 79 -197 122 -301 -357 -210 -176 -288 -37 145 75 36 76 281 453
4966 453 313 398 81 -9 -194 -438 -485 -145 -263 -380 -260 -181 44 -34 117 43 323 356 85 156 310 196 148
4989 148 134 63 -424 -354 -340 -443 -219 -161 -142 85 198 15 85 161 257 270 480 125 -21 -299 13 -74 -248 -137
5013 -137 -338 -173 6 -139 -23 81 583 355 363 410 107 200 231 70 -20 -335 -54 -393 -290 18 -31 -215
5035 -215 -112 -85 68 203 332 194 127 210 160 -222 -72 -188 -293 -251 -222 -151 -289 -288 -161 -39 263 244 401
5058 401 443 365 216 132 251 195 -170 -109 -77 -74 -418 -282 -46 -459 -43 -256 134 124 7 657 404 304 384
5081 384 -243 101 -330 -140 -80 -41 -213 -319 -313 39 -74 -177 -44 259 379 315 110 237 261 270 136 -195 -281
5104 -281 -202 -105 -508 -361 -286 -230 27 -116 478 155 88 192 191 107 187 198 248 -220 -335 -278 -87 -176 -202 -17 -156
5129 -156 -38 -72 10 111 188 231 275 181 -175 -247 -141 -143 -198 -60 -338 -169 -143 -259 -40 -28 26 337 205 72
5153 72 301 427 624 208 -51 38 -294 -327 -391 -161 -223 -35 13 203 -131 -255 60 119 263 297 251 208 79
5176 79 -50 -215 292 -470 -359 -239 32 -273 -226 -111 109 -84 80 260 26 192 109 -62 154 96 -57
5197 -57 -357 -314 -254 -175 -255 23 5 -52 -55 -94 261 183 170 277 398 177 16 -117 -30 86 -43 -218 22 -222
5221 -222 -190 -37 -242 263 188 193 261 -23 285 -37 228 -90 118 106 236 -30 -221 -170 -284 -301 -108 149 40
5244 40 51 165 56 186 72 -104 -206 -195 -99 -144 18 -233 27 -204 -275 -170 -270 -229 195 252 358 269 59
5267 59 270 234 20 229 98 114 -24 -164 -138 -94 -133 -128 -97 39 356 181 52 340 267 253 27 31 -190 -66
5291 -66 -65 20 -247 -222 -163 -145 -5 118 -215 -70 291 151 97 164 272 50 382 48 -138 -115 -314 -229 155 -109
5315 -109 -45 66 176 -258 102 222 -24 286 205 157 69 11 176 -153 -50 37 -80 -30 -254 -21 -209 97
5337 97 285 186 155 126 -181 -185 81 212 195 227 34 -397 -343 -202 -236 51 214 -173 -143 -104 -398 32 195 117
5361 117 106 227 6 -54 57 68 -53 213 46 -188 -215 -181 71 115 -111 251 -125 101 167 -175 -47 -143 184
5384 184 139 208 -60 -384 -211 -135 -96 -44 88 131 -133 -16 154 230 272 168 3 68 -127 -170 162 -48 -127 -273
5408 -273 -82 -238 7 -30 -91 335 238 191 -107 -27 12 -61 92 64 -185 -86 -181 -84 -130 124 13 160 -189 183
5432 183 -49 -18 146 -6 123 -45 -97 20 -71 -211 -68 -7 -171 146 -27 -3 37 -320 26 216 15 171
5454 171 102 68 -7 -42 -192 132 37 37 -202 -91 -86 -20 -74 24 -95 4 -69 112 69 94 162 275 238 -65 130 23
5480 23 87 -145 117 25 -165 131 -20 -37 45 -135 -15 -20 -82 4 -53 101 31 -77 -67 54 -241 29 200 -84
5504 -84 -50 63 -144 82 -92 217 -198 211 13 19 -71 -13 -74 -124 409 5 0 69 251 164 -90 20 367 15
5528 15 -69 61 110 -175 -129 1 -169 82 -4 -36 -4 -26 -188 49 -75 -279 -143 -24 12 -209 207 224 248 -74
5552 -74 -43 30 -116 -103 86 271 240 -74 28 75 -126 29 193 -143 20 200 95 115 -48 119 201 222 208
5575 208 70 28 -354 -128 184 273 -141 -106 -40 -71 152 52 -4 101 172 -232 -118 305 -175 124 -140 185
5597 185 -79 31 -126 -150 140 -51 147 190 213 -191 95 -3 222 59 207 51 34 -19 -55 -125 132 24 -110
5620 -110 120 94 -26 2 -151 344 182 -62 31 132 -121 -103 174 -15 -53 37 -146 -157 -14 -82 92 -139 -91
5643 -91 66 -37 30 110 43 -100 71 -9 -137 -2 191 73 121 230 -2 -31 -145 88 -119 -72 44 70 57
5666 57 131 -189 -71 -123 57 129 7 321 -2 -20 -155 35 -17 -205 -228 -4 -39 132 238 195 62 15 41 -10
5690 -10 35 -59 50 83 20 -74 -35 -32 -14 -205 28 -26 -88 -64 60 -22 -78 -34 19 73 239 6 -155 19 -97 -4
5716 -4 -1 134 -121 28 -10 -137 228 -354 162 169 80 228 -166 132 206 -200 48 -209 -104 -109 -3 -38 -95 28
5740 28 -208 13 -9 -38 256 241 -20 76 43 -7 -186 33 49 -160 162 -35 -187 -36 -95 80 182 173 138 128
5764 128 -56 -95 91 233 46 272 43 -190 74 -216 -1 49 -116 -110 -63 -101 -117 -328 111 89 237 60 -170
5787 -170 -33 31 69 -310 177 -196 34 -424 21 -186 -276 -66 95 342 41 -56 -52 177 72 -37 31 78 18
5810 18 -80 -301 -210 54 201 -49 398 -190 -90 118 58 228 66 211 65 -72 -144 27 -66 -69 -106 -45 -43 -239
5834 -239 -129 -312 70 316 -132 -54 -3 87 6 -161 85 16 152 -107 72 -142 -191 -69 -7 145 -59 295
5856 295 -39 -161 282 289 298 125 -101 248 -77 -312 -28 27 -81 -119 -225 -118 73 219 181 83 133 -58 37
5879 37 -61 -26 38 13 -20 0 -2 -93 -20 13 176 -165 -53 149 323 53 165 -14 37 171 -198 53 49 -152 56
5904 56 -119 79 -80 -176 -34 -158 -49 -106 189 268 391 84 118 15 12 -243 159 209 53 -304 -216 -48 -297
5927 -297 -44 -58 54 -418 72 257 296 43 216 189 367 -29 -106 -18 46 78 -286 -169 -95 -6 0 -35 -99 332
5951 332 11 203 131 68 -32 140 -159 11 -8 -84 -167 18 -108 -179 33 -13 -9 234 177 -89 65 272 19
5974 19 281 -53 -184 99 24 -424 -295 61 -143 27 -21 -226 10 220 166 190 30 -29 -17 -129 53 -76
5996 -76 135 -38 45 -177 -392 -304 -174 155 -27 -177 85 -93 -29 -16 169 126 43 205 -99 47 -161 -260 -60
6019 -60 -1 -182 -205 -149 -92 124 137 125 322 141 329 -35 -41 -175 -148 -27 30 -77 -35 -395 -68 -36 -155 353
6043 353 174 266 151 203 -55 -43 79 147 -74 -191 -226 -357 27 28 -398 -108 -108 -139 100 205 43 227 401
6066 401 87 102 -90 -20 -316 -175 7 -252 -192 -440 -113 -150 33 111 220 174 -114 285 144 172 165 117 55 -66
6090 -66 -155 -176 -232 -206 -32 91 -148 -152 -130 -81 35 46 223 160 163 -134 -7 -37 -19 -115 -135 72 -174 -318 -373 -191
6116 -191 115 183 104 356 12 196 -17 -126 92 -101 59 -45 -171 -114 -242 -184 -29 101 73 -92 14 171
6138 171 36 407 261 391 40 114 -90 83 -112 -45 -60 -92 -280 -174 -188 -138 -33 194 94 151 -18 141
6160 141 -3 274 40 57 -78 -185 -30 -70 -303 -257 73 -39 64 -63 68 -91 60 203 48 331 195
6181 195 -78 31 -38 -206 72 -4 -239 -152 -71 -24 -76 124 68 183 -4 -127 82 156 105 249 -188 -144 212
6204 212 -58 -409 -238 -48 -157 62 -177 -114 150 247 -48 110 201 308 210 -84 -135 81 -154 239 -139 -178
6226 -178 -139 -260 -97 35 171 -6 261 -46 54 99 62 -215 -10 -525 -53 -109 122 -183 -216 84 -189 25
6248 25 222 77 -50 98 90 -32 138 98 135 -154 -307 -135 -148 118 -288 17 -223 -21 66 20 -49 66 297
6271 297 167 195 126 298 -40 223 -94 -65 -146 25 -42 -112 98 -219 -125 22 174 -85 229 283 98 228 55
6294 55 42 -29 -397 77 -250 85 -202 -269 -151 -78 220 24 40 121 249 229 182 56 -97 199 218 53 -197
6317 -197 -96 -242 -74 -38 15 94 -21 193 -66 327 -98 145 324 -14 144 145 222 -97 -208 -245 -35 -157
6339 -157 72 -106 -58 231 -140 64 251 168 170 -101 36 -24 -17 -50 23 -208 -441 -131 -39 -332 -72 -28 104 -94
6363 -94 27 160 237 220 210 295 -136 -21 -120 -37 -216 -87 -247 -146 -115 -48 19 -108 186 71 173 33 294
6386 294 184 -36 10 72 -220 -64 -69 -131 -44 -25 -259 54 43 -25 -112 56 130 137 177 52 207 95 42 -76 -93
6411 -93 104 -86 39 -123 -279 -264 -297 -7 -103 -89 174 233 119 181 -6 245 41 -128 -110 -57 -104 -228 102
6434 102 -87 12 -135 -60 179 128 111 -18 43 138 134 220 97 -66 -228 -6 -143 -96 -125 -109 -15 146 -21 171
6458 171 -20 104 59 83 -62 -100 -181 -145 211 -123 -12 -119 -206 -147 -84 20 -72 74 -18 195 284 -8 207 188
6482 188 -17 -41 15 -2 -64 228 -59 -184 -85 -8 9 -54 121 222 20 -50 -43 241 -170 135 53 -118 -114 -305 -207
6507 -207 26 -148 -9 100 -15 13 -27 -61 101 200 170 137 197 -102 -33 15 -112 -372 -76 -124 -435 -173 -239 -143
6531 -143 130 156 -98 80 298 -48 -86 54 -75 -306 239 -31 -63 -70 -159 47 -160 -92 -70 120 145 -41 93
6554 93 119 112 96 34 24 68 -37 37 -349 59 -256 192 13 167 -191 -70 268 202 90 -14 21 -286 144 -11
6578 -11 64 -234 50 -103 -118 -370 0 -186 273 18 166 -96 -22 -132 -89 -31 -89 -15 7 -207 13 -25 54 22
6602 22 75 80 165 -184 -54 -116 80 51 54 -177 -46 -177 -196 42 246 34 -61 -123 -222 58 -342 5 66 -50 -85
6627 -85 59 26 199 96 -91 -12 35 -63 -145 -59 -84 95 -152 167 35 33 -53 -28 123 93 -34 131 -113 97
6651 97 58 106 -83 -54 -241 -199 -55 -233 57 76 -182 66 -99 -16 67 -35 -26 -42 125 -298 -148 112 -6 165
6675 165 15 -30 -48 277 -44 -167 -11 36 126 162 -207 84 -55 -49 -258 -272 -126 3 -16 -97 -210 -66 110
6698 110 10 219 63 -193 -73 129 64 -134 -97 -87 108 -49 -74 -213 -132 -257 262 -85 -189 -245 -213 98
6720 98 -201 -55 -225 -93 90 291 -25 -104 179 -206 122 5 -103 -106 -105 91 -85 -57 142 267 -64 -253
6742 -253 9 -105 62 226 -15 32 -339 3 121 27 61 -114 11 -24 89 -111 -2 -240 114 152 -184 -116
6764 -116 -94 -171 -408 154 -139 -166 259 -69 -170 -110 219 2 -129 120 32 -25 -281 161 151 258 238 -131 -103
6787 -103 179 40 18 -36 154 -43 51 195 78 -187 173 59 68 103 -11 -56 -260 54 6 53 -152 -131 222
6810 222 -153 -5 -6 -3 -87 234 -273 -88 -246 122 209 -58 60 179 -62 -15 -101 294 316 10 -10 -29 102 203
6834 203 30 -10 -14 -124 -44 -199 -49 -9 -150 -4 60 -96 86 215 -94 94 228 112 -95 36 41 -3 6 -162
6858 -162 -94 62 135 12 -27 -138 15 -132 -152 -11 187 -21 210 -205 -24 -65 -34 118 110 -49 91 -52 66
6881 66 43 166 -238 76 -60 -142 102 66 120 18 -113 -41 -117 66 75 -138 42 -277 -250 -105 107 -95 81
6904 81 263 31 -147 71 -45 -118 -154 138 -265 122 80 -116 81 -37 -152 184 153 95 171 200 208 -125 -8
6927 -8 29 -50 -79 -107 -30 -230 -73 -40 -261 28 179 278 33 59 149 -113 -1 123 66 156 275 -180 79 -156
6951 -156 -228 -187 -144 -118 119 183 44 -44 118 -78 289 132 -102 68 33 -164 -125 -271 -125 163 -98 -208 -41
6974 -41 -13 -83 -120 115 83 -36 82 128 149 97 -56 -68 -189 -47 -188 -226 -17 -13 -11 277 150 315 22 175 64
6999 64 -72 124 -139 59 98 -449 42 -187 -94 15 -127 -265 -4 36 208 169 102 -22 -129 180 -54 -61 13
7022 13 -148 -275 -70 -179 -157 -4 71 -252 -174 -118 -208 232 -189 -32 270 129 183 -109 12 69 96 -427 -200
7045 -200 -51 49 -104 1 -113 -74 0 -8 128 160 484 -12 92 -221 173 -183 -332 4 61 -222 -271 -180 88
7068 88 -216 -104 220 -47 234 -66 -119 134 -32 -211 50 -125 58 -16 -57 12 129 283 19 -208 -21 -45
7090 -45 30 137 23 -85 -57 119 52 -76 -101 -375 -104 -9 -83 33 -213 -78 -141 101 -39 131 79 24 177
7113 177 -28 135 355 -204 -121 96 -274 -142 -119 -84 -23 -189 266 -52 17 54 195 -23 120 174 43 -133
7135 -133 50 -104 -255 -90 -208 -160 -330 -287 34 27 149 -12 218 151 -101 -74 130 36 -184 -184 -167 -82 -97 -199
7159 -199 -40 195 210 17 83 -60 93 7 137 32 65 120 -85 26 -21 -5 13 -223 106 -168 -228 116 -66
7182 -66 -57 -15 194 145 42 -3 -133 -171 23 70 103 -280 -180 -285 -287 -126 90 -224 175 -35 -67 13 -25 144 -26
7207 -26 35 -154 -148 -177 52 -53 7 -11 -74 -45 -126 138 -170 153 32 33 133 -59 208 22 -12 67 101 2 -196
7232 -196 77 -372 -223 38 -146 -97 -165 -16 116 43 -155 152 -151 90 -89 73 -225 75 -343 -152 62
7253 62 -144 -146 -240 -268 -90 344 140 -16 106 17 -195 276 168 259 152 123 -385 -120 0 -206 78 -91 64
7276 64 46 -146 118 150 60 217 13 211 -73 -167 -265 66 32 197 -86 -59 -183 -104 8 29 380 184 -1
7299 -1 -220 106 -31 -58 -75 222 -18 121 221 -41 -334 125 -70 11 -78 149 79 -9 96 267 220 137 198 -82
7323 -82 -174 136 -99 24 -75 -111 33 -244 -108 -291 108 15 299 81 -70 -13 -142 52 65 106 147 -150 61
7346 61 -34 -150 -126 99 -77 -61 -221 -67 -142 127 262 50 176 108 34 -58 -86 -91 173 -71 -121 -83 41 87 -15
7371 -15 -27 275 11 -143 62 311 -71 -32 290 -4 -55 -87 -187 143 -195 -214 49 -58 108 -26 -3 60 28
7394 28 34 9 90 96 -357 -198 -6 -222 48 -101 174 -212 -229 52 -153 123 -95 61 -115 -46 -43 -49 -31 130 159
7419 159 26 11 -150 -26 -141 122 -23 -139 -105 38 178 -50 -85 295 45 -46 -21 122 -105 154 77 36
7441 36 -7 -19 -24 98 -190 266 32 194 173 -10 -50 2 13 -24 134 9 -72 -336 79 -134 17 -48 41 90 99
7466 99 -111 1 196 8 166 228 175 -40 -129 61 -64 25 95 -121 -27 -238 62 169 -77 -61 317 -128 -92
7489 -92 43 149 201 -121 135 -37 25 101 -181 109 -158 149 -2 -90 -132 242 -147 -147 50 -39 143 -39 -198
7512 -198 159 243 -133 -261 69 -63 -271 -170 -57 -232 23 12 103 72 -76 203 -143 -178 196 -56 -68 53
7534 53 101 5 -205 11 56 -19 -353 -177 -41 49 5 91 88 112 -194 -113 68 -203 65 125 -124 39 -26 -182 -170
7559 -170 89 236 -284 -146 -102 -63 0 218 198 86 134 -145 2 -146 87 -117 -57 -211 126 38 -96 -164 -73
7582 -73 59 165 65 78 -60 11 -154 109 192 21 68 -59 58 -99 206 43 -22 -66 -15 89 -62 77 10
7605 10 197 234 10 -86 55 -127 -45 -34 122 -111 -108 -23 69 -100 -180 245 -52 -3 -48 229 -282 -174 -37 -123
7629 -123 58 91 -119 83 79 -61 -236 9 -16 147 -85 -72 -28 -197 173 0 -220 -80 -259 -78 -117 -73 92
7652 92 -7 56 249 -142 -133 -217 0 41 -47 3 -40 238 11 253 -9 31 -58 65 -182 -64 49 -161 87 -30
7676 -30 -10 75 16 258 177 -20 81 126 -258 -51 13 96 188 36 -30 15 -58 -176 139 -242 256 5 21 64 19
7701 19 -50 -14 153 84 66 96 26 21 44 -64 46 80 145 215 -129 -153 -17 77 318 27 142 232 -73 67 -73
7726 -73 19 103 13 -128 -47 -22 -67 -81 -139 45 52 -30 30 -209 -181 -43 261 -363 160 -154 -134 73 -72 94 118
7751 118 -140 -32 -60 51 -22 17 -136 74 350 122 -112 66 -199 -64 0 -242 156 14 86 -374 92 14
7773 14 223 22 -26 -58 -163 153 96 110 3 -37 -146 -129 79 -233 -24 -35 -46 6 264 -37 -186 147 -10
7796 -10 7 35 29 -171 -100 -51 -235 45 -274 -104 34 -205 -35 319 -264 -4 107 -161 141 -119 83 143 274
7819 274 167 -9 27 -339 -335 -19 33 -9 -175 -83 72 -234 -8 67 58 91 31 -91 132 50 -108 149 -46 61
7843 61 -48 34 -96 -106 37 -171 77 -51 -38 215 -1 166 83 110 120 78 -163 5 -39 -204 -86 54 41
7866 41 -400 40 110 -11 230 129 -81 -30 55 -157 -227 -252 -184 -34 254 -81 -320 -282 -56 -142 73 166 35
7889 35 139 -191 79 20 62 80 -2 -158 9 -288 114 -32 151 -116 120 -168 -259 -120 -241 140 -114 180
7911 180 -7 5 7 -283 -131 -26 -50 -280 -36 -169 -111 -219 143 -74 -197 191 -160 27 17 92 -178 11
7933 11 131 3 -231 57 -277 34 23 143 -302 -257 -65 48 -53 355 252 162 181 -59 -137 -21 61 113 44
7956 44 65 -93 -73 -232 -62 27 75 198 -28 -40 61 102 176 196 88 126 17 -151 -157 142 -3 73 51 111 -179
7981 -179 -2 -34 7 175 -20 -115 118 228 -51 -145 174 -152 19 -149 -385 -150 54 -299 -32 75 271
8002 271 10 68 51 -264 232 50 141 47 38 -68 36 -52 56 86 6 -55 19 120 116 257 53 84 -125 -177 6
8027 6 56 -25 -222 177 -288 -144 -122 -67 19 73 277 326 -57 100 -147 -70 8 26 170 27 120 -10 57 -247 -196
8052 -196 -84 109 -72 -13 -80 -112 -49 79 149 257 3 -202 -35 -60 -193 186 -8 -80 -146 -190 -299 38 156
8075 156 -2 19 145 135 -102 188 -112 253 152 176 -319 -153 -78 -273 -43 -30 -6 148 -82 84 179 76
8097 76 -51 254 190 183 257 175 -24 -2 -41 -110 114 -127 -114 -72 -409 54 132 345 -84 15 -35 62 -116 34 136
8122 136 341 10 247 -3 107 77 -136 123 2 121 113 65 81 46 127 144 32 314 -41 14 -46 73 124 81
8146 81 -302 323 -111 -16 10 3 136 11 345 11 143 -48 -60 105 118 94 190 -270 -86 11 -139 59 137 233
8170 233 -42 65 162 239 -69 81 127 5 289 -213 34 -128 74 -39 54 -259 -127 -233 -135 37 103
8191A03
##END NTUPLES=NMR FID
##END=
