##TITLE=1H_23AC1411
 CDCl3
 108 sc, 
 15.11.2022
##JCAMPDX= 6.0         $$ Bruker NMR JCAMP-DX V2.0
##DATA TYPE= NMR FID
##DATA CLASS= NTUPLES
##ORIGIN= UXNMR, Bruker Analytische Messtechnik GmbH
##OWNER= root
$$ XWIN-NMR		Version 3.5
$$ Tue Nov 15 13:56:29 2022 Russian Standard Time (UT+4h)  she@DPX200
##.OBSERVE FREQUENCY= 200.1313499994
##.OBSERVE NUCLEUS= ^1H
##.DELAY= (6, 6)
##.ACQUISITION MODE= SIMULTANEOUS
##.ACQUISITION SCHEME= undefined
##.AVERAGES= 108
##.DIGITISER RES= 18
##SPECTROMETER/DATA SYSTEM= spect
##.PULSE SEQUENCE= zg30
##.SOLVENT NAME= CDCl3
##.SHIFT REFERENCE= (INTERNAL, CDCl3, 0, 15.7039)
##AUDIT TRAIL= $$ (NUMBER, WHEN, WHO, WHERE, WHAT)
$$ ##TITLE= Audit trail, XWIN-NMR		Version 3.5
$$ ##JCAMPDX= 5.01
$$ ##ORIGIN= Bruker BioSpin GmbH
$$ ##OWNER= she
$$ F:/spectra/data/she/nmr/H-F/1/audita.txt
$$ ##AUDIT TRAIL=  $$ (NUMBER, WHEN, WHO, WHERE, WHAT)
(   1,<2022-11-15 13:54:06.29 +0400>,<she>,<DPX200>,
      <continue with go, POWCHK disabled, PULCHK disabled
       configuration hash MD5:
       00 E9 B6 7A A2 85 ED C7 34 08 36 98 17 FE 4E 26
       data hash MD5: 16K
       C6 F4 D5 7F 54 09 F1 83 5A 8A 59 48 48 E6 EF 30>)
$$ ##END=
$$ 
$$ hash MD5
$$ AB 0D E4 F9 FB 1F EA A3 C5 34 94 82 50 F0 69 2E
##$RELAX= 
##$RELAX= 
##$RELAX= 
##$RELAX= 
##$RELAX= 
##$RELAX= 
$$ Bruker specific parameters
$$ --------------------------
##$DU= <F:/spectra>
##$EXPNO= 1
##$NAME= <H-F>
##$PROCNO= 1
##$TYPE= <nmr>
##$USER= <she>
##$AMP= (0..31)
100 100 100 100 100 100 100 100 100 100 100 100 100 100 100 100 100 100 
100 100 100 100 100 100 100 100 100 100 100 100 100 100 
##$AQSEQ= 0
##$AQ_mod= 1
##$AUNM= <au_zg>
##$AUTOPOS= <>
##$BF1= 200.13
##$BF2= 200.13
##$BF3= 200.13
##$BF4= 200.13
##$BF5= 200.13
##$BF6= 200.13
##$BF7= 200.13
##$BF8= 200.13
##$BYTORDA= 1
##$CFDGTYP= 0
##$CFRGTYP= 5
##$CHEMSTR= <none>
##$CNST= (0..31)
1 1 145 1 1 1 1 1 1 1 1 1 1 1 1 1 1 1 1 1 1 1 1 1 1 1 1 1 1 1 1 1 
##$CPDPRG= <>
##$CPDPRG1= <>
##$CPDPRG2= <>
##$CPDPRG3= <>
##$CPDPRG4= <mlev>
##$CPDPRG5= <mlev>
##$CPDPRG6= <mlev>
##$CPDPRG7= <mlev>
##$CPDPRG8= <mlev>
##$CPDPRGB= <>
##$CPDPRGT= <>
##$D= (0..31)
0 1.2 0 0 0 0 0 0 0 0.06 0 0.03 0 0 0 0 0.0002 0 0 0 0 0 0 0 0 0 0 0 0 
0 0 0 
##$DATE= 1668505673
##$DBL= (0..7)
120 120 120 120 120 120 120 120 
##$DBP= (0..7)
150 150 150 150 150 150 150 150 
##$DBP07= 0
##$DBPNAM0= <>
##$DBPNAM1= <>
##$DBPNAM2= <>
##$DBPNAM3= <>
##$DBPNAM4= <>
##$DBPNAM5= <>
##$DBPNAM6= <>
##$DBPNAM7= <>
##$DBPOAL= (0..7)
0.5 0.5 0.5 0.5 0.5 0.5 0.5 0.5 
##$DBPOFFS= (0..7)
0 0 0 0 0 0 0 0 
##$DE= 6
##$DECBNUC= <off>
##$DECIM= 32
##$DECNUC= <off>
##$DECSTAT= 4
##$DIGMOD= 1
##$DIGTYP= 9
##$DL= (0..7)
0 120 120 120 120 120 120 120 
##$DP= (0..7)
150 150 150 150 150 150 150 150 
##$DP07= 0
##$DPNAME0= <>
##$DPNAME1= <>
##$DPNAME2= <>
##$DPNAME3= <>
##$DPNAME4= <>
##$DPNAME5= <>
##$DPNAME6= <>
##$DPNAME7= <>
##$DPOAL= (0..7)
0.5 0.5 0.5 0.5 0.5 0.5 0.5 0.5 
##$DPOFFS= (0..7)
0 0 0 0 0 0 0 0 
##$DQDMODE= 0
##$DR= 18
##$DS= 0
$$ [...]
##$SUBNAM2= <"">
##$SUBNAM3= <"">
##$SUBNAM4= <"">
##$SUBNAM5= <"">
##$SUBNAM6= <"">
##$SUBNAM7= <"">
##$SUBNAM8= <"">
##$SUBNAM9= <"">
##$SW= 18.0517283424941
##$SWIBOX= (0..15)
0 0 2 0 0 0 0 0 0 0 0 0 0 0 0 0 
##$SW_h= 3612.71676300578
##$TD= 16384
##$TD0= 1
##$TE= 0
##$TE2= 300
##$TE3= 300
##$TEG= 300
##$TL= (0..7)
0 120 120 120 120 120 120 120 
##$TP= (0..7)
150 150 150 150 150 150 150 150 
##$TP07= 0
##$TPNAME0= <>
##$TPNAME1= <>
##$TPNAME2= <>
##$TPNAME3= <>
##$TPNAME4= <>
##$TPNAME5= <>
##$TPNAME6= <>
##$TPNAME7= <>
##$TPOAL= (0..7)
0.5 0.5 0.5 0.5 0.5 0.5 0.5 0.5 
##$TPOFFS= (0..7)
0 0 0 0 0 0 0 0 
##$TUNHIN= 0
##$TUNHOUT= 0
##$TUNXOUT= 0
##$USERA1= <user>
##$USERA2= <user>
##$USERA3= <user>
##$USERA4= <user>
##$USERA5= <user>
##$V9= 5
##$VALIST= <valist>
##$VCLIST= <CCCCCCCCCCCCCCC>
##$VD= 0
##$VDLIST= <DDDDDDDDDDDDDDD>
##$VPLIST= <PPPPPPPPPPPPPPP>
##$VTLIST= <TTTTTTTTTTTTTTT>
##$WBST= 1024
##$WBSW= 4
##$XGAIN= (0..3)
0 0 0 0 
##$XL= 0
##$YL= 0
##$YMAX_a= 248715
##$YMIN_a= -136293
##$ZGOPTNS= <>
##$ZL1= 120
##$ZL2= 120
##$ZL3= 120
##$ZL4= 120
##$ABSF1= 10
##$ABSF2= 0
##$ABSG= 5
##$ABSL= 3
##$ALPHA= 0
##$AQORDER= 0
##$ASSFAC= 0
##$ASSFACI= 0
##$ASSFACX= 0
##$ASSWID= 0
##$AUNMP= <proc_1d>
##$AZFE= 0.1
##$AZFW= 0.1
##$BCFW= 1
##$BC_mod= 2
##$BYTORDP= 1
##$COROFFS= 0
##$CY= 11.3945322036743
##$DATMOD= 1
##$DC= 2
##$DFILT= <>
##$DTYPP= 0
##$F1P= 2.36226072786647
##$F2P= -0.459571619588291
##$FCOR= 0.5
##$FTSIZE= 0
##$FT_mod= 4
##$GAMMA= 1
##$GB= 0.15
##$INTBC= 1
##$INTSCL= 1
##$ISEN= 128
##$LB= 0.24
##$LEV0= 0
##$LPBIN= 0
##$MAXI= 10000
##$MC2= 0
##$MEAN= 0
##$ME_mod= 0
##$MI= 1.114404
##$NCOEF= 0
##$NC_proc= 0
##$NLEV= 6
##$NOISF1= 3.799351
##$NOISF2= 2.8
##$NSP= 1
##$NTH_PI= 0
##$NZP= 0
##$OFFSET= 15.70392
##$PC= 1
##$PHC0= -18028.27
##$PHC1= 4.200696
##$PH_mod= 1
##$PKNL= yes
##$PPARMOD= 0
##$PSCAL= 0
##$PSIGN= 0
##$REVERSE= no
##$SF= 200.130013532006
##$SI= 16384
##$SIGF1= 3
##$SIGF2= 2
##$SINO= 400
##$SIOLD= 16384
##$SREGLST= <1H.CDCl3>
##$SSB= 0
##$STSI= 0
##$STSR= 0
##$SW_p= 3612.71676300578
##$SYMM= 0
##$S_DEV= 0
##$TDeff= 0
##$TDoff= 0
##$TI= <>
##$TILT= no
##$TM1= 0
##$TM2= 0
##$TOPLEV= 0
##$USERP1= <user>
##$USERP2= <user>
##$USERP3= <user>
##$USERP4= <user>
##$USERP5= <user>
##$WDW= 1
##$XDIM= 8192
##$YMAX_p= 0
##$YMIN_p= 0
$$ End of Bruker specific parameters
$$ ---------------------------------
##NTUPLES= NMR FID
##VAR_NAME=  TIME,          FID/REAL,        FID/IMAG
##SYMBOL=    X,             R,               I
##VAR_TYPE=  INDEPENDENT,   DEPENDENT,       DEPENDENT
##VAR_FORM=  AFFN,          ASDF,            ASDF
##VAR_DIM=   8192,          8192,            8192
##UNITS=     SECONDS,       ARBITRARY UNITS, ARBITRARY UNITS
##FACTOR=    0.0002768,     1,               1
##FIRST=     0,             0,               0
##LAST=      2.2672688,     0,               0
##MIN=       0,             -136293,         0
##MAX=       2.2672688,     248715,          0
$$ Real data points
##PAGE= N=1
##DATA TABLE= (X++(R..R)), XYDATA
0 0 0 0 0 0 0 0 0 0 0 0 0 0 0 0 0 0 0 0 0 0 -1 30 -105 108 -108 108 -108 109 -136 207 -216 217 -251 316 -328 386
36 386 -429 478 -537 602 -664 742 -829 911 -1003 1110 -1226 1358 -1495 1642 -1819 2003
52 2003 -2208 2436 -2683 2975 -3300 3669 -4109 4624 -5241 5987 -6938 8169 -9858 12319
66 12319 -16217 23541 -42220 248715 199286 36049 120426 72159 38757 -7153 -12558 -54105
78 -54105 -54436 -71303 -77498 -80659 -55634 -61817 -39080 -12635 -9661 -21328 -5026 -2415 -3683 10126
92 10126 37022 31943 24936 25812 19751 -4368 -9219 -10259 -16027 -14377 -8938 -12766 -664 16666
106 16666 26091 36805 62756 65407 42264 30633 24218 -8182 -24323 -19454 -30106 -40904 -35912
119 -35912 -39824 -46185 -36272 -23442 -20273 -10693 -2681 -12160 -12151 -2126 -6143 -3550 20714 30718 26999
134 26999 31938 38199 30795 23362 25421 25448 19291 15601 7740 -3669 -4914 -8778 -14746 -10007 -6658
149 -6658 -15633 -25883 -26010 -28107 -37863 -30649 -16266 -16335 -12204 -322 853 1461 10718 14559 17019
164 17019 20486 20501 14615 12960 14166 5865 10839 22714 19739 12439 16320 14099 2922 -2109 -2791
179 -2791 -9186 -15047 -18378 -23770 -29158 -27744 -27181 -25666 -15526 -11145 -9376 -3203 2102 1375 6633
194 6633 16831 22022 22468 23738 27033 18090 12885 12437 7762 2838 7 -3325 -6245 -6877 -9293 -8965
210 -8965 -2607 2902 409 -591 3762 -2060 -9920 -8542 -10332 -14042 -13988 -13411 -14711 -16084 -13790 -9384
226 -9384 -5762 205 5263 9295 14287 15989 16119 22170 26173 25518 23995 24920 20821 10957 2168 -1595
242 -1595 -7674 -15228 -19094 -23184 -24716 -27482 -27690 -23384 -18181 -15874 -12175 -7416 -2489 -1960 834 6684
258 6684 11206 13590 19090 22105 20734 19659 18477 18371 11928 7776 6116 2301 -2133 -7761 -9284
273 -9284 -8172 -7305 -11600 -8783 -5959 -7456 -9478 -9726 -6491 -7618 -10438 -6177 -4664 -6313 -5903 -3889
289 -3889 -1803 -647 561 3011 4454 5247 6494 9675 13852 13580 14057 18675 19349 13995 11981 12059 6867
306 6867 -1151 -6591 -7817 -13123 -19055 -20926 -19305 -18684 -20789 -19388 -13662 -7995 -9359 -5343 239
321 239 3452 3946 5753 11544 12754 13139 16732 18265 15347 13118 13274 11720 8889 6429 5320 3240
337 3240 -989 -6566 -6867 -5414 -8592 -12481 -10715 -9807 -15734 -19163 -16170 -13841 -12971 -11201 -5435 -1316
353 -1316 -1149 2523 6534 10872 14338 13914 16447 18530 13152 10180 10404 10110 5664 3777 6549 2312
369 2312 -4818 -5366 -4873 -8179 -8924 -8705 -9128 -8658 -13973 -14777 -10236 -8896 -8063 -5684 -887 -764 -4676
386 -4676 -2754 1825 1237 3419 6639 9900 8860 8776 11215 12653 13875 15041 14581 13160 10297 1676
402 1676 -1671 -2968 -8167 -10169 -8552 -10194 -14904 -15809 -14178 -13807 -14529 -11391 -7418 -7017 -6120 -4566
418 -4566 -2947 3130 5394 7718 14415 15878 13933 11973 13880 12173 9761 10420 9630 6725 2834 1215
434 1215 -1178 -3307 -5329 -5626 -7852 -10825 -14943 -16929 -16195 -14681 -15031 -12021 -4083 -4893 -4073 907
450 907 3773 5240 7066 10663 13591 12237 10357 10187 8300 7946 5645 5243 5477 2164 -850 -1534 -2783
467 -2783 -3507 -3063 -156 754 -2633 -3180 -5403 -8783 -10601 -10443 -9056 -7658 -9826 -9978 -6836 -6990 -4556
484 -4556 119 4638 7102 6968 6955 10083 10018 11661 14102 16450 16531 14178 10640 6993 1018 -4395 -5718
501 -5718 -8017 -10924 -13886 -15838 -15154 -16289 -13007 -9107 -4942 -3856 -4038 -4284 -2950 -3493 -3607 2264
517 2264 6482 8827 10809 11800 13668 12297 12190 13803 11184 7957 4592 424 -4204 -6451 -6499 -3082
533 -3082 -3303 -3201 -3839 -5757 -8375 -10541 -11576 -7811 -7747 -8521 -5445 -4357 -4820 -2846 1842 6962 8709
550 8709 8311 7946 5708 4740 2554 2927 7396 9630 8174 8501 9465 6325 5096 5357 5559 1054 -2301
567 -2301 -6851 -10939 -15877 -14530 -14300 -11083 -8567 -8138 -5153 -4009 -5610 -5455 -439 4580 3465 3627
583 3627 7692 6313 5548 10331 12800 14365 15804 13027 8939 4098 984 -2716 -2957 -1593 -4138 -6317
599 -6317 -5685 -6095 -9873 -8475 -5352 -6277 -8622 -8458 -8092 -12054 -10123 -6696 -1890 3083 5879 7579
615 7579 10269 11944 9100 9529 12928 11033 7647 7534 5324 2885 647 2231 712 -958 -307 -4364
631 -4364 -6808 -9384 -11543 -11208 -8508 -7322 -8061 -5207 -2306 -4752 -4596 2293 2749 328 1787 4590
647 4590 1234 789 3588 5507 7293 8847 9285 9094 9255 6834 3580 5296 5079 14 -391 -283 -4152
664 -4152 -6452 -5668 -6610 -8132 -9074 -8512 -11006 -11868 -10836 -9614 -9136 -3521 -1068 1155 5936 6386 5325
681 5325 9173 13448 9833 10193 13772 12643 8298 7169 5901 3936 2119 277 -3700 -6152 -6933 -10316
697 -10316 -12148 -9558 -11156 -11777 -7428 -5529 -7434 -3759 -559 -117 45 4032 5137 3777 3803 5537
713 5537 5485 5550 7112 5672 5706 7056 3739 3491 5649 2960 -212 1041 2261 -402 -2739 -1612 -3254
730 -3254 -4486 -4129 -6404 -7927 -8121 -8985 -9280 -7620 -5698 -6464 -3470 197 -145 1527 5758 7812 7325
747 7325 9894 11500 8580 8220 9192 7613 6777 5150 3247 1446 316 -2899 -5867 -4752 -4050 -8279
763 -8279 -9450 -6899 -8271 -8779 -7450 -4635 -5852 -4358 -1538 -1104 -695 2614 3706 2489 6303 6260
779 6260 7074 8757 8648 8077 8293 9434 7022 3717 3297 1594 -2744 -3814 -4213 -6212 -7124 -8032 -8906
796 -8906 -7980 -7602 -6305 -5887 -4104 -3310 -4384 -2986 699 -836 1301 5690 5791 4606 6510 6165 5571
813 5571 5001 5922 6031 4977 3446 987 2741 3016 -422 -1461 1414 -898 -4550 -5153 -4581 -6510 -8603
830 -8603 -7719 -6168 -6775 -6343 -5386 -5343 -3538 -804 406 2762 3394 1932 3728 6150 4927 6762 9093
847 9093 11004 7732 7068 7425 6527 3692 2185 1057 -921 -5630 -6927 -9131 -9161 -8760 -9032 -7203 -5392
864 -5392 -7330 -8660 -5067 -4777 -3252 -900 2179 4039 4735 6682 6651 7776 7679 8927 8927 6917 4265
881 4265 1675 1184 -843 -2500 -1435 555 -193 -2471 -3179 -1834 -3818 -5413 -5250 -4026 -4621 -6666
897 -6666 -6692 -4560 -4832 -4185 -1381 1098 1764 1773 2168 2840 3470 3374 5971 7455 6508 6647 5497 4501 4405 3547
917 3547 4195 2558 35 -1328 -2434 -4726 -6969 -8523 -4842 -5243 -6844 -7826 -6214 -5815 -5203 -3981
933 -3981 -768 300 690 1330 1854 3939 5234 6511 7441 7786 7783 7711 5849 5059 3297 2324 2135 1194 -2682
952 -2682 -2887 -3711 -6671 -6444 -6550 -6047 -6183 -5449 -4998 -4483 -4468 -3592 -2614 415 1233 489 2468 3171 3917
971 3917 3871 6325 7659 5620 4972 5515 4899 2662 2029 865 457 826 -1531 -1629 -3810 -4947 -4570 -3554
989 -3554 -3018 -4684 -4918 -3257 -4587 -6171 -4154 -3321 -1775 -1415 504 1038 1864 1274 2945 4139 4993
1006 4993 4570 4293 4016 4779 2952 5293 6028 6212 4095 3584 3074 -1597 -3479 -4603 -5237 -7564 -7455
1023 -7455 -7715 -8858 -8942 -6815 -4281 -2543 -1158 440 1696 3194 965 1333 3049 4929 4852 6999
1039 6999 7211 6147 6629 5807 5531 4017 2284 1099 -1067 -3715 -4612 -5352 -4592 -4131 -4218 -2515 -2420 -4377
1057 -4377 -4197 -4518 -3499 -4448 -3894 -1601 -169 -1086 88 3714 5315 5775 6699 6218 6008 3526 2604
1074 2604 2206 2444 1804 529 1241 1063 -517 123 533 -2485 -2806 -3696 -4513 -4241 -6864 -6706 -6516 -4316
1092 -4316 -3789 -1670 -450 -228 -550 -496 2623 1624 1617 3725 4199 5218 4393 5528 5765 6640 6350 4531
1110 4531 3896 1074 -734 -2751 -2463 -4032 -5518 -4809 -4181 -6462 -6043 -4038 -4096 -4318 -3874 -2599 -1695
1127 -1695 -1299 -1317 450 3569 3616 4067 6007 7550 6857 5378 5488 5570 4052 3647 2485 1437 -1064 -436
1145 -436 -1693 -2027 -3232 -2548 -2284 -4090 -5085 -4966 -4526 -3207 -4569 -2962 -564 -1701 -1255 271 969
1162 969 587 1277 2244 3004 2401 3294 2531 4675 5269 3734 3273 3965 3447 2036 1663 1142 -770 -2933
1180 -2933 -3052 -3240 -4575 -4567 -4028 -5693 -5158 -3676 -4385 -3957 -3616 -3435 -902 406 -394 907 3707 4313
1198 4313 2942 4914 6750 5260 4380 5314 4799 4515 3604 1803 228 1704 -540 -2925 -3308 -3383 -5031
1215 -5031 -6721 -5205 -6377 -6250 -5368 -3936 -4265 -2749 -963 1214 1992 3255 4706 3957 5384 4462
1231 4462 3193 5058 4463 2571 2848 3869 1803 20 1188 -750 -1239 -1525 -1479 -2255 -1220 -1924 -3189
1248 -3189 -3105 -2573 -3291 -1845 -2968 -3996 -3514 -2616 -1317 -2595 -1990 1053 699 1441 3033 4128 4385
1265 4385 5468 5712 5989 4912 4172 2653 2213 1649 380 -701 117 -2936 -4473 -3393 -3388 -4561 -5123
1282 -5123 -5237 -5382 -5336 -4689 -2177 -1473 -659 440 178 2906 3264 2663 2664 3631 3083 3552 4583 5076 3188
1301 3188 3438 4096 3310 2042 713 -341 -1051 -2630 -3007 -3613 -4321 -3687 -6349 -3600 -4699 -5092 -3540
1318 -3540 -1367 -2112 -1906 835 757 -435 566 3404 3842 3432 4396 4515 4200 4041 3666 2221 3382 2488
1336 2488 -52 -18 652 -1857 -2083 -1165 -897 -2141 -1131 -3474 -5584 -3425 -4404 -4295 -2879 -939 -2144
1353 -2144 -730 515 93 -282 2824 3748 3009 2980 5081 3417 3110 3821 3866 2176 2833 3200 1862 1903
1371 1903 47 -788 -250 -1239 -3215 -4789 -4717 -4731 -5570 -5247 -4019 -3907 -2612 -2360 -2002 -1518 50 1203
1389 1203 2293 3399 3423 4375 5381 6084 4095 5173 5954 4698 2802 1026 -58 -2503 -3818 -3130
1405 -3130 -3014 -4207 -3805 -3679 -2664 -2766 -2637 -1358 -1749 -998 -2158 -617 -573 -1771 -40 688 2173
1422 2173 718 1816 2886 1831 2413 2780 2692 3075 3222 2847 2363 2247 1076 281 2224 923 -929
1439 -929 -1906 -2468 -2509 -3829 -4946 -3990 -5856 -4904 -3441 -2817 -1521 -993 -525 1625 1045 2655 2837 4091
1457 4091 3893 3108 3292 5084 4254 2402 3579 2993 1270 -273 62 -1134 -1472 -3293 -4248 -4297 -5281 -5338
1475 -5338 -4510 -3298 -3601 -3464 -2010 -905 247 204 626 488 1523 1149 1753 2719 2606 3124 3483 3488 3619
1494 3619 3558 3183 2425 182 1091 26 130 -1950 -950 -1601 -1885 -3314 -3781 -3319 -3649 -3076 -3651 -4198
1512 -4198 -3206 -2506 -2564 -58 -43 761 2995 3634 3665 4192 4230 4375 1168 2247 2155 749 1157 201 -561 434
1532 434 510 179 -60 -711 -1360 -2131 -2627 -2383 -2864 -3674 -3487 -2284 -2924 -3051 -2774 -522 -1400 -71 1472
1551 1472 2028 1746 2724 2825 3091 3996 4211 4570 3800 3272 3022 1991 1234 -717 -1235 -2228 -4189 -4266 -3353
1570 -3353 -3027 -3460 -4249 -3495 -2133 -1858 -1723 -782 -356 -484 64 186 3156 2511 2123 3183 1924 3418
1588 3418 3085 3553 2502 1498 2537 355 266 -529 273 -32 -534 -1123 -1818 -2015 -1974 -1980 -2127 -2443 -1828 -2601
1608 -2601 -3341 -142 -1948 -2044 -528 -211 650 609 1080 1948 2350 1274 2250 3329 3639 2861 2866 3323 1992
1627 1992 1574 1360 716 -176 -1029 -2461 -2404 -4592 -5148 -3694 -3856 -3956 -3823 -3354 -1926 -1456 159 235 1184
1646 1184 1405 1198 2705 3018 3720 2833 4835 3103 2879 1544 843 1398 570 -620 264 -422 -1502 -1011
1664 -1011 -380 -1916 -1707 -2160 -791 -2513 -3239 -2287 -1897 -2261 -1853 -1464 -543 -1406 68 865 1906 2118
1682 2118 1727 2458 3567 3690 3231 3576 3068 1840 1814 2239 990 -817 -619 -473 -1833 -2744 -3132 -2374
1700 -2374 -3201 -2850 -3926 -2677 -1947 -2277 -1979 -1392 206 -844 -51 1803 528 1248 1435 3441 2273
1717 2273 2642 2093 2383 2561 2206 1745 1396 1736 1231 44 -144 -541 -1593 -1445 -1306 -2958 -3615 -3375 -3566
1736 -3566 -4110 -2863 -1614 -604 -1094 324 1818 702 2060 1664 2995 3278 2115 2044 2659 3304 2423
1753 2423 1838 2222 1215 900 761 -265 -1345 -1327 -1911 -2696 -2692 -2318 -2808 -2563 -2235 -2319 -1639 -1769 -599 -1828
1773 -1828 -307 711 303 975 1655 1815 2306 1689 1835 2025 2773 2235 1870 1578 1167 935 192 641 -650
1792 -650 -355 -961 -551 -1161 -3037 -521 -1882 -1652 -3245 -2677 -1988 -2910 -2336 -1186 -366 -485 1873 1563
1810 1563 2826 1831 2973 3689 3261 2736 3672 1564 3452 2637 1233 -270 508 -1143 -1379 -2005 -2477
1827 -2477 -2992 -3267 -3152 -2982 -2360 -2602 -895 -975 -1586 -531 256 -79 688 1447 1546 1137 1691 1409 1947 1822
1847 1822 2706 1293 2581 1176 1350 1234 619 422 272 -806 -1190 -1660 -1604 -439 -1786 -1051 -1764 -2521
1865 -2521 -2463 -2008 -2137 -154 -838 -869 -845 1592 359 1136 1802 2275 2263 1809 1986 2367 1797 2151 1933 516
1885 516 1415 797 1100 -681 -1050 -1238 -1323 -966 -1414 -3371 -2382 -2605 -3306 -1637 -1972 -1027 -1480 -450 882
1904 882 402 1498 578 1250 1796 2572 2279 2842 2909 1727 1846 1768 1171 1441 -15 292 -177 -1351 -1420 -1845
1924 -1845 -2066 -3004 -2349 -2563 -1671 -1534 -1582 -1348 -577 -1375 -621 970 -881 814 1135 1579 1278 1891 2374
1943 2374 3442 3026 1380 2051 1421 1417 -333 737 190 -344 -1898 -1367 -1218 -1364 -1540 -1249 -1748 -1861 -2267
1962 -2267 -1678 -804 -1635 -1489 -643 -718 -585 29 -200 1371 1491 1392 2391 1380 1694 1756 1535 1285 839 1894
1982 1894 1306 1284 -463 -617 -880 -738 -746 -2798 -2316 -1719 -2837 -2661 -1273 -2252 -1860 -1503 -977 -40 316
2001 316 862 1752 1358 1440 2061 1687 2910 1908 2045 2902 2892 2200 2514 547 -682 -404 -1374 -1988 -1614
2020 -1614 -1372 -2183 -2393 -1263 -2130 -2326 -877 -578 -2094 -842 -555 -237 441 450 900 1016 821 717 1041
2039 1041 1570 1068 896 1152 340 300 1335 1822 1173 548 604 -53 -143 -946 -240 -1509 -1396 -1813 -2025 -1620
2059 -1620 -2482 -1208 -1823 -1410 -1443 -400 445 645 1676 1465 1366 2474 1408 2315 2328 2110 2441 1842 1435
2078 1435 -172 316 526 -1416 -919 -1288 -1065 -593 -1202 -1715 -1659 -1175 -1918 -1582 -1353 -1378 -319 -723 -560
2097 -560 571 -647 -423 1546 986 1553 2190 1787 2111 1009 1564 682 1011 386 -326 491 282 -864
2115 -864 -926 -374 -1557 -1915 -2238 -845 -1436 -1073 -1167 -1867 -1134 -96 -1027 -304 585 400 2399 1473 1095
2134 1095 1298 1642 1790 1992 1395 1384 2123 1415 1695 1288 1567 723 424 -510 -208 -721 -1027 -1096 -1095 -1060 -1862
2155 -1862 -348 -1090 -1897 -1266 -215 -530 255 449 986 1019 920 967 1910 1949 2961 1643 1906 1308 982 1713
2175 1713 1769 35 -142 -86 -429 -1151 -1907 -1633 -960 -1892 -2273 -2035 -759 -1517 -1256 -723 -802 473 -183 402
2195 402 1317 415 2373 1263 2005 1449 1486 1310 936 -321 508 1409 1192 -62 1086 -544 -331 -1286
2213 -1286 -645 -572 -880 -2020 -1214 -526 -2207 -814 -1107 -925 -1519 -606 -415 -241 -79 -322 1153 402 497
2232 497 1483 2061 2971 2305 2553 1688 2304 2102 1033 1282 471 -5 -803 -360 -1359 -1289 -2466 -1584 -1490 -1981
2252 -1981 -2102 -875 -671 -1216 -1515 175 -581 518 -205 1464 1820 962 1150 1332 1642 575 2526 2417
2270 2417 2054 -662 610 274 -192 -603 -1310 -1186 -1818 -2061 -1505 -1975 -1306 -1872 -860 -668 -812 -637 -318
2289 -318 585 414 466 -622 694 999 1243 684 931 1651 1500 2138 1505 1125 333 569 609 201 396 595
2309 595 -1723 -849 -1124 -1125 -1168 -880 -2269 -1622 -1113 -1616 -2295 -1519 -588 -1120 251 326 486 882 873 1734 1222
2330 1222 925 1204 880 1161 1504 793 1219 655 436 1925 411 -398 -303 -508 -767 -1026 -1764 -1632 -1280
2349 -1280 -2346 -1700 -1759 -1494 -1205 446 -24 -156 788 375 614 2032 1599 378 2235 1806 2175 1890
2367 1890 682 761 -346 -132 -462 -422 -264 -630 -475 -1118 -1454 -526 -1064 -580 -804 -1039 -188 -1103 -726 -833
2387 -833 -847 -346 496 20 557 1059 572 1595 1286 1845 1098 511 958 2048 892 220 738 -283 -463
2406 -463 -335 -773 -1785 -132 -568 -651 -801 -770 -1298 -2303 -706 -1148 -1143 -662 363 578 1356 689 1154 670
2426 670 1878 1445 854 1385 1035 1263 705 114 636 763 -252 -781 -709 -893 -1216 -1490 -805 -1094 -1374 -1683
2446 -1683 -1134 -1792 -1048 -426 -309 -169 69 138 1004 1250 398 715 864 823 462 1036 543 626 1028 863 1312
2467 1312 -187 -535 -500 -592 -1374 -1628 -940 -219 -1698 -701 -682 -1740 -803 -1306 -631 -1077 208 -496 -249
2486 -249 128 -362 1076 1440 1490 494 1693 1394 1245 741 1507 1731 1258 -714 -347 -209 -475 -438 -804 -619
2506 -619 -1864 -995 -1249 -1278 -1787 -1432 -1047 -157 -1073 -528 -948 -726 138 -102 1386 824 1863 2104 41
2525 41 1380 173 354 805 1159 1649 1537 1002 -357 -724 -684 -268 -457 -1256 -1444 -476 -807 -1229 -954 -855
2545 -855 -855 -552 -457 360 -1266 -416 143 1097 655 -461 1054 1262 1028 1587 -96 97 881 119 -84 49
2565 49 765 -32 71 -936 -1510 -515 -1645 -1411 -978 -472 -1370 -390 -631 -769 -1075 -236 -2149 -986 670
2584 670 143 113 -398 1469 1137 1458 907 2076 1141 1130 1267 993 499 388 -201 239 -470 -769 -772 -793 -978
2605 -978 -1933 -1505 -631 -882 -874 -499 -456 -300 -197 682 174 411 558 124 1193 1822 1418 1246 953 146 -55
2626 -55 582 197 453 147 662 293 2 -689 -387 -195 63 -518 -1558 -1163 -1193 -980 -169 -1043 335 -984
2646 -984 654 -98 -418 -90 -2 1126 257 797 1109 197 989 1132 597 1065 793 1129 -87 -521 368
2665 368 -707 113 3 -1505 -652 -705 -1672 -1956 -1237 -444 -558 -1267 -990 101 -913 186 -43 606 1163
2684 1163 713 1628 1315 858 1400 755 327 1017 1002 -38 324 -456 -662 -1578 -446 -1122 -1317 -1292 -1042 -1326
2704 -1326 -288 -712 198 -564 81 487 1037 -68 648 697 1566 770 1382 1141 584 201 1114 592 234
2723 234 850 729 540 -377 -857 -921 227 623 -775 -874 -168 -1155 -966 -1198 -482 -1054 -993 -1107 -178 -89 -150
2744 -150 -427 550 -8 772 1128 692 535 128 893 1115 903 259 1216 953 438 783 -1058 403 -965
2763 -965 -673 376 -959 -1479 -1435 -767 -775 -1340 -661 -957 -288 -846 -228 215 483 1174 -67 1144 1392 950
2783 950 567 509 1362 701 -796 458 1202 445 282 353 -112 -821 -346 -246 -446 -331 -685 -424 -1289 -508
2803 -508 473 -378 -754 362 -1673 460 -530 110 -97 1697 192 787 1394 613 786 460 953 1086
2821 1086 844 512 545 -536 311 -1233 -382 -786 -1068 -1008 -480 -1247 -761 -841 -579 -468 -832 43 -181 -236
2841 -236 396 438 377 875 662 386 1217 841 85 1228 392 1203 442 616 -458 506 -610 48 -643 -1019
2861 -1019 -1372 -841 -1104 -1221 -883 -965 -1200 -645 312 -1483 -87 -367 462 354 377 952 604 35 1370
2880 1370 439 1169 -18 614 479 633 -252 -421 -268 -927 -425 95 95 -525 -899 -1010 -352 -387 -919 -1306
2900 -1306 -799 329 -762 232 31 -647 -138 -187 4 150 56 325 598 518 1817 443 745 1517 1381
2919 1381 596 -270 163 157 -811 -419 -1043 -300 -1389 -740 -1817 -963 -640 -1082 173 185 -998 -342 202
2938 202 653 855 -354 636 615 1146 306 1087 1089 1050 338 1052 441 215 -97 -753 -109 -650 -496 -552 -1187
2959 -1187 -290 -246 -1413 135 -613 -525 -813 -732 -972 -347 638 893 -33 162 335 960 651 989 49 650
2979 650 834 920 1073 -555 -435 -114 697 135 293 -948 -222 -576 -764 -174 -471 -1382 -216 -199 -1206
2998 -1206 -672 -114 487 -307 -1052 -47 -114 101 1771 609 378 775 199 54 1132 1013 492 -354 950
3017 950 -837 343 -215 -259 -931 699 -643 717 -412 -1233 -98 -1281 -247 -1427 -540 241 483
3034 483 -317 -15 1084 410 1229 916 253 1054 956 912 222 668 121 -237 537 486 5 -448 218 146 -611
3055 -611 499 -551 -755 -1389 -468 -745 -522 174 -600 -1098 -356 -434 -985 230 399 -147 804 1002 571
3074 571 -30 564 714 316 1621 1043 408 317 55 35 -35 -555 -240 99 -720 282 -622 -54 -757 -1272
3094 -1272 -1162 -225 -818 -956 -251 -75 -41 -76 838 331 799 -108 1061 813 385 511 828 -77 -254 66
3114 66 -534 846 486 10 43 -722 -1151 -31 -256 -851 -951 -401 -375 -90 461 -321 -284 -154 -904 -568 1427
3135 1427 630 -471 1330 970 783 -314 1142 930 1084 188 140 40 423 250 -50 429 -27 -766 -706
3154 -706 -1301 -843 -222 -1550 -1397 -1110 -697 -628 -372 269 -819 176 744 -184 355 51 698 519 -209 954
3174 954 -273 745 522 -39 205 252 617 -214 -171 -751 -315 -25 -885 -713 -928 124 360 -465 -262 -226
3194 -226 209 554 -475 379 408 593 752 -124 670 1392 550 210 627 1043 658 566 458 101 -366 14
3214 14 -199 -197 -463 -618 -900 -1079 94 -381 -1265 -84 -267 -672 211 -917 -66 184 316 920 148 233
3234 233 807 1491 219 1003 -232 -678 637 669 626 -463 297 310 22 -414 -223 56 -1448 81 -6
3253 -6 -1195 -1036 -593 -685 507 116 4 107 -6 436 479 -286 1022 210 -220 1334 103 867 824 391
3273 391 -329 559 708 478 -402 381 199 -579 -267 -782 -102 -441 -269 -619 -750 -1032 -669 -1015 -20 -10
3293 -10 368 363 -285 -307 65 614 576 -17 2 1364 1165 501 1286 -299 -722 -1419 298 7 -31 -595 148
3314 148 -934 -181 -486 -678 -546 -532 32 -153 -21 91 1470 -106 114 367 112 -36 473 -971 -1211
3333 -1211 219 738 409 431 1052 313 263 -165 260 225 -398 -895 -509 -520 -465 -99 -881 -606 -599 60 -170 -471
3355 -471 -1165 373 290 -70 510 -722 -161 1143 236 390 664 1053 16 484 360 488 323 63 446
3374 446 300 -797 536 -401 -623 -670 -208 284 238 -133 -295 454 -178 -351 222 -258 104 -26 -733 530
3394 530 1208 570 387 406 686 494 159 -236 152 53 -6 -713 501 -37 -804 -185 -12 -200 -139 -536 -1282
3415 -1282 -1554 -528 -748 -538 -1335 462 -259 -145 676 1328 449 579 562 695 -63 -41 643 1296 198
3434 198 427 1032 -154 -914 -722 597 -67 260 137 -357 -683 -107 -676 1 -429 -516 -1287 23 124
3453 124 -609 -225 411 -102 -507 -262 774 410 -19 1968 501 593 692 -560 362 317 -914 446 -15
3472 -15 -226 77 187 -1752 249 -277 -793 503 1111 409 -709 -120 -895 -194 429 304 -375 -498 197
3491 197 697 103 678 91 584 -564 625 772 -69 320 -292 66 -17 -470 -185 320 -769 114 -900
3510 -900 -1400 -496 -687 -1526 -22 -798 -194 -259 -1014 481 -357 -639 158 407 589 -316 1832 99 -307
3529 -307 322 1123 239 -48 -541 -641 484 -164 -30 361 -797 -556 -331 -460 232 -397 71 -439 360
3548 360 -692 -478 420 216 -565 -125 -389 87 -55 578 -431 1529 1241 -106 -233 323 564 2 124
3567 124 -192 -1331 -1158 754 -619 -426 -927 -238 -1325 -427 -590 -389 -1273 -145 134 -122 -218 -348 69
3586 69 386 336 924 615 1294 1000 400 389 377 429 180 1106 -114 -453 -93 46 -209 33 459 100 251
3607 251 662 596 44 -349 -866 -517 -27 -466 690 -150 675 756 742 -584 958 927 212 280 718 698 720
3628 720 -231 -113 191 -819 67 -309 -595 59 -578 -510 -532 -213 -423 -1217 -1494 -707 331 253 -271 -509
3648 -509 421 712 564 164 202 1303 963 -39 944 410 -394 -409 217 -605 -183 -228 1064 176 -322 -417
3668 -417 -173 262 -632 707 -69 204 -40 -86 -764 -110 -658 63 391 -117 86 -189 390 496 224 637
3688 637 -116 47 -16 43 548 -1 295 -833 -327 -177 -366 58 64 58 197 -437 -97 95 -721 -117 -682 -225
3710 -225 -113 -744 898 -862 170 367 1240 734 629 105 45 568 -172 -758 -146 404 -129 -977 29
3729 29 142 -322 152 215 -527 -825 -382 -689 116 136 -719 -775 -1300 143 -79 772 -308 -124 -266 -770 20
3750 20 976 816 -305 97 1179 393 -270 675 283 677 1188 698 -496 256 -364 -1350 187 -564 632
3769 632 -254 -447 -746 -569 126 352 -354 -56 723 504 597 519 1292 -459 138 356 209 -398 -515 110
3789 110 237 1212 -324 508 -114 267 306 -63 523 801 -963 -235 672 -778 -1062 -97 -629 -735 -355
3808 -355 -1239 -267 1724 251 -205 -85 406 -381 773 1215 132 333 1094 411 186 509 274 -54 -741
3827 -741 895 -347 497 -31 -610 -908 -350 77 -810 213 -737 -402 411 -321 502 -8 553 231 26
3846 26 -584 515 -230 -777 185 -266 515 667 -332 1201 55 841 -703 -644 203 -257 -318 172 874 -167
3866 -167 -486 -333 29 -122 -992 -727 80 -143 -293 -906 267 462 -146 484 957 126 1194 112 1204
3885 1204 -294 291 2 199 946 691 -54 92 -420 409 62 -523 -436 1459 495 217 61 -97 178
3904 178 -611 -343 114 -670 150 -895 -397 -332 758 -462 -267 217 363 310 726 472 -55 893 -407
3923 -407 -199 -42 378 -124 -400 57 286 -422 -996 -950 -252 -555 339 -733 399 285 -546 -806 870
3942 870 621 654 -556 48 239 566 71 123 870 705 30 -1057 -595 330 -380 -76 507 -760 -86 149
3962 149 685 -1149 -57 -1028 831 -974 376 208 857 -4 564 808 -489 -226 -245 -96 -519 -52
3980 -52 154 1071 504 769 -350 -417 439 710 -670 1147 -186 -31 -505 -619 50 -174 -376 369 -33
3999 -33 -683 -1157 358 649 -338 -583 712 308 -30 -580 544 -323 -264 71 89 710 -162 925 322 98
4019 98 96 396 1206 -467 828 -344 -114 -561 -97 -271 -449 -683 -1241 179 -402 354 -251 -230 440 1052
4039 1052 507 34 -788 513 -65 100 -317 158 -842 -77 80 178 541 71 -46 -50 -928 -959 130 -257
4059 -257 220 119 597 -792 -630 21 -215 -250 136 -658 685 -779 280 873 91 273 948 546 -843
4078 -843 -111 245 625 -316 102 681 -422 -316 -159 -745 -248 -6 -402 -200 -1027 -4 -224 -59 -121 259
4098 259 203 -391 431 -482 869 189 971 -334 -414 930 20 -902 169 68 -524 587 777 307 -283
4117 -283 -653 65 -884 539 75 -550 -451 -282 -828 -212 389 -406 -682 -1346 -279 -271 156 -344 880 -888
4137 -888 101 305 -111 539 -85 1009 -434 75 419 247 599 -382 244 -741 334 -102 -336 -162 -1213
4156 -1213 274 1331 -22 -562 -385 -543 -345 -46 -808 -303 975 348 -441 -908 274 -280 -37 591
4174 591 940 26 -7 659 572 -1032 359 406 494 395 -744 446 -555 -361 108 -88 364 -634 -645 848
4194 848 -1963 -1111 -666 73 658 -114 -24 -170 1371 -324 665 254 350 280 283 192 321 701 330 -173 -577
4215 -577 246 -311 -107 171 480 935 213 -563 327 -1457 -453 -657 -309 5 425 -139 110 -839 391
4234 391 381 340 4 164 308 -81 4 -768 1108 506 188 -488 278 99 93 58 525 73 -673 204 468 -33
4256 -33 -562 -567 -65 -571 34 -1181 32 -815 -319 171 337 -120 -1282 148 72 -820 566 -304 -249 12
4276 12 -634 -188 -494 174 479 171 1127 -126 4 389 -292 -110 -400 -382 373 -785 -93 -430 72 -651
4296 -651 -552 77 630 -299 970 -17 -291 -597 305 102 47 -229 367 614 -167 -204 -10 -344 253 -355 -772
4317 -772 -278 26 -334 -566 79 -88 -266 -134 -82 295 -103 -166 502 -285 -39 931 572 -460 1 -101
4337 -101 210 299 343 124 -315 -481 337 -343 227 285 -376 521 -112 393 48 -436 486 -264 -433 -502 285
4358 285 -40 140 328 243 -12 -279 319 -111 1106 -58 -57 -466 16 135 -617 563 -158 -412 -181 -33
4378 -33 -351 -374 -563 -58 281 -229 -104 11 186 -201 -368 -560 -655 899 -856 458 351 -600 429 702
4398 702 447 -211 -148 -67 331 238 -52 183 139 -152 -104 -910 501 -17 -684 174 -231 790 41 -319 -354
4419 -354 -242 -643 -51 -299 -1092 522 686 710 597 211 -161 533 317 -81 -97 -173 579 1434 220 226 341
4440 341 -58 -229 162 -333 1432 -493 -681 -1084 -430 -275 -243 -1162 422 272 216 -62 -53 317 -204 87
4460 87 -62 -339 612 55 -340 59 -714 449 699 317 306 246 563 270 379 475 -619 -300 925 425
4480 425 -248 84 -88 84 -174 -418 171 -1265 437 -581 -105 541 271 -524 307 471 592 -170 43
4499 43 -100 1438 -153 370 370 703 694 -1059 -394 -479 -624 -583 -282 -509 -248 -355 -140 -338 -431 322 -370 -491
4521 -491 277 -923 415 741 -568 -71 471 -538 35 364 -243 -773 1146 -247 606 -115 403 -110
4539 -110 -999 602 -761 -583 134 802 386 383 -540 -669 -83 -345 -175 -473 -869 -147 350 225 -154 379
4559 379 -352 -185 -43 749 378 2 -447 712 499 -399 -693 211 -816 -269 -79 480 -940 -145 -1092
4578 -1092 134 -28 -592 -1153 -276 -588 -647 123 -390 483 -195 429 618 471 323 625 235 177 43 241
4598 241 -37 -88 631 -649 704 -126 960 234 783 595 -589 -90 -573 -167 -729 -280 9 57 354
4617 354 -98 104 546 -2 213 274 51 -185 167 -249 766 731 809 566 -770 625 -719 506 -601
4636 -601 285 775 -510 -105 -329 129 109 322 -1190 273 296 986 -143 -520 -127 -744 201 -233 -49
4655 -49 -94 167 -47 393 246 556 88 534 774 -741 33 -1276 -294 19 621 -849 -275 69 -22 -759
4675 -759 -988 -1213 -1324 -689 108 167 334 523 -119 -181 -67 35 786 14 -63 677 -154 -400 981 718 19
4696 19 -431 844 -10 452 166 381 89 -341 899 -702 -913 -991 359 159 -268 -739 478 -1207 -496
4715 -496 71 483 287 18 1036 -302 -29 347 479 -364 -45 307 481 -113 -102 530 322 176 -141 569
4735 569 -229 554 -91 797 -250 -49 -255 -121 354 -532 376 -313 58 35 -485 524 -267 577 -239 -422
4755 -422 424 -95 235 12 665 -148 -272 -421 -104 -455 687 607 189 -1171 637 -367 -897 -196 387
4774 387 563 -176 197 -632 -13 -79 -746 220 825 -182 -946 892 -435 561 -35 1005 -316 252 126
4793 126 978 -62 156 -123 -37 -536 690 201 -480 681 85 -876 -389 -839 -268 222 -328 193 -297
4812 -297 111 480 863 -444 -85 -166 688 915 0 -103 227 -69 586 -10 -95 445 880 -195 -90 -216
4832 -216 537 228 180 -263 -321 53 353 -388 -486 -397 -137 -151 -394 -205 -840 419 -263 1074 513 -255 304
4853 304 338 152 212 -221 -268 17 -335 -22 -167 32 408 243 -503 190 660 401 -180 -42 -13 -45 -224 -23
4875 -23 -710 -826 -609 -747 -193 262 -195 697 331 -705 644 1003 269 1034 318 286 133 -277 632 164
4895 164 74 211 812 -611 465 -9 -444 -784 -492 -622 -246 276 -250 504 268 4 -228 -676 15 -552
4915 -552 -37 -78 671 -275 -341 -27 -471 -338 213 -130 346 265 -99 368 459 -389 -49 -314 458 -1078 -319
4936 -319 -789 -271 -370 -511 -266 87 -365 153 -81 -145 -332 -476 772 -306 388 -847 358 -51 567
4955 567 303 -270 -271 -71 169 82 -563 232 -337 432 1125 -290 100 -989 587 -556 604 367 -815
4974 -815 51 -260 -496 -586 207 759 226 883 133 -606 319 369 1 -207 1015 875 25 -322 -143 -222 329
4995 329 -182 -864 -612 -79 -608 -798 -744 -320 -98 154 -595 -829 -730 436 -121 42 333 -10 400 -43
5015 -43 61 527 -494 386 103 -283 -1377 -26 -24 52 -217 455 -161 51 -1282 -133 -242 -272 168 338
5035 338 353 -354 -475 143 -276 -367 -423 281 -860 -124 541 -280 530 1083 304 -293 994 -220 551 615
5055 615 331 171 141 -240 -155 -412 914 240 -4 244 -399 -474 -412 -639 -321 -359 -219 151 -950 -399 -114
5076 -114 -776 509 549 1147 -42 82 837 108 751 -87 -255 -191 416 -690 -354 -536 -491 301 -107 438
5096 438 51 318 -552 -520 -55 73 355 -522 426 474 -176 231 120 -68 346 521 -168 485 306 383 -23
5117 -23 120 321 479 -2 25 147 417 -186 91 -48 -520 -438 -405 275 -599 -633 -338 562 -293 -264 -660 -1071
5139 -1071 -430 322 507 344 -212 494 694 -89 308 380 -192 280 296 513 -153 195 -284 -222 152 -328 -263
5160 -263 -734 482 130 -230 -336 -995 -475 -549 -1601 786 644 -128 670 597 626 671 -373 -72 410 -714
5180 -714 80 -798 -13 564 -152 -565 -15 -451 -60 1094 286 -272 -512 -254 173 -417 25 -69 244 -262
5200 -262 11 270 122 -376 -247 999 -232 505 -338 -351 646 430 -189 489 -367 -582 341 -956 -72
5219 -72 -591 -757 242 -206 41 -786 631 325 560 345 -291 -195 -276 -585 -435 410 177 -34 588 -47 440
5240 440 612 -79 353 524 -490 71 -186 -656 -268 680 911 7 532 -261 752 -153 187 -296 -1202
5259 -1202 -317 -897 -850 320 -44 -726 -1116 -397 32 991 -394 -48 609 143 1293 1313 659 499 331
5278 331 -582 -723 192 441 -250 192 -713 -229 316 -71 646 917 -469 -811 -597 -309 -298 -97 -471 -952
5298 -952 -54 -69 -1146 -147 219 -63 58 55 -1071 106 512 607 562 925 -13 -118 72 -411 -6 -478 245
5319 245 639 663 -1039 -1313 -619 -354 -276 375 -310 -591 -316 -835 -307 143 -284 156 920 454 -155 -164 7
5340 7 1139 -441 146 1457 184 -227 -272 371 -183 159 -645 -236 -337 -317 260 -843 -546 -887 538
5359 538 368 -2 -135 696 467 623 -272 -406 496 -315 -824 294 288 -732 -572 -592 211 -472 -297 278
5379 278 80 -672 -252 282 -216 362 -120 54 -894 365 -521 -158 -966 -307 -492 -455 -499 -86 156 -185
5399 -185 412 -160 55 235 255 -991 -356 -89 1126 774 -460 270 109 -240 -420 66 482 -141 -256
5418 -256 276 -612 -323 -482 508 -453 -51 362 189 521 -705 -1610 -709 -84 -201 557 -142 1128 96
5437 96 282 178 683 146 -454 109 -696 179 913 318 -700 109 -66 227 -78 -531 -589 1030 450 -881
5457 -881 -609 -724 147 -696 -306 502 84 411 -632 282 344 -281 -103 236 1224 821 338 -73 568 679
5477 679 -254 759 -66 49 431 -340 -638 -193 225 -787 78 329 -940 -601 -538 214 -70 -961 -613
5496 -613 77 -440 -294 444 413 261 57 1390 -351 239 -697 1033 -428 42 -465 373 -1 802 -174
5515 -174 -144 109 -305 -123 -925 -243 285 735 -282 87 -80 181 -639 -284 -502 -881 851 -172 703
5534 703 1305 924 174 46 462 876 561 -404 -70 372 462 660 -293 92 102 -54 410 -448 -343 -221 -154
5555 -154 -138 -151 184 3 557 -243 693 -219 640 -620 52 57 -418 309 -446 594 -306 40 -188 1140
5575 1140 -796 463 153 27 -772 -1140 -77 -469 46 1100 -524 -338 154 -1359 -375 -395 660 634
5593 634 483 527 490 397 -549 498 -487 -208 113 404 -415 252 -426 18 -386 441 33 -121 -33 -641 -467
5614 -467 -129 -149 -909 -801 -337 -127 -890 823 525 777 -409 -567 262 -934 441 1102 -265 935
5632 935 -165 9 -675 -924 129 -239 200 -131 -940 -105 418 -136 -867 6 -333 -567 -1252 -222 66
5651 66 -1010 176 88 -1249 -288 -970 -303 235 41 89 -208 -126 698 328 -368 -49 666 445 1142 750
5671 750 430 1008 -197 154 609 63 214 -458 -467 -5 496 -353 37 351 -386 -485 -265 -124 557 -55 311
5692 311 676 140 258 -36 377 735 54 -724 -142 -189 -185 391 -31 -723 190 156 -994 194 -152 -1433
5712 -1433 106 759 223 185 608 259 999 -782 255 -748 99 772 215 7 -237 630 479 404 117
5731 117 374 153 1046 -388 616 456 519 -223 -252 -443 129 -403 -497 -852 63 159 401 107 -603 327 132
5752 132 398 -323 -5 -365 256 343 848 22 705 51 582 239 283 -226 13 466 -96 439 637 -927
5772 -927 182 -664 -184 -941 -942 335 233 -1108 303 40 -899 -675 368 -671 380 -411 247 63
5790 63 -112 -9 201 -915 -566 332 510 -480 458 -106 -601 932 -452 286 -243 -222 304 74 211 195
5810 195 -192 172 -1017 317 371 -565 794 -138 -774 -877 -120 187 252 626 -659 -143 -84 98 540 711
5830 711 -89 826 -213 -1370 750 -169 -202 164 829 -923 271 598 -361 -815 261 -417 204 -126
5848 -126 -1045 133 320 -218 533 386 232 1023 358 392 214 -416 -267 964 774 406 -440 147 569 322
5868 322 38 -846 788 551 -13 -578 -531 -509 107 -767 -12 -221 863 -243 317 639 -203 -678 421
5887 421 434 -79 208 300 900 -234 1001 -331 -659 753 571 716 62 250 176 -515 -654 -283 514 -414
5907 -414 166 -136 -641 389 -718 -115 -299 46 258 316 496 569 -166 1187 -47 -305 -286 655 -214 620
5927 620 -956 287 239 303 239 -908 816 -770 -957 -257 -143 -447 -539 -204 -671 -545 -134 -255 -229 300
5947 300 104 -85 576 101 499 373 360 -193 1167 245 -378 -552 130 812 -340 265 -152 -408 -1191 167
5967 167 494 -575 385 -33 166 -538 -485 -892 -56 2 -1059 301 156 61 -281 23 -1 523 684 987
5987 987 866 -428 -977 658 -86 -322 -87 191 19 -62 465 -55 116 409 -360 -682 -506 156 -658 304
6007 304 -46 -231 -824 -313 -158 -125 270 -486 -42 -114 148 371 102 -219 -203 116 346 -528 -659 1160 -996
6028 -996 -900 39 -105 119 638 221 -728 331 64 247 -14 865 247 657 52 -547 -90 219 108 -970
6048 -970 242 132 -364 -519 377 -479 397 532 -157 -362 -165 170 -658 233 -140 -481 488 -142 -248 96
6068 96 -733 215 -110 346 -1328 304 -175 -483 1137 50 285 542 74 48 342 1002 -126 -333 135
6087 135 672 -145 86 308 -139 562 -1102 -202 -355 -841 536 -1472 424 203 -19 -207 -92 395 -345
6106 -345 -333 -111 364 -25 -996 -726 637 656 -35 452 1020 -898 165 330 1323 51 -685 194 57
6125 57 -617 -347 -2 -1469 -423 -355 337 -470 -566 -88 167 713 -1311 -394 -118 120 -68 149 279 -713
6145 -713 214 -491 342 -679 1568 98 959 787 927 -110 -347 352 -29 509 179 941 -64 142
6163 142 855 194 223 1329 -733 -290 95 -82 -188 1085 379 35 258 -62 -95 -24 -213 802 530 538
6183 538 408 648 -82 629 30 -54 412 -557 -40 88 -216 220 180 -326 -480 -384 127 -301 -545 -387 -627
6204 -627 -120 415 456 -71 554 -326 875 822 739 638 97 990 -373 324 -427 383 695 70 -219 -176 -1183
6225 -1183 -176 356 -1549 284 -621 -1085 -740 -566 -57 -407 464 634 -68 -32 -285 -76 246 257 -560
6244 -560 602 -302 666 -256 -290 382 74 101 -309 228 -457 176 84 127 65 -555 -620 -35 32 155 -778 -297
6266 -297 61 189 260 -582 13 -384 78 51 -280 788 229 15 58 249 222 718 1563 466 -473 -467 -729
6287 -729 -237 373 -174 105 121 465 515 -99 436 -256 -280 -635 -614 -98 -559 28 -605 -325 -535 -86 702
6308 702 468 -132 -291 -866 -242 -308 796 414 -147 321 -501 -158 -978 -181 29 21 -631 -413 443 -305 -1096
6329 -1096 -1365 -213 -618 -495 -389 61 326 -239 -612 313 186 318 1036 356 -625 -492 -179 630 661 -1040
6349 -1040 753 147 234 324 24 -548 -145 172 -491 -55 14 100 444 -975 186 319 59 812 -436 -1120
6369 -1120 -753 509 -330 219 -47 502 548 -858 479 554 392 301 124 174 -1031 423 -464 -241 -1542
6388 -1542 -620 -286 -214 495 -23 -184 -226 -192 44 -289 598 513 514 -169 208 229 133 -2 872 1421 958 197
6410 197 -461 607 -414 166 509 1105 -219 -629 577 90 564 -698 -255 956 -197 -770 -176 -789
6428 -789 15 549 -519 391 869 -471 727 635 -313 289 -46 -224 1182 -130 614 409 224 547 -477
6447 -477 -103 355 -397 226 -849 412 -290 -600 138 -205 -282 -973 222 -1609 -861 473 38 45 62 132
6467 132 236 313 -46 -89 -997 487 1043 746 -272 -341 852 -135 -535 845 -847 -206 -328 -222 -203 205
6487 205 -418 25 -932 -226 278 -131 -726 -75 376 796 -285 374 193 86 344 505 255 232 180 1506
6507 1506 -1168 -260 240 -155 1046 -605 -230 -58 -359 647 33 170 -998 -19 41 94 -853 -275 -51
6526 -51 -646 434 -605 153 -665 973 -176 -165 -83 138 60 -11 83 -151 -403 260 132 -705 -625 -537 -506 -23
6548 -23 -33 -318 125 -340 39 436 -706 31 -81 141 941 -61 -483 -4 -549 156 227 -89 -287 351
6568 351 320 -173 758 -465 -86 700 268 -84 -170 -738 327 188 613 -348 182 -433 -271 -628 420 391
6588 391 189 1284 336 403 -108 -142 -813 275 442 265 -650 327 -4 570 787 -379 79 316 -1151
6607 -1151 -321 -380 336 -91 -329 -91 58 546 -319 -45 -528 -709 -1451 -893 -459 -1106 -505 -372 749 -122
6627 -122 862 631 689 -147 167 -270 -329 838 -599 645 -65 990 721 162 -33 359 809 -768 -699
6646 -699 -140 -38 -401 67 422 -513 191 734 -1545 -260 -235 561 -137 -577 175 -100 -337 41 -199 74
6666 74 946 751 887 171 127 226 -641 483 -60 322 40 -995 -620 -554 166 -31 -894 369 545 -1159
6686 -1159 -33 -143 -173 -637 -1115 -671 -909 -935 -57 -58 180 228 -699 -497 128 -807 124 -283 932 510 315
6707 315 -152 863 -454 -277 536 -530 -427 -580 338 -578 -180 -301 -1207 92 -440 462 -309 -120 -456
6726 -456 813 962 1111 -433 85 -54 224 -102 -7 107 265 676 1171 261 70 -7 575 -202 -362 834
6746 834 -442 -27 -469 581 538 -425 242 115 985 488 -38 -140 -567 -254 254 -179 -552 444 493 -1045
6766 -1045 184 -131 399 -17 -847 -764 193 -589 184 164 -1433 -384 -85 -912 -249 -84 -339 -511 -499 387
6786 387 73 529 -1189 939 338 -273 -409 522 145 -40 -163 763 830 715 -182 34 -671 476 -438
6805 -438 -603 -1003 25 -1112 -267 -391 -205 -1302 -163 -11 -204 -352 -197 -148 -855 619 -676 37
6823 37 -482 510 42 402 -589 822 130 705 109 -144 -513 381 174 594 -607 -357 -44 38 -1527 -1187
6843 -1187 175 427 -127 281 -817 -108 -365 -74 -500 -82 -389 -103 292 -1084 -94 -598 -219 -76 428
6862 428 -53 147 268 -389 811 632 -23 -318 98 -128 478 34 -376 -199 650 -96 -1059 -778 -165 -269
6882 -269 -53 -184 456 -72 524 274 -186 -366 451 -265 -572 5 -79 519 -869 238 -31 641 423 -317
6902 -317 1025 -186 -286 -643 -1069 -622 437 -948 740 -235 56 -572 -470 -538 228 -859 -250 1166
6920 1166 -718 162 531 463 -80 685 991 -513 -321 475 -175 -151 -652 341 -38 -189 -1044 -78 -588 582
6940 582 990 65 -207 -230 154 719 63 -205 525 -179 -214 -191 183 565 327 739 249 -362 34 423 -179
6961 -179 -410 241 705 -616 1 286 -816 165 344 -436 180 693 706 515 -887 910 433 -129 -182
6980 -182 -581 -239 -347 105 526 -405 -153 862 226 108 990 1037 402 884 857 760 734 -517 353 -430 268
7001 268 858 -720 -625 -1280 -8 -389 -410 -154 472 -205 -749 48 -29 -308 674 -590 659 404 -806
7020 -806 612 270 -82 168 198 -225 461 571 -234 -165 414 -482 -115 265 -433 243 -635 711 -479 -592
7040 -592 -935 -273 504 -316 -1110 825 454 -995 893 -157 87 333 219 -418 194 -225 441 -642
7058 -642 -529 679 897 494 994 293 136 644 -339 895 -770 -434 525 -182 -212 -582 218 -40 -279
7077 -279 -57 100 831 -16 100 252 138 -391 284 562 -944 481 206 -233 811 961 -48 9 -907
7096 -907 -546 598 -23 169 -595 -88 -310 -491 414 237 17 -457 -660 -354 148 -723 1167 312 367 -722
7116 -722 -194 -370 -195 -377 -561 344 464 -428 -35 98 13 -14 372 -957 -243 369 -981 -1352 -903 -88
7136 -88 -39 345 -294 72 -122 -627 -1101 198 1 -416 -149 474 1006 1350 366 -571 533 239 2 52
7156 52 464 326 -34 464 -293 -317 -349 88 -908 -1558 -140 46 556 -766 -429 214 141 366 -680 -42
7176 -42 -133 -815 734 -301 -98 588 -167 -211 891 122 206 397 -547 442 -155 351 -200 -386 -195 184
7196 184 480 -98 224 572 326 -691 -324 370 -221 208 -651 228 482 -414 26 547 994 449 147 -89
7216 -89 -539 -280 1253 370 588 921 -552 -100 438 208 1013 -437 -532 125 -497 -296 140 513 336 118
7236 118 782 339 -642 118 307 -280 -132 -118 -373 -502 273 275 209 19 -303 -87 -10 276 -257 403 284 -552
7258 -552 460 12 332 -283 -1053 1349 -267 250 -136 741 940 -633 114 -127 -44 429 -786 224
7276 224 -456 -95 -31 547 -201 -50 753 -445 952 -625 -365 -49 348 -666 -586 291 989 -121 487
7295 487 177 296 30 -569 -234 448 -93 206 223 -594 3 601 495 -667 109 311 163 119 -112 -341
7315 -341 -460 51 6 338 -451 -147 -1420 -176 690 -228 336 781 405 -1854 -580 638 -316 -609 -469
7334 -469 47 303 464 63 -32 371 -446 -135 -262 -73 -106 192 99 340 -188 -87 410 99 -28 554 -184
7355 -184 841 -509 704 33 -676 -304 -465 441 -1036 17 532 -788 -101 -460 443 -21 113 615
7373 615 -61 -1065 249 -820 213 -650 -443 1053 -182 127 630 212 -369 428 -303 -65 -300 -725
7391 -725 771 -110 -726 -20 -75 584 -828 -268 -260 169 18 -461 -169 -184 251 901 532 930 252 163 -431
7412 -431 -308 -507 -716 456 717 -16 -26 -528 -313 132 -1247 204 -435 -90 506 -561 739 -1138
7430 -1138 -117 72 6 154 224 652 -135 -615 87 467 56 1157 -145 -357 131 360 149 -129 -1107
7449 -1107 263 -632 -229 152 -641 -190 -555 227 -430 43 520 321 -1038 -129 -145 396 1445 582 210
7468 210 798 -204 135 688 224 170 747 656 94 -34 -511 -193 -306 350 192 -74 -95 48 -259 51 332
7489 332 -1308 -670 -535 536 104 -662 -98 292 -24 -144 532 -487 -930 -165 469 -259 151 -678 503
7508 503 307 -900 -133 -415 180 -62 216 455 439 -722 -133 193 -380 -234 -529 -1336 198 678 349
7527 349 -61 780 -304 8 993 -554 -1 -670 130 -669 399 13 197 767 1184 487 302 -153 264
7546 264 -105 -947 593 168 287 -518 -471 235 -454 -389 -213 -1280 585 -629 326 90 371 -620 -380
7565 -380 674 114 -73 -131 313 87 798 181 -410 604 -202 -744 277 -65 -626 -166 1065 -51 -791
7584 -791 335 522 22 -302 -226 481 -803 638 21 -95 -683 105 135 -19 -87 82 1113 53 221
7603 221 -292 455 -309 1526 -519 217 604 -102 97 511 -117 639 -22 -210 -294 -377 458 307 -506 -684
7623 -684 -347 149 -45 23 -46 173 -818 259 460 164 -443 -600 -212 414 -35 -131 -103 65 351 169 232
7644 232 544 690 -728 -734 -476 368 229 10 -1221 -670 -1075 -404 372 -737 -145 196 -749 117 118 528
7664 528 -154 -34 15 232 -48 -140 -229 -21 -67 -415 670 -291 321 682 98 423 -243 -534 -429 -130 407
7685 407 -809 -343 94 630 289 682 -122 111 144 607 443 386 -612 243 330 -141 -387 -633 453 150
7705 150 97 -102 152 206 -49 616 -21 -910 182 -271 -50 -199 -816 100 -204 169 -596 106 54 260 497
7726 497 98 712 -775 213 769 524 -910 -731 -905 59 -55 -106 99 -78 122 290 -532 125 447 192
7746 192 497 -79 676 61 -13 376 288 -1273 294 630 -75 263 495 468 498 631 -670 -423 472 -312
7766 -312 -572 30 616 408 458 512 442 68 416 -399 276 350 -765 -532 -275 212 163 -322 -311 -323 -344 293
7788 293 -153 222 -75 160 516 53 -437 -109 -117 241 -62 436 461 169 -273 -160 -441 861 -763 -591
7808 -591 345 -622 -678 -454 -229 154 -860 -242 -489 -553 -581 -274 -103 -566 927 1038 -99 -5 47 574 510
7829 510 878 672 302 209 -337 60 -422 -359 111 -251 -613 306 -122 -761 -287 -176 -429 56 -107 803 -448
7850 -448 -749 93 -133 -61 -256 -248 -119 -417 271 574 -288 37 -39 -340 -334 243 -645 641 287 -3 75 486
7872 486 -95 415 371 384 -157 -75 77 -571 141 -492 433 -395 118 -189 113 156 750 -326 -123 -255 -470
7893 -470 462 -224 362 -324 -130 -781 -195 -243 1154 -364 151 -226 -966 -194 -627 -160 -416 -433 28 146
7913 146 528 301 -467 -851 -527 276 206 -51 194 -35 89 121 -253 1290 228 -714 262 23 -226 337
7933 337 -256 -327 -179 -467 -280 -697 -37 -715 -109 -652 -521 -300 -807 528 703 281 577 -199 39 -885
7953 -885 74 358 584 179 706 379 1103 242 502 -153 -787 317 -261 -79 112 -79 -520 -98 -126 -426
7973 -426 -27 295 221 -233 551 -179 -862 -284 -63 455 315 -268 -481 -1 -433 -178 -89 84 -205 414 83
7994 83 -892 257 -115 411 34 546 -95 152 592 -527 677 -32 -119 -873 -205 -638 -784 898 843 99
8014 99 457 -922 685 203 772 -625 501 -87 -126 165 -165 -637 341 581 -136 531 -321 -296 232 923
8034 923 -918 -472 -101 -932 -493 -89 -421 31 -998 -162 544 366 -80 -1075 47 -417 872 405 -1150
8053 -1150 -422 133 540 557 -224 -259 90 169 -480 71 665 -310 -306 -588 -267 -445 -395 -136 764 492 -120 320
8075 320 69 21 -305 -1175 -403 -440 1107 -448 -782 -475 -446 -519 341 -282 -1114 751 146 609 879 -571
8095 -571 -19 282 -5 143 614 -320 201 -118 -687 489 413 155 -591 -679 -293 631 1097 483 -12 -214
8115 -214 119 594 22 88 144 -277 16 -320 658 -216 1147 236 515 690 -196 -101 99 -859 -286 -115 719
8136 719 176 -405 -88 -577 -458 -316 -18 62 267 273 -80 409 -98 -654 445 594 66 4 143 354 238
8157 238 -621 533 -122 198 443 378 -345 -276 116 365 -451 -686 -316 -79 -233 -752 779 127 389 37
8177 37 828 -361 -18 629 391 31 -439 870 282 395 133 -638 714 -156
8191a56
$$ Imaginary data points
##PAGE= N=2
##DATA TABLE= (X++(I..I)), XYDATA
0 0 0 0 0 0 0 0 0 0 0 0 0 0 0 0 0 0 0 0 0 0 0 0 0 0 0 0 6 -26 67 -84 102 -106 108 -108 110 -126 150 -176 192 -218
40 -218 237 -266 295 -323 359 -400 434 -482 528 -584 643 -710 786 -867 957 -1060 1183 -1313
58 -1313 1468 -1655 1882 -2161 2506 -2968 3607 -4548 6059 -8963 16431 -63293 -136293 36027
72 36027 87722 71095 59919 74813 54288 52916 49841 34247 13619 7721 -19694 -32339 -16887
85 -16887 -12906 -21066 -3932 -2317 -18730 -23186 -14261 -17610 -15837 4145 22430 13368 11386 11238
99 11238 -1377 -9512 -8176 -17926 -24939 -25190 -35737 -40748 -20159 3082 9718 31588 60450 54300
113 54300 42448 47915 36503 15305 15011 8982 -7869 -14224 -18632 -31352 -32573 -22364 -21689 -19182
127 -19182 -7358 -15264 -29884 -21848 -18724 -24301 -14402 6193 9874 6644 12589 17125 16767 20550
141 20550 26559 24264 24760 20852 10463 7451 12308 8239 5695 12242 12090 -3682 -11451 -11118 -22054
156 -22054 -29241 -19953 -18418 -23124 -18846 -16222 -17715 -10587 -3559 -571 4499 7388 739 -3182 4675
171 4675 1717 -675 12217 21419 19343 20880 26175 24121 21840 23053 20503 15682 9001 1292 -9806
186 -9806 -14075 -18565 -24522 -24096 -22331 -26878 -29220 -25255 -22156 -22284 -15514 -2107 2188 5828 13881
201 13881 16881 15645 17272 19176 19666 17752 13343 8092 6847 5151 357 583 9249 9496 6469 7390
217 7390 6435 782 -2582 -3770 -6197 -9841 -12500 -15260 -19713 -21796 -21424 -20947 -17087 -13331 -13798 -9150
233 -9150 -3155 -2903 2407 12318 20758 22313 24765 29484 30310 24761 22674 19845 15626 9449 1792 -2230
249 -2230 -6235 -13445 -17685 -17962 -17326 -18352 -22417 -19370 -19438 -20152 -16952 -11474 -9273 -5240 290 6151
265 6151 8783 9686 15190 17443 17215 16296 14776 14534 10392 5401 4843 7339 4168 885 1980 3242
281 3242 552 -4348 -3590 -3169 -5613 -8114 -7132 -7973 -10213 -11952 -11990 -9915 -12135 -11800 -10822 -7901 -7506
298 -7506 -7077 -1089 3950 4491 9101 16927 20081 18995 20585 23534 20833 14312 12794 9123 4944 -1271
314 -1271 -6757 -9328 -11017 -16547 -18680 -16797 -15320 -17545 -17286 -12666 -12073 -12925 -8343 -2137 -580 1528
330 1528 6416 8701 9111 9489 12963 15189 15253 13887 13252 13421 10598 5011 7251 9592 4092 23 99
347 99 -1568 -8557 -12292 -11927 -12890 -16022 -15442 -15449 -15127 -13735 -12049 -7831 -1077 759 2647 8079 9257
364 9257 6344 7338 10143 12824 10642 12013 14087 9820 7376 6799 6717 6560 3342 299 407 -4461 -9820
381 -9820 -10677 -8357 -6078 -10060 -8484 -6586 -10624 -13229 -10548 -7822 -8887 -6779 -3791 -2408 -2192 -1071
397 -1071 3923 8463 13951 15527 17215 19221 15434 10156 11175 11285 7558 5143 4902 1308 -6022 -8406
413 -8406 -8000 -8849 -11196 -11897 -13505 -13448 -15269 -17547 -13343 -7600 -6245 -3348 1477 3028 2669 3869 8929
430 8929 9471 10175 13587 13529 12689 10538 9695 10717 10741 9118 6108 3667 -219 -6832 -10270 -10433 -12619
447 -12619 -14429 -12294 -11046 -12940 -13261 -10679 -8240 -5203 -2098 1673 3083 4548 4331 4635 7186 7893
463 7893 8398 9226 8403 5186 3340 4126 4095 3994 6357 7893 6438 3327 2685 958 -1744 -4092 -5640
480 -5640 -6263 -8308 -11967 -14901 -12747 -12574 -13011 -9645 -6101 -5174 -6855 -4282 -2368 612 5245 10317
496 10317 15976 17691 17606 16544 15944 13438 11330 9694 6264 868 -4095 -5484 -8727 -10557 -9755 -7081
512 -7081 -5570 -8293 -10752 -10736 -13543 -14195 -12019 -8034 -2728 -2608 -1850 3326 5607 8323 11461 13046
528 13046 14157 11542 7851 5397 3601 2668 4122 6013 7194 4033 1693 1295 -2779 -6380 -5074
543 -5074 -4958 -7699 -10584 -12643 -11208 -10990 -9063 -4445 -1130 605 108 -2979 -1760 -2491 -3446 75
559 75 4031 5668 6553 7480 10059 11039 12744 16188 15470 11872 7314 2389 -1912 -5931 -7826 -7442 -5367
576 -5367 -6830 -10475 -10201 -9295 -11896 -12212 -7106 -6443 -8512 -7150 -5074 -4572 -116 3998 8668 13280
592 13280 13024 11670 9935 9301 6885 4981 8348 7078 3188 3096 3657 672 -518 790 -63 -2973
608 -2973 -5688 -8223 -12112 -15324 -15321 -13250 -8832 -6044 -6242 -3003 426 1635 941 5724 10585 8244
624 8244 6605 7832 7844 6025 8517 9701 9471 9382 7109 1956 708 -2325 -4718 -4847 -4066 -6447 -8683
641 -8683 -5927 -6184 -7844 -6286 -1570 -3018 -5144 -5056 -5401 -5759 -4848 -2968 -1069 3822 4465 3892 6843
658 6843 8339 4898 7271 11154 10551 6697 7899 6743 4563 2659 4564 2017 -680 -1388 -5064 -9424
674 -9424 -10478 -12171 -12862 -10100 -10359 -12202 -8767 -5147 -5212 -4616 1719 4935 2793 5679 9618 8729 9826
691 9826 11672 10432 12013 10902 8690 5846 5268 1778 -3070 -2961 -1956 -7465 -8715 -6265 -8712 -9983
707 -9983 -7648 -5549 -6010 -5749 -3104 -3060 -4008 -1433 -1199 -163 2806 2289 2045 6166 4736 2958 3988
724 3988 7824 6427 4366 5565 5927 4807 5672 4717 2883 2931 2159 -1245 -2593 -4171 -7607 -7887 -7710
741 -7710 -9881 -11773 -9424 -7299 -9628 -6936 -2447 -1889 175 2943 5327 5686 7000 8801 7186 9032
757 9032 9454 6995 9589 9011 6336 3260 3886 941 -2297 -3793 -2696 -5757 -7318 -6214 -6899 -8267
773 -8267 -7589 -7444 -7445 -5354 -5666 -5560 -1837 -1930 -2560 418 3998 4770 5163 8472 11328 8021 9326 10257
791 10257 6441 5247 5289 2555 1121 -459 -2804 -3611 -4230 -4781 -5960 -5632 -5269 -7072 -8759 -5754 -6296
808 -6296 -5330 -2738 -1420 -2260 -1291 390 1504 3551 4151 4783 4734 5206 4050 2651 5858 6947 4930
825 4930 6614 5917 5378 2613 1931 1165 -959 -2357 -3162 -5390 -6219 -7585 -7325 -7453 -6530 -6418 -4813 -4494
843 -4494 -5143 -6113 -3927 -1259 -1652 509 5301 6919 6869 7497 9516 10403 11024 9851 8556 7078 3539
860 3539 -106 -562 -978 -3248 -5392 -4428 -5500 -8794 -9093 -8259 -9103 -7650 -7198 -4785 -3362 -3605 -1551
877 -1551 1859 4079 5674 6309 7754 7057 3180 3262 4374 3438 3114 3868 5749 4801 931 1045 1412 1394
895 1394 -18 -747 -1299 -4345 -7067 -6838 -4945 -6419 -5578 -4915 -4544 -3834 -5578 -4129 -2145 -2204 -252
912 -252 2004 2526 3624 3933 5191 6055 6517 8084 8483 7417 5521 3250 3175 2518 -375 -843 -825 -660
930 -660 -5198 -7389 -5774 -5936 -7619 -6274 -4676 -5635 -6329 -6929 -4876 -3622 -994 367 4592 3759 5276
947 5276 5834 7464 7429 6277 8172 7168 6185 4035 2808 2837 13 -1159 -129 -1597 -3134 -4158 -4351
964 -4351 -6390 -7195 -6294 -5972 -5108 -4356 -4317 -3725 -2013 -311 -204 2120 3753 3288 4158 4679 4853 4126 4644
983 4644 5779 5947 3722 2840 2305 1452 561 997 1640 140 -2356 -2195 -3612 -3065 -5491 -5354 -4771 -4706
1001 -4706 -5359 -5068 -4309 -5325 -2864 -991 -355 556 1539 956 2374 2553 2462 5005 6799 7198 8088 9042
1019 9042 7146 5008 4865 2949 1327 -1350 -4149 -5364 -6059 -7906 -7604 -6481 -5012 -4302 -5279 -5089
1035 -5089 -3720 -5047 -3045 -2425 -525 1453 3217 4246 4712 5733 6964 7756 6575 5961 4314 3987
1051 3987 1883 -979 -59 417 -488 -213 -426 -860 -2289 -4575 -4159 -3770 -5976 -6740 -6777 -6200 -5023 -4424
1069 -4424 -2621 770 2328 1357 3575 4371 2989 1141 2061 2956 3053 3800 5180 4080 3691 4648 4896
1086 4896 4022 1856 1644 -519 -2798 -4656 -5106 -4388 -3746 -5151 -5146 -3216 -4594 -5838 -2953 -3325 -2734
1103 -2734 -1955 -1485 -63 154 1575 3855 4980 7038 6236 6122 7267 5493 3003 3996 2733 1988 828
1120 828 539 -809 -2850 -3195 -2875 -3795 -5141 -4701 -5981 -4999 -5729 -5423 -3935 -2529 -1678 -1404 1412 3291
1138 3291 3203 4003 5494 5174 4764 5039 5518 3911 4518 2951 1791 3095 2004 -85 681 -192 -2877
1155 -2877 -4063 -3260 -3345 -5159 -3855 -2657 -2876 -3860 -3673 -1877 -2721 -2222 -1231 -842 -1299 -367 -475 2848
1173 2848 3492 2336 4394 6210 5498 4565 4583 4649 3108 2553 2660 331 -801 -909 -2092 -1848 -3014 -3589
1191 -3589 -3235 -5152 -5206 -6493 -3995 -3926 -4359 -3434 -762 -1049 -960 725 3056 2222 3727 3398 5279 6339
1209 6339 6105 5287 5140 5779 4134 3132 3261 1644 -1902 -2625 -2064 -4972 -5714 -5373 -5029 -6369 -5350
1226 -5350 -4660 -3630 -1976 -2259 -2050 900 1173 -779 1430 3107 4106 2233 4205 4589 2394 2949 3428
1243 3428 2363 1360 2543 1960 1378 1362 543 760 -50 -900 -1132 -1387 -1505 -3842 -4371 -3563 -4478 -5871
1261 -5871 -5350 -4238 -3248 -1792 -903 -473 2176 1580 2809 3942 5614 4453 4654 5565 5824 3213 3922
1278 3922 4007 1859 1164 258 -635 -1025 -2974 -3062 -4211 -4894 -3619 -5285 -4568 -3611 -3899 -3028 -1371 -1740
1296 -1740 -1913 -489 1068 -602 1533 3835 2095 3813 5243 4279 4140 4696 3456 2864 3355 1996
1312 1996 980 721 -475 -2193 -3063 -2154 -3372 -4605 -4142 -2644 -3593 -3294 -3584 -2743 -3266 -1589 -686
1329 -686 209 1217 623 1666 3073 2988 2457 3526 5229 3193 3482 2447 2869 2653 1765 2195 2275 1352
1347 1352 -58 -1148 -1938 -2725 -3672 -3783 -3423 -4325 -5409 -4195 -3573 -2964 -2576 92 -494 -499 889 1132
1365 1132 882 1346 1408 3095 4218 3472 2916 3747 5017 3517 3326 4106 2872 1144 96 -1094 -3251
1382 -3251 -2297 -2936 -3279 -4477 -4394 -4822 -6070 -4003 -3610 -4678 -1913 -1308 -842 483 2862 3228 3850 5735
1400 5735 5871 5282 5122 4032 3492 1502 911 1099 726 -290 -1950 -1881 -2083 -1739 -1688 -2331 -1895 -2355 -2849
1419 -2849 -2317 -2376 -2436 -1811 -1707 -1368 -1745 -987 -341 108 402 375 2133 2661 3020 2048 3083 3630 3417 3895
1439 3895 4477 3127 2326 1235 1451 -190 -1625 -2360 -3108 -3200 -4426 -5042 -5301 -3877 -4415 -3459 -1883 -2161
1457 -2161 -1050 243 347 375 364 2609 3430 3281 3206 4611 3716 4830 3868 4039 3945 2044 1391 -464 -120
1476 -120 -2359 -3889 -2977 -2777 -3263 -3341 -3279 -3105 -2799 -2433 -1957 -2069 -1831 -2076 -721 -303 499 536 1829 2330
1496 2330 2000 3706 3928 3048 3193 3499 3221 3200 1773 1283 1679 923 -572 -22 -542 -1389 -2863 -3897
1514 -3897 -3632 -5445 -4990 -4526 -2695 -2023 -2564 -479 469 -383 1149 1339 2509 2373 1962 2745 2687 2344
1532 2344 1482 2171 2527 2029 1608 2561 2936 560 21 811 -9 -1126 -2853 -1670 -2775 -2980 -3532 -3927
1550 -3927 -3864 -2975 -3823 -2262 -1832 -2332 -624 -469 1202 2306 3313 4637 4442 4022 4725 4631 3280 3221
1568 3221 2791 1552 17 -1202 -372 -1852 -2282 -3313 -3202 -2396 -3832 -3511 -3420 -2681 -2122 -2604 -1634 -1254
1586 -1254 -1011 -72 387 1827 1898 2381 3207 3473 2774 1734 1083 1822 2207 1799 2058 1413 712 1017 156
1605 156 1247 -764 -1155 -300 -1150 -3703 -2541 -1902 -2571 -2026 -3066 -2473 -2431 -2208 -2248 -1099 -618 -109 -662
1624 -662 1139 2651 2535 4224 3956 4934 4068 3720 3611 3143 2071 1656 503 -1041 -818 -2361 -2286 -3482
1642 -3482 -3570 -2845 -3351 -3989 -3372 -2357 -2585 -1907 -522 403 639 1190 2379 1768 2295 3433 1766 2295
1660 2295 2439 1334 1936 2350 1853 1522 1232 959 425 -1221 175 -319 -1145 -2052 -1787 -2128 -2576 -2521 -3449
1679 -3449 -2409 -2003 -2869 -2370 -217 -1023 -1231 -871 1563 2047 2153 3294 3134 3214 2927 3874 3796 1953 1600
1698 1600 2146 635 746 -392 -912 -763 -1226 -1862 -1214 -2991 -2361 -3042 -2599 -1712 -2547 -2008 -1543 -1488 -2083
1717 -2083 590 23 160 211 1042 1713 2024 2960 2592 2879 2764 2277 1695 2784 1963 299 1154 457 -1597
1736 -1597 -1698 -1889 -2294 -2898 -2915 -3947 -3367 -1540 -2892 -2690 -451 -1030 -687 151 1331 871 1162 2507
1754 2507 3305 1799 3124 2861 2523 3164 3156 830 1744 1312 -496 75 77 -1929 -1791 -1987 -2955 -2602 -1340
1773 -1340 -1500 -2040 -1930 -2262 -431 -1524 -1646 -2080 -977 -292 120 754 1260 2242 1220 2336 2139 2003
1791 2003 1428 2386 1962 1857 1915 2531 838 -10 459 556 -570 -436 -1198 -2958 -1501 -2700 -3856 -3526
1809 -3526 -3116 -2696 -1761 -805 -1030 -1040 122 1598 999 2037 2482 3179 3667 2353 3355 2749 2413 1437
1827 1437 2374 539 386 -1265 -1701 -1241 -3076 -2687 -1792 -2536 -2216 -1746 -2233 -654 -1264 -1940 -1849 -20
1845 -20 -436 -1202 -134 842 68 805 1515 2587 1094 2540 2209 2066 2114 1038 360 -939 1381 1512
1863 1512 376 -32 -577 -365 -789 -1763 -2895 -2291 -2692 -2628 -2173 -2956 -1107 -1675 -1114 -543 772 1276 655
1882 655 1413 1044 1841 1270 1411 2941 2454 1920 2201 3047 1612 709 1632 -19 -993 -956 -1413 -1682 -1879
1901 -1879 -1796 -2918 -2411 -2027 -1873 -1699 -849 -1259 -840 694 589 296 419 1417 432 1854 2332 2519 2104
1920 2104 1878 2962 2264 2994 469 -620 370 -48 -881 -742 -854 -630 -2120 -1071 -1834 -1054 -1267 -1925
1938 -1925 -1006 -1859 -1321 -881 244 -189 570 105 1235 2185 1612 1864 2190 2205 1052 1424 1571 1563 1378 608
1958 608 736 579 -1237 562 -323 -173 -1735 -1541 -1700 -1568 -2001 -1669 -2001 -1507 -2036 -1448 -1135 -129 -386
1977 -386 48 567 578 969 382 2407 1612 1490 2225 1631 2402 1611 1280 595 248 221 -616 -1093 -959 -2162
1997 -2162 -2269 -1974 -3207 -1723 -2841 -1881 -1444 -2469 -992 -1310 -1377 -318 1501 648 1315 1428 2866
2014 2866 2260 2431 2594 2530 1269 1177 1132 -175 587 -383 -834 -954 -1262 -1470 -616 -1174 -1854 -2280 -2101 -1929
2034 -1929 -2493 -2033 -898 -1214 -783 -585 -641 -349 343 -517 425 -83 1427 1467 1474 1615 1854 1061 1721 1703 384
2055 384 1178 1329 -103 -276 -656 -686 -1855 -1505 -1542 -1906 -1534 -3297 -1860 -1394 -1712 -1791 -705 -81 300
2074 300 378 1982 1472 839 1988 2575 1975 2206 1452 1760 1957 1012 1387 663 795 -1121 -1167 -1717 -819 -1249
2094 -1249 -1889 -1628 -1670 -1814 -1875 -802 -1689 -2113 -987 -17 -796 -394 474 1314 918 2226 1730 2629 2240
2113 2240 1970 1406 2017 2048 603 -496 -246 408 -486 -726 -1497 -1527 -636 -1765 -903 -1473 -2304 -1943 -1752
2132 -1752 -1756 -1303 -699 -1232 205 -816 -271 46 1459 707 1699 2052 1466 1491 1952 2375 1789 509 651
2151 651 828 68 123 510 -442 -555 -1210 -1554 -766 -1705 -1805 -2780 -2117 -1227 -1711 -316 -1247 -1382 -973 524
2171 524 -27 534 196 891 1039 2165 1662 2566 3404 1730 1841 1266 1668 280 486 21 -650 -959 -2273
2190 -2273 -1699 -2825 -1656 -1865 -1806 -2192 -2298 -1613 52 -1078 -211 580 1483 -16 643 1976 1494 2163
2208 2163 1291 1156 706 1408 1427 1402 468 194 748 801 -215 -130 -390 -570 -434 -2010 -430 -429 -1019 -1911 -1550
2229 -1550 -1980 -2354 -906 -997 -115 -1305 223 1231 1125 1378 1162 1883 2637 1449 1595 1497 1485 897 1778
2248 1778 1866 -501 959 497 -520 -1217 -2238 -2049 -1613 -2198 -1695 -2078 -1313 -797 -838 -987 -853 -890 -186
2267 -186 876 757 889 1268 986 1923 1694 2047 1558 2538 1599 1004 1152 1362 63 -790 -870 -260 242 -1351
2287 -1351 -790 -221 -1261 -1191 -689 -766 -486 -1192 -1595 -2204 -65 102 -619 650 702 205 16 1640 1328
2306 1328 716 1880 1724 1438 1096 827 1405 609 59 -364 -140 -73 -1973 -1345 -402 -1812 -2404 -1506 -1594
2325 -1594 -1767 -561 -444 -737 -833 -869 145 12 777 1052 483 -271 942 782 2206 1434 1641 1199 2469
2344 2469 1099 257 654 568 799 -1203 -594 -1105 -1596 -1299 -2102 -974 -801 -1248 -2063 -2080 -350 -759 522
2363 522 -65 1164 -314 665 1313 782 1211 2449 1098 2056 1351 55 775 5 -229 -51 266 -907
2381 -907 -697 884 -880 -849 -1010 191 -1007 -1744 -354 -1279 -989 -1027 -1500 -1381 -463 -236 163 1008 800
2400 800 1202 899 2228 2011 1298 1209 1355 769 140 73 365 359 177 -1184 -582 -516 -352 -817 -1530 -1514 -1938
2421 -1938 -1212 -1456 -1966 -2025 -139 -501 149 414 -106 -40 1203 1033 769 1031 814 932 1376 2130 1503 884
2441 884 729 723 100 -134 475 -704 -1821 -1832 -661 -1059 -1450 -917 -1786 -1191 -1362 -660 -54 918 -1226 96
2461 96 190 41 -1025 870 985 2197 1635 951 1888 1378 524 734 1117 320 96 -895 -222 -959 -210 -388
2481 -388 -408 -868 -551 -659 -908 -1362 -1805 -645 -1173 -634 296 973 542 186 1686 559 768 1475 1404 1655
2501 1655 1335 947 888 2051 2016 -47 691 554 1112 334 -622 -563 -1076 -1681 -1345 -938 -1527 -975 -1375 -1141
2521 -1141 -1223 -636 307 587 245 451 2034 917 355 490 1384 769 319 633 1170 854 960 535 198
2540 198 1210 270 -243 -878 -374 -1726 -972 -1087 -1130 -164 -975 -614 -686 -296 -766 -247 -200 -415 -379 804
2560 804 -69 621 1089 1388 729 1617 914 1576 658 -161 946 459 36 293 516 -833 -707 -803 -561 -849
2580 -849 -1472 -457 -1251 -917 -1486 -992 84 -12 -758 -1490 -238 523 482 743 1754 615 1261 1205 769
2599 769 852 204 1916 1846 -60 547 1062 1248 759 -798 124 95 -537 -1506 -666 -1514 -1235 -678 -970 -987
2619 -987 -634 -708 -723 534 863 -128 1056 278 1124 909 2219 1213 1386 628 949 760 275 1209 209
2638 209 -506 33 -488 -1261 -208 -1371 -686 -996 -1436 -640 -469 -1143 -636 -1606 -701 62 -323 156 -409
2657 -409 -536 901 637 580 1278 669 2149 790 -152 1358 1290 158 855 660 63 -463 -256 -553 270
2676 270 -384 -760 -627 -780 -1184 -1277 -1600 -645 -1616 -45 -275 25 572 757 842 976 1260 1969 733 694
2696 694 730 482 35 738 1354 473 474 -1051 7 -1127 -110 -996 -678 -961 -1507 -998 -242 -872 65 -31
2716 -31 -356 -668 -693 -547 -546 268 -834 1039 1569 -289 1073 -980 1128 721 1086 1370 581 527 -181 376
2736 376 -526 -431 -1117 -1058 -1207 -197 -203 -724 132 -936 -1530 -796 -1321 -1110 -877 -885 175 707 714 1132 225 679
2758 679 47 1213 1077 608 396 462 982 443 483 725 -333 -630 168 -678 -518 41 -1831 -918 -1238 -863
2778 -863 -1365 -701 -693 -416 -445 879 -113 492 368 780 650 888 1673 1605 1227 377 983 2137 1607 293
2798 293 -304 -533 51 -690 618 -1820 -1222 203 -80 -375 -107 -782 -799 -1191 -805 -634 -1096 -276 -10
2817 -10 -93 660 465 956 258 775 1387 141 417 594 759 385 1021 -462 428 269 -754 216 -884
2836 -884 -375 -822 -847 -347 -375 -570 -761 -1142 25 -198 -162 608 -1310 20 -137 1181 354 446 -97 675
2856 675 -445 77 1094 608 614 716 538 -175 159 -907 -992 -368 -267 -659 -428 -878 -1477 -663 -930 -1073
2876 -1073 -1070 -357 -261 9 1112 -38 694 366 -298 1480 705 772 1576 1591 482 589 964 1124 41 991
2896 991 397 -118 -627 -1014 -108 -706 -708 -725 -416 -295 -191 -173 -263 -830 -954 -286 474 -456 417 -222 619 31
2918 31 793 793 480 1136 1148 2045 1425 438 -507 -70 300 -708 -1175 -241 -136 387 -594 -872 -709 -1346 -360
2939 -360 -1392 -796 -92 -814 86 -369 -794 -654 224 1409 898 863 912 1313 751 337 54 642 510 396
2959 396 -193 512 464 409 2 -634 -45 -180 -479 -341 -771 -1207 -577 -1030 768 -204 -35 739 -127 -681
2979 -681 -645 -197 129 58 -332 560 898 627 924 475 620 455 -205 264 249 -80 -51 275 -970 -144 -1497
3000 -1497 -1149 -1141 -1124 -113 -1005 -889 -2 -406 -29 -375 471 -119 564 108 831 12 616 851 306 1351
3020 1351 520 1034 1008 -235 604 -88 78 -663 -333 -653 -556 -1038 -648 -1275 -991 -421 -1457 -164 -435
3039 -435 -864 -505 -424 101 -63 -116 603 815 241 668 -98 921 731 704 1256 278 1180 257 -835 -224
3059 -224 543 -717 -732 -792 -876 -1233 -308 -489 -725 -300 -608 -1607 -721 -336 -108 -56 637 4 765 552 -105
3080 -105 836 154 306 927 1331 -59 188 145 56 331 43 -104 -34 -636 -1589 -787 563 -1166 -588 -685
3100 -685 -475 -171 -216 -966 239 -2 -915 43 102 298 -418 619 621 47 1539 670 362 -36 608 305
3120 305 814 162 373 303 -187 -399 -756 -965 -672 -918 -550 -990 -637 -731 -1139 -834 -607 829 -430 -350
3140 -350 98 -24 336 506 1270 715 109 218 1234 171 144 -93 111 178 -617 -359 400 -89 -1010 -178
3160 -178 -707 578 -921 32 215 -578 -186 -174 -404 243 -590 54 498 330 548 80 195 -544 1115
3179 1115 752 240 482 1181 393 1992 334 661 -425 -327 56 -566 -883 -464 -382 -1353 -610 -1143 -167
3198 -167 -633 -822 -202 -947 -1241 404 58 120 1185 174 -477 -546 1182 473 -69 371 1793 87 637
3217 637 -470 445 281 -90 995 651 52 179 -473 -660 -421 -891 -191 -1154 -456 -239 -813 140 -743
3236 -743 -281 -398 157 449 -542 56 1354 756 1274 451 412 132 1045 64 324 -201 -172 -951 361 236
3256 236 -595 -475 -1422 122 6 164 284 -107 16 201 -520 -325 -478 931 -411 536 567 1154 730
3275 730 192 811 1429 774 -138 1169 441 -122 -775 2 279 793 -56 489 -946 -134 -611 320 481
3294 481 247 -302 305 320 -756 112 -793 95 361 130 219 809 -198 873 321 439 284 491 56 552
3314 552 -479 778 661 -531 15 -24 -147 467 87 -355 -372 -893 -831 -771 -150 -160 -534 -188 805 181 506
3335 506 175 -229 641 1060 -400 395 1181 1081 429 -318 -830 -305 376 92 93 791 -779 -281 -1241 285
3355 285 497 -592 -77 -388 -671 625 -252 -809 -394 672 91 -566 -414 -494 1238 665 739 -464 241
3374 241 418 718 35 763 468 451 -49 564 283 -354 -441 -775 -1057 27 230 -765 150 -446 -994 -852
3394 -852 -556 -714 863 175 335 -135 10 1207 81 1030 709 -493 -67 664 -179 38 598 546 604
3413 604 -94 -557 27 92 -223 1100 -784 -1329 -17 -879 -635 -238 -201 -224 322 -63 152 -152 142 399
3433 399 -802 840 319 1131 681 -35 573 959 523 463 864 325 -498 -602 -338 431 -965 -618 -764
3452 -764 -1091 -822 -1137 -750 -401 -754 228 488 -633 -170 -1211 1175 1116 -167 -7 -265 526 835 29
3471 29 -242 1007 1374 651 -109 -118 44 -381 -435 -297 287 -631 -386 -240 -1118 -774 -1117 -888 -578 -761 -837
3492 -837 -309 -854 107 -212 -663 91 550 77 106 559 -134 249 1301 -606 847 1156 -87 491 723
3511 723 238 -702 424 -97 -309 -1383 -777 -1150 -429 -218 -390 -946 -599 -64 459 403 -215 -46 169 432
3531 432 -2 -643 804 -735 -107 458 409 656 507 706 58 -385 780 -819 398 -283 -1223 341
3549 341 130 -942 -56 -766 -79 -276 -1354 -537 -505 -959 284 851 -289 -362 -420 833 -599 700 414
3568 414 -351 556 -27 -433 -166 610 -65 807 74 -460 -441 18 63 54 342 290 79 -823 531 -267 591
3589 591 272 354 -469 -608 93 -200 1257 976 334 796 381 -397 -377 50 572 100 -51 124 56 -322 240
3610 240 -883 -269 -125 -556 -626 267 -245 -220 -84 -715 420 -209 159 -273 745 -377 -575 377 -84
3629 -84 124 -187 -41 386 1066 1026 1387 878 627 1238 562 -915 -117 63 -109 -69 -1044 -1224 -167 275
3649 275 -468 12 -849 -114 268 361 376 283 345 236 -396 -232 276 310 272 429 810 -102 521 261 417 597
3671 597 131 -227 -838 -261 -832 -260 838 -84 -1071 103 -289 22 152 -95 440 969 85 -805 581
3690 581 238 96 -217 -618 -217 241 1133 1372 1370 -332 124 1345 -180 -26 725 -1160 -890 389 28
3709 28 -148 -187 178 -315 -305 57 24 -817 -444 234 489 -424 24 -270 -436 -478 -347 1081 475 -709 986
3730 986 76 825 1440 773 -384 -1121 683 -385 46 -715 -722 342 -337 -600 830 -164 227 -29 243
3749 243 -622 -682 -1132 -10 -362 -61 -841 919 592 -647 36 109 -340 412 -738 -134 605 306 298 39
3769 39 490 -303 130 -128 -530 -519 -363 610 -553 -936 -114 464 91 -792 1125 -399 -969 -811 151 -397
3789 -397 216 147 490 107 1131 186 -20 233 502 49 320 395 -137 955 551 -301 696 35 -650 -790
3809 -790 166 -102 -972 -894 -233 -542 342 -389 -417 308 148 662 348 -686 368 -243 560 1276 143 716
3829 716 28 -178 771 212 -925 -409 47 446 777 -185 -292 -152 -1457 -339 179 55 217 -1222 608
3848 608 -97 486 -113 426 12 171 311 1233 -273 413 1007 173 1101 893 -153 480 391 -519 -1604
3867 -1604 -29 131 -154 687 1766 -969 -346 697 -135 -344 32 -929 -769 266 217 113 -694 554
3885 554 943 143 265 100 -243 139 129 66 -88 510 444 857 299 -147 -17 -938 -1226 93 -235 -566 -129
3906 -129 -1114 -97 510 -649 -916 -738 -777 -549 -106 -205 -61 978 384 -80 653 178 269 402 554 114
3926 114 1047 81 -76 697 56 -648 -475 -1418 -498 -626 -629 -277 -128 57 -627 -209 -499 -30 -116 166 -374
3947 -374 1025 372 501 480 516 441 788 198 221 446 -315 396 431 738 -116 532 328 304 -257 -225 633 -348
3969 -348 -151 -128 1 -295 -661 432 -36 217 499 -589 -478 224 -683 -341 961 427 242 102 175 536
3989 536 -515 151 -682 423 211 590 81 -309 317 -525 -82 -148 -88 -171 -486 -1091 -181 -382 -566 716
4009 716 -412 -165 837 -479 -459 560 -502 -580 19 -225 -72 141 994 466 107 791 503 1020 818
4028 818 -200 768 -69 17 -1017 -98 -44 -997 -486 617 -3 -90 -355 249 6 188 823 750 395 390 438
4049 438 306 19 -391 -174 1041 -616 462 1260 -322 359 307 -815 242 551 479 -258 -1359 554
4067 554 -123 235 -379 -465 -559 -560 -510 257 -11 765 295 -436 -300 182 1541 304 1258 -345 676 495
4087 495 653 -292 -686 155 545 125 109 212 -499 155 -235 -584 24 -582 -860 369 -611 -95 -1303 -237
4107 -237 -381 -75 360 -288 -449 350 284 120 -217 139 311 268 65 470 69 249 190 -969 211 888
4127 888 551 -822 966 -799 -366 1231 -335 267 -13 -310 821 245 -235 78 -1069 -407 84 459
4145 459 182 -613 89 1053 -6 -188 463 110 -246 22 -187 453 -649 -605 588 -18 -168 341 -46
4164 -46 52 -595 -459 365 -742 365 -1499 -343 87 1446 454 415 -427 251 650 -175 486 592 585 -322
4184 -322 932 -94 1007 272 182 922 -182 350 413 -516 664 51 366 -531 97 -590 202 38 99
4203 99 -476 -261 -252 36 -384 237 -791 459 38 -284 434 -61 -506 -18 -307 231 752 17 417 619
4223 619 663 556 -193 400 70 768 325 -585 71 625 -434 -301 -622 252 115 -709 -494 -397 544 -809
4243 -809 -431 528 -34 -337 357 47 -474 -432 939 584 -110 -107 -131 627 106 595 -249 142 -108 92 -387
4264 -387 517 50 -554 36 -891 -207 -753 -266 87 -555 1274 493 443 852 -57 -230 176 -245 199 -450
4284 -450 -406 -262 213 787 1046 -182 -76 226 -441 -658 -550 435 387 -219 -339 197 -472 -192 499 -505
4304 -505 145 125 592 118 137 206 522 1400 644 1269 -260 331 600 -173 -120 430 614 -224 -257 578 -322
4325 -322 -265 333 -320 -1323 466 -121 -565 -235 621 -363 706 628 215 292 695 430 228 369 109 1055
4345 1055 -357 -539 1154 197 713 -23 355 97 520 377 -1022 84 -365 184 -1036 -543 508 -266
4363 -266 -469 279 184 550 -402 -436 143 -545 -308 188 122 -315 197 350 622 265 609 -726 -211 -178 -404
4384 -404 -873 433 -319 -585 626 470 392 -644 -495 -238 571 -198 -986 706 215 122 -273 412 -256
4403 -256 -705 -767 -205 236 344 178 829 1162 -122 -851 586 -316 124 -534 -268 568 -113 -799 -382 -125
4423 -125 354 -309 354 -757 -65 -915 187 955 514 -8 291 -115 -105 56 600 -33 337 -417 306 88
4443 88 -113 321 62 620 719 158 480 89 -632 -193 175 -87 -430 -147 57 -3 584 -189 422 605 -437
4464 -437 718 405 -164 -75 -956 -441 -441 184 109 -881 -257 -238 -187 773 -120 283 147 160 -245 595 -658 -73
4486 -73 -906 435 -78 14 -833 -432 -344 -535 32 -346 -152 -216 -44 -181 -424 654 -266 999 -84 324
4506 324 110 97 -239 -310 784 125 346 -557 82 1249 838 -1100 322 -964 -838 -468 722 -82 -891
4525 -891 43 928 -909 -501 -723 -221 -513 849 546 -920 -325 -493 551 442 373 -2 -226 609 -144
4544 -144 693 -115 1232 -343 -4 -243 -739 188 42 147 -436 -494 -26 -518 80 408 -608 -467 -321
4563 -321 718 333 772 798 -270 198 377 301 -185 -397 320 1023 1163 -101 256 22 -52 -1379 -831 827
4583 827 -245 15 181 -133 -554 84 -156 71 76 155 -8 305 -597 339 -454 -662 535 -755 67 939
4603 939 -412 -405 -532 741 336 -967 963 243 -589 508 655 318 -550 -1250 390 517 -12 -1299
4621 -1299 -595 902 -857 719 -486 187 661 -152 -52 69 453 57 -596 -31 426 973 777 255
4639 255 86 333 13 -603 869 -39 383 -357 -89 -537 478 228 284 -495 40 -48 320 544 -461 -380
4659 -380 -1546 -67 51 614 84 26 -193 290 557 645 -683 39 1261 -256 398 590 305 286 693
4678 693 145 -66 -772 210 47 254 -578 93 748 157 140 452 -629 -495 542 -251 478 22 827 721
4698 721 -129 -427 -286 -185 -619 1151 350 305 143 -522 -349 -1265 708 -53 -645 312 312 -401 -137 578
4718 578 -490 -238 447 -177 370 -112 -257 -610 631 -1146 -79 -451 616 1011 206 1681 252 98
4736 98 -41 216 -991 -76 -258 224 73 21 -532 -931 -612 -735 72 -587 -22 -1031 492 -257 -756 37
4756 37 -3 -675 603 145 -217 529 92 -160 1013 1181 47 550 -162 431 724 1016 928 785 267 -81
4776 -81 63 -95 -72 -44 -210 182 -409 -646 -253 -484 -159 -411 454 363 -11 970 507 -264 -234 186 -69 -93
4798 -93 260 698 44 577 -19 306 190 459 275 -505 -710 -262 491 411 523 326 -513 423 -777 193
4818 193 -1240 -437 244 105 956 -165 335 -172 467 26 438 567 195 296 216 156 -386 423 354 231
4838 231 255 -15 -168 641 -695 26 29 90 -315 -520 -699 -124 -337 -751 -205 -170 -133 -17 -345 805 -69
4859 -69 654 551 756 756 95 714 448 245 -684 -895 -269 780 -674 507 -479 1131 -65 1021 -4
4878 -4 -1020 -80 -281 -337 121 236 167 48 -366 219 43 961 129 981 715 559 528 -39 89 260 402
4899 402 770 762 448 118 271 1443 -318 71 204 343 -295 31 323 -300 -531 -457 453 137 -973 174
4919 174 -13 172 54 -500 -314 -302 -142 469 -143 -416 72 -495 -1024 604 -304 295 224 300 563 32 -236
4940 -236 107 31 -94 -674 -873 552 -642 653 -926 -1168 -781 -179 489 -296 -53 1238 -291 332
4958 332 -355 246 375 -40 -134 -364 356 -210 562 -42 -462 256 640 -583 364 -977 -825 96 -407 -246
4978 -246 -780 192 1114 418 -1075 251 407 -891 473 -43 896 -410 -13 677 -237 -79 454 -56
4996 -56 764 787 -15 -624 697 1200 265 292 -461 188 -346 151 -387 13 -470 -252 -107 -463 152 329 105
5017 105 73 -27 -557 -641 -67 1166 789 -186 1359 -67 121 -495 -242 -297 511 985 -451 -267 290 -44
5037 -44 113 380 -401 -535 -575 -942 -984 393 253 33 -437 -269 126 30 12 357 -478 269 786 -220 117
5058 117 -339 2 -315 84 -296 597 188 -398 -277 51 -966 -737 -752 -1047 293 1090 -117 -916 180
5077 180 -30 405 -432 -453 -80 -76 39 -235 738 92 878 362 4 -919 948 373 -605 872 501 365
5097 365 29 562 -41 539 -331 -337 17 -159 240 205 455 159 -301 -367 -277 708 -188 -455 -802 707 286
5118 286 254 131 468 327 -311 1173 42 -441 622 -12 119 -907 -1126 212 -719 -70 62 333 -396
5137 -396 471 -20 -686 -258 1083 -77 171 649 314 -610 331 -844 -50 711 -460 142 -356 -1 -70
5156 -70 -210 -611 -104 504 -367 -390 -921 -296 203 -618 -1162 -1257 -18 -338 -951 -636 -551 1212 698 -576
5176 -576 401 157 201 761 -56 122 -463 386 871 -195 754 625 -98 73 613 810 273 -380 323 1242
5196 1242 -180 -653 343 -525 453 -234 -554 -454 -629 -806 -956 357 34 246 474 229 -755 359 266
5215 266 159 1218 -34 -365 877 40 58 -394 50 14 19 404 417 302 -402 -395 -97 -106 271 -687 -276 389
5237 389 -982 -511 158 403 -185 -60 292 196 -112 668 -337 -330 1175 860 678 714 635 -22 -268 65 -105
5258 -105 629 2 -506 -252 -491 -1276 -22 -742 278 -536 -37 62 -1596 684 -373 -106 1154 119
5276 119 -295 27 616 632 397 -151 508 908 883 -245 -171 801 -951 148 -19 -866 1458 -82 -320
5295 -320 402 -326 61 344 214 -470 181 45 -449 -211 506 -121 -4 888 -300 731 703 699 -484 758
5315 758 517 498 -584 -91 141 -991 459 686 -163 -196 -564 -491 -1249 537 128 -470 66 -241 -656 157
5335 157 -709 325 116 -398 -9 -308 -265 -168 193 298 84 -85 -6 616 209 1007 1113 144 -185 137 121
5356 121 -582 -260 384 156 111 -111 576 136 -655 -339 -575 -1136 -391 435 -56 410 258 -637 -152 -285
5376 -285 -387 1323 -322 -2 -29 173 1 390 1180 90 -571 -269 445 171 0 148 -27 -373 -142
5395 -142 677 222 -428 -78 -1439 -623 -1086 -510 91 752 169 154 17 310 -696 183 129 340 79 -343
5415 -343 532 86 572 283 -364 361 78 -216 -295 127 -353 -337 -356 -13 392 -420 -355 13 -908 -379 579
5436 579 -321 -284 -567 125 452 -311 1050 691 1240 -198 -496 54 -42 -458 -51 -145 -54 417 -404 419 382
5457 382 452 63 -54 348 -177 64 -384 -337 24 494 -253 -438 -539 -76 -852 -285 -7 -390 272 537 -174
5478 -174 22 -90 484 671 1025 -16 217 137 3 13 82 155 -406 -369 -379 -248 -614 -582 -698 -544 -513 -175
5500 -175 -43 12 -745 -251 568 1096 -212 649 -67 206 211 63 280 374 765 180 383 654 -582 -1107 1149
5521 1149 -1268 568 294 -720 -110 -586 320 -36 -584 -400 -4 761 -253 -23 656 -61 -218 -242 403
5540 403 -85 886 420 -460 1140 646 5 806 1172 573 -158 211 682 -29 770 -301 615 -629 793
5559 793 -756 -44 -255 204 1068 -1058 630 -112 717 710 -1175 -492 -212 -965 -43 -554 307 120 584
5578 584 923 263 382 -364 623 -235 -333 -359 410 -334 348 -405 -686 -100 -157 681 193 -216 -852 -317 701
5599 701 -621 -266 -83 633 494 645 179 -398 373 -861 790 188 -283 36 -309 -417 364 -493 531
5618 531 284 -413 -234 -742 -364 -421 -733 -52 455 -100 -91 -222 846 -717 -328 -136 -338 -321 108 149 204
5639 204 841 147 15 246 500 -617 -562 -290 96 341 222 -205 142 -144 -776 -40 -968 -444 266 -420
5659 -420 -51 -263 -892 536 -2102 887 -616 -155 253 284 -124 -696 967 143 640 297 80 -632 549
5678 549 679 -37 -310 -146 60 -865 899 -61 -207 -80 245 -662 -30 -888 -203 -175 -183 47 -452 -735 43
5699 43 -261 833 375 289 1444 11 -600 591 370 16 307 494 483 1101 -234 -651 -219 -699 755
5718 755 -105 -236 -940 -40 -334 -498 -287 40 438 1325 -24 286 -449 -146 336 -55 345 -398 -527 297
5738 297 411 238 261 -769 56 -89 731 68 63 208 197 -472 587 -32 -375 287 -865 -1019 389 -522
5758 -522 145 37 -528 931 -94 101 278 595 134 -1037 200 -210 177 350 115 -1250 -803 776
5776 776 156 144 347 2 795 -505 -117 -195 -328 314 -145 -794 -49 -87 606 -475 -50 -237 -77 -47 -1036
5797 -1036 256 342 738 -392 547 -385 1097 821 674 1059 291 860 861 652 -161 71 -656 -981 367
5816 367 74 -850 128 -239 921 -427 -847 -623 272 -471 -119 -481 204 846 49 -389 25 -167 118
5835 118 1545 1229 130 -861 -272 -361 -275 -129 -120 9 -479 -515 -1221 438 -1245 113 337 733 -518 -461
5855 -461 496 -251 -906 -100 507 886 866 522 -256 382 391 -68 805 569 160 264 -495 434 -763 -772 362
5876 362 -128 -527 -174 -346 -456 -338 422 -205 -740 -618 -161 -9 -328 -379 54 -426 325 955 -32 -110 -328
5897 -328 -4 743 661 -570 1359 -766 -432 -272 -255 -451 -465 131 -692 189 -141 -964 -497 -152 -444 -707
5917 -707 -749 782 -194 25 84 -888 228 -115 -217 -59 827 -312 775 450 1088 875 1135 228 -537
5936 -537 162 -407 61 449 -15 302 1064 428 724 290 213 -237 59 -239 524 247 1022 -626 245 -388
5956 -388 -26 -204 180 590 -774 228 -108 -83 750 275 -733 971 57 -440 -57 603 -613 -224 -425
5975 -425 -379 -423 40 -69 -534 -731 280 -955 -339 474 -90 38 -63 352 -82 110 516 249 638 32
5995 32 -165 604 645 234 454 -37 359 -991 295 113 457 -284 -236 267 -114 234 -747 -846 -23 -337 -780
6016 -780 -856 -441 202 -218 270 -150 1033 -47 -223 -10 1114 1174 -243 -105 434 544 56 581 -640
6035 -640 -301 745 -278 -26 -772 -423 -663 -210 -717 -81 203 140 -336 208 586 425 364 -167 -793 -914
6055 -914 225 803 772 -361 233 -238 27 -459 1143 158 82 -183 1384 -657 -507 -76 1184 -5
6073 -5 -1427 -744 292 -533 -804 -324 -557 208 24 424 107 -275 -432 -358 -269 -526 -58 236 181 671 -574
6094 -574 203 -513 -578 293 7 440 457 247 -295 180 245 384 200 -192 657 45 -124 676 -72 228 -433
6115 -433 -65 1016 -261 434 1337 511 718 97 293 283 153 539 162 422 268 -448 -81 -346 598 -141
6135 -141 -377 -320 -770 279 -881 281 156 -13 -1226 466 642 -345 -604 -314 365 800 620 -950
6153 -950 854 228 519 -25 463 -228 -1168 328 -416 286 -722 372 882 -406 454 -268 170 -61
6171 -61 431 -700 54 -277 303 -267 122 40 -404 11 -470 -345 1238 -464 -345 238 -603 -843 -482 174
6191 174 -401 -356 -217 699 524 651 1446 165 597 491 216 -174 -284 -338 169 -94 -108 2 -734 156 -449
6212 -449 107 287 65 -1161 338 390 -317 292 34 -504 983 -131 178 1071 459 307 -576 -497 402
6231 402 -581 163 76 -606 10 -766 538 -301 -273 -376 -659 -267 -800 -175 -288 -99 1222 42 122 -425
6251 -425 80 36 1320 -108 -230 -28 183 -366 860 631 399 98 -150 384 60 54 -532 25 -191 229
6271 229 -1256 -586 372 -654 612 -721 899 -476 290 -288 -517 -309 943 -284 -598 694 -606
6288 -606 99 257 874 400 -292 -284 201 -393 63 -155 -771 8 -275 287 -377 -465 161 -455 28 143 -546
6309 -546 194 948 207 128 -601 -213 561 3 555 -103 538 -101 -398 83 608 92 -34 556 172 -439
6329 -439 66 797 151 -618 362 406 175 -766 -315 -357 -1 -411 397 -90 -743 -733 -79 864 4 557 -4
6350 -4 -83 -513 -990 371 18 654 33 157 -378 642 619 673 -229 352 -263 -142 -1138 929 23 -1076
6370 -1076 -316 357 -1292 529 363 -13 1253 -371 848 560 -24 311 676 383 1219 -494 275 -311
6388 -311 1115 -80 492 -25 1399 350 563 54 -522 -537 -316 -9 364 -443 -834 -219 263 83 -65
6407 -65 -148 -38 1069 -601 121 -406 946 1094 656 455 617 -170 413 -728 284 345 446 414 554 128
6427 128 -325 939 742 389 82 -552 -784 160 -329 -243 226 -1373 -136 -351 -298 391 933 58 -722 -88
6447 -88 1884 838 343 969 630 719 131 -37 371 -89 -7 285 655 160 -44 -456 19 -254 -329 -365 -106
6468 -106 -530 417 119 -859 -697 -280 -209 255 648 -97 -306 -170 -426 -82 -628 -89 434 167 -38 203
6488 203 -178 185 70 477 700 -603 72 32 -504 -860 -306 -1476 -355 -271 -355 -485 -448 -491 707 -1232
6508 -1232 399 -40 -290 80 510 854 -795 178 -137 519 -206 614 664 -126 -335 -32 -658 1090 108
6527 108 -760 101 -269 -894 -1174 -132 -69 449 600 581 565 640 964 -124 -183 -139 188 80 -370 27 340
6548 340 52 539 -79 991 123 -5 583 491 -282 -589 -789 -55 -120 -219 -398 834 464 -490 104 -86
6568 -86 -17 262 -452 490 379 641 1094 -43 -192 -655 -339 -5 722 140 -150 747 281 -288 468 -349
6588 -349 -1055 -125 186 -531 454 -1041 -1316 400 136 -97 -132 334 -627 -417 113 -518 -400 -314 -215 15
6608 15 -37 357 281 425 213 397 -35 -972 466 -1253 371 81 -352 -665 343 1154 -824 296 -712
6627 -712 -169 179 204 -959 -963 -27 -52 -628 187 658 22 170 -102 137 265 -360 -114 714 -679 298 236
6648 236 -43 310 -702 558 139 -1357 768 233 -43 447 43 -186 -33 -265 -282 -440 -433 -610 -724 310
6668 310 272 604 946 251 539 488 670 -733 -184 -81 -105 -382 685 -424 -122 -717 313 545 -56 -667
6688 -667 30 -309 -134 -416 790 -829 -256 309 -677 259 6 48 -1014 358 405 42 268 353 158 -349
6708 -349 377 -240 -511 -683 -67 150 -417 219 -384 -864 86 194 -564 -57 -342 -845 -153 71 -246 -1109
6728 -1109 1124 -8 -31 1191 647 68 277 66 719 757 221 -17 151 -429 105 -207 962 536 -337
6747 -337 754 33 747 -367 -104 1255 552 -229 -188 -1017 241 -514 -571 177 191 -467 363 755 -404
6766 -404 -93 -710 998 -438 933 -702 75 -731 -6 340 608 62 -645 420 -688 800 -291
6783 -291 -483 -472 -64 -574 -707 -253 -288 -1023 289 -371 -19 336 -631 -215 35 -873 291 240 -199 499
6803 499 207 202 -670 391 -417 217 88 226 292 -609 140 -51 -224 -623 588 -538 -847 -101 -73 643
6823 643 -536 -540 -864 -706 -770 -528 506 -159 64 -152 -831 109 191 -181 -666 547 224 91 739 742 -19
6844 -19 -169 -84 328 -760 -1052 -907 -215 -58 -170 572 51 -761 13 -752 350 245 -831 198 338
6863 338 -73 384 510 635 449 926 -723 -21 259 -14 158 -144 701 -79 -374 -913 -412 -766 -994 584
6883 584 30 -577 833 -158 -672 609 -572 -703 -742 -61 -160 111 47 196 269 -24 126 -411 22 527
6903 527 203 -830 318 559 -467 -273 -24 193 -426 19 335 -967 -859 122 1038 481 -842 -441
6921 -441 172 -65 419 -320 944 662 182 -345 -333 146 421 211 1249 -382 323 490 -369 -145 389
6940 389 437 -950 137 756 243 464 318 -389 -130 -304 -857 599 508 253 766 -469 1034 -159 -987
6959 -987 -99 -79 143 169 -159 74 775 472 -423 -52 -258 -112 -32 -91 550 386 -52 -14 464 -990 -560
6980 -560 -1020 -134 -48 -274 -4 27 197 103 5 -229 747 163 256 -509 -22 945 657 103 89 -608 211 -350
7002 -350 505 -226 -39 191 -763 185 -830 -380 -885 270 284 -28 -618 -40 55 -727 -463 -217 -231 573
7022 573 -528 165 61 209 1199 -736 605 139 -351 349 -1038 625 -11 -41 589 1081 -718 -40
7040 -40 -407 -721 263 32 -587 -574 553 -131 -24 -257 -533 -222 -251 -356 123 -729 491 490 -91 -256 711
7061 711 -769 -610 -8 784 348 -59 693 416 -355 -172 1503 -597 -87 -303 -283 184 -35 424 -416
7080 -416 184 -466 -856 734 223 -123 485 -79 127 212 219 -295 235 -51 189 160 909 63 -402 671 -155
7101 -155 -157 -626 -712 -345 788 193 -987 -289 -468 335 -578 -381 130 -927 293 -873 -15 501 -121
7120 -121 184 -22 318 726 -586 823 -726 613 -165 -911 -603 -210 52 -22 677 479 -241 750 18
7139 18 -185 -1022 -782 483 377 -301 86 -312 704 -522 668 -328 -641 429 15 -312 -622 -762 -557
7158 -557 370 -243 -208 463 1106 -694 1633 28 -33 -30 11 251 -435 717 512 -848 135 291 -244 -458
7178 -458 -215 65 -980 -490 694 -427 297 181 -96 1528 -374 755 246 872 -324 161 1153 645
7196 645 823 352 -296 -375 -481 -326 -633 117 -166 -814 192 -300 -248 116 -229 401 -1020 -552 -508 -330
7216 -330 774 1 323 855 -628 570 512 -256 -183 -241 304 425 951 699 -717 -448 -31 -445 492 1035
7236 1035 57 51 39 -437 -751 95 293 175 319 -131 216 38 201 437 -56 839 -50 101 314 791 -943
7257 -943 1462 -167 -272 -517 810 534 526 -46 528 -429 -815 -272 106 -176 -276 -657 -1085 -578 -449 -55
7277 -55 746 18 -407 319 386 -585 649 -379 669 -243 340 405 457 184 457 829 -417 -16 176 565
7297 565 163 -627 -364 5 151 -12 -366 -276 -143 184 -216 -329 -321 8 497 289 837 43 -63 -114 555
7318 555 -379 816 284 683 -772 391 903 -106 -2 39 -274 -340 1273 189 75 -159 317 -592 -421
7337 -421 107 234 -49 -212 -715 -905 -245 -153 -97 -1226 -691 513 -476 188 195 -238 -71 531 237 504 -96
7358 -96 -1065 103 -934 -394 581 -572 383 -73 -28 -432 -105 297 -95 -185 116 -853 -690 -407 104 -154
7378 -154 -310 133 502 146 320 255 -137 -265 -515 41 -589 -623 797 -347 -31 -366 -160 -24 -155 -537
7398 -537 -429 -100 -425 -536 110 91 166 265 160 210 -11 -479 -809 320 1128 139 -1013 -326 1067 -235
7418 -235 -38 232 270 245 150 433 1116 83 -40 -479 396 -466 -453 -612 506 36 -765 -761 172 336 -154
7439 -154 -254 285 -121 -257 276 -820 -4 101 599 569 -314 709 -75 -215 -259 -314 -376 184 151 -370 -416
7460 -416 35 -386 -190 -230 -197 100 -1106 -976 159 298 -268 316 272 108 -42 -242 -827 67 514 578 202
7481 202 -371 -80 -438 586 -61 318 -411 -732 -215 85 -938 -160 -130 -139 -478 -258 -80 -353 -814 -337
7501 -337 186 -240 -183 61 417 232 -718 -31 -136 371 373 536 -169 -388 141 546 177 -85 1069 -62
7521 -62 454 -720 -421 -117 168 -660 -800 -719 -317 -65 -596 185 160 151 501 -817 198 819 -552 720
7541 720 327 157 657 802 -61 54 465 661 195 -429 -300 -551 589 90 222 221 169 597 -82 -424 378
7562 378 417 323 113 582 -1252 181 -938 561 -35 355 -607 -115 302 410 807 400 603 538 -742
7581 -742 -252 -29 239 615 -536 160 61 492 373 535 -1023 -263 -98 140 -542 1164 521 -47 814
7600 814 393 -1016 196 -1030 -537 -565 -299 1323 -235 146 -206 -376 -199 -762 -135 -169 429 -129 595
7619 595 -787 -369 -319 86 -341 -235 -230 209 216 -575 -544 -899 51 241 204 51 745 -268 -710 -82 646 -62
7641 -62 197 -485 112 36 105 114 -810 31 313 -8 -354 695 540 -289 115 -698 -185 -422 -2059 202 -296
7662 -296 -292 -428 -477 217 96 494 108 -450 191 183 -227 839 -492 -377 -1162 -370 702 -601 1322 -372
7682 -372 -24 -130 -266 -484 277 -187 4 -145 -59 678 47 -280 -2 427 -968 526 -199 49 -695 281
7702 281 160 727 1012 500 580 1048 146 575 -444 -789 -160 -887 168 -372 -313 -442 183 231 -134 -935
7722 -935 -110 623 500 233 -62 163 -433 -562 -485 -443 451 701 -6 -183 136 -263 36 -84 314 530 -482
7743 -482 311 861 206 -58 -420 212 626 -910 105 -138 14 -157 942 -536 225 -27 733 635 459
7762 459 -463 -284 -96 -201 -1021 323 -709 790 352 -129 -298 13 664 119 -753 715 84 -6 -204
7781 -204 -689 -345 -594 216 872 146 -685 111 104 153 -431 254 513 372 -692 235 334 -606 -147 -1045 82
7802 82 245 909 -14 -757 1435 122 -44 162 479 -669 -232 -139 -341 170 -699 -162 16 774 232 475
7822 475 -197 617 244 -79 654 213 -119 252 -470 515 714 -295 32 376 -201 -132 -1039 1276 688 -292
7842 -292 -873 -475 -264 -54 369 -625 172 -859 262 639 -624 -811 -584 358 169 430 -163 -222 -1242
7861 -1242 -1062 -141 470 710 -185 516 862 430 -83 -233 476 168 -471 459 -703 -382 -86 -233 55
7880 55 -741 212 250 -609 -450 142 453 815 469 281 -457 -650 -1351 424 186 -402 309 -408 -876 -249
7900 -249 838 118 -929 493 180 -27 307 380 -743 -120 444 -335 -341 53 -51 -231 -481 -904 927
7919 927 340 852 -476 314 -572 -349 -176 -115 -247 -106 438 156 961 -337 852 146 -45 -14 -949 -733
7939 -733 780 898 512 316 -358 78 -196 -136 461 -280 409 9 -540 -554 -328 -226 314 -57 1262 -31
7959 -31 -22 322 -847 -71 689 306 616 345 401 -102 81 969 53 735 377 -334 -101 988 -464 566
7979 566 684 -765 -461 337 345 -368 233 -75 263 204 163 -779 -590 318 717 -349 249 -45 -308 -862 609
8000 609 -514 736 -92 -64 233 497 1018 -241 400 -285 355 -1031 -477 686 91 200 239 -289 91
8019 91 358 -1159 -610 766 -280 207 650 -422 -353 384 942 -238 904 490 -94 -544 -211 418 28
8038 28 -1023 -28 49 644 493 534 -98 -365 123 -350 -317 -352 356 -377 -492 -167 -373 1198 559 513 -370
8059 -370 314 101 -303 369 -363 962 367 -561 -33 -597 -492 -89 418 -43 1026 246 -523 500 14
8078 14 407 -86 349 517 167 -372 468 -221 121 649 -21 -700 410 -270 1044 -927 -199 -567 -195
8097 -195 103 143 88 55 -111 139 220 -150 -123 615 611 -131 298 -559 846 -276 -204 -11 73 -396 1126 157
8119 157 -832 -530 73 -775 102 985 -1073 -66 354 364 251 546 -201 -79 555 120 -91 -269 187 -459
8139 -459 262 75 180 -549 597 280 161 -640 470 389 933 -208 154 1273 772 -382 243 16 -27
8158 -27 -743 -191 -664 229 451 -75 -181 -696 806 249 384 -61 -14 -336 190 -579 355 478 -758 -425
8178 -425 -166 -74 857 -710 -1069 183 -590 -346 377 -208 349 -466 110
8191A10
##END NTUPLES=NMR FID
##END=
