##TITLE=1H_1AC1411
 CDCl3
 108 sc, 
 15.11.2022
##JCAMPDX= 6.0         $$ Bruker NMR JCAMP-DX V2.0
##DATA TYPE= NMR FID
##DATA CLASS= NTUPLES
##ORIGIN= UXNMR, Bruker Analytische Messtechnik GmbH
##OWNER= root
$$ XWIN-NMR		Version 3.5
$$ Tue Nov 15 14:09:27 2022 Russian Standard Time (UT+4h)  she@DPX200
##.OBSERVE FREQUENCY= 200.1313499994
##.OBSERVE NUCLEUS= ^1H
##.DELAY= (6, 6)
##.ACQUISITION MODE= SIMULTANEOUS
##.ACQUISITION SCHEME= undefined
##.AVERAGES= 108
##.DIGITISER RES= 18
##SPECTROMETER/DATA SYSTEM= spect
##.PULSE SEQUENCE= zg30
##.SOLVENT NAME= CDCl3
##.SHIFT REFERENCE= (INTERNAL, CDCl3, 0, 15.7039)
##AUDIT TRAIL= $$ (NUMBER, WHEN, WHO, WHERE, WHAT)
$$ ##TITLE= Audit trail, XWIN-NMR		Version 3.5
$$ ##JCAMPDX= 5.01
$$ ##ORIGIN= Bruker BioSpin GmbH
$$ ##OWNER= she
$$ F:/spectra/data/she/nmr/H-F/1/audita.txt
$$ ##AUDIT TRAIL=  $$ (NUMBER, WHEN, WHO, WHERE, WHAT)
(   1,<2022-11-15 14:08:02.35 +0400>,<she>,<DPX200>,
      <continue with go, POWCHK disabled, PULCHK disabled
       configuration hash MD5:
       00 E9 B6 7A A2 85 ED C7 34 08 36 98 17 FE 4E 26
       data hash MD5: 16K
       A7 F4 B8 0F 53 BC BC DC 86 25 62 44 07 22 21 3D>)
$$ ##END=
$$ 
$$ hash MD5
$$ E5 CC 6D 2A D1 BC 67 7A 19 C5 5F 6F F0 73 BE 3B
##$RELAX= 
##$RELAX= 
##$RELAX= 
##$RELAX= 
##$RELAX= 
##$RELAX= 
$$ Bruker specific parameters
$$ --------------------------
##$DU= <F:/spectra>
##$EXPNO= 1
##$NAME= <H-F>
##$PROCNO= 1
##$TYPE= <nmr>
##$USER= <she>
##$AMP= (0..31)
100 100 100 100 100 100 100 100 100 100 100 100 100 100 100 100 100 100 
100 100 100 100 100 100 100 100 100 100 100 100 100 100 
##$AQSEQ= 0
##$AQ_mod= 1
##$AUNM= <au_zg>
##$AUTOPOS= <>
##$BF1= 200.13
##$BF2= 200.13
##$BF3= 200.13
##$BF4= 200.13
##$BF5= 200.13
##$BF6= 200.13
##$BF7= 200.13
##$BF8= 200.13
##$BYTORDA= 1
##$CFDGTYP= 0
##$CFRGTYP= 5
##$CHEMSTR= <none>
##$CNST= (0..31)
1 1 145 1 1 1 1 1 1 1 1 1 1 1 1 1 1 1 1 1 1 1 1 1 1 1 1 1 1 1 1 1 
##$CPDPRG= <>
##$CPDPRG1= <>
##$CPDPRG2= <>
##$CPDPRG3= <>
##$CPDPRG4= <mlev>
##$CPDPRG5= <mlev>
##$CPDPRG6= <mlev>
##$CPDPRG7= <mlev>
##$CPDPRG8= <mlev>
##$CPDPRGB= <>
##$CPDPRGT= <>
##$D= (0..31)
0 1.2 0 0 0 0 0 0 0 0.06 0 0.03 0 0 0 0 0.0002 0 0 0 0 0 0 0 0 0 0 0 0 
0 0 0 
##$DATE= 1668506509
##$DBL= (0..7)
120 120 120 120 120 120 120 120 
##$DBP= (0..7)
150 150 150 150 150 150 150 150 
##$DBP07= 0
##$DBPNAM0= <>
##$DBPNAM1= <>
##$DBPNAM2= <>
##$DBPNAM3= <>
##$DBPNAM4= <>
##$DBPNAM5= <>
##$DBPNAM6= <>
##$DBPNAM7= <>
##$DBPOAL= (0..7)
0.5 0.5 0.5 0.5 0.5 0.5 0.5 0.5 
##$DBPOFFS= (0..7)
0 0 0 0 0 0 0 0 
##$DE= 6
##$DECBNUC= <off>
##$DECIM= 32
##$DECNUC= <off>
##$DECSTAT= 4
##$DIGMOD= 1
##$DIGTYP= 9
##$DL= (0..7)
0 120 120 120 120 120 120 120 
##$DP= (0..7)
150 150 150 150 150 150 150 150 
##$DP07= 0
##$DPNAME0= <>
##$DPNAME1= <>
##$DPNAME2= <>
##$DPNAME3= <>
##$DPNAME4= <>
##$DPNAME5= <>
##$DPNAME6= <>
##$DPNAME7= <>
##$DPOAL= (0..7)
0.5 0.5 0.5 0.5 0.5 0.5 0.5 0.5 
##$DPOFFS= (0..7)
0 0 0 0 0 0 0 0 
##$DQDMODE= 0
##$DR= 18
##$DS= 0
$$ [...]
##$SUBNAM2= <"">
##$SUBNAM3= <"">
##$SUBNAM4= <"">
##$SUBNAM5= <"">
##$SUBNAM6= <"">
##$SUBNAM7= <"">
##$SUBNAM8= <"">
##$SUBNAM9= <"">
##$SW= 18.0517283424941
##$SWIBOX= (0..15)
0 0 2 0 0 0 0 0 0 0 0 0 0 0 0 0 
##$SW_h= 3612.71676300578
##$TD= 16384
##$TD0= 1
##$TE= 0
##$TE2= 300
##$TE3= 300
##$TEG= 300
##$TL= (0..7)
0 120 120 120 120 120 120 120 
##$TP= (0..7)
150 150 150 150 150 150 150 150 
##$TP07= 0
##$TPNAME0= <>
##$TPNAME1= <>
##$TPNAME2= <>
##$TPNAME3= <>
##$TPNAME4= <>
##$TPNAME5= <>
##$TPNAME6= <>
##$TPNAME7= <>
##$TPOAL= (0..7)
0.5 0.5 0.5 0.5 0.5 0.5 0.5 0.5 
##$TPOFFS= (0..7)
0 0 0 0 0 0 0 0 
##$TUNHIN= 0
##$TUNHOUT= 0
##$TUNXOUT= 0
##$USERA1= <user>
##$USERA2= <user>
##$USERA3= <user>
##$USERA4= <user>
##$USERA5= <user>
##$V9= 5
##$VALIST= <valist>
##$VCLIST= <CCCCCCCCCCCCCCC>
##$VD= 0
##$VDLIST= <DDDDDDDDDDDDDDD>
##$VPLIST= <PPPPPPPPPPPPPPP>
##$VTLIST= <TTTTTTTTTTTTTTT>
##$WBST= 1024
##$WBSW= 4
##$XGAIN= (0..3)
0 0 0 0 
##$XL= 0
##$YL= 0
##$YMAX_a= 244756
##$YMIN_a= -155612
##$ZGOPTNS= <>
##$ZL1= 120
##$ZL2= 120
##$ZL3= 120
##$ZL4= 120
##$ABSF1= 10
##$ABSF2= 0
##$ABSG= 5
##$ABSL= 3
##$ALPHA= 0
##$AQORDER= 0
##$ASSFAC= 0
##$ASSFACI= 0
##$ASSFACX= 0
##$ASSWID= 0
##$AUNMP= <proc_1d>
##$AZFE= 0.1
##$AZFW= 0.1
##$BCFW= 1
##$BC_mod= 2
##$BYTORDP= 1
##$COROFFS= 0
##$CY= 11.3945322036743
##$DATMOD= 1
##$DC= 2
##$DFILT= <>
##$DTYPP= 0
##$F1P= 2.36226072786647
##$F2P= -0.459571619588291
##$FCOR= 0.5
##$FTSIZE= 0
##$FT_mod= 4
##$GAMMA= 1
##$GB= 0.15
##$INTBC= 1
##$INTSCL= 1
##$ISEN= 128
##$LB= 0.24
##$LEV0= 0
##$LPBIN= 0
##$MAXI= 10000
##$MC2= 0
##$MEAN= 0
##$ME_mod= 0
##$MI= 1.114404
##$NCOEF= 0
##$NC_proc= 0
##$NLEV= 6
##$NOISF1= 3.799351
##$NOISF2= 2.8
##$NSP= 1
##$NTH_PI= 0
##$NZP= 0
##$OFFSET= 15.70392
##$PC= 1
##$PHC0= -18025.96
##$PHC1= 3.000696
##$PH_mod= 1
##$PKNL= yes
##$PPARMOD= 0
##$PSCAL= 0
##$PSIGN= 0
##$REVERSE= no
##$SF= 200.130013532006
##$SI= 16384
##$SIGF1= 3
##$SIGF2= 2
##$SINO= 400
##$SIOLD= 16384
##$SREGLST= <1H.CDCl3>
##$SSB= 0
##$STSI= 0
##$STSR= 0
##$SW_p= 3612.71676300578
##$SYMM= 0
##$S_DEV= 0
##$TDeff= 0
##$TDoff= 0
##$TI= <>
##$TILT= no
##$TM1= 0
##$TM2= 0
##$TOPLEV= 0
##$USERP1= <user>
##$USERP2= <user>
##$USERP3= <user>
##$USERP4= <user>
##$USERP5= <user>
##$WDW= 1
##$XDIM= 8192
##$YMAX_p= 0
##$YMIN_p= 0
$$ End of Bruker specific parameters
$$ ---------------------------------
##NTUPLES= NMR FID
##VAR_NAME=  TIME,          FID/REAL,        FID/IMAG
##SYMBOL=    X,             R,               I
##VAR_TYPE=  INDEPENDENT,   DEPENDENT,       DEPENDENT
##VAR_FORM=  AFFN,          ASDF,            ASDF
##VAR_DIM=   8192,          8192,            8192
##UNITS=     SECONDS,       ARBITRARY UNITS, ARBITRARY UNITS
##FACTOR=    0.0002768,     1,               1
##FIRST=     0,             0,               0
##LAST=      2.2672688,     0,               0
##MIN=       0,             -155612,         0
##MAX=       2.2672688,     244756,          0
$$ Real data points
##PAGE= N=1
##DATA TABLE= (X++(R..R)), XYDATA
$$ [...]
2730a712J182j08p85K62J045p30n33J332q55K9O91P38j433J122J31K09N82m96
2748F71L14J4J02O2J66j30m75o86O21l23m84J211j24j873Q69o35K27m33M09m74
2768i71m71R84o09k50J608o15j94M87j72N25K55K68n8r33N43Q68K77r69M02m65
2788E10j206J247r7M3r96J16o86M07k51p26J251j878J806q8pl51J79K86J42N35
2808B36j22K68K63K44m04J107q33L69n33K89m68R21r91J29j068P03q3J70p78L56
2828b25J03j563M86J99o77J570q60K83L04l98k88J422m37O88r3j21J526q64K90
2847A345n15J583j049k28J16p78J3O2K90r95k63R68q05o60k34j037J054P35m47
2866h45O89j060J236l24m27Q4J61j18O83L19J038j333O01R38k57m53j71n54m94
$$ y = [-1712, -530, -638, -1423, -1161, -116, -846, -1379, -47, -902, -873, -182, 556, -877, 245, 376, 585, 1167, 671, 985, 999, 1101, 1163, 1329, 1199, 724, 38, 659, 336, -148, 1063, 939, -934, -65, -700, -473, -906, -497, -971, -1442, -458, -1067, -1317, 291, -324, -518, -31, -203, 322, 577, 845, 787, -146, 397, 1265, 1542, 573, 975, 510, -696, 551, 454, 497, -499, -383, -1069, -662, -913, -1639, -388, -2266, -460, -548, -555, -906, -727, -441, -299, 236, 114, 382, 645, 889, 485, 1592, 759, 1128, 595, 884, 416, 1337, 346, 475, -593, 110, 27, 197, -581, -225, -122, -1685, -1199, -1000, -1677, -107, -967, -684, -380, -778, -1066, 356, -81, 607, 514, 393, 1919, 1055, 1345, 830, 2413, 1364, 1136, 1252, 474, 487, 549, 839, -156, -419, 549, -256, -916, -1150, -2187, -1133, -398, -845, -156, -1216, 20, -304, -731, -647, -486, -604, 79, 398, 1436, 103, 704, 1642, 1385, 932, 761, 207, -287]
2885b87l9O96O99j495J85k63M90k30K12o10n97O99k38k64n62J517n83k2l8Q1P96
2906A47J45J084j443K59M81o38J68J932j666K37j61k93M0k19J86m04L03j627J624
2925A55m10m74p11P06q30Q96K57j235R58p5L94N41n19O06J97o3L16m06J119m26
2945I96q58N00M38J38j181P42r80O56n15n06M80o80N76O63j182L63j048J016r44
2964a326L68J064j085J212m25j44M53m5j07M67O99p68q2K36n25Q87qm7P01o40
2984H85j071L17k76N79p00K35q90l33Q65q86N65J21j2Q8J64l2r8J42l4J084l01
3005D12J29J92M37j001M96R95j251K24j98R58j826M91M31m77M6n65q37J85Q49
3024c10l65M45J8j614o1J184K74l70P30K39j166P42O50K5M06n20M78m7N06q41
$$ y = [-287, -326, 370, 1069, -426, -241, -504, -14, -244, -32, -642, -1239, -540, -778, -1042, -1604, -87, -670, -692, -730, -649, 147, 292, 1376, -67, 192, 673, 35, 203, 2135, 469, 706, 545, 252, 292, 73, 259, -145, 158, -1469, 155, -255, -729, -1440, -734, -1564, -668, -411, -1646, -688, -763, -369, 172, -347, 259, 456, 393, 709, 303, 1422, 996, 138, 638, 1076, 1214, 33, 775, -205, 451, -64, -570, -90, -770, -194, 469, -713, -350, -1398, -382, -1326, -958, 106, -979, 233, -192, -336, 117, 72, -35, 432, 1131, 363, 281, 517, -8, 879, 871, 824, 1525, 885, -186, 131, -145, 434, -266, -31, -921, -1254, -389, -1275, -710, -589, -601, -513, -349, -381, -479, -337, -371, 713, 412, 541, 733, 1170, 169, 665, 1660, 409, 633, 435, 1393, -433, 58, 489, 12, 58, -507, -1344, -1159, -310, -675, -230, -212, -1826, -1887, -703, -429, -799, -69, 170, -996, -254, 396, 421, 827, 307, 785, 738, 1244, 403]
3044D03J42K13K4O0M5o31n66p04K58J047q63m81r2O87r56Q54L99j413J898j200
3064h76J472o13n57K179j334L58o50Q52Q7j72L38l3p75K45L57k01N16k99m50o75
3084b31o04J120j048L18m81K14L96n46J78J4j0M06j62J00L28q27J400K40N3j365
3104e07J659m6j138O38p72N02n09J234J63n17j105R57p06K70n1m8p38N90m36j79
3124g39K21M55j64j86J09n4O99r83J150O92q20M40J59n58K48j97j72m31N73k09
3144B33P60q12M11j198J17j54P37J79r77M10p54M23n42O06l93K02O17o36J560
3163G89j651N09J082l77J057j196P59j430J400K12m88p79R98j01O4m46j064M48
3181b14l29N0J12m9l23O9r60J113J93J10L80j004Q93k39j50L87O53p54R58k30
$$ y = [403, 545, 758, 782, 842, 887, 256, -310, -1014, -756, 291, -572, -1053, -1145, -458, -1414, -560, -161, -1574, 324, -876, 596, -17, -574, 1605, 271, 629, -21, 831, 918, 746, 1084, 1051, 276, 521, 878, 677, 1193, 894, 444, -231, -835, 285, -763, -445, -926, -712, -316, -862, -684, -670, -680, -274, -436, -336, -8, -835, 565, 805, 858, -507, 1152, 1106, -32, 606, -166, 336, -173, 1061, 1224, 707, -398, 559, -147, 123, 72, 24, -714, -124, -560, -739, -518, -63, -227, -413, -304, -358, 341, -642, 508, 1200, 380, 820, 979, 421, 669, 472, 300, -131, 442, 233, 993, 181, 592, -606, -489, -643, 94, 273, -704, -294, -1048, -625, -1167, -561, -954, -752, -135, -771, 789, -862, -353, 729, 352, 1409, 213, 972, -458, 942, 1154, 666, -113, 885, 784, 848, 402, -662, -214, -543, -493, -381, -430, -753, -684, -1644, -531, -338, -228, 152, -852, 41, -198, -348, 39, 692, -62, 896, 666]
3201F66n6n50L94j24q96K16Q79K15l94m36P95j282Q9l62R25j79p23M19J21o79
3221i62R67M1o1r0n50k24P80n21L92M49K60k52m07P38J89Q4q93L8m09J136n76
3242A29J142j385N86m97K97r06n3J18Q95j233P29m85j9k69J52m00J774n05pq4
3262b1K46K1K3L61r2K45j62l35j9M78k53L44q71M80j962J074N86o81m06N85O61
3283C02j276L33N10k19l77O68J97j825R99N25O9M86L67j346J916Nm95j051O39
3302D27o59R19O90j280l38Q2j45J05P3R05p19j025j67O84n6m50N67m45k54N66
3322e20K04J93n09M24j82N50M49n70P36O6p31P95l43k51j54p73O04Q00p95K05
3342A98j157M76J298j236l13l70J324o37m21J547q43m77J36J018j511J740o23
$$ y = [666, 610, 60, 454, 330, -566, -350, 529, 744, 350, -86, 709, -573, -484, -846, 79, -100, -823, -404, -283, -962, 5, 46, -15, -105, -655, -879, -99, -620, -228, 221, 481, 229, -178, 560, 749, 833, -60, -22, -431, 705, 129, 1271, -114, 472, -25, 272, -634, -687, -569, 326, -907, -178, -663, -682, -951, -799, -1199, 575, 70, 63, -21, 225, 246, 269, 630, 538, 783, 621, 286, 267, 745, 492, 836, -35, 445, -1517, -443, 143, -538, -944, -359, 302, -974, -641, -131, -350, -727, -59, 138, -1687, -688, -163, -94, 392, 759, -587, 1329, 1334, 839, -212, 427, -232, 687, 1377, 97, -241, -159, -304, -199, -126, 779, 60, -965, -1132, -448, -504, -954, -387, -832, -1086, -520, -316, -123, -632, -208, -390, 160, 609, 39, 775, 841, 110, 905, 562, 311, 157, -616, -12, 788, -7, 198, -959, -483, 815, -421, -734, -1104, 220, -417, -838, 709, -134, -611, -475, 543, -968, 772, 149]
3359A49J47l23J33R80l14m03k55P52M7N71l83q45r21P28m3k45L22r5N3r38M15
3380d68k04K03m92l1J114j266J723l86q47J287j88m24j94P63j028R21M53j80m02
3399C54j79L30L72n21J19l81R2o97M55p1K63l92l54j11qM82j51N18j062K39N09
3420a94R00j230N56K05k97m98Q29R8J023j439J341j468M14Q2R07j430Q86L49p70
3439B64m83q3P72j453N09j4p6O94j337n0J613j142l44O70k80J366o96L85j273
3458i58P35R16k15n99P03K48pm88L81l02J9k59j477J337p79J051n36k0j034J334
3478E0L30o89m0l79J68p80J258p71P53M49o92J133j023L91R4O88l84p84P06n2
3498D26m61O75j412Q15J401j382j08J50j77K10m73L55J91j175P32J07j92m00K24
$$ y = [149, 296, -27, 106, 1086, 772, 369, 114, 866, 913, 1484, 1101, 256, -665, 63, 20, -225, 97, 2, 55, -883, -468, -672, -469, -961, -992, 122, -1144, 579, 193, -654, 633, 445, 21, -173, 590, -438, 483, 936, 756, 354, 175, 505, 877, 356, 475, 94, 186, -511, -56, -127, 136, -256, -610, -721, -729, -247, -398, 120, -942, -703, -194, 706, -524, 32, 237, -60, -558, 271, 369, 1392, -47, 1294, -174, 240, 322, 1229, -201, 685, 1034, 264, -219, -302, 470, -983, -474, -488, -564, 130, -1207, -1257, 356, -786, -1130, -460, -740, 626, -70, 315, -958, -223, 693, 478, -121, 582, 830, 823, 335, 716, 414, 433, 174, -1303, 34, -745, 306, -230, -250, -1284, 50, 380, -309, -349, -728, -560, -1340, -82, -853, -100, 349, -343, 790, -233, 158, 252, 940, 556, -228, 478, 426, -35, 640, -772, 43, 1444, 62, -46, 104, -73, 137, -336, 19, 210, -965, -233, -126, -318, -718, -494]
3517d94J489j236K71q91M58K42JO24q73O77J97j42M0K37l80l52Q69j229J065r51
3537c78N14J55q18K13R13k60j233J94N20m64j96l7M92K54R81m03q2L50j77m30
3557A08J005k96p32n60P80m67J173n77o13J146m02O15j004r80M39o8k05K92L72
3576B6k23l66r4L58R23j210J80Q31o33k82J94P70k1k96J11rJ060j020m69K101
3596A931j415K55p04J12N1P73j55k317P61P87p5J67o29K14L98o62k89P69q66J659
3616G65k283K060p51O31O3l6P9J586j434n80o7m98Q59L84j449J303l49jj027O10
3636a35j28J161j604Q19r66K09j76R73p92O41p88J019o4J11M18j083M79n98L04
3655b00J44j49J197n15m34J43O19n48m09n42J37R92n90q21J008R80k513J477K75
$$ y = [-494, 995, -241, 30, -861, -403, -161, -160, 464, -409, 268, 465, 323, 363, 600, 220, -132, 737, -492, 573, -378, 136, 291, -527, -314, 599, 339, -894, -700, -180, -644, -840, -877, -385, -131, 850, 447, 365, 715, 538, 108, 1113, 817, 85, -475, 305, -162, 1011, 434, -179, 967, 565, 1180, 176, -804, -365, -433, -638, -346, 26, -197, -563, -657, -299, 624, -586, -406, 425, -208, -490, -296, 474, 453, 157, 268, 259, 1319, 299, -170, 1931, 516, 771, 67, 179, 230, 1003, 848, -1469, -708, 79, 4, 171, -458, -244, 154, -508, -797, -28, -894, 765, -1518, 542, -209, 422, 485, 449, 528, 2114, 680, 100, 33, -465, 394, 778, -671, 632, 283, 282, -745, -135, -263, 898, -706, 113, -853, -644, -820, 153, -639, 2, -786, 233, 169, 280, 698, -385, 94, -504, -200, -56, -205, 992, 477, 43, 186, 805, 257, -152, -694, -557, 435, -155, -976, 32, 1012, -1501, -24, 251]
3674B51r76L94N22k35K66j172J252R2j42N05j330R36L32p30m47J082m43M56l34
3693B79q5N28l94M06j091q26K092r2j841O06m67O92J01n94j83O96J63Q0M97o58
3713i1k43j62L75n4M50j032J463k3L12l23Q61n14l20N8j044R92j062O02o24L85
3733Fn75r41J023j14k52J73O55p05P54Q3p3p34O02m51M46R91k79j46O6j63o45
3754b79O93L9k03J9J303j802l22Q39r8p91j30l25L83M21L03j80k64Q2n0J22N36
3775B96j41o62N44l93j17K54J486r59K93n30K15l10J209r33R0L18n37j40L5O6
3795H4J27n90J96J25J4r14j31P01m66q3M63m78M26J399j109Q5l44q2J209p77M12
3816B67M89p56J68j10N02m30R1J49j21o38J70J13k03K59n1M44m23o76O94m48M87
$$ y = [251, -725, -331, 191, -44, 222, -950, 302, 394, 252, 757, -573, 363, 695, -35, -482, 600, 157, 613, 279, 194, 722, 328, 734, -357, -1183, 909, 817, -1024, -418, -885, -193, -92, -686, -869, -173, -10, 70, 567, -91, -334, -496, -121, -175, 275, -757, 706, 683, 995, 672, 1533, 1019, 699, 757, -287, 705, -357, 245, -379, 6, -569, -1510, -487, -601, -853, -680, -25, -730, 24, 107, 34, -700, -98, -549, -103, 888, 609, 463, 529, 366, -279, 414, 453, 250, 269, 1572, -230, -552, 287, 189, -602, -732, -1057, -674, -253, 50, -130, -394, -312, -362, -240, 296, 155, -507, 37, -356, -473, -219, 1267, 308, 601, 71, 286, -24, 1185, 252, 342, 660, 123, -17, 18, 84, 211, -379, -183, -58, -44, -958, -1089, -388, -854, -937, -474, -952, -526, 873, -236, -151, -495, -577, 632, -145, 267, 756, 0, 168, 58, 560, 130, 221, 370, 249, -389, -219, -106, -309, -50, -101, 343, -80, -756, -62, -510, -23]
3837b3n3O41m22n25P5l12J92K19K60l35M21j79R90l63j83j82J21n19L11q3O67
3858G18k55m73J78k85p16N45L19j206J164q50R03k03m6J85p59N56M19r15L99L42
3878B0l5J66k75N78l61o54Q18j108J132k26M65N0K9q75P79p5p84j85J007m80K37
3899B23M89j246M15o13l52M61J372j253j72O99n27O72O05j498N86K46K35P50q22
3918B70p64J444m93M73j452J894k122K23M58p39J020J7j622R26l11n48J238L45
3936B57p82n18J379o06o28R98Q31n04j69J75l15L4R76j498M35K49N10j368J634
3955A090o49j46J66n49n14M40j235O61r0N06N43o66J26L14M09p87K24j12o7j88
3975e24R54m34j70N09k87M97k11N99p10J021j675P73o08O48l13O05o91R03j593
$$ y = [-23, -76, 565, 143, -382, -307, -619, -427, -208, 52, -283, 138, -41, 949, 586, 403, 221, 342, -177, 134, 51, 718, 463, -10, 168, -117, -833, -288, 31, -1175, -11, -861, 42, -161, -207, -22, -781, -225, 194, -721, -322, 20, -15, 151, -124, 454, 93, -561, 257, -851, 281, 55, 520, 570, 599, -276, 503, 428, -356, -541, 466, -14, 223, 712, -534, -119, -732, -1084, -623, 749, -504, -676, 23, -504, 168, 773, -725, -139, 107, 342, 1092, 270, -494, 950, 457, 930, -522, 1372, -750, -527, -69, -808, 212, 229, -1393, -467, -778, -1326, -88, 257, -525, -1043, 336, -270, -898, 100, 931, 427, 258, 433, 118, 152, 1128, -370, 65, 314, 824, -544, 1090, 441, 295, 461, -88, -602, -162, -1397, -736, -826, -320, 223, -443, -317, -3, 406, -381, -157, -269, -336, -524, 430, -4, -174, 335, 48, 545, 334, 933, 223, 1244, -431, 342, -266, 382, 69, 674, -17, 886, -707]
3994g07j117K301j432j06K84j20M18K50n21P33k36p5K88m5O18M36j034L52N25
4013H12l56N5L27j704J641l79L68l02j47l01n83K18k33o84J475j159k02L71K56
4032e27P70n79j87j81r8J011n96J131j326J260l52l05O45m25O64p00K48m99J210
4051A164k87j556o24K042n72j67m56k74q5J021m58k43N46P4J4n30j026J493M49
4070E25j002N56l08P17K04o78J036o52Q52n10k53j16j61N26q27P31j351l60R65
4089a06j40PJ1l44P07p1q20p2R41n54P53M49j885M52L47N68l75L42j77K58Q06
4110A097j88j066M50o97L60j76M42n32L94P36o90k43j69P39q72P34m2q09M29p71
4130h74m51P18m38O77J33m62L6K78N04J123j092P40j036L55P66n91r71P95N4R84
$$ y = [-707, -1824, 477, -955, -1061, -777, -897, -479, -229, -750, -17, -253, -328, -40, -85, 533, 969, -65, 287, 812, 456, 511, 838, -866, 775, 396, 764, 462, 315, 14, -569, -351, -584, -1268, 207, -952, -1154, -783, -527, 243, -336, -523, -704, -802, 209, -387, 744, -582, 678, 326, 21, 666, 241, 905, 205, 453, -46, 1164, 877, -679, -1303, 739, 167, 0, -456, -730, -815, 206, -252, -495, 51, 125, 139, -391, -1417, 76, 525, -477, 79, -229, 488, 692, 14, 1050, 398, 1250, 740, 487, 371, 210, 736, -91, 640, -711, -1071, -106, -246, -239, -228, -572, 135, 64, -756, -828, 113, -441, 312, 761, -1124, -672, -325, 243, -132, 210, 33, 291, 1097, 909, -157, 293, -404, -44, -220, 222, -310, 84, 820, 130, -113, -282, 457, -415, 319, 277, -532, -103, -874, -1325, -607, -1045, -368, -235, -697, -661, -383, 121, 1244, 152, 892, -144, 211, 977, 386, -585, 210, 264, 1248]
4150A248q66p17m3o45J382L79j395j35LJ261k37m22j23M35K28J75j756J835r35
4169c28R74k55k17J011j120j90J190j66J43k31j032J76o40J87r2J150q25P18j3
4188D40o43p7M07M53o79n00O57l54Q24q15N8L39L26m5q51J001K78r35P09N8l52
4209B99J081r80K5l7N64o83M20j55p90N90m08K79m82r59J781k81q04l9J376j391
4229e94K35P82j25p01Q94n41M15n05p0O52n4p81J384j097j85M47p82O88K6o41
4249e53J074n04K39m87K93m55O12k75l33N72M5n4j280J230J5m08K09j266J133
4268a93O53p08O28o10R35q88P91k37M52q15o4j43K80n36Q73j076j23J112j068
4287g37L0N96n67L1J401m92J82q24J101j127m65Q86k20K62j31M47K90r46K51N54
$$ y = [1248, 382, -335, -378, -1023, 359, 738, -657, -792, -789, 472, 235, -187, -310, 125, 353, 528, -1228, 607, -328, 646, 391, 174, 1185, 65, -125, 1065, 899, 1042, 811, -221, -45, -685, -498, -590, 560, -265, 453, 440, -203, -280, 127, 580, -99, -599, 58, -296, 528, -287, -229, 110, 436, 391, -460, 541, 819, -116, 593, 651, 299, 1380, 400, 425, 388, 952, 269, 689, 534, -256, 334, -74, 205, -277, -1236, 545, 264, -540, -579, 797, -594, -359, 423, 298, -403, 491, -50, 365, -140, -210, 442, 388, -393, 991, -106, -291, 156, -626, 62, 88, -553, 521, 17, 256, -231, 62, -393, 219, -56, -389, 183, 228, 174, -1106, 124, 139, -269, -60, -1326, -193, 460, -248, 380, -230, 705, -183, 608, 371, 823, 8, -56, -199, 81, -455, 418, -658, -781, 331, -737, -707, -111, -678, -647, 754, 262, 444, -380, 721, -406, -871, 15, -205, 57, -74, 373, 663, -283, -32, 522]
4307E22j268M2J241K61j436J194p62n34P68L44q30l73N86pk63q06J026N15p84
4326e64K23L94M69l43q43J065n41J097j778J809q73q27J224m81N31p26M48q00
4344e16O38K91P9O04j334L61P0r85N58N46q47P32k78M34m18o54j64J148O66j489
4364e58P33N89m29N28n81k96O58K63j109m5K43m02N77m25n02R33O76m53l42k49
4384a91m67j19O80l37l03K75O41r28M57R61j52q87M49j1J54Q6Q80j282R4p71J935
4405A164q21o87P57o17Q49k12l81J30n8m80j97O72o10O25K43l99m3p75M14R00
4425D74r31M21J65k66o9r20K405j659l1M30k38l0J272j406l3L19L50o99Q99m24
4445B9N15j022R27j743N02K97j78Q27m26N93l88J9j88n60P31O92n99J73k71K48
$$ y = [522, -746, -704, 537, 798, -638, 556, -206, -740, 28, 372, -458, -831, -245, -252, -515, -1321, -295, 220, -564, -341, 53, 522, 179, -664, 401, -140, 957, -821, 988, 115, -712, 512, 31, 562, -164, 284, -516, 122, 413, 492, 1096, -238, 123, 193, -792, -234, 312, -535, 197, -81, 353, -65, -719, -883, 265, 931, -558, 175, 764, 335, 863, 282, -14, 644, 907, -202, -247, -4, -406, 171, -254, -756, 177, 853, 400, 58, -191, -658, -777, -97, -434, -737, -462, 179, -749, -292, 669, 517, -370, 79, 68, 222, 308, 1188, -94, 0, -771, 1164, 343, -344, 413, -204, 645, 433, 52, 182, 124, -356, -553, 119, -491, 134, 377, -22, -65, -840, -426, 474, -457, -36, 129, -137, -206, -1126, 1279, -380, -411, 19, -219, -249, 1023, -383, -416, -97, 253, -446, 453, 29, 544, -478, 449, -1294, -792, -495, -673, 154, -272, 321, -67, -48, -236, -796, -65, 627, 28, 201, -70, 178]
4465A78j213J186N17l06q2l98P29k50J8j018J420j045L43q59J496j052J118l77
4483D05j27m80J99l30n2R31n26P1m83L2L11LP0K84L54nq85Q42L25r35K16m91L31
4506F0O15N7m14k48K3M74j023J70N01k79l4k19J31L11j93n34Q94o43O77k30L76
4527D72n61j152J938J77n63k55L80j43Q20j811J291q18L11o4j283O50Q85j081
4545h07M65K24k24L76p56Q58R9q97Q44k45J19l04M68o3p80P75k67P15j229J409
4565G80q9j383J36J535k447R40Q89J96j334o5J105n70l17O76k76k55l09R21j610
4584a477J944j775J601k74m7J23k57m02J13P44k34L04k18K62N12p6p5n57L37p39
4604a91l13J603m43m92q46J0l98O17P56j127P24P0O96J85L07p18o69l5M20L55
$$ y = [178, -1035, 151, 668, 362, 280, -118, 611, 361, 379, -639, 781, -264, 79, -780, 716, -336, 782, 405, 278, -202, -3, -333, -385, 546, 20, 91, -392, -360, -49, -46, 24, 308, 662, 657, -228, 614, 939, 4, 220, -271, 60, 675, 732, 318, 70, 93, 567, -456, -286, 215, -64, -98, -317, -186, 125, -68, -602, 292, -351, 326, 96, 472, -89, -1241, 697, 874, 311, 56, 436, 293, 1113, -698, 593, -225, 86, 22, -1261, -611, 274, -807, -342, -118, -342, 34, -722, 136, 235, -662, 182, -63, 56, -248, 220, 157, -623, 152, -115, 600, -629, 780, 691, -692, -556, 979, -1468, -528, 361, 557, -777, -842, 263, -307, -624, 52, -224, -479, -788, 133, -1477, 467, -1308, 293, 19, -28, 95, -162, -564, -451, 293, 59, 363, 145, 407, 919, 843, 768, 211, 548, -191, -504, 1099, 656, 164, -682, -672, -1070, -453, 303, -824, -100, -30, 666, 851, 1158, 440, -229, -264, 156, 511]
4624E11o76Q52K4J77l95l52O4k02J69N61q96n78M86O03n53p2K91l50j50K83m44
4645f47j40K20N91n47l88J023N1k99O36L86j061J005p77j03N76l59R3rm63J91
4665b1L80l14J22J35p54M38J1p85M00M63o89k50N32O32N50r25l47n4o77J960r93
4686a86O34p34R34j27j60K75p96o4k32J039n19O24m06K24p60K41J21O25p80j409
4706a456J374k19O62n55P07q02m56O77o8j48n29j52J174M33n62J60K62K27r90
4725b61j37Q10N08r30M43o77R9J139n28j106M90O68n72m87J324j354L19R8R9j029
4745a084M53N67N84j224mJ384m45n50J145k44n39R75j077K07Q0j75k70O90k66
4764B07o41O07P16r21O97p10o55K5n18L71J69J163j093M41j75m79j82R87L69j482
$$ y = [511, -165, 687, 711, 888, 493, 141, 205, 3, 172, 733, -163, -741, -255, 348, -205, -277, 14, -336, -486, -203, -647, -787, -567, 24, -523, -911, 112, 163, -136, 500, 886, -175, 830, 53, -50, 526, 167, 260, 251, -212, -21, 359, 45, 167, 302, -452, -14, -3, -788, -388, 75, -614, -864, -332, 300, 850, -75, -422, -476, -1153, 807, -186, 448, -286, 648, 521, 361, 636, -160, -224, -456, 583, 64, 688, 282, 506, -254, -13, 108, 733, -47, -1456, -82, -301, 361, -194, 513, -289, -745, -68, -136, -284, -813, -965, 209, 642, 80, 240, 502, 729, -261, -398, 412, 920, -10, 433, -244, -145, 994, 466, -640, -150, 518, -54, -541, 783, -571, -252, -154, -55, -1084, -631, -64, 520, -704, -708, 676, 231, -319, 826, 582, 43, 1018, -59, 148, 228, 53, -217, 473, 207, -434, 173, 889, -32, 665, -45, -700, -675, -1193, -822, -653, 510, -583, -142, -317, -796, -978, 9, 378, -1104]
4784a104J542N63r97J15L39j25j038O95o7j96O08l5K0n97N49o47O05o13m73J417
4804E61j576J288j118L15K04J664j553l11P19o82KM20j60J09L59M14q36M60J2
4823B91K00Q3j069M78J16K14n89R1N62o61L94l15m41p96J324j88k34n38O67J427
4843A016j307P23m75J31R2r89J311j167J495j311J480l40l81K25j168J818j42
4860A011l81Kp50l67m36Q85o06R69J1Lj64o48j93Q3M12J013l72j305J416J55q92
4881a54l74J152rr5j182j26J690j227m65Q35l2J74K07o84L50L20j248J80J023
4900C35q74j14L93O5J19M15q00N29K11k8M6n25Q9j8O8j02l81J180o42P11l46K96
4922F27j101J564n43j465J362n3j020K49j55P73k73M4K47j269N12ON59m47m70
$$ y = [-1104, 438, 1001, 4, 119, 458, 333, -705, -10, -77, -273, 335, 300, 320, -277, 272, -375, 230, -383, -856, 561, -1015, 273, -845, -530, -326, 1338, -215, -526, 193, -489, -487, -67, -227, -118, 241, 655, -181, 279, 291, 491, 574, -495, -17, 99, 313, -276, -185, 377, -284, 110, -205, -646, -1442, -118, -306, -540, -1078, -411, 1016, -291, 432, -43, 88, 180, -809, 502, -665, 830, -481, 999, 659, 278, 503, -665, 1153, 1011, 630, 632, -118, -485, -921, -36, -642, 327, 338, 341, 177, -471, -664, -581, -169, 844, 472, -833, 583, 738, -154, -528, 624, 615, 520, -662, -788, 902, -325, -790, 45, 13, 187, 394, -290, 60, 380, -868, -688, 335, -539, -653, -260, -195, -76, 339, -461, 68, 279, 251, 297, -228, -139, -157, -89, -191, -572, 608, -34, 677, 331, 627, -474, 1090, 547, -918, 444, 391, -629, -380, -535, 238, -35, 9, 256, -1013, -501, -495, 64, -383, -853]
4941h53K06N49nk97R43m16r11J537j030M99j98J93j16L17M65J22m59q94N83N24
4961G59r43J11m53L53m14k97J137j578J715j081J063j616J292p56k10J168p15
4978d65J030P1q58O20M05k81j243J538j037P60J02j093J239n60O84k52k25o52
4996b17J21o26J007l99K93j051Q82r48J23R17J17j90o5P86p72n02R12N16l02l60
5016B42m69J13M26N85j579J5M19l09K66M73N11j357Q1P02m28m18R46m48L95N6
5036B22k69k23P76q32L8O45m16J43j88O34q02J29J074n26J33q2K57J1n04M08r43
5057c15M64J83p88P91j636J010m51n1J29o8P16n07M45O86M4q56l51j51M75j9o21
5078h71J274J73l77K35n93O58n20N32K54p84N21j269J847j093q44m34Q07J200
$$ y = [-853, -647, -98, -103, -400, 543, 127, -784, 753, -277, 222, 24, 217, 101, 418, 883, 1005, 546, -348, 235, 759, -184, -73, -526, -173, -587, -884, 253, -1325, 390, -691, 372, -1244, 48, -708, -918, 250, -465, 565, 636, -222, 398, 803, 522, -721, 817, -220, 540, 642, -451, 788, 228, 912, 660, 435, -217, -96, -722, 285, -114, 179, -872, 10, -938, -815, 102, 219, 29, -36, 750, -22, -524, 388, 904, 602, 242, -227, -114, 312, 897, -682, -667, -248, -557, -291, 182, 693, -664, -583, 119, -309, -727, 219, -229, 166, 222, -47, -270, 506, -326, -288, 357, -59, 84, -104, 530, -272, -143, 931, 405, 538, 456, 713, 724, 220, 628, -315, 149, 332, -456, 335, -1301, -291, -742, -793, -664, -732, -16, -523, -78, 608, 652, -204, -555, -706, -231, -250, -871, 403, 576, 199, 434, -159, 499, -21, 511, 765, -19, 502, -767, 1080, -13, -857, -1291, -484, 716]
5096G16p16K6K12j540N87l88J332P9l31n38M45m04M28M38l01j57J480j357Q93
5115I04j344J693n77n71l74Q1J229n92l85j83n42M17L77n22M1k82M6N36Q43j172
5135c77R18j033K42K91P05o56M24j287N13J496q42p09J118n40j293J187L47q27
5153c23P50o44q66J52R98l43n54N33n09R71j335J568l93n75L45R48l52J17k57
5172B31K62n34P76l75k46K30M18m23l92l83O91J63k52K26p26J61m04N28j17k8
5192a94o21L77M24o56O28M22n61K2P68r12j64R86j94m0L15k97j049N11k10J112
5212F67K02j240N36n73M80n94Q23Q2n70J06O43o51l53J9J52N59p93m03P32P9m10
5233e07j33P97q73J96R79l37K58o66L78Q00j98j132k40M52J461o22n46L72q74
$$ y = [716, 0, 26, 238, -1302, -715, -1103, 229, 308, -23, -561, -116, -520, -92, 346, 45, -112, 1368, 11, 904, -440, 1253, 676, 105, -269, -188, 1041, 449, 64, -119, -661, -244, 133, -389, -348, -630, -584, -48, 795, -377, 541, -492, -250, 41, 746, 90, 514, -773, -260, 1236, 394, -315, 803, 263, -1030, 157, 504, -323, 427, -217, -1083, -931, 67, -276, -830, -297, -806, 165, -1170, 398, 5, -570, -225, 723, 371, 488, 231, 493, -41, 735, 360, 114, 344, 762, 339, -53, -436, 255, 418, 166, 392, -334, -173, -577, -49, -166, -194, -815, -438, -14, -670, -42, 380, -181, -159, 609, -303, -467, 519, 325, 285, 600, 303, -746, -235, -445, 667, 869, -371, 165, -408, 72, -522, 301, 383, -187, -81, 562, -89, -442, -423, -271, 288, -505, -908, -176, -97, -507, -640, 157, -716, -520, 459, 122, 380, -286, 92, 892, 694, -438, -678, -226, 1235, 613, 67, 439, -435]
5252d35R51l80m78k86N97o7J54L09k98n11M9j84l75N66M59K50r42J122j106K42
5272c63L00p73J289j64J97j43m30k29J28j17l47M67L06L95l45j04l44J067n57
5291B33p45L64k46Q54o66k13l03R9L92k57O3O22M71l42j03n01J36M69o73J056
5311G10n93r0j0r00O91o1Q59j312m82J379K86j78m40M96p11M48K20l34L9R9o5
5332E1j174Q29j52N86K92n04j74O07K48n80k90Q24r78P04J67L27K62r71L35r56
5352e47j86L67L80J03l45M65j275J78r8Q51L97r01N45K73q68P28O71q1j98q97
5372d38J161L86j741o8J839p43L79p41M83n74p47N82L19l01O77j695J661l89q08
5391g58O07j49O41j001O87k1R2j74k13N23R13K94m60j179J590j366J34L57n75
$$ y = [-435, 516, 136, -342, -628, -31, -98, 56, 365, 67, -444, -395, -579, -954, -388, 71, 321, -621, 501, -605, -363, -63, -836, 453, 289, 486, 343, -87, -316, -188, -305, -652, -185, 121, 516, 171, 67, -277, 790, 233, -512, -148, -394, 460, -206, -419, -722, -623, -231, -488, -425, 197, 668, 326, 223, -278, -142, 327, -346, 710, 117, 27, 17, -883, -192, -253, 606, -706, -1188, 191, 477, 299, -141, 355, -356, 92, 312, -22, 17, 116, 51, -1123, -294, -446, 140, 432, -72, -246, 361, 609, 29, -261, 563, -415, 289, 456, 783, 1045, 74, 409, -547, -733, -366, 14, 117, -228, 237, -1038, -860, -958, -107, 290, -611, -66, 207, -661, 67, 738, 657, 459, -438, 723, 1109, -632, -700, 1139, 396, 775, 34, 517, -57, -804, -222, 97, -204, 473, -1222, 439, 50, -758, -151, -300, 341, -660, 27, 6, 98, -76, -289, 234, 1147, 1441, 981, -198, 1392, 26, 160, 517, -58]
5410e8K38o24K63R38N35j551q79Q77O57m11Q5o88K25O1J132J44j562k44M86jK04
5431a73N64J10n0K86k83l05O1L75o98P59l32Q1o3O76k051J308q90N80J18m28k85
5452f40M0r8k49p5Q00k65J429p32n50Q06q58O00n62R42m94N53q83L45M81n89K2
5473B3n07j55P48Q56q48m64Q19j364J164K54k08j283J366l75k095K126q49O78
5491a14J3j43Q43m01N40p99J053k25n35M15Pn98k6k56K01M14L93j70n63N06m66
5512H9k04K04p5l16K65l56J71J22J19n83K17M90j003J108K28o93Q46m14Q6j30
5532A71n44J452n21o43J012m24L92k81j04m88J00l57M90M1l51q31R28j06k33N76
5552B79m26o71Q44J86l20L22j74J68L34n19N20L55k15k31k27n01N74P06l72q37
$$ y = [-58, 180, -444, -181, 757, 1292, -259, -1138, -261, 396, -15, 70, -618, -393, -332, 800, 944, -618, -862, -376, -377, -173, 391, 501, 451, 737, 454, 149, 210, 585, -113, 646, 314, 395, 332, 1008, -1043, 265, -625, -45, 73, -355, -640, -600, -698, -947, -1022, -222, -487, 942, 210, -340, 466, -392, 208, -354, 588, 94, 647, -236, 109, 590, 1, 23, -484, -639, 109, 965, 117, -347, 472, -892, 272, 526, 318, -965, 401, 26, -2069, 57, -792, -114, -101, -244, 599, 198, 738, -61, 992, 767, 232, 647, 654, 56, 30, -226, -25, 389, 782, 612, 49, 555, 89, -115, 89, 14, -302, -37, -393, -222, -100, 19, -564, -347, 143, -860, 248, 476, -217, 629, 215, 301, 171, -373, 1079, 558, -85, 927, 503, 895, 614, 510, 22, 122, -235, 255, 296, -55, -886, 42, -64, -297, 279, -147, -818, 26, 212, -108, 214, 40, 208, 542, 23, 543, 898, 683, 452, 225, -276, 298, 1004, 632, -205]
5572b05K59N6j49K73l85J84p29L12n17J154p11L47l64N47K10k11Q6N3j52l01K56
5593A3J044j568Q80q36M88j21K93P19j50o37J065n99p18J153p02m75R30q06r40
5612i67J497j033L6O41J20l66n76l46N87K75n4l3L6K1K37M3J081m36j038l72N97
5633e0O72K92k19o34l63K20M33k27k35j56l68J50J278n93n26l18O62j76Q73j314
5653e99L33m41M20P83j69J206j188m28L08r23R19J012k280J577p38K21O43m76
5671A80m57M54k17O30o85r16J567l50k72r98J780q05l17m02O23N91j426M12P99
5690A91l7L81j207q1j57J122J08L57j078P09K06pO42j654Q21r92R93o49L54l18
5710b96L09p4k09p91K60O13J51n45J50K19J03p21J166K2L0q9j165O75m76Q52j79
$$ y = [-205, 54, 110, -39, 234, -151, 33, -696, -384, -901, 253, -458, -111, -475, 72, 282, 71, 157, 210, 58, -243, 13, 1057, -511, 369, -467, 21, -100, 193, 912, 762, 125, 1190, 591, -127, 1026, 324, -151, 779, -27, -967, 530, -503, -467, 174, 294, -72, -648, -994, -407, -132, -186, -219, -183, -162, 75, 118, 1199, 763, -275, -647, -50, 622, 914, 695, 61, -302, -82, 351, 124, -111, -267, -635, -485, 793, 200, -326, -644, 18, -158, 715, -599, -266, -707, -287, 496, 327, 1533, 345, -83, 225, -698, 221, 1233, -1047, 530, -208, 13, 656, 180, -277, 177, -40, 590, -95, -1011, 556, 206, -66, -1064, 716, -89, -406, -808, -185, 406, -1020, -608, 191, 154, 535, -672, -753, -910, 212, 320, 677, -401, 308, 514, 507, 1149, -505, 316, -676, 317, -332, 22, -296, 13, -61, -270, -1061, -801, -188, -37, -582, -432, -213, -110, -831, 335, 357, 387, 298, -867, -192, -668, 184, 5]
5731Ej45m11J557p91J98m13m74N57j95o73Q41m12N51o60K99p15O68r59J825j115
5751d62J254k34p64J130m00L35q87J2m92O79J073j278J69o95J28J60P64J29m64
5770A57n05K98p57N32K55j09M53n50k45L73M45q56N10q1o12J177r63L04N02p01
5790c73O95q70Q04L52o93N70P47p66l89K7l93L41o11N93K74j193J099J028q48
5809C94j360Q49O36j318K49N93j282J935j142j34o7J184j32m85L15o73M07j42
5827a73KK82L44m71N64J10m79M0K5k69N0J14K54l54r75N16p73P50J00M6K95o38
5849f40p3P54k63n5L07m35M87J46m79O69L84k30m64p41J035n3j386J229p12O51
5869A31l83o88P08J32q55j03Q40O51q96l12J897j205P80r16P38J14l86M88n12
$$ y = [5, -140, -551, 1006, 215, 413, 0, -474, 83, -112, -785, 56, -356, 195, -465, -166, -881, -213, -1172, 653, -462, 792, 558, -206, 924, 524, 859, -28, -16, -508, 171, 1244, -34, 135, -560, -432, -272, 492, 621, 157, -348, -50, -807, -275, -20, -129, 324, -226, -471, -98, 347, -509, 1, -80, -692, 485, -478, -174, 328, -373, 322, -548, 256, 608, -85, 485, 1232, 466, 77, 104, -289, 52, -559, 34, 308, -885, 214, 1242, 394, -966, -117, 519, -799, -550, 43, -1239, 696, -446, -580, -647, 537, 405, -80, 235, -438, -31, -173, -171, 111, 455, -16, 548, 658, 179, 219, 244, -25, 25, 139, 393, 39, -936, -420, -1193, -443, -343, -297, -2, -640, -713, 41, -222, -277, 30, -405, 82, 228, -251, 418, 802, 572, 108, -633, 402, 349, -1037, 192, -520, 131, -252, -940, -232, -100, -955, -1058, -218, 433, -463, -775, 1122, -83, 697, -219, 519, 633, 247, 735, 223]
5888B23l80Q25o01P90j91l13k73R5P00j112N20j05n76r07J517O9j575Q68K66k39
5908c99m9RL82N79p41J10j47r5J66M6R66p21mJ022n27r68M40L57l08k40K10N72
5930F60r53Q61J8j309N84P5j40P7J10p62K92P7L21p29R78k39p49J093k02O45k04
5951E04m93J38J267q84o13J061j022n5O43k6K13n64Q05j122J95Q8q6j9P5M39p46
5972b02J81m00M17m86N30J53M63m80q00Q48l58j12R19q83R14p21M19j42j135L8
5992h37J241l94r04J367m46N26n23m90n4Q08l49l28Q75k78p37Q60l67J38p27M58
6012a61j7N47n03M05l13N23K90K00o82K53k94N7r32M13k84R5J143m75m96M51j62
6033E8j259M6L76N39k57L22O42O4j5r53J83K31M50m98J04p6J018j055R12k83l62
$$ y = [223, -157, 668, 67, 857, 666, 353, 80, 175, 875, -237, 283, 178, -398, -1305, 212, 281, -1294, -426, -160, -399, -448, -439, -57, 522, -219, -109, -256, -351, -185, -139, 827, 106, 102, 1124, 597, -371, 69, 426, 118, -122, 88, 660, -293, 568, 586, -723, -139, -64, -204, -127, -17, -779, -487, -410, -89, -818, 160, -79, -828, 265, 63, 708, 504, 11, 149, 1416, 532, -81, 980, -42, -97, 546, 520, 733, 169, 974, -148, 47, 135, 49, 30, 105, 544, -202, -21, -421, -4, -490, 40, 193, 656, 176, -624, 224, -134, -246, 673, -210, 704, -17, 402, 260, -875, -837, 404, 10, -894, 473, 27, 553, 30, -460, -514, 294, -55, -383, 492, 214, -523, 337, -30, 108, -619, -161, -178, 369, -134, 271, -42, 481, 771, 971, 289, 542, 248, 305, -627, -214, -498, -403, 740, 265, -231, 220, 58, -1201, -1155, -779, -240, -497, -175, 467, 531, 516, -437, -254, -23, 427, -71, 33, -43, 975, -80, 832, 549, 187]
6054A87M76r34M27l51j45r7L03O35j082J596n54j160k67j00J478j76n57L95M60
6073E34k61l37m44Q48K40k72L48p72O16L2j158J349j64j263M94k53J130p96k43
6092c72l1m50Q46L97j351l2L70N30j23N67n59m29P4N46J82j91l98pJ72O76k30
6113A87m01K49m42J227m30l12J60p2q37P9N86L11k35j92m63R43j124K54M08j660
6133a764R23R60K07j22L22k59r16Q51k2m78J380j023j07m30N44R47m4j106M84
6152C47l35M99j40n05M05k68l95N01K24l75l14k05P00j389O32P37Q7O76j174R67
6172F75j765J795r67m96J790p52m70J085j025J26K2L28m52R22k07n03l26K20m33
6191d33L70q32L52n5L07l24R41p30o42O04L61p30J257K98q71R20j389l35P40R38
$$ y = [187, 663, -271, 156, -195, -340, -437, -134, 501, -581, 1015, 461, -699, -966, -1066, 412, 236, -321, 74, 534, 273, -64, -508, 340, 580, 308, 656, -116, 500, 532, -626, 723, 559, -704, -210, -463, 667, -129, -372, -403, -853, -7, 390, -961, -993, -623, -93, -216, 351, -208, -637, -563, -17, 165, -26, -424, -431, -259, 417, 187, -214, 35, -407, 820, 390, 78, 238, 166, -671, -592, -6, 305, 70, -122, -585, 358, -766, -512, -104, -1764, -841, 119, 326, 204, 526, 267, -649, 202, 180, -298, 1082, 59, -48, -478, 66, 1013, 969, -137, 347, 12, 511, 371, -134, 271, 3, -392, 109, 333, -42, -356, -561, 139, -1250, -618, 119, 206, 882, -292, 675, -1090, 705, -262, -758, 1032, 280, -190, 895, -130, -4, 18, 346, -106, 816, 609, 106, -220, 0, -433, -63, -895, -543, -598, -291, -615, 326, -404, -1046, -442, -81, -811, 446, 744, -127, 793, -596, -931, -191, 747]
6211G47p35N60n80m61L07m28R03l63K47K81j51j95J36r40P44m37J067j482j57
6230i37J149j60J27j199R56o92l64J299Q20j906J338J0J34m41K58k01L82K9k74
6249C28J68p58J364n58j650O41R27q24rL45k14Q11j161P78l98j63K73l44KJ201
6269G59p56O6n6R8n94O55K66m6J49L8o5M55L82j099n06J70J53k61N36l59j67k78
6291d60M25j72M29K4J7l52M63j165J852j293R1L19j95K49m10J156j171K72R45
6310A024p61K98M99j209j31N06k09o74R05m60M50p69n50Q80O2J93j55J77k03J26
6330aj02O13j096J14M27O9l78M13m9M33m69J462j542n02N30K63k5R8k55o6P36
6351F73m09J71M3J44p68m38J190j232R95k44o62m01R30J40j66n6M40j98k44P3
$$ y = [747, 12, 572, -8, -469, -162, -590, 313, -50, 197, 478, 327, 132, 268, -672, 72, -365, 702, -780, -937, 212, 52, 179, -1020, -64, -756, -1120, 179, 999, -907, 431, 441, 575, 134, 392, 191, 573, 602, 328, 496, -262, 1102, 544, -1106, -465, 462, -362, -371, -26, -240, 571, -590, 188, -210, -373, -100, -444, -442, 759, 3, 69, 13, 111, -483, 172, 438, 392, 541, 579, 514, 969, 1351, 252, -254, -84, 69, -192, 344, -15, -182, -460, -35, -207, 222, 246, 263, -89, 374, -791, 1061, -232, -141, 178, -17, 232, -178, 978, -193, 79, 1024, 263, 561, 1060, -149, -280, 226, 17, -657, 248, -212, 238, -531, -1081, -201, -139, 54, -101, 76, -127, -1, -103, 510, -586, -472, -45, 24, -354, 59, 10, 443, -26, 1436, -106, -608, -78, 185, 160, 258, 3, -63, 673, 264, 435, 478, 622, -146, -584, 606, -626, 369, 125, -537, -938, -8, 132, -34, -90, 350, 152, -92, -19]
6371a9L47M20l68n73J105j74j71p00k20K81j94J162j012J00Kp34J89P22m79j42
6391d58m01L85L00L95q26K26P86L68m04n66O69j13l86J387r97M54r32Q3R83m92
6411D61np27L08l58M98m0m23N79m81q5L00l62q8P69L6j092Q71n31J78n21Q36j47
6433b4K24m68Q01j4q56K41K84J21p30J135l50J44j08n58J85j25j28j202P03L89
6453c36J64M12o21l72M48J76n04J787p05j175Q45n55N44K38m75n0M8k30j14j71
6473f46J123L94o12q12J458j589O85K33j48K12n02Q50n07J59l37m50N74n24Q13
6492C74j096Q44k15n86R73P0j143J037M48j097P11l06J98n21N87p35N85M85p49
6511a36N17k82M62j024M29L79l09m37l15P4R25K3J61j9r33L8N91k0j47P85q72
$$ y = [-19, 328, 748, 380, -193, 912, 738, 567, -133, -353, -72, -266, 896, -116, -16, -14, -748, -559, 163, -316, -458, -859, -474, -174, 221, -605, -379, 407, 775, 371, -195, 474, 361, -25, 1362, 365, 819, -113, -30, 953, 461, 456, -271, 37, -321, 177, 137, -286, 293, -188, -273, 27, -335, -423, 346, 382, -710, 161, -370, -192, -713, 123, -24, 200, -268, 533, 519, -337, -96, 188, 309, -421, 714, 364, 508, 400, -158, 27, -98, -226, -1428, -725, -336, -172, 240, -381, -753, -305, -129, -633, 1154, 449, -726, 119, -436, 108, 346, -129, -179, -131, -361, -475, -646, 477, 871, 259, -553, 905, -684, 1, 234, 86, 298, -204, 646, 139, 298, -39, -489, 85, -439, 374, -722, 122, -93, -679, 294, 364, -779, 258, 706, -391, 320, 14, 212, -309, 278, -457, 128, 613, -136, 381, 99, 561, -463, -34, 345, 36, -401, -716, -642, 283, 306, 467, 448, -485, -447, 144, 124, -23, 762, -110]
6532a10P93j13k95o2p1K15N62j022p1m7M62o5O26j369N20L0R59j30j006K55Q78
6553I39j361P65k5l14j007J500l47o84L57n28L43J70L18J1Q01k63K92j201Q26
6572E92p13M48j7R74L2j572j0p71J901q30j031k6J446j193p8J85J36k02J710j018
6592c7Q71k92R07p41p93l25q2Q94M8n0k15r4k30O34N27j061n88J185p37m16k14
6613h09L65M08J75J24p90P1L99l77O22J35j011L08O61L39p54J52j59k62J73k09
6633d39O46K32l59p56P12j21j60K41J97n24N10r49J65J261j327Q21K9lm2P27j39
6654G22n15J54n67J088p28M1M0m7l58R04n12N77k01o49M32o1L98j10J27j195N25
6675F5J16K48j45Q84j344K94m71J24N70o66L42m74j73O74J100r95o12R63J1n67
$$ y = [-110, 683, 570, 275, 213, 142, 357, 919, -103, -174, -221, 241, 176, 802, -567, -47, -17, 942, 812, -194, 61, 939, -422, 343, 318, 4, -1003, 497, 150, -534, -177, -705, -362, -192, 126, 137, 938, 675, 967, -234, 592, -121, 327, 310, 1284, 1316, -256, -266, -1037, 864, 34, -997, -1023, 423, -770, -848, -663, -527, -729, 981, -37, 834, 542, 1449, 708, -85, -410, -492, 402, 450, 400, 185, 91, -139, 495, 1022, -39, -627, 558, -179, -595, -809, -444, -36, 139, 263, -527, -456, -57, -434, 188, 323, -688, -380, 281, 620, -134, 18, -141, -403, -230, -439, 207, 439, 80, -676, 36, -85, -245, -4, 193, -331, 179, -770, -605, 656, -671, 150, 179, 176, 134, 861, 722, 207, 361, -206, 882, 154, 195, 235, 188, -170, 734, 222, 799, 598, -51, 381, 320, 718, 608, 735, -460, 65, 181, 429, 284, 1168, -176, 118, -353, -229, 341, -325, 17, -457, -630, 44, 1144, 149, -463, 500, 511, -56]
6695e6q2P78o53J16L16M01o71k14N29r52l1J180j030O31P60o86o3p87j17n05J093
6716d3k8j35K4M20k59O0J070k039M61Q56R1p86r8N64m24Q66q32O84r36P31n93
6737c46n09O68K19L0l90q5R77j203L63P30m89K16k23l00M66l04m34J442p92K13
6757B49L45o03K86k94J283o19p64Q2M89l0m33k97o61J242l88P35m67p40k66P60
6777i1M55n23q02J053n26J35j4k60l09r2N06J66L17p43J354n02m96N97j25Q93
6797I93j015N64l74o85O79o24K99L58k83M47l23M98o62K54O44r90K28n48p4j17
6817g31P35r81J193j15n47R90r26M40p33L47P83q7o18N4N05m96R16q38P5P87m07
6838C46po5j90N7o45R1p00Q04nN46o80O98n10n59K056m07K70q21q52N34O96o89
$$ y = [-56, -138, 640, -13, 103, 419, 820, 149, -65, 464, -488, -519, 661, -369, 262, 1022, 336, 273, -514, -631, -1136, -43, -71, -206, -182, 238, -21, 39, 1109, -930, -469, 387, 478, -308, -406, 158, -266, 600, -232, 452, -484, 247, -346, -855, -187, 32, 62, -328, -413, 564, -639, -276, 454, -35, 181, -42, -342, 124, -180, -614, 828, 36, 249, 594, -9, 277, -17, 1266, 647, -117, -35, 454, 424, -9, -306, -967, 275, -113, 622, 155, -585, -851, -91, 364, -159, -961, 92, -434, -299, -313, -573, -882, -974, -468, -302, 15, -728, 626, 124, -372, 225, 100, 993, -22, 542, 168, -517, 162, -462, -163, 195, -88, 359, 36, 534, -128, 126, 770, -220, 8, -540, -614, -731, 4, -977, 216, 101, -446, 544, -382, 58, -675, -328, 455, 368, -250, -196, 309, -187, 729, -109, -34, 753, 346, 339, 274, 84, 141, -504, -413, -1113, -309, -314, 232, -448, 250, -260, -819, 1237, 830, 1100, 279, -573, -39, 657, -32]
6860c2k68J247q09r69J033K40j00p71j28l53J208N57j142N45p35M09j54P0k86
6879d38Q81m35n78J158q22O97m19K35p2J24J72n0o63O34P12r20M72n18l41J510
6899A339j657K05K09L65q3n65l00L33L10N7M23j040L90M08n81k45J207r02j02
6918b29K77L25m23m22j04J080K97L27j395J34J66j99r4O42l79k58K31p4j051J138
6938a1q75K63K57p85J169k71l39J437j321L93q14J035K57K6m22M8J60K28m78L44
6958C01m98P06j96M54r68Q89j318m9N8K6Q74n0K53m34o51k53K25R8P13l4j31P49
6980G64o13P45q57j44n96R31L64p3J43r12N71l99l03J159m52o08O79qm01J21p79
7001f68P82j18p16l0O97J81p45m0M2J004l1m58m60k06J850j30j010K2Q02p91M00
$$ y = [-32, -300, 947, 138, -831, 202, 442, 342, -429, -557, -910, 298, 855, -287, 258, -477, -68, -222, -152, -438, 443, 8, -570, 588, -234, 463, 44, 279, 207, 331, 503, 453, -210, 424, 1136, 216, 688, 170, -171, 1339, -318, -113, 96, 461, 378, -187, -487, -154, 156, 213, 636, -404, -14, 394, -187, -432, 775, -127, -229, 48, 373, -50, -472, -576, 504, 801, 1128, -267, -133, 33, -166, -260, 382, 3, -255, -24, -98, -1149, -11, -886, -623, -366, -1151, 18, -253, -592, 845, -476, -83, -897, 138, 395, 421, -1, 47, 207, 435, -43, 301, -197, 509, 313, 767, -201, 688, -630, -679, -621, -595, 279, 229, 482, 48, -603, -856, -631, -533, 180, 146, 15, 764, 151, 896, 39, -105, -701, 230, 594, 521, 664, -248, 323, -76, -379, 780, 328, -280, 399, 391, -10, 111, -668, 114, -4, -720, -750, -53, 128, -617, -657, -615, 389, 358, -100, -560, -766, 1084, 954, -56, -34, 768, -23, 377]
7022C77K76p54j66R43m22p7m73O05q92K96K3l84M56J32m38r67J522k06R21j444
7042f72j81j65J689j40j430J520o92n32L19l43J102p49Q95j002j84M93o70P16
7060b6K9k02L21k84r91Q7P41m8n27Q76k92O65k75p00K42J368r57Q6N5M0L55K44
7082H07n73q58K05J192N4j668p00J953k76k80K14j566N61J623j152O18M31q75
7100b90R57j073M91j28p7J55O59j290J112o08l33Q52K26o24P97m45l13K24k6o85
7120d19J325P3q52j01q74J304l29K98p00K15m0q99Q51n99P87K50j062J117K40
7139E85q34j96P65j59L29q88P24m6l0K13q06J380j020m07J99k79M90L80n50P51
7159F01k49M4j49p95L30K80q69O76K3m27K24L97l21j59M8O69r7o86N95k02R74
$$ y = [377, 653, -101, -267, 676, 254, 177, -296, 309, -583, -287, -264, -648, -192, -60, -498, -1465, 57, -149, 772, -672, -853, -1018, 671, 531, -899, 621, -71, -603, -284, -627, 475, -274, 621, -381, -565, -72, -742, -26, 3, -199, 122, -162, -1153, -1066, -325, -373, -900, -24, -316, 349, 74, -626, -384, 984, 27, 113, 168, 208, 563, 807, 234, -624, -419, 773, 827, -841, -1541, 412, 136, -144, 70, -1496, -935, 688, -464, 154, 585, -290, 667, -406, 85, -43, -120, 35, 694, -596, 516, -92, -425, 427, 653, 29, 826, 381, 68, 292, 266, -419, 906, 979, 127, 26, -848, 456, 127, 425, -275, -60, -100, -999, -148, -747, 40, 290, -772, 345, 585, -249, -445, 320, 161, 490, -398, 326, 280, 250, 463, -343, 1037, 17, -390, -191, -470, 20, 400, -150, 601, 352, 396, 247, -548, -218, 62, -807, -131, -108, -535, -311, 86, -235, -394, -346, 323, 226, -460, 135, -67, 907]
7180I07j436R26o51O57j33L0r95L53J032m97N87j89J10q38K51L26M32j066o52
7199h46R50o69O16O87q57n51m0R40j95m38M30p02J470j229M70J053r39r87R16
7218G9O84o84K12n5J129j921L19J34K79m19N28m46J51j72l21O15m71O78j057J332
7238E94K3J9o76j94L52J87l86M37n69M35K89j06P13j235l87M6m1k45K35J66NK35
7260a03l82M90J81n0N36j421Q58Q3K56l32J45K19l47k98Q16o65N12K42j361O21
7280@o91K38j23L72N7L44l04p2n33O77L94n29K45L4q18K06R26m36o46K95N89j02
7302A23J200j422N18l61j361J892l79k88p3k31Q20r81M94o9Q9K12l82j6K36n63
7322e42L39K79j305R35J09l1k03p12J264n94o3J034j04N8n93m70K196j365o96
$$ y = [907, -529, 397, -254, 403, 270, 300, -695, -342, 690, 193, 780, 591, 701, -137, 114, 440, 872, -194, -846, 104, -565, 51, 738, -119, -670, -710, 230, 35, -403, 27, -675, 795, -434, 36, 1089, 150, -837, 79, 763, 79, 291, 236, 1365, -556, -237, -103, 176, -243, 285, -161, -10, -182, -503, 112, -359, 319, -738, 594, 617, 636, -40, -234, 118, 305, -81, 356, -213, 222, 511, 405, 1118, -117, -504, -458, -499, -744, -509, -343, -338, -103, -485, 5, 186, 136, 672, -749, 109, 192, 448, 116, 261, 480, 133, -165, 651, -14, 498, 740, -621, 0, -691, -453, -576, -204, -147, 197, -107, -179, -712, -35, 359, -170, 75, 109, -709, -503, 423, -13, -659, -364, 225, 123, 1323, -99, 419, 58, -1303, 589, 210, -78, -151, -382, 438, -543, -49, -118, -29, 183, -199, -215, 21, -542, -203, 76, -1229, -294, -185, -216, -419, -1131, 133, -461, -524, 510, 406, 464, -129, -599, 1597, 232, -464]
7341d64K61M37p9P82o72o91P0O41P4m61L37J001r07k50o9p77J363q00oJ49R1M85
7363E15L20l20m85j386L7J447j625J629k9Mj50j58N32j076J900q86k45M46J97
7382F67j5O92k536M4J172k15J92n28N21K88N32j629R65o41N85l81K28R30j140
7401b69k73M85M98j65l26L79o67P03K17j527J132J2p1O1k91m6j67P59o65qL61
7422A32M79j064j42P74K43l08p91L51K72K60N57m43P1M17o83j82J11l00R09r32
7442b69M81m97j152J407Q55j327M27L44j39m49J55M59r35N02R4Q23m36N84j712
7461g85J354o68p99J019M84q82K75K98J56j85k69k90n12j33k12Q27J33J066N4
7480I31o74r72O55J36o33P7o8l57J14J80M76l64L37O07k12O9p02K53L76o70J452
$$ y = [-464, -203, 234, 155, 937, 265, -426, -356, 285, 359, -102, 235, 1236, 329, 79, 10, -767, 596, -204, -210, -61, 30, 515, 835, 515, 30, -1356, -1319, 128, -1497, 132, 103, 107, -43, -201, 331, -745, 1155, 269, 24, 470, 667, 652, 1344, -1192, -1148, 24, -191, 1, -527, -6, 282, 814, -815, 150, -491, 94, -287, -59, 871, -269, -542, -57, 441, 276, -50, 329, -338, 365, 582, -945, 187, 199, 128, 189, -102, -148, -315, 444, -221, -229, 132, 611, -453, -595, 179, 422, 114, -677, -326, -54, 206, 763, 320, 391, 808, 125, -57, 54, -246, 663, -269, 212, -285, -1437, -30, 825, -502, -75, 269, 130, -319, -164, 295, -640, -138, -44, 779, 343, 927, -785, 569, -99, -898, 121, 605, -277, -2, 296, 452, 267, -2, -292, -804, -937, -1149, -322, -189, 877, 931, 257, -715, -60, 76, -557, -480, -548, -905, -791, -611, -135, -499, -162, 445, 233, 302, -400, -147, 229, -441, 1011]
7501A011k50j169J91N01j25J00n17l57P33J40r43J051n61Q39j740J028k05l3j16
7520d22p1J8P7N83n56j75M51l27J179q48k96L82Q15o52k11q8R14q71j99N1M56
7541B10j397L99P18J4K74l05j081O88J421j676O72k86r58J588n15m49l23O43M75
7560A12j52n00O42O55N76r35l06L49l44k86m46O96l52N79o38Q55o54k52n6J98
7580b59K74P9q48P23l69K51N9k33L24L7k72Q37q30J044j108J193K42j073k03l80
7600e12j1J651p47j048P95L66k81l69j56L0M92k75O57o37n55R02q73J558j232
7619b45N12k58m34R6k47m23K048n59p93M68r1m30N96L8p4q38L52l01J262o61n85
7640e67N97j16m49N41L54P42j558j07J093R6j826M54J271j36j73n21Q14r04J362
$$ y = [1011, 761, -408, -217, 284, 159, 259, -258, -615, 118, 258, -685, 366, -195, 644, -1096, -68, -273, -306, -422, -493, -475, -398, 185, -371, -546, -95, -422, 757, -91, -387, -5, 810, 158, -53, -141, 773, -98, -297, -246, 210, -1187, -788, -70, -56, 218, -87, -1168, -480, 941, -735, -63, -349, -1307, 281, -234, -683, -1006, -363, 112, -40, -540, 102, 757, 1333, 398, 92, 441, 97, -189, -635, 61, -291, 288, -350, 505, -149, -401, -457, -259, 15, 94, -754, -31, -400, -149, -90, -323, 1, 38, -234, 603, -227, 817, -291, 902, 1144, 71, -132, -512, -523, 1128, 381, -667, 128, 494, 213, -156, -312, -282, 210, -65, 592, -45, -600, 302, -571, 987, -245, 267, 9, -425, -329, -576, -999, 1049, 490, -303, 165, 74, -356, 240, 278, 204, -634, -282, -583, 679, 18, -567, 30, -86, -535, 6, 360, 1102, -456, -563, 530, 626, -1200, -746, 525, 389, 216, -305, 509, -395, 967]
7659I67k60r20J5N71O0r23K85K62j51p13L61J78N88ql50n7P6l53n0P4R63k11q56
7682d52L58j110K23J051p0n3j31p96N27L14o28O77J34m92O20K6l08J50n59L99
7702a20q29O69R91p75M87r30k92J205n37j02J68J019l70j28j043N29k62j49J240
7721G71j748J271L55q61j1j21L36N43k57o32O72j08J98j282J785q83J75m57P77
7740E23J9j261J190k1r36N26J028r72j22O16j46j002R37J26M59o86j89K49Q5j67
7760B56l4p59M86K41n25M21K20r94Q34m02N35J31m4r41N55J02p69P30k31J22O18
7781E52n62l20L24P62j100L57k21j46N82j54N36o08Q6O93m7j088j17K83j43P13
7801C82p64K33O41j36q6n74J083j914J181k72m8P33p14m0K39p41J348r32J211
$$ y = [967, 707, -213, -198, 373, 433, -490, -205, 57, -94, -807, -446, -268, 320, 312, -38, -95, -19, -372, -422, -348, 615, 404, -452, -94, -1204, -981, 70, 0, -53, -184, -980, -453, -139, -767, -90, 44, -448, 172, 198, -110, 40, -519, -120, -949, -280, 711, -64, 423, -507, -799, 406, -131, -233, -65, 954, 584, 456, -587, -58, -320, -469, 771, -977, 294, 649, -212, -223, -344, -8, 535, 278, -354, 318, 210, 408, -874, 911, 28, 203, -254, 523, 542, -719, 471, 450, -486, 40, 1068, 96, -26, 590, 444, -558, 379, 505, 964, 278, 89, 338, 423, 256, 222, -537, -51, 190, -335, 86, 306, -688, 146, -256, 279, 410, 366, -575, -20, 82, -687, 43, -188, -66, 552, -10, -330, -6, 756, -344, 13, -208, -354, 228, 74, 610, 2, 88, 781, 734, -354, -471, -188, -331, 382, -382, -149, 492, 356, 270, -304, 779, -1135, 46, -226, -274, 459, -255, -295, -56, -797, 551, -381, 830]
7820H30K31r59k02O64k65o03R92j805R91P78o28K58L80n11j077N19Q71k39p0j0
7840A45l53P7p61Q24J49n29J183o38n24K93j045J895j125k80J102k66j88N93l29
7859B23p98K27J831j180q56k31K09j72L51K00P57q14N59L23o61M3m85M77m57j03
7879e57K18j8L7Q22n61L22n96O74o55M34Q38p45K45p42P42j90M41m06j85J8q08
7900f72O67p09Q75n15N31N54q59o5J95j81q87J278P54j751O53M31l21m41J298
7919H35n09j23k24L07m43k35K37m83L55K44M44K61j016L8L87l96J56j89Q56j70
7939C32k11r52J60r1m18Q75O65j2k57o45l46J109L64p40N83o01O4N16k90J3n92
7960d74O34m24N20o75J579j148l98J59R26q73P39m49r2o01J475j289M00K31o09
$$ y = [830, 1061, 102, -100, 564, 299, -304, 688, -1117, -126, 652, 24, 282, 662, 151, -926, -407, 464, 225, 155, 145, -208, -131, -892, -68, 81, -448, 735, 97, -427, -134, -1179, 716, -409, -689, 413, 147, -41, 552, 223, -575, -348, 1483, 303, -553, -784, -575, -747, -396, -196, 561, -253, 306, 629, -32, 11, -474, 3, -454, -557, -339, -357, -320, 502, -59, 263, -333, 341, -314, 120, 958, 213, 458, -284, 458, 268, 709, 303, 118, 136, -672, -5, -714, 161, -354, 177, 731, -128, -193, 2, -179, -1066, 212, 966, -785, -132, 299, -22, -463, 835, 326, 203, -21, 286, -157, -392, -155, -638, -283, -39, 405, 666, -350, -312, 75, -321, -165, -354, 502, 332, 121, -831, -671, -762, -1180, -305, 360, 348, 91, -554, -900, 209, 573, -167, 416, -185, -121, 395, 105, 118, -474, 160, -264, 256, -419, 1160, 12, -386, -227, 699, -174, 565, 116, 24, -577, 898, -391, 9, 240, -369]
7979c69k82P97J05o57M60k33O32k99Q60j988O91M14L93p4J05q09J12M76J33P5
7999E42l46q52J281q62J019p54k53M93J2m92L28r9k60J554j652M19J49j86L6M72
8019E49k29L98j064q30J167l13M37J28J70n78J072m34r16P56r70k07J078l52N39
8038D01m72m35j17O82n52Q73o33j48p31J315l45j437K055n50P84p96N43o76M28
8057A89O71m67K29m34q53J416r35k78R56n2m57O7J42L54j017j70K08J06j060K022
8077F37q59l16L15K06P13j159o67N31M44L39j410J956j823J587o50n86O78J54
8095I0P3J25q48O83M42q58J011j094L40n55P75n49j14O76k59O39j101M47J17L8
8115G8N75O82r86K89m05j44O97q12k04j82M84j04n09L61M01L24j175K68K51M90
$$ y = [-369, -651, 146, 251, -406, 54, -179, 453, 154, 1014, -974, -283, 131, 524, 450, 555, -254, -142, 334, 467, 542, 196, -656, 625, -237, 782, 28, -225, 268, 280, -212, 116, 17, -243, 1311, -341, 78, 227, 41, 77, 549, 320, 718, -346, -1176, -9, -322, 115, 243, 413, -165, 907, 473, -443, 313, -657, -864, 214, -138, 401, -71, -506, -623, 59, -493, 380, -253, -401, -1132, 183, -162, -1599, 456, -94, 690, -106, 437, -239, 189, 860, 393, 622, 188, -665, 751, -184, -462, 494, 442, -15, 52, 194, 548, -469, -639, -431, -325, -1385, 637, -222, -538, -223, -17, 696, -463, -1130, -599, -155, 184, -1226, 730, -1093, 494, -156, -742, -64, 90, 163, 288, -560, 123, 565, -293, 718, -376, -36, -591, 184, -365, -479, 197, -62, 577, -524, -77, 40, 78, 653, 1335, 349, 638, 233, 89, 786, -26, -230, -412, 72, -32, -541, -180, 221, 545, -630, -362, -111, 379]
8135C79l11l53K21K77o44L00K46L27J53p55K8l83M81M45j164J247j165J011K1
8154C61n52j97R32m94q75Q07l50N26j358J424L30k77Opl29P4l01Q16n50Q24j447
8175f37O75jO23j239K99N79l58k21O37m11O50q79k57P93l59j87
$$ y = [379, 68, -285, -64, 213, -431, -131, 115, 442, 595, -160, -132, -515, -34, 411, -753, 494, -671, 340, 361, -191, -388, 544, 50, -825, -18, -368, 158, -1200, 224, 554, 277, 283, 276, -53, 21, -280, 536, -14, 810, -637, 38, 37, 660, -579, -280, 299, -59, -280, 357, -54, 596, -283, -540, 253, -106, -293]
8191b93
$$ Imaginary data points
##PAGE= N=2
##DATA TABLE= (X++(I..I)), XYDATA
0@%%%%%%%%%%%%%%%%%%%%%%%%%%%j2P0j55K01k12K16k16K16k26K54l11L74m11
40b12M37m80N45o09O66p37Q14q93R84j086J203j323J453j609J786j977K190k438
58a286K721l055L468l967M591n398O500q097J0606j5173K6068q6920q5670K17355
72F1743K8236r1714L7612O9560p0066k6240M8326o39m5882n39r45j2178N6J474
86a196o093N471p615j3068K304K649q606K932J5538O149j1494O543P871j6979
100a5594k426J8463j1037j4366J5608L778j8878J6969L0352p807N463L0489j0025
113D0989j8169J8675n760k4760O624j15k5310K84O923j9840p610J4468o620j1279
127c1500J6874r71j9355O666J2453p632N602J6823L421m590R264Q605l755Q629
$$ y = [0, 0, 0, 0, 0, 0, 0, 0, 0, 0, 0, 0, 0, 0, 0, 0, 0, 0, 0, 0, 0, 0, 0, 0, 0, 0, 0, 0, -12, 58, -97, 104, -108, 108, -108, 108, -118, 136, -175, 199, -212, 225, -255, 290, -319, 347, -390, 424, -469, 515, -571, 632, -691, 762, -847, 939, -1038, 1152, -1286, 1435, -1620, 1848, -2119, 2472, -2926, 3574, -4523, 6083, -9090, 16978, -69942, -155612, 61743, 89979, -1735, 35877, 105437, 35371, 9131, 57457, 56818, 10936, 10397, 9452, -2726, -2670, -1196, -7289, -1818, -9433, -22501, -20197, -17548, -26154, -23222, -7684, -1535, -13029, -6486, 1385, -15594, -18020, 443, -10594, -24960, -9352, -5574, -24452, -7483, 22869, 15062, 20525, 51014, 40989, 22820, 41495, 35735, 10975, 17599, 17484, -7826, -7542, -619, -20459, -28069, -13601, -20221, -31500, -14626, -15597, -34952, -28286, -15833, -23465, -17863, -1040, 2381, -2209, 7055, 15660, 11905, 20534]
141B0534J0067q199k972P191o629r844Q940L538j5897m81Q442j5026j2730Q316
155d750p940j4446J0535P0j3995Q326O546j1079O880J8702p779m227J7766J483
169F092j0439J1412R773q616N688J1154l997k116N622k934p510M249J77j2512
183F043j873J702j5810o783P759l951j0421L776K276q557L71J1708j241j797J1421
198e377N10k419J3507M582n004P141P042p287R12Q701m940q696O484L16r223M070
214A0319K202r922j187J299p897n315M481n243p936N326N25q180l6R218l253l13
230a5912Q315K401j697O472N396j36P052P752k110o4P310l567m974N014k095j1618
246G539q96K941j0795n189L628o993q461K896J117o843L349L386p027L156R861
$$ y = [20534, 30601, 22402, 19430, 26621, 19992, 10148, 19088, 22626, 6729, 6248, 14690, -336, -13066, -4750, -12690, -27136, -16601, -16531, -30526, -22200, -15654, -26733, -19853, -1151, -8930, -13157, 4609, 6092, -4347, 7065, 16838, 8222, 13910, 25064, 21067, 18951, 24573, 21639, 14129, 18378, 18555, 6043, 4170, 5872, -9938, -16721, -8962, -12913, -23334, -19558, -17282, -25839, -25468, -13760, -15001, -16798, -5377, -4867, -7286, 6221, 10803, 5799, 12940, 19982, 12695, 13607, 22308, 17368, 8672, 15156, 15472, 6249, 10319, 12521, 2599, 1412, 2711, -5186, -10501, -6020, -11263, -19199, -13873, -13348, -21528, -21564, -12346, -15599, -15912, -7597, -5196, -6893, -421, 4975, 4839, 11891, 19643, 17533, 17469, 24779, 21212, 16238, 21252, 19157, 7539, 6643, 9584, -1211, -6400, -2772, -9765, -18226, -15330, -14213, -21056, -17707, -14321, -21348, -18192, -8331]
261h331k001P39J0004K720m379P765Q714l968L00P775m753k954N421k401m004
276A0647J800j711o967m61K046o507n324M079m106q375K784J369p036J003L966
291a2793k326Q85L285R36j169P909N359k651N678N969l563M250R138j667l791
306A5449K361M00m603j887J412o956n069q3o221m831K480m251n062L118j042l732
322a8517K275N651j667j912P579K529r06O934L563k366M114M981j207K816L349
337A7216k438l027L483P43q007k63K808o902n009K790o494n092J090j265l511
352a3878j223J248l850M00O509J67m57P789R50j201O832M515o44L75O428j167
368A2793k721M590R63m052N37J52o852NJ551o117l547Q52l996n296J110J980o484
$$ y = [-8331, -10332, -9593, 411, 3131, -1248, 6517, 15231, 11263, 11563, 19338, 14585, 11631, 17052, 14651, 10647, 12447, 10736, 3769, 3308, 5354, -1153, -6477, -2398, -6504, -14879, -12095, -10726, -17762, -16759, -12793, -15119, -14234, -10949, -10013, -11182, -3273, 2086, -565, 5113, 11082, 7519, 11769, 20907, 19240, 15449, 17810, 18210, 13607, 11720, 13132, 6176, 1107, 1024, -5197, -10028, -7548, -11799, -16861, -13743, -14785, -18517, -16242, -10591, -12258, -14170, -6591, -4062, -4968, 1966, 5529, 3163, 7277, 12258, 11051, 13867, 17216, 14778, 11751, 15234, 15977, 7970, 7707, 10515, 3613, -1396, 1394, -5100, -10192, -9102, -10367, -13878, -15101, -13853, -17703, -17303, -10794, -10627, -11084, -3295, -2345, -3546, 3286, 7801, 7157, 7532, 13960, 12793, 10072, 14662, 15625, 11573, 12110, 12262, 5410, 5415, 6966, 849, -2698, -1846, -5842, -11138, -10028, -8048, -14532]
385a4532j76L067k293M2N104J15p38M227L724N25L591M520J428N18N814o11l976
402A0349M971L26o199K311R1o022m074J420k559n479o86j390n259L41J280m400
418a4979O81L385k204l00N301J839OM017N494j065J472N431l03P93M636j048k453
435A0703L030K98l892n84M61o150m085K495l753o516J144p64m846p91J891k604
451a3963O40L694m68j539O242L304k775N482L856j431K561M974K09k556M129J87
467A2546k139k74R61l654j125J716m656m366K279m503m612Q56l32m010k618K415
483a1516o65j561M255J413r59L153J755J452K753L596J214J168M834O46k699M467
499A3306J545m490K05O82n110j973K95l028m279o50j892k724k40R42m627j195
$$ y = [-14532, -14708, -11641, -13934, -13892, -8788, -8673, -9411, -5184, -1460, -935, 2656, 7176, 8604, 9122, 14936, 14325, 10349, 15320, 15646, 9447, 11758, 11849, 5827, 1753, 3173, 614, -4865, -5551, -6941, -12200, -11859, -10579, -14979, -14298, -10913, -13117, -13417, -8116, -6277, -6271, -2254, 3240, 2175, 3647, 9078, 8775, 9568, 14204, 13156, 10703, 13733, 14031, 10139, 9555, 10016, 3866, -219, 2276, -1477, -7993, -6849, -7613, -12459, -13250, -11359, -13963, -13323, -9629, -10097, -11636, -5394, -2090, -4865, 617, 4473, 3042, 5603, 10577, 10786, 8230, 12359, 12546, 10407, 10133, 11094, 7440, 6315, 8031, 3375, -991, 1288, -3215, -7827, -6971, -7303, -11313, -13931, -11516, -12181, -13742, -9487, -8074, -9033, -5880, -4125, -2673, 80, 3676, 4890, 6058, 10892, 11538, 8839, 13306, 14851, 10361, 10566, 11248, 6138, 4165, 4460, 1432, -2847, -3497, -5389, -8113, -8353, -7411, -12038, -13233]
515a3233K122q25j056N007J311j327M747J953K87L601K571K417k20L374jj934
531H794M316p46k678k61K53l946m478L010k919n725J5O06n870j041K101k652j124
548a2345L280j314l43M009J371j594M262M766j367J577N541J32k129N084O1j763
564I228R61J717k532j724L80l749k812M07k448m776q68Q15m966n82J280k152N73
581a1248J130K445j147P95L747Q07K236M210O13Q79L845O50l19K697M89j840r40
598I049J324l139l160J755k168m013J205l169k441l13k080k939j32N31m96o96
614a0882L331K40n09K832L355j005L089K278J875R14J596J745M84N71P22o70j755
631H211J169l565j430J683n283m250O76o03l449j987J476j237k139J171J29n21
$$ y = [-13233, -11111, -11936, -12992, -7985, -6674, -8001, -3254, -1301, -1014, 2587, 5158, 7575, 7355, 10729, 10728, 8794, 13110, 12364, 9686, 9425, 9678, 5732, 1254, 4264, 1345, -4380, -4365, -3759, -9629, -10670, -8569, -11221, -12345, -9065, -10379, -10722, -6713, -5342, -6936, -2674, 2092, 725, 2302, 7843, 7975, 5846, 10930, 10991, 9228, 10189, 11906, 9374, 7650, 8030, 4281, 1469, 1876, -572, -5348, -6216, -5401, -10367, -10949, -9669, -11821, -11248, -10118, -7673, -8820, -8025, -4278, -3471, -1235, 2975, 3588, 4467, 8312, 8962, 8643, 11340, 11829, 9989, 9049, 10373, 7234, 4074, 5829, 3661, -352, 853, -2316, -4757, -5070, -7150, -10089, -10221, -9690, -10186, -10882, -7551, -7311, -7820, -4988, -1633, -2638, 451, 2729, 4604, 5518, 7114, 8859, 9343, 9914, 10636, 9966, 8211, 9380, 5815, 4385, 6068, 785, -3465, -2789, -3392, -6841, -8828, -7352, -8589, -10728, -9557, -9428, -9949]
647i949K868J541j300L422K764o19K780L012J293n86L622N91q36N21J412j209
663I327j729k18j710k281j151k429j870q16j916k484j561J772j854k462K166J502
679g714j636K237K310J220K74L378K257J126K557J623p11K085K80p80J56J225
695I887k234k244J064k068l729p91l35l235n57J69l991l6Q1j611P77J429j002
712h426j69K504M022q68J418K608P19J636K560K062O62k56M19l89Q38l85r19l783
730D253J862l203l872M62n44l031j861K93j761k541J429O14k03l42K230n61K778
747c998K831p07J774L652k35N32L053K228j814J044J310j426j839R46o50l396
763C305K45k240r41k892n00k679K30j378o3k233J312O61m72M76K726p58J425K518
$$ y = [-9949, -7081, -5540, -6840, -3418, -654, -1273, 1507, 4519, 5812, 5226, 8848, 9439, 8603, 9124, 10536, 9327, 7598, 7380, 5670, 3389, 2238, -191, -2061, -2877, -4793, -7277, -8838, -7066, -8920, -11382, -9216, -7714, -9350, -7113, -4803, -3583, -3309, 69, 2326, 3452, 6009, 7632, 6921, 9006, 9286, 8506, 8662, 9887, 7653, 5409, 6473, 4405, 676, -115, -450, -3685, -4242, -4073, -8064, -8100, -8019, -9630, -8853, -7424, -8426, -8595, -6091, -2069, -2937, -1519, 1089, 1808, 3444, 6004, 8066, 8728, 8472, 8891, 8502, 9340, 8955, 8036, 4253, 6115, 2912, -960, -498, -1042, -4073, -5934, -5641, -7402, -9943, -8514, -7900, -8103, -8445, -6215, -6776, -3998, -1167, -1874, -100, 3552, 3317, 3849, 6902, 9130, 7316, 8360, 9670, 8244, 6405, 7351, 6701, 3305, 3550, 1310, 369, -2523, -3023, -5702, -5472, -6850, -6913, -9146, -7834, -7173, -7645, -7169, -4443, -5201, -3776, -1258]
781a258J925N49K139J222O79J956K044k295J892J628l538j9K62j596k963l2j423
798A172l261j396o85o74k591K23m51r30L23R09r97K739K154M57M71L326k81O86
816A194L119K544o53K81J068l08Q82k96p16j756K53k625j839n31m1l073k769M13
834d853r25k555K124o57j204P27P34k7J695J308J476m37L951J360r61M507P06
851F969k22K87N03M59j404J586j607k348j592P39k850j122k74l011l10j212p37
868f146j018j81J087j618R96K629p94k64L841J323j90K224J075P73R72J086N00
885F295J286K36j209j727K047r73k962M09j219l197m83l57k521o96M9j838l47
902g207O75q65l46K744L13O9J120J510K748n89K779Q41Q83Q19J082P05k06K65
$$ y = [-1258, 667, 1216, 3355, 4577, 5256, 7212, 9256, 6961, 8853, 10481, 6943, 6924, 7186, 5590, 2627, 2595, 1172, -2089, -3485, -4170, -4844, -7435, -7212, -7663, -8593, -8270, -7361, -8358, -5619, -3465, -3008, -2537, 789, 508, 1194, 4313, 6857, 6204, 6485, 7553, 7245, 8127, 7831, 7115, 5359, 5612, 2987, 1148, 617, 576, -2497, -5266, -4853, -5778, -8333, -6209, -6866, -8070, -7343, -6609, -6636, -4941, -3633, -2157, -2594, 1357, 2717, 1756, 6263, 6969, 6747, 7034, 7537, 7996, 6592, 8178, 6571, 4223, 2631, 3370, 520, -602, -876, -3887, -4197, -5409, -6146, -7164, -7345, -6258, -7876, -6880, -4251, -5045, -5309, -1468, -145, -335, 1889, 2964, 3737, 4709, 5795, 6295, 7581, 7817, 6608, 4881, 6928, 5955, 2993, 3402, 2183, -1014, -1497, -1854, -4375, -5071, -5022, -6860, -7207, -6532, -7397, -7743, -4999, -4686, -4617, -3497, -1987, 761, 172, 2951, 3792, 4675, 5494, 6576, 7281, 7075, 7340]
920G340j029j075J185k388j241J13j936k203j957O54k334k089K63R2j147R17J569
937e266r98J125J360N01J568J117J061J265J149K460j151R08J604j93j340J699
953F869r53j716p33K4p47j673r41j602j903K0j915j100m02m10n41J191J852k40
971d920Q97J248O70J09K256J255J455L49Q92Q99J329P82k086P69k46l50k210N98
989C696p41l103j120O37j444j662l6j357j058N34p45l89J416N6l44J790K023M10
1007a437l19K824J447O92N67J252N48J70M43R5o86n29j604o08K91k195r36l11
1025b96j550j386k000Q9M01j903r8J755j346L26J688O18M54K084J58J776J744
1042B514J115j00p3K067N04n91J406j454j088QN6j724o61k726O28j051j708l97
$$ y = [7340, 6311, 5236, 6421, 4033, 2792, 2905, 969, -1234, -3191, -2537, -4871, -6960, -6697, -6605, -7752, -6835, -5266, -6264, -5139, -3779, -3278, -1710, -593, 468, 1733, 2882, 5342, 4191, 5099, 6703, 6510, 5170, 6869, 5916, 4200, 3467, 3491, 2744, 1071, 130, -1472, -3375, -3355, -5270, -6370, -6772, -7182, -7723, -6532, -4680, -4920, -4023, -2775, -2105, -1996, 260, 1515, 2970, 3319, 4211, 5110, 6439, 7221, 5135, 5904, 5658, 5308, 3098, 3696, 2955, -148, -1268, -631, -2075, -3737, -3773, -5130, -6188, -5654, -6399, -6788, -5372, -5316, -5660, -3870, -1847, -1437, -1756, 1068, 2515, 3207, 3774, 5026, 5574, 5744, 6187, 6282, 5596, 5067, 3463, 2855, 3146, 951, 15, -296, -1846, -3232, -5232, -5143, -4742, -6645, -6743, -4988, -6334, -6008, -4320, -3702, -3248, -1164, -1006, 770, 2514, 3629, 3529, 3456, 5523, 6027, 5436, 6842, 5388, 4300, 4308, 4364, 2640, 1979, -747, -119, -1170, -2878, -3275]
1060c275j560L0P7j603r3N46j96R08J386R32J001J52K194J335O80Q99N40O29J691
1079F273m90p6N03j378j76r04o37p17k209n49j863p66Jj109j178M03k96q35K68
1098e735M65N63L21J708M42J49J684J509N78J396J928o86P74k14O77L79j304j7
1116D617j073l83j003j247r40o07k597l66j65l96j252o49J456j444L34K68K291
1133c156n93J150J051P84J840J225j237K001K114O28j307N96M57p22L69n15j746
1150B939l60j101j216o65j454l90j562j89n07j321R56j38K84O9J049J81o82K032
1168b075J855R91j93J450J241N97P11R12o69J362j959o55R77q87k041K21j215
1185F23j419r39p75J04j428q72L53j015O55K56n10J041J451l28Q29J992K43J338
$$ y = [-3275, -4835, -4805, -4728, -6331, -6424, -5878, -6074, -5166, -3780, -2848, -1847, -1695, 499, 1834, 2514, 3413, 3953, 4582, 6273, 5783, 5707, 6210, 4832, 4656, 3752, 3115, 2398, 189, -360, -2223, -2989, -2988, -4097, -5275, -4872, -5168, -6003, -5735, -5270, -4707, -4386, -2678, -2236, -2087, -403, 1106, 1684, 3080, 5008, 4322, 5096, 4882, 5559, 5938, 4634, 4617, 3544, 3161, 2158, 911, -29, -636, -3233, -3599, -3764, -4160, -5412, -6061, -4605, -6049, -5715, -5447, -3156, -3749, -2599, -1548, -764, 1076, 2301, 1064, 3065, 5179, 5807, 4500, 5096, 5553, 4831, 5200, 4685, 2939, 2579, 1478, 262, -403, -1857, -2247, -3809, -3998, -4505, -5826, -4870, -5008, -4724, -4655, -3606, -3425, -4107, -2075, -220, 771, 578, 2028, 3269, 3866, 4577, 5489, 4820, 6182, 4223, 3568, 4545, 3658, 1617, 1838, 623, -796, -1735, -2510, -2406, -3834, -4706, -4353, -5368, -4713, -4457, -4967, -3926, -2475, -2803, -1974, 18, 261, 1599]
1203A599L08J582J98q5Q35K65m11P64n31M14j434n00r38j708n76j011j255J68
1221b316q36r67n34M33l35r9O59k8Q50O53R50j37J876N59J278R7J436J87L2K157
1241E915p40j232O28l55p20r34k95r62n88k097K18j740l84n77m99M95q04m06L85
1260d692J334k34m0J548J266m10J012J250R07R87J130m89J019p20J367j086m70
1277C679K82j501m41m0j054j423K7r21o36j918q5M59j83k52m04j76Q53J327m17
1296b824J546M49R39Q06P71J254j38J041O44n59L78k65n7M92j306j310q00L12
1314A373k142p36P01j776n41n50j62m33q5L15l21K47N20J447K95m15J716J299
1332G52k2K241M32L72M70j97J79l3K0j28p33r93m44j467n41N04k041j923J226
$$ y = [1599, 1907, 3489, 3687, 3602, 4437, 4702, 4291, 5055, 4524, 4938, 3504, 3004, 2066, 358, -218, -1229, -2484, -2316, -3152, -4119, -4653, -4220, -4555, -4654, -3995, -4023, -3173, -2520, -1570, -1707, 169, 728, 2006, 2103, 3539, 3726, 3758, 5915, 5175, 3943, 4571, 4216, 3496, 2562, 2267, 1305, 717, -1380, -1162, -2902, -3286, -3863, -4362, -3867, -4671, -5077, -4692, -3358, -3592, -3632, -2084, -818, -1228, -216, 1034, 1941, 2928, 4058, 3569, 4588, 3868, 5235, 4149, 3679, 3961, 2460, 2019, 1979, 925, -498, -471, -1392, -2028, -3946, -4031, -3572, -3755, -4007, -4411, -4587, -3734, -2407, -2824, -1278, -829, 110, 916, 1687, 2941, 2803, 3844, 4488, 3929, 4307, 4042, 3985, 4477, 3171, 1861, 1061, 1373, -769, -1505, -804, -2580, -3121, -3671, -3833, -4266, -4351, -4036, -4357, -4110, -3590, -2143, -1848, -2263, -547, 752, 730, 2971, 3403, 3775, 4245, 4048, 4227, 4194, 4214, 4086, 3353, 2360, 1916, 449, -92, 412, -1629, -3552, -2326]
1351b326l72j652m98p5J258P91m17l7J381N51j02O75J652O17R8J004M46O81J224
1370D899o24n61J62l24j253M09o6j938j149P35j067j792o36K44o20j031P19j84
1388d077p6j32Q07Q36R79J104l41J585M94M87Q63J875p05L96P94r23rl24L51o12
1408C372l46j996O13j629j82j084j515k28M46j272o57L35K58L13J139Q20j507
1425c120J533O65Q51J49J770N42J257k45k13O08M97K74j074k0l10j008j017L55
1443A494j261q77n30q93j017P19j060j272O32P50p71oJ504J088q31J351J375N2
1461D47k18J519J268K65k0R31k46n72p10Q41o05l21q74r60L18j656j423j2o24
1480b652j061k19k14R9P36R04p41j80J514J18Q4J277Q7J242P04O88L73J34J623
$$ y = [-2326, -2698, -4350, -4848, -4923, -3665, -2874, -3291, -3328, -1947, -1396, -1498, -823, 829, 1446, 1544, 2548, 2994, 3675, 4899, 4275, 3714, 3876, 3552, 2299, 2708, 2642, 704, -445, 290, -777, -2569, -3205, -2961, -3581, -4612, -3893, -4077, -4153, -4285, -3478, -2642, -1663, -559, -900, 685, 1179, 1666, 2529, 4404, 3699, 4095, 4889, 3966, 3957, 3633, 3984, 3372, 3026, 1030, 1643, 14, -168, -1252, -2767, -2995, -2549, -3821, -4478, -4143, -3885, -3572, -2433, -1613, -3120, -1587, -922, -71, 78, 1848, 2390, 3647, 3402, 3189, 3797, 4294, 4568, 3494, 3474, 3164, 2156, 1139, 1494, 233, -644, -1174, -2067, -3084, -2365, -3425, -4697, -4065, -3315, -4086, -4092, -2588, -1500, -2331, -980, 395, 447, 229, 1748, 3016, 3281, 3261, 4192, 3946, 3374, 2664, 3505, 2900, 2579, 1705, 745, 1063, -593, -2016, -2028, -2652, -3713, -3932, -4146, -4047, -3311, -2407, -3148, -3328, -1814, -1696, -1612, -335, -248, 994, 1698, 2386, 2759, 2893, 4516]
1499D516p75K96m22m77l68n37q40j28r77r64N91k491J106j546n02l43N99j71o03
1518d036k36J561J029p4k37K043O61R51j24N3P31Q48L27k40R32Jj036P68r14r05
1538B103o17j150K8r91j287n96J63m07m23j873J159M3Q36N85q20L47K277n17Q48
1557b92M08R80M25J371m49Q12N40m80P79o62j024L06n18j217O5j497r89P8J71
1576a193J47k811m5J424j570N38O44m28J090p30R82K020m2r0R43J194j77M81J526
1595C903p09k2n96j94N91r12O48q97o78j6j535o14n21j74j226j83P73j181p9J211
1615b411j009Q39J59N83R92L13N71%J248K15M08J144P50j355L59J139o99j59r14
1634B173r29J48k207N43O90r31j933j98K4j547K024q27n22J744m28K1K86P92O07
$$ y = [4516, 3741, 4037, 3615, 3138, 2770, 2233, 1393, 1265, 288, -676, -85, -2576, -1470, -3016, -3518, -3861, -3262, -3433, -4036, -4272, -2711, -1682, -1756, -1993, 50, 711, 1662, 1538, 1591, 2322, 3170, 3497, 3257, 4189, 4190, 3154, 3922, 3008, 2103, 1486, 336, 364, -627, -1914, -2510, -2347, -2754, -3177, -5050, -3891, -3848, -3012, -2427, -3247, -2900, -623, -1140, -292, 116, 1096, 1521, 2892, 2443, 3255, 3795, 3315, 4094, 3432, 2408, 2714, 2196, 979, 1044, -453, -1442, -1364, -1193, -1046, -3857, -3902, -2478, -4048, -3510, -2866, -3294, -2204, -2934, -1952, 68, 26, -64, 879, 2073, 1896, 2377, 3903, 3194, 3172, 2576, 2382, 2973, 2061, 2709, 1812, 1134, 1118, -417, -1031, -1552, -1726, -2952, -3135, -2362, -3543, -3622, -2411, -3420, -2581, -2422, -1839, -847, -534, 37, 37, 1285, 1500, 1908, 3052, 3802, 2447, 2806, 3945, 3246, 3087, 2173, 1244, 1392, -815, -272, 418, -513, -2446, -2644, -2620, -4167, -2143, -2970, -3492, -1748, -2176, -2155, -1869, -1077, -470]
1653d70o58J291J793n11J120N85o69O40P84j025M40K43p44j398M16n47k325o72
1671a707J135j683K45m66M82j478K44L30M37Q9m96J353j88K142j440J376J033
1688A408M44R9j46J473j17m59L51K24r91p04J243o49j036q73j590L91r14k52o02
1707b700J65K4p23L32j9m22Q00R12l5Q27K74J438o4o15J965J5Q13o57j92M57Q60
1728C455j469j11O49j236m81N7j892R42m21j495o73N68k15j001N19N84R3r49J724
1747a352J69m70J209O5J613n33J221l47L03J200L56j082JJ263j346o89K64n72
1765A273j225K18j31j975L18j100J86l13M93r40P43p97P79J211O05j297N60O20
1783g72J551J41O33N29M34j89j41k92Q34k96j2L61j300j20o79n95r27J81j698
$$ y = [-470, -1128, 163, 1956, 1445, 2565, 3150, 2481, 3121, 3905, 2880, 3320, 3563, 2819, 1421, 1837, 1290, -1035, -1707, -572, -2255, -2010, -2476, -1994, -3472, -3228, -2898, -2461, -2372, -2868, -1515, -1703, 439, -1001, 375, 1408, 1852, 1951, 1805, 3278, 3161, 2702, 3053, 3277, 2286, 1582, 2825, 2176, 1140, 267, -1323, -932, -1846, -2098, -2700, -2535, -2511, -3234, -2902, -2921, -3343, -2543, -1631, -1666, -839, -565, 873, 809, 194, 2159, 2174, 2987, 2330, 2138, 2595, 3455, 1986, 1875, 2524, 1288, 807, 864, -1028, -86, -507, -2002, -2675, -2107, -2322, -3323, -2804, -2220, -2127, -3076, -1352, -1183, -1653, -444, -379, 1234, 701, 1922, 1575, 1878, 3078, 3434, 2352, 2353, 3616, 2270, 1581, 1845, 1273, 48, 266, 135, -1840, -1522, -2622, -2436, -2749, -2256, -3196, -2453, -3250, -2471, -1260, -655, -1952, -1392, -772, 779, 920, 1553, 2082, 2516, 2327, 2186, 1894, 2728, 2432, 2420, 2781, 1481, 1361, 682, 87, -840, -659, -2357]
1802b357J8n01K80p92R41J09j055N91R86J253k85M14K29L82M38J83J013K99n96
1821A550N18R43m80o2L3O56r22k355J934j161j031l72j512P36o51o42M52J071
1839a295j084q87J011P53k93Q14j63R94o02J688L23M43M13J72P69p06k92O42k95
1858B405p82J76n84l77m17o20m61n23k2o18L97o95o29j87J026j70M69j95j24J82
1878a749J661j98J415m64O20L58l94J428M6n22m68Q28o69o8p65o14k63o32kJ21
1898c31p02l1j333l14k63N86p41J182j60j65J622p54O92K45Q04r58K422J85p65
1917A221J276o78Q09M95j041K23j69m91p5l01j694n1r26Q95m49r75j71O5j99K12
1937b024o4L02m41J157O55q07R62R58J068j46k34R2N64J84L09R1j171r96J305
$$ y = [-2357, -2339, -2840, -2560, -3352, -2411, -2302, -3357, -2766, -1780, -527, -812, -398, -169, 213, 651, 834, 1847, 2146, 1550, 2068, 3011, 2531, 2469, 2502, 3158, 2236, -119, 1815, 654, -377, -749, -2261, -1525, -2176, -2818, -2366, -1295, -2379, -3266, -2255, -1502, -1795, -981, -1144, -150, -752, 936, 1259, 1702, 2115, 2287, 3056, 2350, 2058, 2700, 2405, 1623, 1799, 1215, 838, 421, -199, -660, -1183, -1205, -1823, -1426, -2121, -2750, -2937, -1911, -2081, -1612, -1807, -1931, -1749, -88, -286, 1129, 665, 1285, 1643, 1249, 2677, 2723, 2201, 1733, 2561, 1892, 1824, 1059, 445, 182, -450, -452, -331, -1033, -1064, -2397, -2711, -2974, -2388, -3129, -1947, -2107, -2272, -650, -1404, -712, -467, 337, -621, 1801, 1986, 1221, 2497, 1819, 2628, 3123, 2082, 2305, 2136, 1645, 1570, 1269, -425, -476, -1402, -507, -956, -1931, -2102, -2037, -2236, -2024, -2088, -1786, -2227, -1070, -415, -1222, -260, 698, 1766, 1620, 1386, 1478, 2042, 2226, 2535, 2626, 1455, 459, 1764]
1956A764l40N8Q72j771n43p67l61n54n98K57m48p11J291K55j068Q25N34k13J000
1975e18k80P36O30P15m53O53J061m8j60N30l88n71M38m95p58P06j889Q18j145
1994d18l26p53j238P33L07m45j042J659r63Q33M30j90P67k10P49l30J001R68O62
2013B194n55R17M7k60m02M05J17n85m64q62j95n67J48q12N08j357K05N7m83q48
2033b792P12J21n04J709p80J493n81j78P99J649j778J256L99L44NJ99J87o59R0
2052A691n9m41O8j140L20l11n09q67K45m32j28q69R87p2l91p02j07J654l36N19
2072h80J55R29N52K52o07O15J97L85k1M2j74L63L32j122L91p4o21l27j381j81
2092a175j64J562j910l50j34P8m57R81k51n34J631n37M94O57N84J47k77k53J278
$$ y = [1764, 1424, 1482, 2354, 583, 40, -727, -1088, -1642, -2240, -1983, -2431, -3142, -1851, -1596, -2664, -1839, -1305, -1518, -518, -798, -62, 568, 1283, 830, 1483, 2544, 2496, 2336, 2866, 2478, 1907, 2345, 1850, 1092, 1798, -91, 727, -418, -744, -1497, -2735, -2002, -1695, -2140, -3182, -1523, -2486, -1653, -1223, -1413, -646, -856, -107, -437, 564, 1532, 2194, 1639, 2556, 2603, 2343, 1941, 2346, 2463, 1878, 1414, 552, 357, -210, -62, -874, -366, -1723, -1518, -1461, -1944, -2792, -2080, -1959, -2463, -754, -1534, -41, -622, -800, -1, 1648, -130, 1126, 1525, 1869, 1874, 2073, 2260, 1601, 1691, 1632, 1191, 1259, 119, 439, 128, -381, -1248, -1003, -1435, -1563, -2432, -1445, -1517, -1908, -2610, -2717, -1063, -1399, -880, -725, 204, 756, 1008, 401, 1016, 1213, 1598, 1577, 1619, 1445, 1808, 2140, 1018, 1409, 1335, 714, 387, -994, -1175, -1339, 223, -1687, -2037, -2171, -2093, -2550, -1569, -1820, -2354, -723, -1260, -766, -109, 475, 622, 345, 92, 1370]
2111A370k37P47M1l92K54K87p94j53N24j381m74o70l75o2j26Q76q03m10J395j061
2131a444M95j397R5K309j006l59J384p03O17P54N06M51M82r56J243o19q2K29j14
2150A885n30j405J048j262L07q67o51J23n19J99j21O34k70r03J255l00J7l16P38
2169i38Q02O59l22M64L70l12N34L79P37q29R25j188J173n12j060L29j111J64j396
2188a132K84l7j186L54R6k80l21P68o18N23O44J45P0K18K82N68N55L24M90r60
2208G87J60J255o74M28N33q90o1j068K92m09n41n84n6j018P87k12J35n34K03J58
2228a309n02J901j148j8O96K60L71Q5N04l51N62N35j27j21l26J011j142N49K91
2247A721m04j037K93O46j113n61m6P8q65n0p13N70q92J212m31K24n8l61J273K01
$$ y = [1370, 1133, 1880, 1921, 1529, 1783, 2070, 1276, 1123, 1647, 266, -208, -878, -1253, -1315, -1441, -565, -1368, -1778, -383, -1444, -949, -2346, -2251, 58, -948, -1307, 77, -626, -9, 745, 1251, 1702, 2184, 1228, 2471, 1852, 1770, 1999, 1885, 1355, -50, 998, -264, 43, -824, -1475, -1352, -1871, -1672, -1793, -1159, -1429, -2332, -1077, -1377, -1360, -1676, -938, -136, 523, 201, 665, 1035, 723, 1257, 1636, 2373, 1544, 2469, 1281, 2454, 1942, 882, 1211, 100, 264, -1132, -848, -885, -2071, -1717, -1621, -1901, -2222, -1454, -2072, -1549, -905, -760, -690, -472, -190, 378, 933, 1257, 1747, 787, 947, 2202, 1528, 1956, 2489, 1599, 1538, 470, 762, 353, -188, -772, -828, -1846, -1059, -1271, -1136, -1670, -1467, -1309, -1811, 90, -1058, -1076, -380, -120, 251, 336, 840, 489, 1051, 1586, 1459, 1338, 1012, 2023, 881, 1430, 1721, 1317, 280, 573, 1219, 106, -455, -501, -423, -1288, -1338, -2051, -1481, -2373, -1161, -1592, -1368, -1426, -1787, -514, -313]
2267c13l9M80N54Q87l23j345J841N8j057L73O40q71O77n21m66N1q55j15k81K3
2287f02r40k49L30m99Q34o35P47l59l42Q85O3Q92q89J389J90K12k08M51j2J50
2307A408N5j29l74L93O94j447k12m11K83m70j120M64r41O25K55j360j50J419P
2326a011m69J100o25L21J63P96k96Q38N16j094J359l77J454j339j35M45r85J021
2344A682l43k96j417N93k14p18k17l38J14m11m8M36j024L03Q63m16J281r63J000
2363a33J12N69J83K1N18R5l4k8l18k44Q36N23j705L33L86p53p12N90n73l93k78
2384a005J0j098j11N5P56l12j34L93m57N38J093N43l86L87M49o16J217j60K41
2403A403N01j371R31n2N6r88O65j135JK89q34m13o75P57L3p17K75j330J83N44
$$ y = [-313, -352, 128, 682, 1569, 1246, -99, 1742, 1800, 743, 1116, 1756, 885, 1562, 1041, 575, 626, -229, -344, -625, -602, -1542, -1791, -1461, -1960, -1126, -1761, -1014, -1373, -1715, -830, -767, 125, -764, 625, 815, 1027, 819, 1270, 1258, 1408, 1463, 1334, 960, 1353, 2047, 600, 388, -23, 260, -210, -1330, -866, -1807, -1182, -927, -2287, -2437, -1018, -1011, -1480, -380, -1005, -684, -521, 275, -21, 817, 1333, 239, 1598, 1221, 2675, 1336, 1201, 1646, 661, 1682, 1339, 1043, -374, 219, 5, -713, -930, -1268, -1154, -1565, -1613, -1177, -2201, -1898, -1035, -1451, -170, -1133, -133, -21, 548, 731, 752, 1270, 1365, 1331, 1303, 985, 741, 1577, 2100, 395, 728, 1114, 361, -351, 239, -334, -727, -1005, -995, -2093, -2204, -2149, -1393, -1705, -1839, -1446, -1903, -1365, -272, 271, -115, 272, 721, 105, 1322, 1162, 1403, 1904, 533, 1464, 1412, 1468, 480, 1145, 10, 11, 300, -534, -947, -1622, -865, -832, -1549, -1274, -2604, -2421, -1877]
2423a877P89J33o0K49P57j51R60j25J03M01q27J359q45Q02q11P61q23j19k70m30
2443b4L38j263n02J39L04K36M54p11k15j11N2M39P3k48J80k07J115K6j61N80O4
2464E58J241k21p73J092l99P57o59k69p36n48J02J1L13j010q3l17O69l53j019
2483a644L53o02n0P05L24L51p13M93p20J422J02J41Q6J113n44k02Q55m85L67O2
2503A414n20M2N23o67l35L8M72k331N48O57j047Q93j68%m09K6Q8K7m72N18r08
2524a611M26J266r5N22L18J85N70j012n3M29o59L54n63R35n49Q09q53l05M0n36
2544c82O6j221m71J147L95m41q66J350l64l19j34P49p39P45L08Q90P48r38L47
2563H70l47J30L44P66j343J166r69j29j58l14O5r85N53k81n18J08k17L61l34q37
$$ y = [-1877, -1088, -955, -1015, -766, -9, -160, 800, 675, 778, 1179, 352, 1711, 866, 1668, 857, 1618, 795, 676, 406, -24, 314, -949, -1451, -1312, -1008, -772, -318, -1029, -1244, -1355, -1303, -864, -791, -1039, -859, -1066, 49, 75, -86, 494, 558, 1799, 1578, 805, 1897, 1498, 2255, 1596, 1327, 591, 43, 145, 156, 469, -541, -624, -941, -272, -625, -1644, -1291, -1893, -1943, -1238, -914, -563, -1276, -783, -1503, -81, 21, 162, 248, 1361, 817, 615, 1470, 985, 1352, 1414, 894, 936, 1459, 792, 457, 495, 967, -1364, -816, -159, -1206, -313, -481, -481, -890, -864, -776, -749, -1221, -703, -1611, -1185, 81, -14, 508, 826, 1011, 1581, 569, 516, 945, 286, 640, 77, 1012, 463, 1272, 419, 114, 154, -382, -316, -1537, -2008, -861, -466, -907, -1773, -423, -787, -1106, -1240, -491, -1230, -485, -177, 713, 1461, 523, 870, 523, 653, 997, 1763, 420, 1586, 617, 488, 330, 16, 81, -904, -351, -632, -1150, -1042, -1259, -898, -1232, -2069]
2583b069K755k018J324j238P21Q0l38j87L21K200j054R31m12m50L62m89J215p49
2601I05r56O46j36J88o63P38m77j203K49J11j206J207K08j053r1K83J28J057q9
2620a54o61J151m73O97M8m37N75J046n47j32K9N65p20L21l55K02K67j357p40J010
2640C35m32q43J23J211j973L74L30o06L45j6P4R66q69L33l06R93K13M82k06N25
2660A053P54q08R02q17O6q76M55J08m39J85l56m18M34m02q02K43m49L09q79O64
2680a073K2J26m70j4L42N67J036n92M96P56r78M38p64J454J53j307J260q58K54
2699H48P4O70o45n74j417R98k091J779j291M73j19m00J312o95k3J34N1o0O11J01
2719b64K38n82P52N92Q51n10p19O92K33R72j781m34P20P99j150m49l32k52k03
$$ y = [-2069, 686, -1332, -8, -1246, -525, -445, -783, -970, -649, 1551, 497, 1428, 1016, 566, 928, 439, 1654, 905, -51, 595, 459, 647, -16, 722, 245, -958, -709, -598, -1804, -597, -389, -1442, -1533, -1250, -1122, -65, -154, -815, 336, -137, 560, 608, 171, 746, 1792, 1245, 1113, 1142, 1707, 987, 1308, 953, 1155, 1422, 65, -675, 335, -97, -940, -817, 394, -1579, -1205, -875, -1481, -1136, -1152, -1078, -112, -981, -648, -954, 39, 252, 734, 528, 1053, 1807, 999, 1901, 1084, 1150, 274, 729, 837, 398, 583, 227, -191, 243, -159, -961, -718, -1167, -858, -1737, -1073, -1051, -925, -1395, -1409, -1067, -500, 536, -56, 440, 1196, 218, 656, -108, 1346, 1499, 192, 1452, 594, 848, 922, 1592, 947, 373, -1044, -46, -2137, -358, -1649, -1176, -1295, -1695, -383, -1078, -1101, -967, -916, -976, -365, -264, -26, -608, 144, 736, 1587, 1077, 358, 1050, 1283, 2255, 474, 40, 760, 1559, 409, -40, -372, -624, -827]
2738h27K78r4o34R50K43r20K29r99L47J114N36p88M48Q77j12o21L54r6R31n00
2758G16N43k18N25j119R52n32n64N28l52q2M02j309p39J081o79n97J82J229j048
2777a081n65J541j007R30n74j24O92l18L62J378j092R66K19k68R8m60n37K149
2795B309j475K49j156J244k079J673n64j564R70M00O3j162J03m70O84p69O38K57
2813f49J1j58J91J096j72L13q57Q15M88l47M62J61j291Q71N65l54oj020J097j136
2833H0j27r68O14k4n50l93R95j382L31J039K2j360J328n27P97L63o4J427j313
2852B88n5Q65j17L78o92M4J68p37J013M59j230P15p15j099Q51q40m10N05j418
2871b027Q51N97k06j56r18J313K80M52J03N62r26J075j380J727n9q61l74K46P07
$$ y = [-827, -549, -643, -1277, -327, -84, -1004, -775, -1774, -1427, -313, 223, -565, -117, 760, 648, 27, 381, 285, 1216, 716, 1259, 1041, 1566, 447, 1399, 867, 303, 831, 479, 397, 799, -510, -1249, -168, -847, -1444, -1262, -33, -1081, -1646, -105, -1112, -182, -756, -880, -188, -506, -144, 1234, 142, 1108, 1327, 1059, 1157, 697, 160, 2309, 834, 1083, -73, 1171, -908, 765, 201, -1363, -393, 7, 70, -1092, -989, -1459, -775, -1544, -906, -649, -638, -796, -605, 491, 319, 632, -225, 590, 1078, 731, 1193, 1354, 63, 934, 1499, 1145, 1139, 119, 1216, 80, -47, -1015, -401, -425, -975, -1368, -373, -1755, -1424, -385, -363, -1723, -395, -922, -125, 238, 174, 1601, 288, 233, 1098, 981, 1359, 667, 711, 879, 142, 1155, 1614, 384, 1099, 384, -715, 136, -704, -1114, -609, -2027, -1176, -579, -785, -941, -1859, -546, -266, 186, 289, 851, -75, 1000, -380, 1347, 1288, 427, 53, 299, 1006]
2890A006J1l16k69N19m36k41l59n94J45M24j556J173k42j38k2P18j318J135l11
2909f71N9J28l33Q88j127K201j091R54j222J947r19p3j76L3L09n36l68M70K00
2928F73j163o06M82Q81p41M94j137K18M36p84J602m90l92L79J03J16m69j67R91
2947D26M89q44J107K78j196l52M31J95Q16j072N82j389O45N84l30o16j13J96q35
2966i98L11k63K62k71k44K52K44o1j04N79J21L61J155o81m81O97l34m13N30l39
2986C23L53M2l10n71J472r04o00J49j75P81q36o72J34M3Q81o61no08p30J363M00
3007a31n31R37k09r3J267j004n57J431k77L62r1O03o96m76M34l14m44N35r18o12
3027g84J65l39P72R4l51j426J096N1R2l0Lk66O44ql39J97l9J625j130l6P12o2
$$ y = [1006, 1017, 701, 432, 951, 515, 274, -85, -679, -534, -110, -1666, -493, -735, -873, -895, -177, -1495, -360, -671, -612, -484, -817, 71, -1056, 1145, 54, 1008, -214, 1733, 814, 741, 565, 598, 907, 371, 3, 473, 673, -490, -1096, -614, 267, -474, 20, -1117, -899, -463, -1247, 355, -135, -527, -148, -45, 71, -398, -565, 426, 915, 71, 1178, 1456, 260, -92, 339, 534, 1350, 278, 860, -529, 116, 700, 370, -246, -359, -163, -998, -687, -950, -688, -959, -1203, -951, -707, -768, -872, -293, -172, 189, 1344, 663, 182, 879, 545, 132, 662, 323, 676, 718, 408, -163, 1309, 405, -195, -46, -221, 560, -276, -948, -814, -771, 110, -551, -556, -1164, -1894, -531, -131, -662, 275, 66, -27, 1240, 236, -321, 1110, 833, 1195, 1104, 1707, 1011, 535, 969, 655, 211, 746, -172, -784, -619, -958, -186, -92, -443, -1869, -773, -722, -630, -660, -657, -923, -279, -287, -626, -429, -468, 1157, 27, -9, 703, 641]
3049F41L23m56P57j128J378j013O18o05l56m11J87m96o48P14N23q83R42p68Q40
3068A59o48n25P35P4J55K75K34r15P27j93R38n61m80LJ075n84L15j086J145j59
3088F84o07P58j446J058q02l1j91J59M05j041M58L38k88o80J442o65K43n08L00
3107d14N63M51j83N39o04l20J36O65J42k88k50M52j89m93j76O01m17j174R57n19
3127e21k69K32J91q51Q87Q2n74L7n16Q75m71Q20j0J46Q28m95J21M95j028n1J687
3148A615j559N02K2Q40p16j76k05K90o00J31j220L56J026o87m67J78L40o0J37
3167b53m2n12M08J074j449Q17R02r99J55J656j284L18n70P44j315J728p31N72
3185A219l64q6m43j197J258p45p3M27k21K17j85K44m12J15j116R11K05p90L21
$$ y = [641, 964, 508, 1265, 137, 1515, 502, 1120, 515, 159, -252, -65, -561, -1209, -495, 28, -855, 87, -681, 159, -489, -1014, -279, -205, -50, 225, 459, -456, 271, 78, 1016, 455, -25, -22, 1053, 469, 784, -302, 843, 684, 77, 835, -611, 447, -355, -386, -577, -418, -13, -1054, -596, -258, -546, -1226, 216, -449, -206, -714, -414, 149, 600, 417, 956, 352, 32, 168, 833, 975, 687, 437, 889, 700, 207, 31, 632, 215, -959, -2, -521, -790, -558, -367, -1218, -331, -249, -823, -786, -1302, -427, -898, -78, -88, 58, 886, 391, 512, 1007, -21, -72, 1615, 56, 558, 580, 1420, 704, 528, 323, 613, 13, 144, -1076, -720, 306, -381, -848, -670, -330, -390, -253, -295, -807, -399, 675, -774, 43, 945, -54, 101, 1757, 473, 791, 221, 965, -350, 1378, 647, 1219, 855, 769, 326, -871, 387, -358, -431, -4, -225, -8, -193, 51, -361, -246, -1362, -451, -246, -1036, -715]
3204g15J294p87j56K42K03M3O84K7j422J374K71o46j57N87l45K59p13n60P93J95
3224D71r98n57K95JR22j058N16K47j65J96q12J95J048P5k38j11J016r48R92r2
3244I95J29p38j32L39L17j448N34L81q06J35k43L30n16m89K67Q93p58j99J02N33
3264c74o48Q02n55k08J090L12K58j59k8k44N74j49O2L68j53j027O10R15q70r09
3284c33M88R1j40k07j37p58N25j56P33l35n21K92K94j4P04j340O92K08N04O80
3304A270j066N47J55l68j45K85Q25j114M15n45K63l30O43j016k4p74J24J171j55
3323A61j144J26Q1q8M13j33o4n6O86l43N12N2L62Q27K7o36N0L12m52k06L68j87
3345F68J91j040Q27p36J79M24r83P70n52j049M15P33O01j255M32p94M36N37k80
$$ y = [-715, 579, -208, -364, -122, 81, 124, 808, 835, -587, 787, 1058, 412, 255, 842, 497, 756, 43, -517, 276, 471, -527, -1084, -789, -788, 134, -924, -408, -161, -326, -130, -942, -747, 301, 376, 138, 27, 1043, 95, 1087, 995, 1124, 386, 254, 593, 910, -538, -4, 377, -429, -294, -537, -207, -723, -1212, -945, -52, -810, -1009, -907, -374, -1022, -220, -775, -983, 107, 419, 677, 518, 490, 246, 820, 671, 733, 1101, 948, -79, 531, 1446, 576, -333, 155, 246, 106, -101, -238, -996, -471, -627, 106, -229, -750, -458, -164, -178, 526, -814, -122, 86, 590, 1270, 204, 751, 906, 538, 393, 678, 1503, 389, 804, 259, 522, 192, 835, -181, -205, -979, -855, 316, 161, -983, -857, -776, -864, -451, -584, -648, -704, -18, -361, 151, 203, 565, 1392, 1419, 783, 833, 1145, 693, 487, 855, 668, 859, -181, 646, -90, 89, 513, -470, 300, -252, -1301, -886, -153, 448, -807, -375, -1169, -733, -196, -476]
3364d76K21j48P01o46N78L23M77j000L38N55j810J726n40L71k72M80j516K50Q34
3383D46o07K14o66O18p68L21Q4L80r74j07M03N74M93j074J557l52l66o94Q02m27
3403a43K88o17J348j338M56N28m33Q85j442R74M6j61j41k47j88j11o74N2L66j50
3423g02J45K89l7L42r95P12j14Q00n68R24p82j20J007m44M1R39j255M81p05P58
3443G16p83R43j050J93N4P66j520M03k57J80l98jQ21q9r07Q88m71n45J275r10
3463f92R14p21R5P68K89k05L09K38j199O72m75R15o41m22P49j547M73J312p24
3482A08o17p98Q53n53N69p52O46r58Q52l8k77P75q23O66J109j040L3J14P95n90
3502G4j83R15K10m98n42O0Q35k1j010J03nJ29j51l47o71J436o71j73j436J413
$$ y = [-476, -255, -403, 298, -348, 230, 553, 1030, 30, 368, 923, -887, 839, 299, 670, 398, 878, -638, -388, 446, -161, 53, -613, 5, -763, -442, -358, 22, -952, -1059, -656, -82, 411, -663, 894, 542, 176, -518, 284, -143, 145, -472, 876, -462, -6, 522, 89, 974, -468, 506, 552, 391, 250, 3, -185, -296, -970, -918, -552, -702, -557, -268, -305, 37, -958, -246, -360, 440, -128, 796, 14, -106, 901, 457, 498, 1437, 182, 663, -42, 716, -67, 876, -174, 19, 73, 839, -681, -278, -535, -355, -753, -754, 67, -22, -929, -41, -512, -1057, 218, -692, 222, -499, -404, 364, 653, 448, 757, 995, -204, 468, -7, 908, 267, -155, 594, -953, -480, 832, 108, -509, -1307, -454, -1007, -438, -1190, -544, -1502, -650, -688, -965, -190, -1013, -347, 762, -278, -245, -131, 664, 74, -109, 806, 1016, 518, -24, 36, 871, 850, -160, -57, -62, 67, -84, -431, -1102, 334, -337, -510, -1946, -533]
3522e33M5M19o86K55m02J46K12K27J52r6O10l74O32q01R67K86j80n66o9k77k11
3543b44N46j31k51J10j89L94J50j246O35q29J196j101N57p87J271j89J79Mm02
3562c27O13j217J541Q3m96j18O27K53j15m68R9o0n5o60J379j467l64M13M06k3
3582D4m98J33n0k80k75Q96L77j095Q6N32P69j113L13R92j64L13n2m13k83p0K22
3603C84p0j88Q79j216J02l82O56m52N47j125J24M13n3k32M64q25P88o50j09N09
3623d36K07j009K157j096k84L89J1J147o91n43R13j60J172k303J897j287P65j464
3641f15K94O35L48j510m47J227N49p40n25K66k9N17K13k78N4r6P04l14L4M24q87
3662a76P90j99J7R7P41p93L86o01M7k05N06q11m73R40q24K6R04j151P19L6j372
$$ y = [-533, -488, -69, -755, -500, -902, -756, -544, -317, -165, -261, 349, -25, 607, -194, 773, 1059, 879, 313, 244, -33, -244, 302, 171, -80, 30, -159, 235, 385, -861, -226, -1055, 141, -960, -403, -1190, 81, -108, 71, 75, -327, 286, -931, 610, 693, 197, 79, 706, 959, 844, 376, 475, 415, 360, -300, 1079, -388, -752, -339, 67, 44, -454, -321, -371, -651, -926, -30, 347, -748, -662, -130, 639, -474, -161, 831, 667, 980, 928, 515, 232, 162, 384, 314, 126, 1005, -211, -109, -491, 165, -287, 260, -865, -741, -328, -381, -613, -149, -974, -186, -836, -945, -436, -229, -1238, 919, -177, -461, -72, -61, 1086, 395, -148, 765, 605, 1777, -526, 1371, 84, 849, -615, -321, 314, 662, -848, -1295, -68, 481, -259, -784, -518, -547, -30, 183, -95, -41, -137, 567, 253, 287, 711, -176, 614, 415, 432, 529, 1270, 477, 863, 262, 309, 104, 610, -201, -674, 266, -558, -532, 372, -779, -60, -24, -1396]
3683a396J29P68P03L44K17j86m32N19j40p4K71o88o00N01J224j034J87J02m5r69
3703e99N80q05Q5M19l58P47l11k17P35j068P39m18O98m68J6n78K80m58K33O37
3723a11N4P63p61J022o89m45Q39J59j115R67k45j93j12L80q93P64n20k03k82N38
3743h3n22L60m2k81L01j84j29J69R16n83%j64L55N9J003k68j366J199r80J392
3763A152q37L17L40j082L19k12l09N33o46P77p4K96j174J278j078Q2n43P53k32
3782c40k06O91j28J79n37R8R82r03J64L35N50j001m50J29J236M5m10l38M95M79
3802A070o73r38J629q37o28J53k82L2l93P36j125R89p99J427o34R50l34j71N13
3821F85l5j92p7j09J73M68o50J011j111N99m69K98q7j028O91K77o69J60M24l64
$$ y = [-1396, -1267, -499, 204, 548, 765, 579, 147, 666, 526, 452, 723, 35, -565, -64, 1160, 126, 313, 415, 370, -599, -19, -824, -739, -320, -678, 69, -242, -459, 276, -792, -53, -471, 227, -241, -225, -803, -523, -981, -748, -111, -57, 706, -55, 967, 278, -167, 672, 831, -284, 683, 438, 245, 133, 513, -380, 384, -136, -339, -621, -83, -605, -245, -287, -568, -267, -451, -580, -411, 505, -78, -78, -242, 113, 172, 1175, 907, -459, 740, -240, 1152, 315, 632, 972, -110, 209, -3, -312, 221, -425, 352, 278, 574, -600, 678, -400, -318, -861, -108, -340, -546, 145, 17, 196, -341, -243, 739, -164, 0, 335, 885, -116, -566, -437, 799, 844, 434, 96, 591, 1070, 397, -541, 1088, 251, -377, -224, -506, -474, -867, -131, -1256, -267, -1066, 361, -273, 677, 343, 172, 685, 650, 458, 381, 272, 445, 913, 263, 1274, 163, 762, 293, 591, 504, -524, 167, 444, -225, -65, 359, -5]
3841ej145L95M46L67l80j065J116l39N49k41P85j084K45Q18l99J159r5q78K8N93
3861H70r99J067L6p0r56L97m02l0K46m06p15M72J079j074o8J120o99n00L68K4
3881b40L18l32J213q22j31N7L69k99J89O28j5j138J303j443q97J806n3m93l69
3900c49J237j327J05l91P62k25q41M97k24p2l67P84l71K05k61J527j165L68m58
3919e66N91L76Q74j812J50J693q50l39L72o96L43j76k33Q82q59M04r63O51l2m0
3939b30p94N45l39J07l71L47M77l92Q71J69l25M75l67k42L12L3M88n8J94r21J62
3960A41l95N40Q25m77j257Q67p08K18J50l17L10m61o24Q20j22N86K3j04J65K06
3980C86m83N73p79J63K38n0L41o26J212q71k12N02m41J048j186M54j16o00Q84
$$ y = [-5, -1150, -755, -309, 58, -322, -1387, -271, -610, -61, -302, 483, -601, -356, 462, 63, 1222, 1127, 249, 277, 870, -129, 938, 974, 904, -52, 345, -57, -87, 159, -247, -962, -490, 589, -485, -553, 567, -132, -632, -264, -240, 78, -254, 959, 137, 6, 63, 432, 133, 322, 950, 935, -203, 1100, -343, -1240, 566, 513, 20, -349, 888, -439, -334, -725, 37, -188, -1029, -532, -756, -828, -1195, -411, -782, -577, -838, 689, -476, -108, -566, 25, 401, 1275, -537, -387, 1306, 456, 117, 489, -207, 136, -40, -273, 609, -250, 154, -809, -158, -190, -230, -1024, -479, -818, -711, -1082, -735, -258, -650, 221, 390, 65, 540, 173, -69, 243, 276, 764, 706, 900, -21, 141, -254, 286, 1111, 634, -623, 244, -464, -246, -96, -413, -103, -564, -1188, -368, -490, 96, 119, 15, 180, 386, -97, 476, -303, -140, 98, 48, 389, -237, 975, 104, -108, 394, -47, 1001, -185, 269, 153, -447, 437]
3999D37l85j11j63n84O56J86j154q0P40l6k28O27j39L78k72L91M0o8m8N78j325
4020e60J021m25M37l00K0k12LJ206k42q76p62L90J016m93n66l80o3K31K90N8m45
4041f52l03J384j720J447j210P56K80p08J239l97m3m52J148J08m98J1M3n55j01
4060b23L14l7l44l13j89m52J317n81l70J383n31J16p90k6N32p42P63k70O90N53
4080H00j489J323j3n64R94p81q14P26K30k55m26m61Q73k00l67J017l43M94o88
4099E6n44K17r78J037R93j431k21N86R27m93k23M8l95L92N22n45L06l87J97N54
4119F18q54R28o56k80j4N42q41O08n15k67J018j62k65j81J002j605Q07n45N05
4138a57m96M58Q34j260L92N09M00p43n59O07n97Q18j53l49M62P78j019j19L75
$$ y = [437, 52, -59, -222, -806, -150, 36, -1118, -1198, -458, -494, -722, -95, -234, 144, -128, 263, 303, 235, 187, 765, -560, 461, 36, 473, 173, 193, -19, -16, 1190, 948, 72, -690, -300, 716, 223, -343, -723, -786, -555, -265, -207, -652, -955, 429, -1291, 156, -1054, -298, -18, -726, 513, 116, 73, -379, 769, 877, 379, 390, 433, -122, -223, 91, 54, -290, -603, -792, -1244, 73, -508, -878, 505, -26, 90, -700, -726, -194, -936, -173, -443, 247, 800, -689, 634, 621, 57, 1051, 270, -544, 182, 412, 157, -269, -730, 143, -57, -424, 593, 250, 744, 56, -488, -271, -1249, -212, 781, -650, -871, -285, 642, 149, -74, -26, -421, -29, 493, -52, 254, -133, 64, 618, -236, 692, 36, -244, -258, 284, -557, 51, -464, -731, 287, 125, -140, -321, 681, -924, -117, -662, -157, -653, -195, 639, -621, -229, 280, 680, -63, -622, -15, -612, 206, 53, -296, 166, 944, -75, -194, 181]
4157A81LQ46r50o69M13m43p9N50o55l69J028M90p81k67P91j181P42Q30n02n47
4177e69J158j87J71q52J655j144j034K62O55j080O72k68P70J82j061J049n12J106
4195I73p36O00j559J043j294M04K78O29j030P98n8n83j04N32l33N30O73l08j41
4214C14n51K05J11k37J07J85O5J79P85j510J6L88p63P95k70j95m09N25N12k44
4234Hr59J17M32N82p2n43m31N38P92n01L79p61k10J345j081N96L13m90R78j143
4254a11k90o4Q9l28M05o30N82n52N59o00J76M11J263j844O13J051r01R88j271
4273d54M87n15L50K9n94J434n03J10k81L97r32M34J67Q8L0M21p89K44m07M35q9
4294F2q24R90r93l74Q26L93J71K51l77Q06r01p82J384j140K08l00K62L53j76M00
$$ y = [181, 184, 1030, 80, -589, -176, -619, -698, -148, -803, -1172, -144, 346, -435, -702, 89, -1092, -350, 480, -22, -569, 589, 402, 573, -279, 1376, 232, -802, -540, 115, -965, -293, -561, 209, 391, -670, 379, -133, 973, 237, 837, -722, 321, -973, -569, -291, 338, -692, 106, 48, -535, -639, -107, -440, 90, 763, 455, 314, -237, -32, 79, -158, -51, 134, 199, 378, 1163, -347, -331, 57, -706, 89, -181, -376, -785, -260, 252, 8, -951, -834, -402, 180, 108, -435, -866, -328, 464, -37, 342, -419, -629, 716, -365, 231, 544, 54, 1032, -111, -401, -465, -376, -704, -299, -929, -347, -899, -340, -940, -764, -353, 910, -934, -321, 730, -171, 817, -454, 33, -482, -132, -103, -697, 737, 234, 344, 63, 460, -472, -38, 129, 217, 247, 668, -121, 123, -284, 151, 62, -762, 228, -765, -1139, -313, 80, 251, 502, 125, 931, 30, -752, 632, -508, -300, -600, -338, 15, -161, 239]
4314B39MJ00m93N12l8J04n43l58N51O83j265O5M78M37p92k2k55L58M61J03J72
4335E01p39l2L9O06p11l45M91J311r15j94Q45K42j434P08l67K48J68p21j34L28
4355a05q61N22O44m48m89J060O3j405P56N8j01nk30Q11M2P82o61j265R11m72R19
4376E26M11p85K92O41k1j093Q34M48j081n22r2J484j390p28J402P0j285N55L89
4395E5n17M24l97L64j41K46Nr28J157j042L77R32p7l80m99J032k59M96j29n0o77
4416ho73J188q28R61n63o5o37L5J37L02Q90o14j250J055o12m06J089k78K94j81
4436a64O74p0p36j3J335j252L16L99j4N4r89J33P45l04J0N37l00j71p42J93l80
4457g39K30q7Q51k9o45N40o34O53j07O43p44P16l7q98O35k29L19l24L45L34k42
$$ y = [239, 243, 343, -150, 362, 324, 428, -115, -473, 78, 761, -504, -439, 39, 476, -316, -338, -593, -235, 226, 329, 501, -238, -270, -231, 375, -336, -681, -190, 1121, 206, 12, 857, 1099, -335, 373, 6, 254, 422, -299, -433, -105, -966, -444, 200, -248, -737, 323, 386, -1019, -263, -205, -306, -311, -541, 270, 312, 1094, 433, -832, 79, -393, 526, 937, 152, 444, 1085, 1064, -29, 805, 1253, 172, -350, -442, 1042, -348, -1076, 326, 396, -889, -334, 55, -462, -38, -435, -71, -212, 34, 39, -889, 268, -774, -397, 535, 458, 78, -421, 611, 352, 848, 719, 669, -8, -681, 507, -321, 640, 77, 12, -625, -590, -453, -151, 739, 125, -1125, -70, -682, -1088, 1, -277, 17, -164, 510, 440, -296, -309, 1026, -226, 90, 489, 475, 529, -460, -327, 418, 114, 124, 661, 361, 190, -552, -359, -739, -509, -596, 255, 226, -419, 121, -513, 140, 33, 676, -68, 648, 611, -287, 348, 119, 438, 114, 459, 793, 551]
4478E51l97R30j109l95Q96K13j689L95N99P7o99J103m92p13M2O85q04N99K08n72
4498e72L12P82j003P49k96J08l07N94J18l21L42m4L84j32j367N80Q35m03n82j12
4518c35k50N27P54j685J271l50o97Q13L07j46m31L45J71M96o38n4K17O69p11P39
4538A012m47j011Q93K36l13n73J326j475L84M49o85O0Q95k188O47P44j735J215
4556e66l30J262r57o62Q5J631J9j546J347j77J6k14k96M50m35L35l02K91O84p12
4576g7M15j90L12m51j117Q22m44N22l6K22l26oj29k75j03J335M71r95q38J246
4596C58q73l82O99L71J56q9k73n93R50P26q45p79J144k17l09M18n30L97K69n38
4616F0L21m12o57q4M81k22l8L90M55m76M20k33L67J54l02k03Q0J69j19R7j95m0
$$ y = [551, 154, 1084, -25, -420, 476, 689, -1000, -605, -6, 71, -628, 475, -17, -730, -688, -3, -807, -208, 0, -572, -260, 522, -481, 268, -28, 80, -227, 367, 485, 164, 506, 462, 846, 714, -653, -73, 762, 359, -223, -335, -585, -58, 696, -989, 282, -68, -765, 48, 355, 209, -222, 123, 294, 790, 152, 98, 315, 984, 273, 1012, 565, -446, 447, 683, 370, -203, 1123, -352, 32, 481, -204, -144, 751, -1437, -790, -46, -1781, -566, -896, 366, -591, -1253, -1168, 463, 482, -1064, 283, 106, 122, -92, -388, 62, -373, -38, -340, -49, 635, -77, 338, 148, 460, 9, -1108, -286, -730, -208, -244, -22, -348, -354, -483, -758, -861, 474, 945, -50, -888, 358, -515, -897, -198, 173, 329, 240, -33, -626, 324, 1050, 205, -574, 570, 353, 44, 462, -68, 329, 598, 60, 381, -31, -688, -772, -291, -513, -551, -161, 294, -182, 238, 5, 372, 526, 224, 21, 101, 270, 151, 248, 53, 13]
4638A3j65R43o91M28j45o6m53P98r74m7p61L20Q75P2o48K44L10O60l17r70k46
4659h20J035q19M43K67L60j291R71Q39j021N98l15j69o0J449j540L20J44M06q83
4678h6q8P06j29j273Q08k96P01q06K0O30j347J138n93O83l42Q47q25N19K5p70
4698d78J26J074q4n68R4J071q73l54M05l41m26O30j85j88K90M84q76j19L29j453
4718a442J434o7o89J020r14r2J169q12J74o82O21L46N14j066O06l62J000j93r12
4737c47K83J018L33k545J823j360J219j77L16n6m57l0q38J77l48N21L34l75M4
4756d65j29M72K26l52P15J66j191J862j508o14P04J30l95R92o09J15r4Q8o28J26
4776c89m65J107k47j144R46r32J722j314P08p23N90l06M18K0J116j384o1L94n87
$$ y = [13, -152, 791, 100, 528, 383, 317, -136, 662, -312, -359, -1120, -800, 75, 147, -501, -257, 53, 713, 396, -574, -820, 215, -604, -161, 106, 466, -825, 146, 985, -36, 562, 247, 78, 18, 1467, -73, 247, 391, 797, -86, -174, 532, 403, -870, -62, -358, 343, -463, -443, 187, -1160, -22, -615, 68, -274, 573, -252, 267, 292, -478, -352, 722, 638, 70, 164, 1235, 362, 8, 413, 72, -354, 276, 91, -97, 193, 677, -199, -318, 11, -1442, -8, -75, -764, 256, -658, -750, 419, -393, -219, -901, -280, 66, 580, -486, 120, -242, 758, 565, -347, -64, 954, 1287, -1258, 565, -795, 424, 247, 563, 507, 50, 20, -818, -641, -989, -468, -134, -509, -465, -594, -122, 104, -248, 467, 633, -558, 1304, -204, -818, -114, 16, -379, 613, 4, 119, 25, 113, -515, -389, -854, 253, 6, -1138, -192, -1124, 598, -716, -8, -731, -141, -447, -29, -9, 1107, -277, -338, 56, -531]
4795e31N68k84J642r65J11N98j010J60k15J87o5r89M49J068j127O65k42l29Q90
4814E81o43J58L50n89L09j85K15k81j421J578J11K24l37K14j73j04K38L21L61
4833I27m44J87p67J057m85J4P98j105p50j61Q21k02j31K14l95K0N68p2o39Q86
4853C41jm95n40N18N3Q41j369O76O52o77L15N53m30m63J72J370j611k72L1L83
4873D7P10j116N15M49k68j352R54l10j12M53p02O31j24P1l19J412M53r81K08q27
4893b08j39Q09j269J308l79L47k54J263j268q26M90M71o06P2j63j35k7m5L72j85
4913c72J022p08j425O47K10N69P25l85k34Q1p0j48J098q44L78j09o31J104o75
4932B33k09N61K18M46k056Q02p39J243n71j379J998l85q82N42j437N85M39J015
$$ y = [-531, 37, -247, 1395, 430, 541, 1139, 129, 289, 74, 261, 196, -793, -344, 724, -403, 262, 20, -309, 581, -62, 96, 446, -143, 166, -19, 196, -85, -1506, 72, 183, 407, 70, 284, 111, 7, 245, 566, 927, 483, 670, -97, 960, 475, 489, 1287, 182, -568, -729, 92, -110, -241, -27, -422, -402, 166, 94, -545, 341, 340, -155, -695, -177, -124, 717, -652, 24, 676, -1, 314, 867, 437, -26, 146, 1516, -95, -367, -336, 47, 757, -359, 156, 605, 337, -1015, -61, -371, -483, -30, -732, -101, -225, -154, -473, 939, 1392, 411, 619, -208, -347, 462, -807, 501, 122, 469, 215, 1478, 210, -616, -126, 345, -261, -189, -352, -487, -514, -559, -187, -372, 650, -58, -1483, -836, -626, -57, 668, 283, 49, 130, 60, -88, 1010, 166, 544, 435, -196, 908, 233, 24, 585, 803, 1249, -807, -5, -744, 499, -72, -1451, 547, 162, -720, -178, -1615, -1030, -591, 424]
4950D24l48Q0M28j110N61j77J55k83J28K69M68J395j365j144L97Q1K50N84o57
4969A36m15n82k55J158M39j56J99o24j83M35k50J65J66j283O35P78Q2k89o45N55
4989F6M44k74j37N17K26R5n51j201J95R05N49o75k23M08r4p58R49n69O1l41L63
5010d5p18L2M68O90k08o79Q59l78K74J135j546K65n72N93J49l79P91j98j011J46
5030c32K55n34O18j07J379j980J056L35j009O77n31j26o73J176l22j15o94Q32
5048i5n97M02K01L93L34j400J547l46J078o56O8J33j302O84j038Q82k80O32j167
5067e27K76J332j422l74Q57o86l02Q7P43m84L54L25Q17j903R76M44R0m22j79%
5087BP81l00l23o2j36O93j1l49L55p34m19N59L77o16M14j79j421L82Q68K03K84
$$ y = [424, 76, 156, 584, -526, 35, -142, 13, -270, -142, 127, 595, 1990, 625, -519, -122, -41, 209, 793, 136, -279, -861, -1116, 42, 481, 325, 524, -100, -283, 152, -98, 67, 233, -1050, -415, 363, 445, 156, -489, 66, 510, 236, 99, 616, 842, 937, 386, -815, -620, 285, 834, 159, -64, 344, 250, -508, 441, -128, -67, -408, -45, -763, -731, -263, 427, 219, -460, 399, 21, 295, 1430, -116, 149, -423, 170, 319, -60, 731, 533, -478, -332, -77, -611, 7, -100, 1279, -701, 355, 690, -319, 358, -173, -299, -972, 204, -118, -233, -927, -95, -692, -290, -89, 304, 638, -762, 785, 439, 1517, 861, 929, 1062, -240, 444, -594, 288, 8, 640, -527, -251, 1081, -341, -715, 142, -544, -846, -759, -16, -500, -146, 179, 996, -907, 69, 513, 603, 181, 2, 2, 783, 483, 160, 98, -38, 655, 644, 295, 650, -84, -503, 56, 433, -183, 231, 52, -1369, -987, -119, 84, 368]
5108C68j88j118L29L75l62N49J73k0m24P80l5N97p79N33l62K2j76M86K28j218
5128b42L75P48l69r48o93K009j425k1J073o50J17j72P11o96K54L91p75L66J59
5147B12n29O99k07m57R38r6o66M1J240p77N09p93J73N46j050K38O70n11j03L4
5167A11m11j234L49N40j83J103j008K99K06M62j37L31p28Q75m64k00J06L77M76
5186H70m73l20L80q01L04K71J047j379m6L0K99l50L01q91J54M26k43q8J237j330
5206f02O48n57m16J168j00Q22j055K69p45m10K033q49m26p4J078q18k57N63j19
5225A53L48l83n07j27j45k31J566j021P77r99J81k28J230j41j485R05m61J299
5243G31j608l17J578k33K15n29N60k09K75m19l36Q05p70O34N8j81k3l8L52O87
$$ y = [368, 180, -938, -609, -234, -596, -47, 126, 106, -318, 462, 427, 1024, 245, 778, 416, 438, 262, 748, 976, -242, 133, 881, 512, -436, -1129, 880, -545, -566, 507, -143, -26, -198, 513, -183, 71, 462, -313, 53, 212, -317, 382, 175, -282, 656, 560, -106, -65, 1175, 398, 907, 114, 287, 833, -217, 21, 691, 180, 77, 111, -300, -1534, -1185, -645, -828, 275, -733, -434, -228, 234, 97, 428, -300, 575, 111, -89, 17, 394, 870, 397, 77, 457, -344, -40, 231, 1278, -101, -147, -117, 182, -168, 133, -758, -604, -178, -421, -509, 728, -602, 46, -511, -927, 241, 141, 963, -92, 177, -568, -978, 1055, 206, -220, -294, 784, -34, -291, 272, 153, 501, 118, -389, -516, -661, -892, 674, -347, 430, -569, -388, -616, 614, 473, -1012, -107, -568, 731, -877, -1194, 384, 151, 366, -163, 397, 188, 463, 44, -292, 513, -257, 377, 435, 254, 231, 193, 545, 1232]
5263A232r66n56n22j81M87m00j9K78O17Q90n03k72P36m72o26J37m44L36O23M9
5283D24j554L41P54N73J00j19n07k79p0L18L05l43m7l05O69M34q48j099J868j408
5303g93m0J047l69K39q03J206j134L38J039K26j402Q03N12j249K99M3k38j09J333
5322I48l03q27N4l1K40J54l97n75J272j513Q86M96o88O12r88O7Q89l25k92N38
5342B17m17K27l60R70j47q43J384m3j81p58L04N63j124M54m41q6O6k69p05R03
5362b86l27l9k50M45L29P40j101L50n2K42l42k25J401q56l09p66J332R53j190
$$ y = [1232, 266, -290, -812, -993, -506, -906, -925, -647, -30, 860, 357, 85, 821, 349, -277, -140, -584, -248, 375, 424, -1130, -789, -35, 538, 638, 519, 12, -267, -337, -19, 286, -57, -104, -409, 260, 694, -154, -1253, 615, -793, -833, 214, -155, 84, -719, 487, -647, -309, 730, 956, -446, 357, 869, -380, -81, -38, -276, -385, 948, 645, -182, -128, -159, 81, 235, -162, -737, 535, -978, -92, 404, -284, 328, -660, -593, 296, -29, -321, 217, -200, 27, -333, 637, 490, -353, 1031, 988, 807, 49, 353, 916, -208, 246, -195, -281, -215, -484, -1189, -286, -613, -652, -902, -457, -128, 612, -489, -139, -191, 51, -291, -516, 885, 29, -280, -1046, 286, 1239, 49]
$$ [...]
8191C92
##END NTUPLES=NMR FID
##END=
