##TITLE=dept_SR9_k CH-,CH3- -up, CH2- -down
 CDCl3, 1000 sc
 15.12.2020
##JCAMPDX= 6.0         $$ Bruker NMR JCAMP-DX V2.0
##DATA TYPE= NMR SPECTRUM
##DATA CLASS= NTUPLES
##ORIGIN= UXNMR, Bruker Analytische Messtechnik GmbH
##OWNER= root
$$ XWIN-NMR		Version 3.5
$$ Wed Dec 16 10:05:13 2020 Russian Standard Time (UT+4h)  she@DPX200
##.OBSERVE FREQUENCY= 50.327992884445
##.OBSERVE NUCLEUS= ^13C
##.ACQUISITION MODE= SIMULTANEOUS
##.ACQUISITION SCHEME= undefined
##.AVERAGES= 23000
##.DIGITISER RES= 17
##SPECTROMETER/DATA SYSTEM= spect
##.PULSE SEQUENCE= dept135
##.SOLVENT NAME= DMSO
##.SHIFT REFERENCE= (INTERNAL, DMSO, 0, 214.665)
##AUDIT TRAIL= $$ (NUMBER, WHEN, WHO, WHERE, WHAT)
$$ ##TITLE= Audit trail, XWIN-NMR		Version 3.5
$$ ##JCAMPDX= 5.01
$$ ##ORIGIN= Bruker BioSpin GmbH
$$ ##OWNER= she
$$ F:/spectra/data/she/nmr/depta/1/pdata/1/auditp.txt
$$ ##AUDIT TRAIL=  $$ (NUMBER, WHEN, WHO, WHERE, WHAT)
(   1,<2020-12-16 07:22:48.64 +0400>,<she>,<DPX200>,
      <created by zg, POWCHK disabled, PULCHK disabled
       configuration hash MD5:
       00 E9 B6 7A A2 85 ED C7 34 08 36 98 17 FE 4E 26
       data hash MD5: 16K
       45 80 78 58 81 37 CB A5 AE E7 53 17 77 10 9B 2B>)
(   2,<2020-12-16 10:03:46.89 +0400>,<she>,<DPX200>,
      <Start of raw data processing
       efp BC_mod = 2 LB = 3.5 FT_mod = 6 PKNL = 1 PHC0 = -3286.904 PHC1 = -1072.201 SI = 16K 
       data hash MD5: 16K
       A5 50 2B 33 DA C5 1D 3F 8E 04 9D 08 66 1D 70 81>)
(   3,<2020-12-16 10:04:38.06 +0400>,<she>,<DPX200>,
      <pk PHC0 = -351.0015 PHC1 = 23.6 
       data hash MD5: 16K
       6E 1D A8 A1 F7 79 28 60 78 AC 03 26 E1 C8 A9 BD>)
(   4,<2020-12-16 10:04:42.62 +0400>,<she>,<DPX200>,
      <abs ABSG = 5 
       data hash MD5: 16K
       C8 02 3E B2 35 DD B3 38 37 6F 93 35 C0 A9 2D C7>)
$$ ##END=
$$ 
$$ hash MD5
$$ A2 52 3F 1B 3C A4 4E BE F4 45 AF 30 FA 2C 69 DE
##$RELAX= 
##$RELAX= 
##$RELAX= 
##$RELAX= 
##$RELAX= 
##$RELAX= 
##$RELAX= 
##$RELAX= 
$$ Bruker specific parameters
$$ --------------------------
##$DU= <F:/spectra>
##$EXPNO= 1
##$NAME= <depta>
##$PROCNO= 1
##$TYPE= <nmr>
##$USER= <she>
##$AMP= (0..31)
100 100 100 100 100 100 100 100 100 100 100 100 100 100 100 100 100 100 
100 100 100 100 100 100 100 100 100 100 100 100 100 100 
##$AQSEQ= 0
##$AQ_mod= 1
##$AUNM= <au_zg>
##$AUTOPOS= <>
##$BF1= 50.322709
##$BF2= 200.13
##$BF3= 200.13
##$BF4= 200.13
##$BF5= 200.13
##$BF6= 200.13
##$BF7= 200.13
##$BF8= 200.13
##$BYTORDA= 1
##$CFDGTYP= 0
##$CFRGTYP= 5
##$CHEMSTR= <none>
##$CNST= (0..31)
1 1 145 1 1 1 1 1 1 1 1 1 1 1 1 1 1 1 1 1 1 1 1 1 1 1 1 1 1 1 1 1 
##$CPDPRG= <>
##$CPDPRG1= <waltz16>
##$CPDPRG2= <waltz16>
##$CPDPRG3= <>
##$CPDPRG4= <mlev>
##$CPDPRG5= <mlev>
##$CPDPRG6= <mlev>
##$CPDPRG7= <mlev>
##$CPDPRG8= <mlev>
##$CPDPRGB= <>
##$CPDPRGT= <>
##$D= (0..31)
0 2 0.003448276 0 0 0 0 0 0 0 0 0 2e-05 0 0 0 0 0 0 0 0 0 0 0 0 0 0 0 
0 0 0 0 
##$DATE= 1608024953
##$DBL= (0..7)
120 120 120 120 120 120 120 120 
##$DBP= (0..7)
150 150 150 150 150 150 150 150 
##$DBP07= 0
$$ [...]
##$SUBNAM3= <"">
##$SUBNAM4= <"">
##$SUBNAM5= <"">
##$SUBNAM6= <"">
##$SUBNAM7= <"">
##$SUBNAM8= <"">
##$SUBNAM9= <"">
##$SW= 219.3118970423
##$SWIBOX= (0..15)
0 1 3 0 0 0 0 0 0 0 0 0 0 0 0 0 
##$SW_h= 11037.527593819
##$TD= 16384
##$TD0= 1
##$TE= 0
##$TE2= 300
##$TE3= 300
##$TEG= 300
##$TL= (0..7)
120 120 120 120 120 120 120 120 
##$TP= (0..7)
150 150 150 150 150 150 150 150 
##$TP07= 0
##$TPNAME0= <>
##$TPNAME1= <>
##$TPNAME2= <>
##$TPNAME3= <>
##$TPNAME4= <>
##$TPNAME5= <>
##$TPNAME6= <>
##$TPNAME7= <>
##$TPOAL= (0..7)
0.5 0.5 0.5 0.5 0.5 0.5 0.5 0.5 
##$TPOFFS= (0..7)
0 0 0 0 0 0 0 0 
##$TUNHIN= 0
##$TUNHOUT= 0
##$TUNXOUT= 0
##$USERA1= <user>
##$USERA2= <user>
##$USERA3= <user>
##$USERA4= <user>
##$USERA5= <user>
##$V9= 5
##$VALIST= <valist>
##$VCLIST= <CCCCCCCCCCCCCCC>
##$VD= 0
##$VDLIST= <DDDDDDDDDDDDDDD>
##$VPLIST= <PPPPPPPPPPPPPPP>
##$VTLIST= <TTTTTTTTTTTTTTT>
##$WBST= 1024
##$WBSW= 2
##$XGAIN= (0..3)
0 0 0 0 
##$XL= 0
##$YL= 0
##$YMAX_a= 20003844
##$YMIN_a= -18138814
##$ZGOPTNS= <>
##$ZL1= 120
##$ZL2= 120
##$ZL3= 120
##$ZL4= 120
##$ABSF1= 214.6655
##$ABSF2= -4.669434
##$ABSG= 5
##$ABSL= 3
##$ALPHA= 0
##$AQORDER= 0
##$ASSFAC= 0
##$ASSFACI= 0
##$ASSFACX= 0
##$ASSWID= 0
##$AUNMP= <proc_1d>
##$AZFE= 0.1
##$AZFW= 0.1
##$BCFW= 0
##$BC_mod= 2
##$BYTORDP= 0
##$COROFFS= 0
##$CY= -3
##$DATMOD= 1
##$DC= 0
##$DFILT= <>
##$DTYPP= 0
##$F1P= 0
##$F2P= 0
##$FCOR= 0.5
##$FTSIZE= 16384
##$FT_mod= 6
##$GAMMA= 0
##$GB= 0
##$INTBC= 1
##$INTSCL= 0
##$ISEN= 128
##$LB= 3.5
##$LEV0= 0
##$LPBIN= 0
##$MAXI= 10000
##$MC2= 0
##$MEAN= 0
##$ME_mod= 0
##$MI= 0.4000791
##$NCOEF= 0
##$NC_proc= 2
##$NLEV= 6
##$NOISF1= 120.0001
##$NOISF2= 80.00006
##$NSP= 0
##$NTH_PI= 0
##$NZP= 0
##$OFFSET= 214.6655
##$PC= 4
##$PHC0= -3637.906
##$PHC1= -1048.601
##$PH_mod= 1
##$PKNL= yes
##$PPARMOD= 0
##$PSCAL= 0
##$PSIGN= 0
##$REVERSE= no
##$SF= 50.3227091
##$SI= 16384
##$SIGF1= 140
##$SIGF2= 120
##$SINO= 80
##$SIOLD= 32768
##$SREGLST= <13C.CDCl3>
##$SSB= 0
##$STSI= 16384
##$STSR= 0
##$SW_p= 11037.527593819
##$SYMM= 0
##$S_DEV= 0
##$TDeff= 16384
##$TDoff= 0
##$TI= <>
##$TILT= no
##$TM1= 0
##$TM2= 0
##$TOPLEV= 0
##$USERP1= <user>
##$USERP2= <user>
##$USERP3= <user>
##$USERP4= <user>
##$USERP5= <user>
##$WDW= 1
##$XDIM= 16384
##$YMAX_p= 298537688
##$YMIN_p= -327775064
$$ End of Bruker specific parameters
$$ ---------------------------------
##NTUPLES= NMR SPECTRUM
##VAR_NAME=  FREQUENCY,     SPECTRUM/REAL,   SPECTRUM/IMAG
##SYMBOL=    X,             R,               I
##VAR_TYPE=  INDEPENDENT,   DEPENDENT,       DEPENDENT
##VAR_FORM=  AFFN,          ASDF,            ASDF
##VAR_DIM=   16384,         16384,           16384
##UNITS=     HZ,            ARBITRARY UNITS, ARBITRARY UNITS
##FACTOR=    0.67371834180669, 1,            1
##FIRST=     10802.5493505904, 0,            0
##LAST=      -234.978243228581, 0,           0
##MIN=       -234.978243228581, -327775064,  0
##MAX=       10802.5493505904, 298537688,    0
$$ Real data points
##PAGE= N=1
##DATA TABLE= (X++(R..R)), XYDATA
$$ [...]
5905A746429K0762l6755n9548k47729l90272l41438k50856j16824J11427L53147
5895G88343L82483J57089r5044l22340l97809l53374l07295l28630k76597o7745
5885h20919K61739M80331M05993J99103L9857P0104J70363N5509j97604l55101
5875C09375k32770j2734J79k097J53163L29966L16736J69836n5493k60859j02202
5864F13100K10015L17761J84830m2471k52772l65015k71543k61006m46905m67314
5854g81320k44309O4110L70689N57112M67276J92121K8655o6872k8420L8862q7068
5843E10836q9921J12266J31046j17954k48005k64373l63771l19645J4331L18681
5833c16509M71179N83892N06197N8841l61687k90688N2958K61816K32315R9823
$$ plain form
5905 1746429 1767191 1730436 1670888 1423159 1032887 691449 440593 323769 435196 788343
5895 788343 1170826 1327915 1232871 910531 512722 159348 -147947 -476577 -753174 -820919
5885 -820919 -559180 -78849 327144 526247 566104 636208 806571 862080 664476 309375
5875 309375 76605 63871 64050 61953 215116 545082 861818 1031654 976161 715302 613100
5864 613100 823115 1140876 1325706 1283235 1030463 665448 393905 132899 -314006 -781320
5854 -781320 -1025629 -961519 -590830 -33718 433558 625679 654334 587462 559042 597904 510836
5843 510836 420915 533181 664227 546273 298268 33895 -329876 -649521 -635190 -316509
5833 -316509 154670 738562 1244759 1303600 941913 651225 704183 965999 1198314 1298137
5823A298137j86269m04768m44593m58410m18660k65755j38687j2921K65834M60678
5813c05414M32870K64671J18300J25435K03986K36465K21960n7611n14414o70316
5803E5932m33572J8135L33512L81346L23704K19160J58598K45689L45058L52805
5793B000367J70619j23239k67027k77151k88835l52031l46038k89501k00441j48327
5783a21604q8601r4669k17554l12356k70576m1946K46892K56007J47408K70325
5773b26674L04794J46531q468O8445N08338R23062Q37542K29484m12865p48413
5763A621776q47988o19181l18042r3445J19294J75066k4379k42244k55418q4344
5753e68905J82896L54939M46265L25458l9263l34521l18774k5922K27860J57794
$$ plain form
5823 1298137 1111868 707100 262507 -195903 -614563 -880318 -1019005 -1031926 -766092 -305414
5813 -305414 127456 392127 510427 635862 839848 1076313 1298273 1240662 726248 55932
5803 55932 -377640 -359505 -25993 355353 679057 898217 1056815 1302504 1647562 2000367
5793 2000367 2170986 2047747 1780720 1503569 1214734 862703 516665 227164 26723 -121604
5783 -121604 -210205 -304874 -522428 -834784 -1105360 -1147306 -900414 -644407 -496999 -226674
5773 -226674 78120 224651 216183 284628 792966 1716028 2553570 2783054 2370189 1621776
5763 1621776 773788 154607 -163435 -256880 -137586 37480 13101 -229143 -484561 -568905
5753 -568905 -386009 -31070 415195 740653 701390 366869 48095 22173 250033 407827
5743D07827n3221M6259L28621M39331L07926K71600M21223K35981k31711n06295
5733A667541l59068j68486l39937o10377n30772k11603R6862K43357L08092L93599
5723D89208L35645J73880J98372K24213l7420k68995k26861M0688K34238J23457
5713A286425n7322k7151j9291j13131j7255K63219L63289K02532J4725r9432j70692
5702A625916r1508N301j5484j7707L8691J05879J13440O5298p6848k72505m42419
5691A038054n82770n39285k66497m780n7607j82301p1222O9751o9866m38252n63823
5680a668598l66268j53284j11585j5065K68944N03741O14148L75214p3601k89529
5670i15883k74087k70897k30365o1127J22479L08113M79934M08942L13699N29077
$$ plain form
5743 407827 354606 400865 729486 1168817 1476743 1748343 2169566 2405547 2173836 1667541
5733 1667541 1308473 1139987 800050 189673 -341099 -552702 -455840 -212483 95609 489208
5723 489208 824853 998733 1197105 1421318 1383898 1114903 888042 928730 1162968 1286425
5713 1286425 1229103 1201952 1182661 1069530 1052275 1315494 1678783 1881315 1896040 1796608 1625916
5702 1625916 1534408 1539709 1524225 1506518 1545209 1651088 1764528 1829826 1752978 1480473 1038054
5691 1038054 455284 -84001 -350498 -355278 -412885 -595186 -666408 -596657 -666523 -1104775 -1668598
5680 -1668598 -2034866 -2188150 -2299735 -2314800 -2045856 -1542115 -927967 -552753 -626354 -915883
5670 -915883 -1189970 -1460867 -1691232 -1752359 -1629880 -1321767 -841833 -432891 -119192 409885
5660D09885P97871Q23405O59689L58505o3042l85494l84493k22233j24432P4906
5650A944567K71549K21235J05377P7044K12011L65211K91947p9443o31750q47539
5640A930209o35988k60655J60115K79323L6657j59876k33950k26220k28385l58323
5630C02907o21145n93139q5546K61234J18981j12626k06555j18452J33739L48896
5620e71706N64095N25264J99361J9627K9734R982Q4773L06107L86163K96157Q5124
5609A934681k8344J06037K13766J98588J43326O2804p9566l12606m68439m07404
5599A362843j30828N1228j91772n20227n81532n18598l88328k75514k32899o0072
5589a485699K32879M20763L33738Q6145m8320j3089K29150O47163R25109P96530
$$ plain form
5660 409885 1207756 2031161 2690850 3049355 2986313 2600819 2216326 1994093 1869661 1944567
5650 1944567 2216116 2437351 2542728 2619772 2831783 3196994 3488941 3409498 2777748 1930209
5640 1930209 1294221 1033566 1193681 1473004 1509661 1349785 1115835 889615 661230 302907
5630 302907 -318238 -911377 -996923 -735689 -616708 -729334 -935889 -1054341 -920602 -571706
5620 -571706 -7611 517653 717014 736641 766375 776357 861130 1167237 1553400 1849557 1934681
5609 1934681 1906337 2012374 2226140 2424728 2568054 2630858 2551292 2238686 1770247 1362843
5599 1362843 1232015 1283243 1091471 571244 -10288 -528886 -917214 -1192728 -1425627 -1485699
5589 -1485699 -1252820 -832057 -498319 -412174 -460494 -473583 -244433 402730 1327839 2124369
5579B124369L43444k9660q2048k53741o48713q00291p01805m95077j22462K89992
5569c75992N71538M58459N4631l28961m80937l03922k2086J66566K95481M03055
5559D37832K36978k8367L9529K11685L18248K14749j46275l84576j72294J76240
5549I03749K98770J92472O3655P9548m5231l49614m88485m00426k85871j48161
5539a79594J9635M4755L9306J68040K20508J20964r7291k25077m4421J75928J71220
5528D13973J0054k10934l73928m33072m38055k97259Q5017N02880O69451O49874
5518E78001M65842K88841K53174K43461Q1791k76438m85287n15262n64187o50807
5508e80871m97325j00724K63883N13432N83389L37446r7098k78998k73937l68361
$$ plain form
5579 2124369 2467813 2438153 2356105 2102364 1453651 653360 -48445 -543522 -665984 -375992
5569 -375992 195546 654005 708636 379675 -101262 -405184 -427270 -260704 34777 437832
5559 437832 674810 646443 685972 897657 1215905 1430654 1284379 899803 727509 903749
5549 903749 1202519 1394991 1458646 1538194 1492963 1143349 654864 254438 -31433 -179594
5539 -179594 -159959 -115204 -75898 92142 312650 433614 336323 111246 66825 242753 413973
5528 413973 424027 213093 -160835 -593907 -1031962 -1329221 -1244204 -741324 -71873 578001
5518 578001 1043843 1332684 1585858 1829319 1911110 1634672 1149385 634123 69936 -580871
5508 -580871 -1078196 -1178920 -915037 -401605 181784 519230 422132 143134 -130803 -499164
5498d99164n20036n81105l89354K4973N03979N95658M20534L72765L53936J17096
5488C99282l22412o10945n95265l90271j12701J29171L21238N75755N93665K56021
5478B43538Q8443J41692K05377R4157j35811k42594k77202j62079j03903j86667
5468c35049j89390j28430L4246K64062K60388o8690l08173k66308k09241k43790
5458a190375l13194l17970j79493l195J50814J84191j9638m65127q16760n42456
5448c513203R5495M50731M91161L81353K68545K13499K1801j80418j35674k1382
5438a928092j72399n45704q35539r89292j290522j581177j548635j412264j219157
5429a1522781q70820m38772J09266O60979R31224P56659L37789k453j29035j92001
$$ plain form
5498 -499164 -1019200 -1600305 -1989659 -1964686 -1460707 -865049 -444515 -71750 282186 399282
5488 399282 76870 -534075 -1129340 -1519611 -1632312 -1503141 -1181903 -606148 -12483 243538
5478 243538 331981 473673 679050 773207 637396 394802 117600 -44479 -148382 -335049
5468 -335049 -524439 -652869 -618623 -354561 -94173 -162863 -471036 -737344 -946585 -1190375
5458 -1190375 -1503569 -1821539 -2001032 -2004227 -1853413 -1669222 -1688860 -2153987 -2970747 -3513203
5448 -3513203 -3417708 -2966977 -2475816 -2094463 -1825918 -1612419 -1590618 -1771036 -1906710 -1928092
5438 -1928092 -2100491 -2646195 -3481734 -4471026 -5761548 -7342725 -8891360 -10303624 -11522781
5429 -11522781 -12393601 -12832373 -12723107 -12062128 -11130904 -10374245 -10036456 -10038909 -10167944 -10359945
5419a0359945m37108r39356j621240k365691l168843l960686m917013o406823
5411c4176705q671075j1525429j4293237j5940696j4478041q459674P03169R851656
5403i6990032J5368643J6364730J4640853J1882159R022926O656400M893332L637352
5395a4523637K980161K652164K295623J743811J075510M39821K38109M94681P72862
5386a830895P82591M81791k7898l50374m18965k37467O2465K25122M07065M75575
5376d30990L64252K92449K77806K60309R8504j01793j94939j72594j34158j05553
5366A53293o6778Q1188K76767K19561k9956k16552l33039m43540m59354m39515
5356a257925k90960J2753K61007N02809P23501O15443J76811j71974k77839k26487
$$ plain form
5419 -10359945 -10797053 -11736409 -13357649 -15723340 -18892183 -22852869 -27769882 -34176705
5411 -34176705 -42847780 -54373209 -68666446 -84607142 -99085183 -107544857 -106841688 -96990032
5403 -96990032 -81621389 -65256659 -50615806 -38733647 -29710721 -23054321 -18160989 -14523637
5395 -14523637 -11543476 -8891312 -6595689 -4851878 -3776368 -3336547 -3098438 -2603757 -1830895
5386 -1830895 -1048304 -566513 -594411 -944785 -1363750 -1601217 -1538752 -1313630 -906565 -430990
5376 -430990 -66738 225711 503517 763826 862330 760537 565598 393004 258846 153293
5366 153293 86515 167703 444470 664031 634075 417523 84484 -359056 -818410 -1257925
5356 -1257925 -1548885 -1536132 -1275125 -772316 -48815 566628 743439 571465 293626 67139
5346F7139m0832J56746K61012L20160L04250K80111J39895j27603l19341k69838
5336G71699l27637m80175k71999L5289O4901r6551j93947j50740j06983j27507
5326h83650k30590k27887o9350J4383R2274J22633P1106J79859M65862O94525
5316B29165Q25846P74817M70447N2844k80955m91266o33867n62122k38906R242
5306A55245M4021K8921R8191L52288N42812K96595j32901k45904j72008j63202
5296H04058q280K74514L44128K02848M6225r0717j55134r294J67687J90819L6316
5285A803170j37348m2837K52903K95573R2001J4499l1988k16545l68876l31292
5275A329260k60509j26805j0050M5155R1415o184k42721l34620j82140J7217J7052
$$ plain form
5346 67139 26307 183053 444065 764225 1068475 1348586 1488481 1360878 1041537 771699
5336 771699 444062 -36113 -308112 -272823 -207922 -304473 -498420 -649160 -756143 -883650
5326 -883650 -1114240 -1342127 -1411477 -1397094 -1304820 -1182187 -1111081 -931222 -465360 229165
5316 229165 1055011 1829828 2300275 2353119 2072164 1580898 947031 384909 146003 155245
5306 155245 199266 228187 326378 678666 1221478 1518073 1385172 1139268 967260 804058
5296 804058 795778 1070292 1414420 1617268 1663493 1572776 1417642 1408348 1576035 1766854 1803170
5285 1803170 1665822 1622985 1875888 2171461 2263462 2277961 2245973 2029428 1660552 1329260
5275 1329260 1068751 941946 931896 977051 1068466 1062282 819561 484941 302801 320018 337070
5264C37070j42129k22548r4059R7827Q6155N2702J91176K95676L23505K41006
5254A166381J08510P5984O7155J5885n9966j3738K49599M38110L78823J04580
5244B531323k52128m12614l20237j49382q768K61999M65903K66458j91281n11075
5234A680198m98973l01958j34546m2115j1770O2327J42833R1714o0955j39836
5224G86919m9749p2726k49440l56821k05968p407k5311j45648j95830o1085K96527
5213b86539P10374Q25336N51669R2457j81829k06591j61546n2126R2092J48850
5203A532147Q2146L0521O5860R9404L2759l8689m4877N7105J39076K2915j39856
5192A838511k23689k15461k34196k93742l92559m77402m11273k54493l9723J08149
$$ plain form
5264 337070 194941 -27607 -121666 -23839 62316 115018 306194 601870 925375 1166381
5254 1166381 1274891 1350875 1418030 1433915 1373949 1360211 1609810 2047920 2426743 2531323
5244 2531323 2279195 1866581 1546344 1396962 1388194 1650193 2116096 2382554 2191273 1680198
5234 1680198 1181225 879267 744721 702606 690836 753163 895996 987710 926755 786919
5224 786919 737170 664444 415004 58183 -147785 -155192 -180503 -326151 -521981 -583066 -286539
5213 -286539 423835 1249171 1800840 1893297 1711468 1504877 1343331 1291205 1383297 1532147
5203 1532147 1614293 1644814 1710674 1810078 1842837 1804148 1759271 1816376 1955452 1978367 1838511
5192 1838511 1614822 1399361 1165165 871423 478864 1462 -409811 -664304 -704027 -595878
5182e95878L09670N52641N36555K33441j27338k78113j69958N4299J83091L8653
5172G37063j05311n270J05816j0006k00330k30671k93452n19395n69560k38261
5162a329377J28849K64091J53123o634q5290j90643k28874o9879K76485O76171
5152d11978Q13519O71443L97737K0572k35421k95453k58287k4896L16000L66460
5142A359696J22313j34488j96129j35580j64124j36434j955J12337J7969k55145
5132E88460k11751M5457L0143j82094k33012m2245K41487L71920K45338J23103
5122I76806j2890j86309j07713J23919N1988k11002j10229K97599M13920J42927
5112A379016j09193r3097N3579J43574J60847R9376j5480j13745j87094k79372
$$ plain form
5182 -595878 -286208 266433 802988 1036429 909091 630978 461020 515319 698410 737063
5172 737063 631752 626482 732298 722292 521962 291291 -2161 -521556 -1091116 -1329377
5162 -1329377 -1200528 -936437 -783314 -789948 -875238 -1065881 -1294755 -1364634 -1088149 -411978
5152 -411978 401541 1072984 1470721 1491293 1255872 960419 702132 677236 993236 1359696
5142 1359696 1482009 1347521 1151392 1015812 851688 715254 713299 825636 843605 588460
5132 588460 376709 422166 452309 270215 37203 -5042 236445 608365 853703 976806
5122 976806 963916 777607 669894 793813 845801 634799 524570 822169 1236089 1379016
5112 1379016 1269823 1176726 1230305 1373879 1534726 1634102 1618622 1504877 1317783 1038411
5102A038411l81497l40070n8098J98636J18059M418J67029K66112J78694J27990
5092A319684P1042O4033R7097P2165Q7510K33680L14142K04410O5791j91660n46728
5081A791166n96365k56245K19709M70304M42757M55086N41313M07234L5935l00659
5071C210235m52092l82844j54201n5951p7727k8467l6745k65057m68479m37733
5061H50939k70299p4355k6358j757L04387O22067N92172K20010n7072L00J22565
5050B282599K10096K67126K45085J51070J07512o68k94176n81120m88806j23928
5040A774790O9975M3430N2043R2480J19027J35487J27806J31956o3576m71607
5030B011811p19733o47510m37440j94008J21397L52853M58358M57894K72125J969
$$ plain form
5102 1038411 656914 316844 258746 457382 575441 579859 746888 1013000 1191694 1319684
5092 1319684 1390726 1454759 1551856 1624021 1711531 1945211 2259353 2463763 2529554 2337894 1791166
5081 1791166 1194801 938556 1158265 1628569 2071326 2526412 3067725 3474959 3510894 3210235
5071 3210235 2758143 2375299 2221098 2165147 2087420 2058953 2022208 1757151 1288672 850939
5061 850939 580640 506285 479927 478170 782557 1404624 1996796 2216806 2159734 2160034 2282599
5050 2282599 2492695 2759821 3004906 3155976 3263488 3262820 2968644 2387524 1898718 1774790
5040 1774790 1844765 1888195 1940238 2032718 2151745 2287232 2415038 2546994 2483418 2011811
5030 2011811 1292078 644568 207128 13120 134517 487370 945728 1403622 1675747 1677716
5020A677716k34294l84886l40760j75508J0347J07008k8491k85836m75055n15878
5010f45637l59692j88050k03996j63686P1627K32929J93584J44087J20282k343
5000h00895j36736k62506l79918l06368j07041J22226L33233M44223M68137M04243
4990b21402K28303J00691J64937L06969L49651K06251P127q3341n8333M9246J78965
4979A229064R9083j76014k86256k64681l21803k57853n3700l5076k78558n49470
4969h95264o74657o83395o37293n71143m69455k45676J82372N39263N71787N67800
4959b315661O74088P11024N52762J88749j73052m87338p84738q53342o26302k17330
4949c331140R3020J28031n5649k78911n28548p77839j127542j642445k245650
$$ plain form
5020 1677716 1443422 1058536 717776 542268 552615 659623 631132 345296 -129759 -645637
5010 -645637 -1005329 -1193379 -1397375 -1561061 -1489434 -1256505 -1062921 -918834 -798552 -800895
5000 -800895 -937631 -1200137 -1580055 -1886423 -1993464 -1871238 -1538005 -1093782 -625645 -221402
4990 -221402 6901 107592 272529 579498 929149 1135400 1142527 1059186 1000853 1050099 1229064
4979 1229064 1328147 1152133 865877 601196 279393 21540 -32160 -67236 -345794 -895264
4969 -895264 -1569921 -2253316 -2890609 -3461752 -3931207 -4176883 -3994511 -3455248 -2883461 -2315661
4959 -2315661 -1641573 -930549 -377787 -189038 -362090 -849428 -1634166 -2487508 -3113810 -3331140
4949 -3331140 -3238120 -3110089 -3165738 -3444649 -3973197 -4751036 -5878578 -7521023 -9766673
4940i766673l055195m185571n555864p035110q143986p953327n060999k72898
4932e1029623L600679N007492M264336L411309L869972M961703N154659M286573
4924a6472900L163686K235202J619829J478559J580398J725315J796576J467821
4916a405514P53770O9107l18991l01194m6783J18492L31528N73797O02068N15510
4906H91790M81776L74035J97869o405j56731j82289k69718l28334k70926k30178
4896E00889j64385q4998j28108k77546k32241m5127r6770k59178q1543J91363
4886f77644L57402N18079M25172K21437K38139K86356K10620n1517m00568m62180
4876F65296j81363O5761J05221K11559L52159M00448L61964L50357L49437l9727
$$ plain form
4940 -9766673 -12821868 -17007439 -22563303 -29598413 -37742399 -45695726 -50756725 -51029623
4932 -51029623 -47428944 -42421452 -38157116 -34745807 -30875835 -25914132 -20759473 -16472900
4924 -16472900 -13309214 -11074012 -9454183 -7975624 -6395226 -4669911 -2873335 -1405514
4916 -1405514 -651744 -582637 -901628 -1202822 -1249605 -1131113 -799585 -225788 376280 891790
4906 891790 1373566 1747601 1945470 1939065 1782334 1600045 1330327 1001993 731067 500889
4896 500889 336504 251506 123398 -154148 -386389 -431516 -528286 -787464 -869007 -677644
4886 -677644 -320242 197837 623009 844446 1082585 1368941 1579561 1528044 1127476 665296
4876 665296 483933 549694 654915 866474 1218633 1619081 1981045 2331402 2680839 2641112
4866B641112o46810q27138m97821j96833j94562j82457P1469L40534M00333K73016
4856A180843J08407J57373M15431O11925L90570j10813k81317k1912J94644n6169
4846B588982n60780p28511m98962j60909M3817K55678O14432O34848K45014R502
4836B443111j9284q3615j22654o3489l4926L2288K16475L15354K42554J21615
4826C047429j64945n54212o32295l45275j14941k22382l03605j37921r1640j91628
4816B88585j63769l0857O4304J86064L14536L16155K35208J67768J38556K04701
4806A721251L64896L91545J86864k1463J58220M63649M36464J42827k03018m27921
4796C213314n80882n62137l29319j03232m7706j19594j19765j3193L3277q5493
$$ plain form
4866 2641112 1994302 1167164 669343 472510 277948 95491 166960 507494 907827 1180843
4856 1180843 1289250 1446623 1862054 2473979 2864549 2753736 2472419 2450507 2645151 2588982
4846 2588982 2028202 1299691 800729 639820 683637 939315 1553747 2188595 2433609 2443111
4836 2443111 2423827 2340212 2217558 2154069 2119143 2151431 2367906 2683260 2925814 3047429
4826 3047429 2882484 2328272 1695977 1350702 1235761 1013379 709774 571853 480213 288585
4816 288585 124816 93959 158263 344327 658863 975018 1210226 1377994 1516550 1721251
4806 1721251 2086147 2477692 2664556 2643093 2801313 3264962 3701426 3844253 3641235 3213314
4796 3213314 2632432 2070295 1740976 1637744 1590038 1470444 1350679 1337486 1370763 1285270
4786A285270k15832q8497J43225Q9067J8335K09238L89115L81720K53313N8739
4776B523693l5855M318R2433J35384m6573k58656j78037q684m7002j13987r2058
4765A974976j02276l6803l3479o5644M138O9429J64896K44335R9887j74328l11848
4754A833283l95488m03233k98478k58323k15880l9316J77115L01556K55958Q9034
4744A046228R9807L75343M97882K49294j80208l83294l32050j73980K9323K27147
4734A455492M62713N82169M12952o57m30729o61509o30031l87400j83058n4523
4724E65419P7885K06523K82795K23787N3391j42630j47035k8989M2510l6905q3491
4713A013260Q1727K29447K52183L1855k84627m21427l62675j60162K27128N22156
$$ plain form
4786 1285270 1069438 980941 1124166 1213233 1231568 1440806 1829921 2211641 2464954 2523693
4776 2523693 2487838 2492156 2584589 2719973 2673400 2414744 2236707 2228023 2181021 2067034 1974976
4765 1974976 1872700 1835897 1802418 1736774 1740912 1810341 1975237 2219572 2319459 2145131 1833283
4754 1833283 1437795 1034562 736084 477761 261881 222565 399680 701236 957194 1046228
4744 1046228 1146035 1521378 2019260 2268554 2088346 1705052 1373002 1199022 1228345 1455492
4734 1455492 1918205 2500374 2913326 2912669 2481940 1820431 1190400 803000 619942 565419
4724 565419 643304 849827 1132622 1356409 1409800 1267170 1120135 1091146 1133656 1096751 1013260
4713 1013260 1094987 1324434 1576617 1608472 1323845 902418 539743 379581 606709 1128865
4703A128865L73065j809k87075l51681j63322J90346N04652O50419N64045K94421
4693B901926J6969j19351j33594k88133m15001k55357L4319K02380J67221P565
4683B118944j95003j10060K19629M00983L17746J38952o6775k42881k50092l2235
4673B299208O4521r2152k76827m45990m89944l03443m1450J25470K29024K06400
4663A274817R9367l4194j63826k04344k29675j93809j4812N3602o8165j47677
4653C71284j42948j52802r0305N8538J45658J97434J11249N0129O3753j06194
4643E05796k70427k08375k02195k88784k93466j67668K00723O64422P72718L60476
4633A073220j85519n66420n97960j96717J92093J52368m3816l1826J00566J80020
$$ plain form
4703 1128865 1501930 1500121 1213046 861365 698043 888389 1393041 2043460 2607505 2901926
4693 2901926 2918895 2799544 2665950 2377817 1962816 1707459 1741778 1944158 2111379 2118944
4683 2118944 1923941 1813881 2033510 2434493 2752239 2891191 2824416 2581535 2331443 2299208
4673 2299208 2363729 2271577 1994750 1548760 1058816 755373 713923 839393 1068417 1274817
4663 1274817 1374184 1339990 1176164 971820 742145 548336 533524 587126 518961 371284
4653 371284 228336 75534 -14771 43767 189425 386859 498108 548237 611990 505796
4643 505796 235369 26994 -175201 -463985 -757451 -925119 -724396 -59974 712744 1073220
4633 1073220 887701 321281 -276679 -473396 -281303 -128935 -172751 -204577 -104011 76009
4623G6009J44463q2757k16938q3329J28927K53065K76195J40982R3829K66878
4613I97324L88097L32633K75265J65674j77517l74113j31129K92738O40493O96965
4603C106430N18652K41725o0705k06444l01196m52249m67307j68327L27519N46408
4593C084506L00886l6014l09310n73450n80043k67045K1541Q5156n3120j32860
4583A540247n0618k3174p4497o4729j61578k64143k8562M34976O46606N16780
4573B471308L83390L03195K14495O6205j70302k03879o0442j71744o17320p50824
4563A464082m08064P0904L64530L64872K63993K55206L85296K88505R46j26817
4553B923453j70492j50348p1275j21194l18082m15234j96966J98194N60210Q14004
$$ plain form
4623 76009 220472 137715 -79223 -162552 -33625 219440 495635 636617 730446 997324
4613 997324 1385421 1718054 1993319 2158993 1981476 1607363 1476234 1768972 2409465 3106430
4603 3106430 3625082 3866807 3806102 3599658 3298462 2846213 2378906 2210579 2538098 3084506
4593 3084506 3385392 3349378 3040068 2466618 1886575 1619530 1641071 1726227 1673107 1540247
4583 1540247 1489629 1466455 1391958 1327229 1165651 901508 872946 1307922 1954528 2471308
4573 2471308 2854698 3157893 3372388 3438593 3268291 3064412 3003970 2832226 2214906 1464082
4563 1464082 1056018 1126922 1491452 1856324 2120317 2375523 2760819 3049324 3050270 2923453
4553 2923453 2752961 2602613 2531338 2410144 2092062 1676828 1479862 1678056 2238266 3052270
4543C052270P66819L72753J51385K18565J15838k32022o18210q46628p91587m90588
4533A698595K8809L17719K10790J18714J72511L63412O90191R16920Q02477L89340
4523E709478q596j21496o1277o9254j53197k65567l46582l68231j83574Q5838
4513D217542R9077M45J12033K07373J05553K763j91631m63125o69005o61254l42584
4502B417187R9017K59454J16753O5573L11727N43242M46264J83670p926j97495
4492D237466l93540m76302k96629j3106O9352q4532m07081n86950m13859M160
4482A638979K45612J73219K1077o7555j80043m14749n80366m64629k17331K9952
4472A84166J84831K20822L47373M52855L94055K69889J14539J2344Q0481J75770
$$ plain form
4543 3052270 3819089 4191842 4343227 4561792 4677630 4445608 3827398 2980770 2189183 1698595
4533 1698595 1727404 2045123 2255913 2374627 2547138 2910550 3600741 4517661 5320138 5709478
4523 5709478 5700882 5579386 5518109 5448855 5295658 5030091 4683509 4315278 4131704 4217542
4513 4217542 4316619 4317064 4429097 4636470 4742023 4744786 4553155 4090030 3421025 2759771 2417187
4502 2417187 2516204 2775658 2892411 2957984 3269711 3812953 4259217 4442887 4434961 4237466
4492 4237466 3843926 3367624 3070995 3057889 3127241 3042709 2635628 2048678 1634819 1638979
4482 1638979 1884591 2057810 2078887 2011332 1831289 1416540 836174 371545 154214 184166
4472 184166 368997 589819 937192 1390047 1784102 2053991 2168530 2180874 2261355 2437125
4462B437125J57327J76472K06038N5289j06562n0141J5601n3413j30301j21367
4452B586068j93770l42638l74723k88944q9382K90362O08362N35074J46853j83187
4442B694075l15182k32916k6343P3583J17771J95036J44381j66911l67018m00539
4432A715937m37797l37108j46339r744J69128L93722M94831L21250P4829K436
4422B241145r1196k78721l49306k08615J54017O45445P52430L59171k2859k14127
4412B987384l09592l20126j29950J65224J53686r5447k36874j58865j1974n1343
4402A992123j85019k24838j47685P8988L09314L14160K31378K19774Q7187j47073
4392B528309k16446j43330o449K30060K46957o1841l26991l57888j72509j04830
$$ plain form
4462 2437125 2594452 2770924 2976962 3032251 2925689 2875548 2891149 2837736 2707435 2586068
4452 2586068 2392298 2049660 1674937 1385993 1296611 1586973 2195335 2730409 2877262 2694075
4442 2694075 2378893 2145977 2119634 2193217 2310988 2506024 2650405 2483494 2116476 1715937
4432 1715937 1278140 941032 794693 784949 954077 1347799 1842630 2163880 2238709 2241145
4422 2241145 2149949 1871228 1521922 1313307 1467324 2112769 2865199 3224370 3201511 2987384
4412 2987384 2677792 2357666 2227716 2392940 2546626 2451179 2214305 2055440 2043466 1992123
4402 1992123 1807104 1582266 1434581 1513569 1822883 2137043 2368421 2588195 2675382 2528309
4392 2528309 2311863 2168533 2162084 2392144 2639101 2577260 2250269 1892381 1719872 1615042
4382A615042j54836J07803N33641P19162O79595N98322O00109N01428K85653J06670
4372E592589K8546K79600O44974P72538P57602N50955K30382K0322q6902j75041
4362H615565k01685k04611j12982P158J87042L97635L26639o0217k13824J497
4352H742217J08097j02159l55327m30731m68630m69895m29769n13537n73617m38493
4342E068156k91229k76679m84471o77148n77851m18990m09345m87018l85456j67489
4332H92480m0579K5961j8570k6638R9179J37126J05838Q1456J33039K95746M98410
4321B183448O47351N01596J34764j82680l11480l30557l43859l38362k10686n1950
4311A697585p6880j16578L1313J88590J81697N3504M2483M1107j05169l34495
$$ plain form
4382 1615042 1460206 1568009 2101650 2820812 3500407 4098729 4698838 5200266 5485919 5592589
4372 5592589 5621135 5900735 6545709 7318247 8075849 8626804 8857186 8877508 8790606 8615565
4362 8615565 8413880 8209269 8096287 8103445 8290487 8688122 9014761 8954544 8740720 8742217
4352 8742217 8850314 8748155 8392828 7962097 7493467 7023572 6593803 6080266 5506649 5068156
4342 5068156 4776927 4500248 4015777 3338629 2760778 2341788 1932443 1445425 1059969 892480
4332 892480 851901 877862 859292 832654 931833 1068959 1174797 1256253 1389292 1685038 2183448
4321 2183448 2830799 3332395 3467159 3284479 2972999 2642442 2298583 1960221 1749535 1697585
4311 1697585 1620705 1504127 1535440 1724030 1905727 1959231 2001714 2042821 1937652 1603157
4301A603157l90045l52058l46402k92455j38983Q8202K46286L06442K32215l9356
4291I17003l53759o07840o73470m18227n9110P7696J43964K86082M82565N95098
4281C90002N44754K94149o4020k64344k67206j49779R230J59298K62763K00681
4271A115528M891q6413Q6732L86460N20224M38419M10469N13051M14423J57649
4261C961433j2591j1455J02233K74016L28929J23823k47257m54418k54925J2762
4251C822550O1071K6417p9692k69323m31890l98153j52315O7665P0924j9743m7865
4240B649646l705O2051O9482J18821P5805j01105j37699q5183r4201j23439n5590
4229B374883O5847J10406K3041q1990q9238j20960j86945j39885j7107J28081
$$ plain form
4301 1603157 1213112 861054 514652 222197 83214 171416 417702 724144 956359 917003
4291 917003 563244 -44596 -718066 -1136293 -1195403 -1117707 -973743 -687661 -205096 390002
4281 390002 934756 1228905 1164885 900541 633335 483556 492786 652084 914847 1115528
4271 1115528 1120419 1034006 1120738 1507198 2027422 2465841 2876310 3389361 3803784 3961433
4261 3961433 3948842 3937387 4039620 4313636 4642565 4766388 4519131 4064713 3809788 3822550
4251 3822550 3883621 3910038 3830346 3561023 3129133 2730980 2578665 2646330 2717254 2697511 2649646
4240 2649646 2645941 2707992 2777474 2896295 2972100 2870995 2733296 2648113 2553912 2430473 2374883
4229 2374883 2440730 2551136 2574177 2492187 2402949 2281989 2095044 1955159 1938052 2066133
4219B066133K51377L21697K79705J19858Q1679J74951K30489K57596K31647Q7333
4209D102465j36058j62928K10834O54812P67575O75499O24137N24285L39070K18544
4199G818235J94726J61047k359l91776r33282j269911j142209p64211l76918m4754
4189C248588J13139Q1400L4228Q4691l1351l01313l49203j52677P6154K12731
4179C016387K76846K15901j5264k06104k09264l5098J76312K51801J41807K2541
4169C635865P349L9044L0161o4615k62748m09184l36512j28975m56j9531n5925
4158B434473m6788j35667l64552n19316l90443l7510K32069K50942Q1706j08357
4148A396557j75380p0495M3270j6001q6480m4234K2189n0802k38395k97275j78724
$$ plain form
4219 2066133 2317510 2639207 2918912 3038770 3120449 3295400 3525889 3783485 4015132 4102465
4209 4102465 3966407 3803479 4014313 4669125 5436700 6112199 6736336 7260621 7599691 7818235
4199 7818235 8012961 8174008 8171649 7779873 6846591 5576680 4434471 3670260 3293342 3248588
4189 3248588 3361727 3443127 3477355 3562046 3530695 3229382 2880179 2727502 2803656 3016387
4179 3016387 3293233 3509134 3493870 3287766 3078502 3043404 3219716 3471517 3613324 3635865
4169 3635865 3643214 3682258 3712419 3647804 3385056 2975872 2639360 2510385 2509929 2490398 2434473
4158 2434473 2387685 2252018 1887466 1368150 977707 940197 1172266 1423208 1504914 1396557
4148 1396557 1221177 1150682 1193952 1177951 1091471 1047237 1069426 1018624 780229 482954 304230
4137C04230J4895R4024J09120R2725M5782Q5277J90803L60620N48122N85134K34582
4126B665314k29593m93437n16723k43945J4246J7682p3674O8222L02016K89015
4116A799123J18802m8228n9048J27003J57861n0987q7337P0068K25735K95883
4106B548875J97504J39295J86146Q8498k29162m40647l58024j78935j12609q7915
4096A753026N8507J37656K0798j08259j63324p4369J53163K26763O4441j44995
4086A923407l09738l58959k36366L0610K67702L36352K73362K24803K52110K32933
4076B636216l9079m67209n69409l57488k55962j83282P2021K00545m1790j67278
4066H27285J22620M59935N77448M39879J85115j39973l54266l00757j44709r1399
$$ plain form
4137 304230 319125 413149 522269 614994 660776 746053 936856 1297476 1845598 2430732 2665314
4126 2665314 2435721 1942284 1425561 1181616 1195862 1213544 1139870 1208092 1510108 1799123
4116 1799123 1917925 1869697 1810649 1937652 2095513 2044526 1957189 2027257 2252992 2548875
4106 2548875 2746379 2885674 3071820 3160318 2931156 2490509 2132485 1953550 1840941 1753026
4096 1753026 1811533 1949189 1969987 1861728 1698404 1624035 1777198 2003961 2068402 1923407
4086 1923407 1613669 1254710 1018344 1048954 1316656 1653008 1926370 2151173 2403283 2636216
4076 2636216 2597137 2129928 1560519 1203031 947069 763787 835808 1036353 994563 827285
4066 827285 949905 1409840 1987288 2427167 2612282 2472309 2118043 1817286 1672577 1581178
4056A581178j35201j92108k14567m3001J32341P2999j96279m44422m00231q5343
4046G5366J62629K58954L64577M27144J68986j60522j84248j08249n1715j86656
4036G66266l62114k26287j1781N5048Q751n8808q1912j41544p6792J71365L08140
4025C50332K45120J6167j72895N224K14470K24146K74051M29458L41351J9568
4015A946992j57783j57982q9967n8886K7544J54903J27698n3991k05098k48950
4005A284480l16375m52536m27914k44954j26263q6197j32382j76303q4198R7333
3995f65309L32193N67935O88583O73816L17725l35218p63527q20036o46788m49648
3985a100274k29541J70296N07297M73394K87357K03296N9056k57545o15611p89457
$$ plain form
4056 1581178 1445977 1253869 1039302 996301 1128642 1201641 1005362 560940 160709 75366
4046 75366 237995 496949 861526 1288670 1457656 1297134 1112886 1004637 952922 766266
4036 766266 404152 177865 166084 221132 229883 171075 89163 -52381 -129173 42192 350332
4025 350332 595452 611619 438724 443948 658418 882564 1156615 1586073 1927424 1946992
4015 1946992 1789209 1631227 1541260 1482374 1509918 1664821 1792519 1738528 1533430 1284480
4005 1284480 968105 515569 87655 -157299 -283562 -369759 -502141 -678444 -762642 -665309
3995 -665309 -333116 234819 923402 1597218 1914943 1579725 816198 -3838 -650626 -1100274
3985 -1100274 -1329815 -1159519 -652222 -178828 108529 311825 370881 113336 -502275 -1291732
3975a291732n50966o6934K34050M02061N46228P13345Q75640Q05732N35470K69148
3965B472042J26283o9148l44170o00645o22119k36790K50881N15059M49761K13781
3955B154935J8443k67174o49416p98800n27791L0550O08357P99620N94388K33791
3945B196903j23378k83294j90514M3252J79531p258j92743j11153l0263k5372
3935A455711o3535j49612j34017j07677j50803j35582k76940n54994n70504l04356
3925i92309l3036J32730J80498J70947J66362K03026L01015L60741K13711m8895
3915F54790j30553n7928j18586k67050l72901k46952k1015N9155N4261m4809r0362
3904e81950Q3073K03355N2093j00578k5766K14890L51526K07491P4139J19211
$$ plain form
3975 -1291732 -1842698 -1909632 -1675582 -1273521 -727293 -13948 861692 1667424 2202894 2472042
3965 2472042 2598325 2529177 2185007 1584362 962243 725453 976334 1491393 1941154 2154935
3955 2154935 2173378 1906204 1256788 457988 -69803 -39253 569104 1368724 1963112 2196903
3945 2196903 2073525 1790231 1599717 1642969 1822500 1815242 1622499 1511346 1481083 1455711
3935 1455711 1392176 1242564 1108547 1000870 850067 714485 437545 -117449 -687953 -992309
3925 -992309 -1025345 -892615 -712117 -541170 -374808 -171782 129233 489974 703685 654790
3915 654790 524237 466309 347723 80673 -292228 -539180 -560195 -501040 -446779 -491588 -581950
3904 -581950 -498877 -295522 -243429 -344007 -369773 -154883 196643 404134 478273 597484
3894E97484J44758O071k01742l79580k76202J52695N43999O53574N86389N32280
3884B359726K86679n7307o1624J47544K93238M03998L81151J38862j19876k03472
3874C568919k44398l44176m25793m71030m83330m39270m21932m47701m96129n97063
3864h01903o18957m35136L751N39799P36899N19070J51895j22390j53500L2761
3854a47711K55455L12793J52503J1010o6075j21704k10752l15152m08852n06643
3844a045128m01455q6109K00160K43239j3536m29333o70149m86967k04024n3326
3834b946628J66635L51077N43935P54546O33365J89521j28856j21228N3967J63557
3824c40109K04139J92381O2257j44686l25369m14364m53956l35311j34566M0080
$$ plain form
3894 597484 742242 748313 546571 166991 -109211 43484 587483 1241057 1827446 2359726
3884 2359726 2646405 2589098 2527474 2675018 2968256 3372254 3753405 3892267 3772391 3568919
3874 3568919 3324521 2980345 2554552 2083522 1600192 1160922 738990 291289 -204840 -801903
3864 -801903 -1420860 -1855996 -1852245 -1312446 -575547 -56477 95418 -26972 -180472 -147711
3854 -147711 107744 420537 573040 584050 517975 396271 185519 -129633 -538485 -1045128
3844 -1045128 -1446583 -1532692 -1332532 -1089293 -1102829 -1532162 -2202311 -2689278 -2893302 -2946628
3834 -2946628 -2779993 -2428916 -1884981 -1130435 -497070 -307549 -436405 -557633 -503666 -340109
3824 -340109 -135970 56411 118668 -26018 -351387 -765751 -1219707 -1555018 -1689584 -1649504
3814a649504J51788K013j85284p5931Q8535P9902N7095K1428J4254K01991M06239
3803h87474K61497j61274l98073j91370N7626L8610j41153j48388K7630N3458
3793a488911j65789l41417k33953j01513j60486j60755j09174j40962r7479K2246
3783b978193K44691M61157L68426k261m84342p67658o00306m01317o33751j127906
3773e921460j590915k035041k766034l989251n676381p358412p453129l359610
3765d0150233L567763P550553P473164N841605M088393K683392J777333J342871
3757e825159J031651O60510L43527K66888L62768L89992L30983K28835P6327p032
3747b140710n1136r8741j34212j81053j83289m0840J20441J91151K4594l52519
$$ plain form
3814 -1649504 -1497716 -1495703 -1680987 -1756918 -1668383 -1588481 -1531386 -1509958 -1495704 -1293713 -887474
3803 -887474 -625977 -787251 -1185324 -1376694 -1319068 -1280458 -1421611 -1569999 -1542369 -1488911
3793 -1488911 -1654700 -1996117 -2230070 -2331583 -2492069 -2652824 -2761998 -2902960 -3000439 -2978193
3783 -2978193 -2733502 -2272345 -1903919 -1906180 -2390522 -3158180 -3758486 -4159803 -4793554 -5921460
3773 -5921460 -7512375 -9547416 -12313450 -16302701 -21979082 -29337494 -36790623 -40150233
3765 -40150233 -36582470 -29031917 -21558753 -15717148 -11628755 -8945363 -7168030 -5825159
3757 -5825159 -4793508 -4132998 -3789471 -3522583 -3159815 -2769823 -2438840 -2210005 -2133678 -2140710
3747 -2140710 -2191846 -2290587 -2424799 -2605852 -2789141 -2829981 -2709540 -2518389 -2493795 -2846314
3737b846314o46351p96118q79869q94765q56629q00314q23421r74405j046433
3728a0564619q11181o60538q17900j075618j422346j995211k730224l456729m195104
3719b7729470n264954p082918r571784j2397982j5547364j9212294k3563955k8230957
3711a48601678l2216309l3776160l0362831j9953331l472298J3584768K4821876
3704b29975963K8426186K7630556K6048073K4547218K2282489J9140181J5728706
3697f6172554J2408226R536878P445867N946574M767731L856693L135086K708374
3689a6367125K469572K093827J544807R58357M84055L05407L83191M21211L00930
3680g405768O0974r3032O6584L65051M33109L19961L78421N21363N57879M81199
$$ plain form
3737 -2846314 -3492665 -4288783 -5168652 -6063417 -6920046 -7720360 -8543781 -9518186 -10564619
3728 -10564619 -11375800 -12036338 -12854238 -13929856 -15352202 -17347413 -20077637 -23534366 -27729470
3719 -27729470 -32994424 -40077342 -49649126 -62047108 -77594472 -96806766 -120370721 -148601678
3711 -148601678 -180817987 -214594147 -244956978 -264910309 -268382607 -254797839 -229975963
3704 -229975963 -201549777 -173919221 -147871148 -123323930 -101041441 -81901260 -66172554
3697 -66172554 -53764328 -44227450 -36781583 -30835009 -26067278 -22210585 -19075499 -16367125
3689 -16367125 -13897553 -11803726 -10258919 -9300562 -8816507 -8511100 -8127909 -7706698 -7405768
3680 -7405768 -7344794 -7437826 -7371242 -7006191 -6573082 -6253121 -5874700 -5353337 -4795458 -4314259
3670d314259K76423R918j78001k46004j69289Q9342L53199N18390M30871K4493
3660c204917k44781j52375J91634N26540O33296O90717Q18798P83535M62847N8838
3650E64132p1238P6873K14714J74179Q5767n960j59137k03231p0337R3082J76355
3639H75199P6118j72663k54492p1148Q7200J33815J31440q322j56843j83524k28082
3628B28698k20068j34470j83358k41373m2513J58443R6420m9580r1164L9305J66103
3617b73557J37296j1129j42573j09884r8868j88733j31613K5351J58730L12095
3607c22885L02966J07915k823J1518K0597m6999k13659l58333l45301k22917j04930
3596a174851m441J98545M57987M46863J78258m8450n6267k7073r1228k03280k12578
$$ plain form
3670 -4314259 -4037836 -4027918 -4205919 -4451923 -4621212 -4531870 -4178671 -3660281 -3229410 -3204917
3660 -3204917 -3449698 -3602073 -3410439 -2883899 -2250603 -1559886 -741088 42447 505294 564132
3650 564132 492894 569767 784481 958660 1044427 1038467 879330 676099 605762 698844 875199
3639 875199 951317 778654 524162 453014 540214 674029 805469 797147 640304 456780 228698
3628 228698 8630 -125840 -309198 -550571 -593084 -434641 -338221 -387801 -478965 -439660 -273557
3617 -273557 -136261 -147390 -289963 -399847 -498715 -687448 -819061 -793710 -634980 -322885
3607 -322885 -19919 87996 85173 96691 117288 70289 -143370 -501703 -847004 -1069921 -1174851
3596 -1174851 -1179292 -980747 -522760 -75897 102361 53911 -2356 -29429 -120657 -323937 -536515
3585e36515l4423P9070M1633J26192K64250J85230Q8332L363j96597l80706n49326
3574i09497m27539J42519O49050P12654M60964K41473K42134K22464O6650j94793
3564A206079m60856l97687j01094m438k55928m63089l92616k11546q139K07181
3554h82133K53406N7392j72625k80227k82306p0615K71021M06714K74503P6055
3544c48815N724R8631K18141K46138J54500M9329M798j71976l18076l10003k45713
3533f17322j79452j95638j66645q9713o4784p7783j35591j34992p833k8157j88562
3522a886472k36976j14477P8113J98309J13857j95336l97584m30921m38225k76327
3512c586039Q4914M95315O68329N16873K45766J69264K11001O6883j62693l26155
$$ plain form
3585 -536515 -570938 -491868 -450235 -324043 -59793 125437 213769 217132 20535 -360171 -909497
3574 -909497 -1337036 -1194517 -545467 167187 628151 869624 1111758 1334222 1400872 1206079
3564 1206079 745223 347536 246442 242004 -13924 -477013 -869629 -1081175 -1089314 -882133
3554 -882133 -628727 -571335 -743960 -1024187 -1306493 -1377108 -1106087 -699373 -424870 -348815
3544 -348815 -343091 -244460 -26319 219819 374319 423648 428446 256470 -61606 -371609 -617322
3533 -617322 -796774 -992412 -1159057 -1248770 -1313554 -1391337 -1526928 -1661920 -1669753 -1697910 -1886472
3522 -1886472 -2123448 -2237925 -2159812 -1961503 -1847646 -2042982 -2440566 -2871487 -3309712 -3586039
3512 -3586039 -3501125 -3005810 -2337481 -1820608 -1574842 -1405578 -1194577 -1127694 -1290387 -1616542
3502a616542m00333m06161m31592m78657m12950k93716j98651j90532l28246p99431
3492e556811j580690k143320k020556j224240k38542M63806O16628K59605j87902
3483a1612022m17207n12523n90467o64027p22790j037946j793539k874174m215316
3474b4440011o020278q494795j1640519j5506212k0647117k7386622l4471052
3467a48606606l6788759k4364884N206232L1635649L8804758L3396467K5320771
3460g5396372J8487121J3333719R770197P318224N452469M002911L107789K490683
3452a1433259J858969J258655Q68983Q00731R25514R16621P41007M86105K89105
3443c287569J53593M4460j79851l21218j27920K29701L67034L52169K54544J17423
$$ plain form
3502 -1616542 -2016875 -2423036 -2854628 -3333285 -3746235 -4039951 -4238602 -4429134 -4757380 -5556811
3492 -5556811 -7137501 -9280821 -11301377 -12525617 -12764159 -12300353 -11683725 -11424120 -11612022
3483 -11612022 -12029229 -12541752 -13132219 -13796246 -14519036 -15556982 -17350521 -20224695 -24440011
3474 -24440011 -30460289 -38955084 -50595603 -66101815 -86748932 -114135554 -148606606
3467 -148606606 -185395365 -209760249 -204554017 -172918368 -134113610 -100717143 -75396372
3460 -75396372 -56909251 -43575532 -33805335 -26487111 -21034642 -17031731 -13923942 -11433259
3452 -11433259 -9574290 -8315635 -7446652 -6645921 -5720407 -4803786 -4062779 -3576674 -3287569
3443 -3287569 -3133976 -3089516 -3269367 -3590585 -3718505 -3488804 -3121770 -2769601 -2515057 -2397634
3433b397634Q8233J76041L38029M14188L65007L37985K92872K61864J99737K6429
3423A02751p2066j34870k54608l78521l95486j04078K78138L39162J70902k9172
3413d77848k51382k99734j30780q6466j39299m5311R6614Q9025o2695l6134L61121
3402i82889P03854O31250K45450o3858j43896r1425Q6130L04095K49962q0083
3392H58590m18903o93592p19181m88988j87853R5600K34971L30240M43329N98998
3382E3211P15920O06887K25426k06718m25672m70228m99015n04468l84326k31398
3372a120381j34622j6719L6335k6084j7979J78480M20062N61771O13558M02572
3362H96993m4130k89209k58378l4497K05860L16072K22998l1442r8459P624Q3981
$$ plain form
3433 -2397634 -2309401 -2133360 -1795331 -1381143 -1016136 -678151 -385279 -123415 76322 102751
3423 102751 30685 -104185 -358793 -737314 -1132800 -1236878 -958740 -619578 -448676 -477848
3413 -477848 -729230 -1028964 -1159744 -1246210 -1385509 -1430820 -1334206 -1245181 -1307876 -1344010 -982889
3402 -982889 -279035 352215 597665 533807 389911 298486 384616 688711 938673 858590
3392 858590 439687 -253905 -973086 -1462074 -1649927 -1554327 -1319356 -989116 -545787 53211
3382 53211 769131 1376018 1601444 1394726 969054 498826 -189 -504657 -888983 -1120381
3372 -1120381 -1255003 -1271722 -1235387 -1261471 -1279450 -1100970 -680908 -119137 494421 896993
3362 896993 852863 563654 305276 270779 476639 792711 1015709 984267 885808 893432 977413
3351I77413K12829L63324K44848j4916k01178l78165l86280j30759J32728L0666
3341H50510k81071l89907l67527k32204Q6940M85234N50621J15666l64182m39956
3331A4124j62900J03182K21067J33948o1897j44762j00982R4982M07835L63568
3321H68165L4253p1646k7037j17804k46532j68707j5550j5491j18673k31824l65665
3310d76511l84892k50535M3800M94982P16943N83068L99658K54489J91172K43754
3300A815928K44380J03991l8581j10022k10085l65306l59127j11486K72502N05001
3290A747195L19309l8883k53160l54707m13207m66301m41743l06160j47606N4854
3280c00409L34289M70481L85375J88511r3234j35612K6759O2626o9494k28392
$$ plain form
3351 977413 1190242 1553566 1798414 1783498 1582320 1204155 817875 687116 819844 850510
3341 850510 569439 179532 -187995 -420199 -333259 151975 702596 818262 454080 14124
3331 14124 -148776 -45594 175473 309421 247524 102762 1780 96762 504597 868165
3321 868165 902418 830772 803735 685931 439399 270692 255142 239651 120978 -110846 -476511
3310 -476511 -861403 -1111938 -1068138 -573156 143787 726855 1126513 1381002 1572174 1815928
3300 1815928 2060308 2164299 2125718 2015696 1805611 1440305 1081178 969692 1242194 1747195
3290 1747195 2066504 2027621 1774461 1419754 1006547 540246 98503 -207657 -355263 -300409
3280 -300409 33880 504361 889736 1078247 985013 849401 876160 938786 869292 640900
3270F40900j75608l6073m4178r3986k9085Q0186R0505K2182P9756L21247M37932
3259A293778L46867K04919P3213q4108k20991k45988j79626j53433k69345k94320
3249D70966j2434J32874q1934k89628j76934J98551L87415L17452Q3070k54644
3239G74754m21123m15455m27096l41985Q1251M64647L44237j6149j77071j89144
3229c23134k58678m24564n43801n53249l67668p3368K8576j0124J45693M77078
3219a903239M93960J47355l2998M8240J84423K51374J10811j43992m83666o59307
3209a987039m41595j9955L75427O59732P48093N14934J02213j86823l92574o13133
3199a240720p15573n30012j55440J3403K3648O3770J21779K74357L18987O9252
$$ plain form
3270 640900 465292 429219 385041 291055 261970 342156 432661 454843 534599 855846 1293778
3259 1293778 1640645 1845564 1918777 1834669 1613678 1367690 1188064 1034631 765286 470966
3249 470966 458532 591406 509472 219844 42910 241461 628876 946328 1029398 774754
3239 774754 353631 -61824 -488920 -830905 -749654 -285007 59230 43081 -133990 -323134
3229 -323134 -581812 -1006376 -1550177 -2103426 -2471094 -2544462 -2515886 -2526010 -2380317 -1903239
3219 -1903239 -1409279 -1261924 -1294922 -1246682 -1062259 -810885 -700074 -844066 -1327732 -1987039
3209 -1987039 -2428634 -2448589 -2073162 -1413430 -665337 -150403 -48190 -235013 -627587 -1240720
3199 -1240720 -1956293 -2486305 -2641745 -2628342 -2604694 -2540924 -2419145 -2144788 -1825801 -1756549
3189a756549j82336k77641k13351p637J78645K35264K04686L79151P25860P86667
3179G2759M75678Q2298j24992l0258J77370J53547o1733l36846n13841m79477
3169e85495l39517j15886J01947K11081K39071J72619P1209Q9580J45274O1366
3159E1249R681J91436M12938L86481N2258k82856l94190k77312p8064j01535m02942
3148d32856o22959n52920k76947J84025N74930P21545O25965L41194j86406o07242
3138b31671n13754j79025J25125L68656M56885M11800L67770K30457M8953r9336
3128I85860j43436j76289k49353l97439n34949n76457o00233o37068o93814p08555
3118c731733m64972m9987L2992k14512l18180k66207l76955o53995p63347n83820
$$ plain form
3189 -1756549 -1938885 -2216526 -2429877 -2437514 -2258869 -2023605 -1818919 -1439768 -713908 72759
3179 72759 548437 630735 505743 475485 652855 806402 744669 407823 -106018 -585495
3169 -585495 -925012 -1040898 -938951 -727870 -488799 -316180 -244971 -155391 -10117 51249
3159 51249 60930 252366 665304 1051785 1104043 821187 426997 149685 71621 -29914 -432856
3148 -432856 -1055815 -1608735 -1885682 -1701657 -1126727 -405182 220783 561977 375571 -231671
3138 -231671 -745425 -924450 -799325 -430669 26216 438016 805786 1036243 1085196 985860
3128 985860 842424 666135 416782 19343 -515606 -1092063 -1692296 -2329364 -3023178 -3731733
3118 -3731733 -4196705 -4246692 -4213700 -4428212 -4746392 -5012599 -5389554 -6043549 -6806896 -7390716
3108g390716l28613j35596O9641J87941R0531k7636l1503j20415l84121o22297
3098h692784q18745j014416j261973j715808k289742k845056l450114m251092
3090b6339730n449155p296625r773518j2816781j6735917k1813627k7691966l2627951
3082a60545270l1816123j8851884M450874K3523961K8906583K4412861J7272995
3075a12646003J2860840J3303416J4762959J3350841J0485575P926061O041257
3068c3915054M553870L380003K405503J553009Q56624L15280l33221j227569k183876
3059b4595431k976654l613536m267181n141075o361810q103694j0676299j4562535
3051h0298215j9648576k5341763l1012570l6241139m0325713m1488624l6006501
$$ plain form
3108 -7390716 -7719329 -7854925 -7785284 -7597343 -7506812 -7534448 -7565951 -7686366 -8070487 -8692784
3098 -8692784 -9511529 -10525945 -11787918 -13503726 -15793468 -18638524 -22088638 -26339730
3090 -26339730 -31788885 -39085510 -48859028 -61675809 -78411726 -100225353 -127917319 -160545270
3082 -160545270 -192361393 -211213277 -206762403 -183238442 -154331859 -129918998 -112646003
3075 -112646003 -99785163 -86481747 -71718788 -58367947 -47882372 -39956311 -33915054
3068 -33915054 -29361184 -25981181 -23575678 -22022669 -21166045 -20850765 -21183986 -22411555 -24595431
3059 -24595431 -27572085 -31185621 -35452802 -40593877 -46955687 -55059381 -65735680 -80298215
3051 -80298215 -99946791 -125288554 -156301124 -192542263 -232867976 -274356600 -310363101
3044c10363101j7411963J4450886M3346646N3984042M9010645L8725088K8970930
3037i9286827K1195154J5559389J1780301R157408P053662N364269M267126L612658
3029b1296860L018096K456043K124498J948779J558586R73060N02406L12642M51324
3020g951426Q11013J222723J490967J526890J488652J540612J686276J908537
3012C724244K145749K123439J978939K122017K407047K498021K106643J032622
3004B0138721m88118j805597k481216k488036k073723j692421j527594j180473
2996F401543p52549o64862o55534o49400p47665o91238m65724l16849k51502k10903
2986I95317j77168l606K17637J36450j87397k94551j00876K7713l4551q8928j18497
$$ plain form
3044 -310363101 -327775064 -313324178 -269977532 -215993490 -166982845 -128257757 -99286827
3037 -99286827 -78091673 -62532284 -50751983 -41594575 -34540913 -29176644 -24909518 -21296860
3029 -21296860 -18278764 -15822721 -13698223 -11749444 -10190858 -9217798 -8715392 -8402750 -7951426
3020 -7951426 -7140413 -5917690 -4426723 -2899833 -1411181 129431 1815707 3724244
3012 3724244 5869993 7993432 9972371 12094388 14501435 16999456 19106099 20138721
3004 20138721 19650603 17845006 15363790 12875754 10802031 9109610 7582016 6401543
2996 6401543 5648994 4984132 4328598 3679198 2931533 2240295 1774571 1457722 1206220 995317
2986 995317 818149 814543 1032180 1168630 981233 686682 585806 613519 578968 490040 371543
2975C71543j77104k28127j03986J31732J20479j4955j7683J28752K57000K93804
2965G61455J96587J31910K47055M17343M46625L69388L76965M08977N57206P95149
2955D708660R82745J222577J590353K154482K732303L118701L159468L014168
2947B2683457K856292K397378J436459j1713j438796k221587k416855k273699
2939B1010936j846179j300329r93519j000337r54040j012380j411000j689005
2931A0804147j695013j581188j374082j179314j061999q10420m15207j03509q8772
2922B494643j34310k6945J37312J40391j33548m77996n66839k25210J96490L83140
2912A787128L31587J42914k26442o31321p68488n74144l59813k39518o1656L6434
$$ plain form
2975 371543 194439 -33688 -137674 -5942 114537 99582 81899 210651 467651 761455
2965 761455 958042 1089952 1337007 1754350 2200975 2570363 2947328 3356305 3913511 4708660
2955 4708660 5691405 6913982 8504335 10658817 13391120 16509821 19669289 22683457
2947 22683457 25539749 27937127 29373586 29361873 27923077 25701490 23284635 21010936
2939 21010936 19164757 17864428 16870909 15870572 14916532 13904152 12493152 10804147
2931 10804147 9109134 7527946 6153864 4974550 3912551 3102131 2686924 2583415 2494643
2922 2494643 2360333 2333388 2470700 2611091 2477543 1999547 1432708 1207498 1403988 1787128
2912 1787128 2118715 2261629 2035187 1403866 635378 61234 -298579 -538097 -599753 -563319
2902e63319k0213j45252o6863J69737J92040O5680j9949j06234j32844j56542
2892g83759k25902k83997j72481J28573K29434n7044j74917K2456K31087L15984
2882g70566J89738J8628k5348K14905N27052N30829K40052j68939k55113r668
2872D91570K26262L51166L10038J20956m8088j38397k67092l01591j72863j02063
2862D69898j69740k01038j00172Q3214L25542M42938K81035J06j64961k69847
2852F96975l04025k97866k61735j01983J43722L38846L10657L4818l96708p22679
2842e59978p08436n01203l07242j57375J1912K03179L41959M49734L92403L6294
2832g98753j36608O7417K63994K58774J86623J9246j56839m0742J54725J46212
$$ plain form
2902 -563319 -583532 -728784 -795647 -625910 -433870 -368190 -388139 -494373 -627217 -783759
2892 -783759 -1009661 -1293658 -1466139 -1337566 -1108132 -1165176 -1340093 -1317637 -1086550 -770566
2882 -770566 -580828 -562200 -587548 -372643 154409 685238 925290 756351 501238 491570
2872 491570 717832 1068998 1379036 1499992 1451904 1313507 1046415 744824 571961 469898
2862 469898 300158 99120 -1052 82162 407704 850642 1131677 1131783 966822 696975
2852 696975 392950 95084 -166651 -268634 -124912 213934 524591 559409 162701 -559978
2842 -559978 -1268414 -1769617 -2076859 -2234234 -2222322 -2019143 -1677184 -1227450 -835047 -798753
2832 -798753 -935361 -867944 -603950 -345176 -158553 -139307 -296146 -336888 -182163 -35951
2822c5951P8396J08538O9526n1959j36765j47217J599K51399M25678M52411K66412
2811A282067j59029m46180n05426n49244n05042l25129j51877j32282j87239l4208
2801a713589L38815M19665K23299O1700l2882j24071j47857j43759k19981k69625
2791a608285j67996N5501K61102K49722K47532K63238M24395O78053P21378M71060
2781A595700J16234j75121k02416L437J98131J63480L5999j2614L3380O0901n6812
2770A760299j43321r6687K5887J89355L02928L02180K66376J31118K222O8403
2760B808760O6645j87153l31912k58389j94259j19750j29340j77813r7045P9830
2750A459574J92379K31932K13517K64615L59358L16172J47772J03830K29832N06642
$$ plain form
2822 -35951 42445 150983 220509 168550 31785 -115432 -113833 137566 563244 1015655 1282067
2811 1282067 1123038 676858 171432 -377812 -882854 -1207983 -1359860 -1492142 -1679381 -1713589
2801 -1713589 -1374774 -955109 -731810 -670110 -702992 -827063 -974920 -1118679 -1338660 -1608285
2791 -1608285 -1776281 -1720780 -1459678 -1209956 -962424 -699186 -274791 403262 1124640 1595700
2781 1595700 1711934 1536813 1334397 1337834 1535965 1699445 1735444 1722830 1756210 1817111 1760299
2770 1760299 1616978 1520291 1546178 1735533 2038461 2340641 2607017 2738135 2740357 2808760
2760 2808760 2875405 2688252 2356340 2097951 1903692 1783942 1654602 1476789 1379744 1459574
2750 1459574 1651953 1883885 2097402 2362017 2721375 3037547 3185319 3289149 3518981 4025623
2740D025623P33602P00971N27704M81430O19507P77240Q85259J070081J087010
2731A0908427O58308j1159l90424j99313L35341Q76386J292415J643184K153880
2722A7267045K836836L532232M209162N397936P392523J0193907J3651776J7777790
2714H2259207K3067884L0182287L8944941M6751068M6735538L0596763l247180
2707B95290508l8465453n2473079m6905457l5746060k5995478j8881730j3701451
2700F3121800r919899p191245n299691l822093k514760j385456n15396J27333
2692C2600593R41124K326383M254967O610743R665343J3518380J7994002K2696542
2684A10608077K6586997K6538262J5405746p613020k5839698k8658946k2821322
$$ plain form
2740 4025623 4759225 5460196 5987900 6469330 7088837 7866077 8751336 9821417 10908427
2731 10908427 11566735 11555576 11165152 10965839 11301180 12177566 13469981 15113165 17267045
2722 17267045 20103881 23636113 27845275 33243211 40635734 50829641 64481417 82259207
2714 82259207 105327091 135509378 174454319 221205387 267940925 298537688 295290508
2707 295290508 256825055 204351976 157446519 121700459 95704981 76823251 63121800
2700 63121800 53201901 46010656 40710965 36888872 34374112 32988656 32473260 32600593
2692 32600593 33541717 35868100 40123067 46733810 56399153 69917533 87911535 110608077
2684 110608077 137195074 163733336 179139082 171526062 145686364 117027418 94206096
2677I4206096j5565959r614378n989701n822110p818494q421469p225199n807786
2669B7941000m623909l728707l035884k444823j922284j504160j068124p56649
2661H856460n77666m14403l02155j65603l1449l1643J6218o3178l02179m28960
2651F555442l27064q0978l9780l15212o26659q32270q20548o11255l97714k36915
2641B267047J1028L26035M54744L58558L25271J10880l58640n87059m82964k88949
2631B135951k69329n29433o45320l19425J56531L17952J05117k51770n05123o35874
2621d40723m76362j21110J64508J75320N5888Q4037K11990K01964O6167j3825
2611i2146N7684N0811j02844l08677m25454l34702k87490m36152o44448q12653
$$ plain form
2677 94206096 78640137 69025759 63036058 57213948 49395454 40973985 33748786 27941000
2669 27941000 23317091 19588384 16552500 14107677 12185393 10681233 9613109 8856460
2661 8856460 8278794 7864391 7562236 7396633 7365184 7333541 7349759 7286581 6984402 6555442
2651 6555442 6228378 6147400 6107620 5792408 5165749 4333479 3512931 2901676 2503962 2267047
2641 2267047 2278075 2604110 3058854 3417412 3742683 3853563 3494923 2907864 2424900 2135951
2631 2135951 1866622 1337189 691869 372444 528975 846927 952044 700274 195151 -440723
2621 -440723 -917085 -1038195 -873687 -698367 -642479 -558442 -346452 -144488 -78321 -92146
2611 -92146 -34462 16349 -86495 -395172 -820626 -1155328 -1442818 -1878970 -2523418 -3336071
2601c336071q34540o61788k56804K86764O95582Q16226O87182L73644J62433K24208
2591a843164L07105J99030l4519j71535j65911K4926M49832P26150N78155Q9405
2581A59474k82970k64355j13808j0873M4890r8263l70886l83701j78800O089J06669
2570a386534J89055K15513J05614L2238M893j32298j93675p5156L8008K2678O4088
2559a115576K76619K03605j95947m47126m96799m99735n59399o40174o50687p20064
2549d845283r14079r22730p24429m88946j66263J71712L51062L80874L08677K67793
2539f581612K64036K58796K32914R5812r1145j66121k07014k88011m77105q07722
2529g767172j068560j127512r89309q66245j087613j652960k503582l611102m742885
$$ plain form
2601 -3336071 -4170611 -4832399 -5089203 -4802439 -4106857 -3290631 -2603449 -2229805 -2067372 -1843164
2591 -1843164 -1536059 -1337029 -1371548 -1543083 -1708994 -1684068 -1234236 -508086 70069 159474
2581 159474 -123496 -387851 -501659 -512532 -467642 -565905 -936791 -1320492 -1499292 -1493203 -1386534
2570 -1386534 -1197479 -981966 -876352 -844114 -839221 -971519 -1165194 -1240350 -1202342 -1179664 -1115576
2559 -1115576 -838957 -635352 -831299 -1278425 -1775224 -2274959 -2834358 -3474532 -4125219 -4845283
2549 -4845283 -5759362 -6682092 -7406521 -7895467 -8061730 -7890018 -7538956 -7158082 -6849405 -6581612
2539 -6581612 -6317576 -6058780 -5825866 -5730054 -5821199 -5987320 -6194334 -6482345 -6959450 -7767172
2529 -7767172 -8835732 -9963244 -10952553 -11818798 -12906411 -14559371 -17062953 -20674055 -25416940
2520b5416940n498237n288878l304395M58350M240946O157525O137193N221182
2512a7293254M091504L004995K140034J566648J128559P18997L49429j3739k42202
2503d549029j56815R4930J81008P6867L4655M9226J38763K73691K99520R9677
2493c457507j75474k36526j35119l3659J05949L08969K68550p7430k46930j48622
2483c827799j20018k29037l55532l94026l64258k99829j73764j91711m64147p56675
2473g176796r93063j283637j645425k009026k249104k313724k226782j876168
2465b1773725j438609j056640n29520J31284N66616P15490O97926N64753M63745
2456b1658680M12578K32935o3893k66795m00398p12430j133384j264222q58446
$$ plain form
2520 -25416940 -30915177 -36204055 -39508450 -39050100 -34809154 -28651629 -22514436 -17293254
2512 -17293254 -13201750 -10196755 -8056721 -6490073 -5361514 -4642517 -4293088 -4306827 -4549029
2503 -4549029 -4705844 -4610914 -4429906 -4353039 -4318384 -4269158 -4130395 -3856704 -3557184 -3457507
2493 -3457507 -3632981 -3869507 -4004626 -4038285 -3932336 -3623367 -3354817 -3432247 -3679177 -3827799
2483 -3827799 -3947817 -4176854 -4532386 -4926412 -5290670 -5590499 -5764263 -5955974 -6420121 -7176796
2473 -7176796 -8169859 -9453496 -11098921 -13107947 -15357051 -17670775 -19897557 -21773725
2465 -21773725 -23212334 -24268974 -24798494 -24667210 -24100594 -23385104 -22687178 -22122425 -21658680
2456 -21658680 -21246102 -21013167 -21077060 -21343855 -21744253 -22456683 -23590067 -24854289 -25712735
2447b5712735j67665M73478O93824M03151j78617q84659j566229k066283k439788
2438c1445523k827966l248438l372291k130720J106790M643006O264265N924420
2430b5086457M736838L546468K759920K195273J630222J176737R87522Q86115
2422g167362O55982N68765Q36761J049612Q57750M70972K09759J62918K57169
2413b097674L79388M53796L70812P7524j86625l63425m85035l52329q2031K15192
2403b070407M65608M87020K53625K9979O6377R4086k9637j12588k5708J13604
2393g28041N7000j31105k33197j88503k92848n95562o13547m42450l08544k18616
2383c695413j29891K8669J82853K86510L39548M32187L76150k7903l35532l73349
$$ plain form
2447 -25712735 -25880400 -25406922 -24713098 -24309947 -24488564 -25373223 -26939452 -29005735 -31445523
2438 -31445523 -34273489 -37521927 -40894218 -43024938 -41918148 -37275142 -31010877 -25086457
2430 -25086457 -20349619 -16803151 -14043231 -11847958 -10217736 -9040999 -8053477 -7167362
2422 -7167362 -6511380 -5942615 -5105854 -4056242 -3198492 -2727520 -2517761 -2354843 -2097674
2413 -2097674 -1718286 -1264490 -893678 -816154 -1002779 -1366204 -1851239 -2203568 -2285599 -2070407
2403 -2070407 -1604799 -1117779 -864154 -834175 -767798 -673712 -703349 -815937 -841645 -728041
2393 -728041 -671041 -802146 -1035343 -1223846 -1516694 -2112256 -2725803 -3168253 -3476797 -3695413
2383 -3695413 -3825304 -3796635 -3613782 -3327272 -2987724 -2555537 -2179387 -2207290 -2542822 -2916171
2373b916171k51357O3095L25886K73243K9574j53312k18985j6504L74489M60358
2363b029684K11076j8431j98120l65764l33350k05626k25974l43335k59914k679
2353c771801K80697M16568K93187J93795K31752J89043J36541j0817l10134n45100
2343b896269o02603m19997p0188J12291R0151J19741K02968J33659O127j0574
2333c334694K8910J28956J36761K2266o4871j56315l00378l17033j36205L6704
2323c955899O0049k2491n4560q6728k88940l74573k92056n03249q30191q37506
2313g186144n84567k48948O2737J03776j68998m08064m69479m45833m76554n20886
2303a0342960m91825l64549o7109L0797r6108o8087J06641K37858J56556j51333
$$ plain form
2373 -2916171 -3167528 -3104433 -2778547 -2505304 -2475730 -2629042 -2848027 -2864531 -2490042 -2029684
2363 -2029684 -1818608 -1837039 -2035159 -2400923 -2734273 -2939899 -3165873 -3509208 -3769122 -3771801
2353 -3771801 -3491104 -3074536 -2781349 -2587554 -2355802 -2166759 -2030218 -2041035 -2351169 -2896269
2343 -2896269 -3498872 -3918869 -3989057 -3876766 -3786615 -3666874 -3463906 -3330247 -3324120 -3334694
2333 -3334694 -3305784 -3176828 -3040067 -3017801 -3082672 -3238987 -3539365 -3856398 -3992603 -3955899
2323 -3955899 -3895850 -3918341 -3972901 -4059629 -4348569 -4723142 -5015198 -5518447 -6348638 -7186144
2313 -7186144 -7770711 -8019659 -7956922 -7853146 -8022144 -8430208 -8899687 -9345520 -9822074 -10342960
2303 -10342960 -10834785 -11199334 -11266443 -11235646 -11331754 -11399841 -11293200 -11055342 -10898786 -11050119
2293a1050119m98163o35988o72408o46530n06116l29816K2103O66438J123348
2284a2527251J171585J198774J173437J095011J070782J051464J043064R96406
2276c726728P35260K36780k41340m99861m90957l47543j74372k1585Q9768O9506
2266d371072j7238J48101N35099Q33444P50744M46876J86747j2218j38666j73731
2256a811914j40578M5654K48700J08731k44986l80215k53014j5972K11542K17233
2246b014819P2671q0725j89027j36623k1936L4762J12357K60872L69486M40221
2236a152761L93226K00322K39993L65527J20714k23425l32025l36368l49640l40564
2226a415001k52683j85605l19676o30375p28011m55564n7746K35862J00561m72354
$$ plain form
2293 -11050119 -11548282 -12184270 -12856678 -13503208 -14009324 -14339140 -14317037 -13650599 -12527251
2284 -12527251 -11355666 -10156892 -8983455 -7888444 -6817662 -5766198 -4723134 -3726728
2276 -3726728 -2991468 -2754688 -2996028 -3495889 -3986846 -4334389 -4508761 -4530346 -4440578 -4371072
2266 -4371072 -4388310 -4240209 -3705110 -2871666 -2120922 -1674046 -1487299 -1499517 -1638183 -1811914
2256 -1811914 -1952492 -1906838 -1658138 -1549407 -1794393 -2174608 -2427622 -2443594 -2232052 -2014819
2246 -2014819 -1942148 -2022873 -2211900 -2348523 -2370459 -2335697 -2223340 -1962468 -1592982 -1152761
2236 -1152761 -759535 -559213 -319220 46307 167021 -56404 -388429 -724797 -1074437 -1415001
2226 -1415001 -1667684 -1853289 -2172965 -2803340 -3531351 -3986915 -4044661 -3808799 -3708238 -4180592
2216d180592q64600p76137m25765k05495k85509m44402o25860q40550j029318
2207i678228j311538j734000k196275k611393k863287k936671k674097j908845
2199b7914334q86397L45686J705694K824125L373344L217443K569204J829284
2191a2935951J273696J013710R14588Q21087O65493M77004J91655J9763L2050
2182g526905l5944l10537o82793p69288m60364j73109r4278j52227j26470N4454
2172a0277461J05205o6057k59061k89537j04794Q5785R4344P8463k9100l47430
2162a1009643m48448j53961Q9684J51632J83903K16869L29562L92707K24725R4363
2152i928607K12733M78314P54744P92101N59201L25971J60144J16210K06633J94667
$$ plain form
2216 -4180592 -5045192 -5821329 -6247094 -6452589 -6738098 -7182500 -7808360 -8648910 -9678228
2207 -9678228 -10989766 -12723766 -14920041 -17531434 -20394721 -23331392 -26005489 -27914334
2199 -27914334 -28800731 -28455045 -26749351 -23925226 -20551882 -17334439 -14765235 -12935951
2191 -12935951 -11662255 -10648545 -9733957 -8912870 -8247377 -7770373 -7578718 -7558955 -7526905
2182 -7526905 -7562849 -7873386 -8556179 -9325467 -9785831 -9958940 -10053218 -10205445 -10331915 -10277461
2172 -10277461 -10172256 -10238313 -10497374 -10786911 -10891705 -10805920 -10711576 -10633113 -10662213 -11009643
2162 -11009643 -11458091 -11612052 -11522368 -11370736 -11186833 -10969964 -10640402 -10247695 -10022970 -9928607
2152 -9928607 -9715874 -9237560 -8482816 -7690715 -7131514 -6805543 -6645399 -6529189 -6322556 -6127889
2142f127889K34754M00349M53222M51181M89681M55136M07347M97688N23949K68719
2132a945863j56817m05865l48585o0428J95151K73212K57842M29025N47420K74999
2122i39909l4653j39791j20094q7220j64484k10757r6345J03995K08215K12159
2112a268884J35111l2993k76820l45455j83682j56729j62483j14093j82574k39156
2102b827758j38510M788K3458m3190n6980J2380J92393M04287M38018J57446r2004
2091a925672P297K30756M40988N38842L91502K29325J13626r7648k81843l29336
2081f82163l82938m20716k34218j00776j84387k99093j04581L32772N35532M63679
2071a076889K63235r984j17646r3616j83509k66938k38500j57087o5988J20156
$$ plain form
2142 -6127889 -5893135 -5492786 -5039564 -4588383 -4098702 -3643566 -3236219 -2738531 -2214582 -1945863
2132 -1945863 -2102680 -2508545 -2857130 -2917558 -2722407 -2449195 -2191353 -1762328 -1214908 -939909
2122 -939909 -974562 -1114353 -1234447 -1321667 -1486151 -1696908 -1793253 -1689258 -1481043 -1268884
2112 -1268884 -1133773 -1166766 -1443586 -1789041 -1972723 -2129452 -2291935 -2406028 -2588602 -2827758
2102 -2827758 -2966268 -2961480 -2938022 -2981212 -3038192 -3025812 -2833419 -2429132 -1991114 -1833668 -1925672
2091 -1925672 -1918375 -1687619 -1246631 -707789 -316287 -86962 26664 -70984 -352827 -682163
2081 -682163 -1065101 -1485817 -1720035 -1820811 -2005198 -2304291 -2408872 -2076100 -1540568 -1076889
2071 -1076889 -813654 -823638 -941284 -1034900 -1218409 -1485347 -1723847 -1880934 -1946922 -1826766
2061a826766L95891M80270J69770j73200k18384j10485l6901k5394r3323k44623
2051a683145k66379j86685j98345j73640J6115J75280K46041J33857l1418J16284
2041a852035L71731M28646L99474M04249L96759L16574J28096k23062m81696o71368
2031g82632r15010r64580q60378n52790q8258L33740N36796M71446M77389N08971
2021a835306L76326J42695p2716q6043L3814J5714k11081k44524n7448m561q5532
2010b028662k95142n25029m68845j57391K39693N13612M74804L13908K32008J07244
2000a593800j776m1284l5295Q5780M30633P54098O68064K70664l2599l31639n60228
1989c87382m26620k29062m6848J30298R7078o0441j81472k39398k77070j01115
$$ plain form
2061 -1826766 -1430875 -950605 -780835 -954035 -1172419 -1282904 -1319805 -1345199 -1438522 -1683145
2051 -1683145 -1949524 -2136209 -2334554 -2508194 -2492079 -2316799 -2070758 -1936901 -1968319 -1852035
2041 -1852035 -1480304 -1051658 -652184 -247935 148824 465398 593494 370432 -111264 -782632
2031 -782632 -1697642 -2662222 -3522600 -4075390 -4163648 -3829908 -3293112 -2821666 -2344277 -1835306
2021 -1835306 -1458980 -1316285 -1389001 -1475044 -1441230 -1425516 -1636597 -1881121 -1938569 -1943130 -2028662
2010 -2028662 -2323804 -2848833 -3317678 -3475069 -3235376 -2721764 -2246960 -1933052 -1701044 -1593800
2000 -1593800 -1595576 -1636860 -1672155 -1586375 -1155742 -401644 266420 537084 504485 172846 -387382
1989 -387382 -814002 -1043064 -1089912 -959614 -862536 -922977 -1104449 -1343847 -1620917 -1722032
1979a722032K42904L38095K20983J59820L01481N65041O97852N21514J29509k15559
1969A239608k84537n7042J25811O5448p9979k24455n29603r23365r11764m49367
1959b029245l1764J05640K00810M08358N83326N46398K61301M0881J16836L90422
1949E92963N35532K45402k52135m22362l01498n3498J95437K82329K43919K9703
1939A095792k02572l29021n07616o08491m52152j25466J33239J38884K6589j84675
1929a015489l10530j54917J67607M32230M67077M22992L00424K7106j69309j50485
1919A6706j70185k27786J9950K90896K60204q648l00970k98883j24867k08096
1909g51679n14981n69286k12392J65031L61261M53528M83078L94026J51703j90972
$$ plain form
1979 -1722032 -1479128 -1141033 -920050 -760230 -458749 106292 804144 1325658 1455167 1239608
1969 1239608 955071 898029 1023840 1089288 1009309 784854 255251 -668114 -1579878 -2029245
1959 -2029245 -2061009 -1955369 -1754559 -1346201 -762875 -216477 44824 85705 202541 592963
1949 592963 1128495 1373897 1121762 699400 397902 344404 539841 822170 1066089 1095792
1939 1095792 893220 564199 56583 -551908 -1004060 -1129526 -996287 -857403 -830814 -1015489
1929 -1015489 -1326019 -1480936 -1313329 -881099 -414022 8970 309394 336500 167191 16706
1919 16706 -153479 -381265 -361315 -70419 189785 181137 -119833 -418716 -543583 -751679
1909 -751679 -1266660 -1835946 -2048338 -1883307 -1522046 -1068518 -585440 -191414 -39711 -230683
1899b30683m96705o05488n53021l47651m8532J76446J96269M7945n3453k0446
1889a935319L4875J26281K55587K70163J28769J17498K67347K37672L4679m4939
1879e07387R4536K07952N2686j58915l02609l66145k87394r3102K4317J8327R9269
1868a218465K88686L96513K25648q7415k66388j21862L04433O57357O14731L92876
1858A186114J99065P0456l8934j55348k53544k66797k20085n7902O3835o0264
1848D66596k40815l71867m29810l82894k50764j25023j05778n8868J32879K05348
1838a160996L278j54710p0029J80194M05638M14634K50891N6332j3874M2437J27347
1827H1142J88146J38762R135r6070k74993m53646n29278m90633l56850j86357
$$ plain form
1899 -230683 -727388 -1332876 -1885897 -2233548 -2282080 -2105634 -1909365 -1861420 -1914873 -1935319
1889 -1935319 -1900444 -1774163 -1518576 -1248413 -1119644 -1002146 -734799 -497127 -462448 -507387
1879 -507387 -412851 -204899 -152213 -311128 -613737 -979882 -1267276 -1360378 -1336061 -1317734 -1218465
1868 -1218465 -929779 -533266 -307618 -395033 -661421 -783283 -478850 178507 793238 1186114
1858 1186114 1385179 1455635 1416701 1261353 1007809 741012 520927 463025 526860 466596
1848 466596 225781 -146086 -575896 -958790 -1209554 -1334577 -1440355 -1499223 -1366344 -1160996
1838 -1160996 -1157718 -1312428 -1382457 -1202263 -796625 -381991 -131100 -74768 -88642 -46205 81142
1827 81142 269288 408050 417185 321115 46122 -407524 -936802 -1427435 -1784285 -1970642
1817a970642n9294M4096J17150J41143J70356L11821L23602J85394K56697L76933
1807a02744L03673K77461L69137L10650k8021m36467m68977k40131j12922j45617
1797b73958j90089j34172j05983j42673o5819K36449M95709M37979Q3664k70036
1787G1071l80091l07282k51941k57364k7051L72911N90845N11514L51168K70158
1777I43938J98059Q8707o4537k10408l42278n40877o40380l78353O464J33841
1767h05824l0863k11031j76235j56116j41120j48874j95057j00209M9461K61419
1757a654449M43052M33420L30141K47984J55326k2269l06769m66917k40954J02263
1747i79172K58013J35648k1817K0573Q3626O8736M7798j01520k56010j32572K21597
$$ plain form
1817 -1970642 -2029936 -1985840 -1868690 -1727547 -1557191 -1245370 -921768 -736374 -479677 -102744
1807 -102744 200929 478390 847527 1158177 1130156 693689 224712 -15419 -128341 -273958
1797 -273958 -464047 -598219 -704202 -846875 -912694 -676245 -180536 257443 341107 71071
1787 71071 -309020 -616302 -868243 -1125607 -1152658 -779747 -188902 322612 673780 943938
1777 943938 1141997 1230704 1166167 955759 613481 72604 -567776 -946129 -939665 -805824
1767 -805824 -836687 -1047718 -1223953 -1380069 -1521189 -1670063 -1865120 -1965329 -1915868 -1654449
1757 -1654449 -1211397 -777977 -447836 -199852 -44526 -66795 -373564 -840481 -1081435 -979172
1747 -979172 -721159 -585511 -607328 -586755 -503129 -434393 -386595 -488115 -744125 -876697 -655100
1736f55100M24141K70547q4453j98883l8315j40489l80755l52154j84407j5972
1726a355840K80826N41658N28304K77925j88381p14358q51746n64809j79389P8733
1716b147077J54221P6483k7176j2056J71092K49623K56163K93303K45018J72720
1706e67686K04668L27502L74280K87432K35013K81024K58078L5998k76501m66695
1696F93113n34638n03990l16250J01910L94588K71199p8585k74791j64637j8060
1686d30141R4396K59065L77275N40817P03518P20450O16238L49415q038j99883
1676C023112j40630o6996m5230M6598O9335r9050j97918q450K50707L13458J93698
1665C338634R8176K68644N68566P13632R46845J420824J859210K127175K130349
$$ plain form
1736 -655100 -230959 39588 -44865 -243748 -282063 -422552 -803307 -1155461 -1339868 -1355840
1726 -1355840 -1075014 -533356 -5052 272873 84492 -629866 -1481612 -2046421 -2225810 -2147077
1716 -2147077 -1992856 -1916373 -1943549 -1955605 -1784513 -1534890 -1278727 -985424 -740406 -567686
1706 -567686 -363018 -35516 338764 626196 861209 1142233 1400311 1436309 1159808 693113
1696 693113 158475 -345515 -661765 -559855 -165267 105932 27347 -247444 -412081 -430141
1686 -430141 -335745 -76680 300595 841412 1544930 2265380 2881618 3231033 3222995 3023112
1676 3023112 2882482 2815486 2770256 2816854 2886189 2787139 2589221 2580771 2831478 3144936 3338634
1665 3338634 3436810 3705454 4274020 4987652 5934497 7355321 9214531 11341706 13472055
1656A3472055J875848J433517Q16783J98932k88012n13988m45369k52576n3562
1647A6243628J17684L47159N63482N79121L64937L4479m98619j026650j261413
1638A5463808j502191j687688j551577j378962j268479j025661o27486m91313
1630E930451p33377q53018p21435n13743l57278k89330j96605m4018k0421k31039
1620A970187m48704m72707j56295J29815L53l04263m37037l37562j14051K914
1610a67350l3581j7868M6164j02239m07350m14647k04690q2355K5010J33431K01697
1599a023778K77569K36699L0876k09907l82980l75043k04353o3703n3333l4941
1589a802894R4497K10292K99945M18938L34621J0178l28373m45102l22749k50279
$$ plain form
1656 13472055 15347903 16781420 17598203 17797135 17509123 16995135 16549766 16297190 16243628
1647 16243628 16361312 16708471 17271953 17851074 18216011 18250490 17751871 16725221 15463808
1638 15463808 13961617 12273929 10722352 9343390 8074911 7049250 6421764 5930451
1630 5930451 5197074 4344056 3622621 3108878 2751600 2462270 2265665 2221647 2201226 1970187
1620 1970187 1521483 1048776 892481 1022296 1022649 718386 281349 -56213 -170264 -167350
1610 -167350 -200931 -218799 -172635 -274874 -682224 -1096871 -1301561 -1383916 -1358906 -1225475 -1023778
1599 -1023778 -746209 -509510 -478634 -688541 -1071521 -1446564 -1650917 -1714620 -1767953 -1802894
1589 -1802894 -1708397 -1498105 -1198160 -779222 -444601 -434423 -762796 -1207898 -1530647 -1780926
1579a780926p1562L07833M29400J91104m2900q3762j70233l96474m68683k19630
1569b305833K08423M85116N70154M58777K08181j3549r3087j95650k97830j61450
1559a136748M0369J46505K70709K99443J86281M2710N536O6518M9692n975J39826
1548A04866L86678M15846L09293N6426l66666o98956p03914l40844J17361L83880
1538c36030K58987q1854k06131j29739r498J88128L22830J20256k11265l65852
1528d50168k66104o0255J25151K75549K99133P5079j99756j61122J96277N23511
1518C57295N98773N22728M69387M31354L28567K72167L31995N27266Q25944J151766
1508E817242J511174J715556J414426N53589n20570j243822j361315j169401j013272
$$ plain form
1579 -1780926 -1852488 -1544655 -1115255 -924151 -967051 -1050813 -1221046 -1617520 -2086203 -2305833
1569 -2305833 -2097410 -1612294 -1042140 -583363 -375182 -388731 -481818 -677468 -975298 -1136748
1559 -1136748 -1096379 -949874 -679165 -379722 -193441 -150731 -145195 -78677 -28985 -34960 104866
1548 104866 491544 907390 1216683 1273109 906443 207487 -496427 -837271 -719910 -336030
1538 -336030 -77043 -158897 -365028 -494767 -504265 -316137 6693 126949 -84316 -450168
1528 -450168 -716272 -776527 -651376 -375827 -76694 -1615 -201371 -362493 -166216 357295
1518 357295 956068 1478796 1948183 2379537 2708104 2980271 3312266 3839532 4665476 5817242
1508 5817242 7328416 9043972 10458398 11011987 10491417 9247595 7886280 6716879 5703607
1499E703607q95305q76596p67580l23704K82468P74709J062329J218358J648029
1490G826315K472778L322311M138991N235665O593682P509104O956674L995481
1482D8051001j088128n413520o779465n965036m440832l077545k197756j724103
1474A7364616j409794j210984j214399j322083j311292j176198r39126o87577
1466H093163m73796k50245k65105o22010q99763r51263q38239m71790n1773J98972
1456C468151K99252L40217M52022N94458P80970J115572J874309K796966L523644
1447A5245561M340083N756886Q110202J1046470J2779310R733213r1520j0010764
1439E6909441j3003881j0984239p962856n762388m397909l305816k328621j629053
$$ plain form
1499 5703607 4808302 3931706 3164126 2840422 3122890 3897599 4959928 6178286 7826315
1490 7826315 10299093 13621404 17760395 22996060 29589742 37098846 44055520 48051001
1482 48051001 46962873 41549353 34769888 28804852 24364020 21286475 19088719 17364616
1474 17364616 15954822 14743838 13529439 12207356 10896064 9719866 8780740 8093163
1466 8093163 7619367 7369122 7104017 6482007 5582244 4630981 3792742 3320952 3269179 3468151
1456 3468151 3767403 4107620 4559642 5154100 5935070 7050642 8924951 11721917 15245561
1447 15245561 19585644 25342530 33452732 44499202 57278512 67011725 66920205 56909441
1439 56909441 43905560 32921321 24958465 19196077 14798168 11492352 9163731 7534678
1431G534678j060977o96558o88917p95887p35546n02758j26976J54368J85386
1422C266813M4939j78767l93386m73457n32909n34697l45306j68320n2952N5435
1412F87393J21046L7959q4281j65980k09848j04163R1660J39466j29481m20554
1402c6783l92997l10152k84445j57915M1867O9743m6973o1363M0823M5810M940
1391a087445J46125J95439K14987L75613M06665K25138k3711j75552l01244n61349
1381e85334o93563m62765r1029K21202L31231J62672j64391l29031l17480j96563
1371b125051j1412L9111k38164o60991p66454l37040M15528R74747J038108Q27823
1361h43795N34931J29938k09528k61896j04348J56425L52344K77649K0301o7142
$$ plain form
1431 7534678 6473701 5777143 5088226 4292339 3556793 3054035 2927059 3081427 3266813
1422 3266813 3311752 3132985 2739599 2266142 1733233 1198536 853230 684910 631958 687393
1412 687393 808439 846398 762117 596137 386289 282126 373786 513252 383771 -36783
1402 -36783 -429780 -739932 -1024377 -1182292 -1140425 -1070682 -1117655 -1179018 -1138195 -1092385 -1087445
1391 -1087445 -941320 -745881 -530894 -155281 251384 476522 452811 277259 -23985 -585334
1381 -585334 -1278897 -1741662 -1832691 -1611489 -1280258 -1117586 -1281977 -1611008 -1928488 -2125051
1371 -2125051 -2136463 -2097352 -2335516 -2996507 -3762961 -4100001 -3684473 -2709726 -1671618 -843795
1361 -843795 -308864 -178926 -388454 -650350 -754698 -598273 -245929 31720 52021 -15121
1351a5121n1315j11091j59134k39006n23707p06077l85487M8729K07006J95721
1341a739482J17943J28836K84982L49792L76861M51808L83268L65297M45305M05388
1331A569998J30213j65628k97294l46915k54588j17612N7730K85442K96686N3585
1321A211617k21614m95404o28259m25587j76997k27481k35082K3070K14585J04610
1311h56542J4735M5136J23825K24680L85022M50074J35986k96217l07561j13219
1301a94081j8853j7118k4339J60839M67850N00364L41709L44817M80210N26101
1291B567499L53394P0709j57556j72277m325J23759J76935P4451j41708m28094
1281B462787o14591l77419Q3617M59834O42950P05919Q30470Q54514P54262P38443
$$ plain form
1351 -15121 -66436 -177527 -336661 -575667 -1099374 -1805451 -2190938 -2142209 -1935203 -1739482
1341 -1739482 -1621539 -1492703 -1207721 -857929 -481068 -29260 354008 719305 1164610 1569998
1331 1569998 1700211 1534583 1237289 890374 635786 518174 575904 861346 1158032 1211617
1321 1211617 990003 494599 -133660 -559247 -736244 -963725 -1198807 -1175737 -961152 -856542
1311 -856542 -841807 -796671 -672846 -448166 -63144 386930 522916 226699 -80862 -194081
1301 -194081 -212934 -230052 -254391 -93552 374298 874662 1216371 1561188 2041398 2567499
1291 2567499 2920893 2991602 2834046 2661769 2657444 2781203 2958138 3032589 2890881 2462787
1281 2462787 1848196 1470777 1554394 2014228 2657178 3363097 4193567 5048081 5802343 6540786
1271F540786R85592J421288J825419J962772J662037J390742K003232L627222
1263B1419090N789964P698966Q876492R208218Q432594O255379K725000r06816
1255F9498887k984428k376865p70459j124918l212909n163492o895704p861330
1247C9108782p336791n872837m323311l174490k322177j760551j563957j635551
1239A1119117j610965j258953r78668r88361r85007r16569p95460o37152m85170
1230B462812m40101n28069n56629j34708L64741L24264Q8963o412J708N7989m8565
1219A585993l68301n72935n71523m52327k43319k8993l723N7067K50338J90672
1209a57051N141N729J1590L6689J57011K33264K56120L41366N07975N02012K58870
$$ plain form
1271 6540786 7526378 8947666 10773085 12735857 14397894 15788636 17791868 21419090
1263 21419090 27209054 34908020 43784512 52992730 61425324 67680703 70405703 69498887
1255 69498887 66514459 64137594 63367135 62242217 59029308 53865816 46970112 39108782
1247 39108782 31771991 25899154 21575843 18401353 16079176 14318625 12754668 11119117
1239 11119117 9508152 8249199 7270531 6282170 5297163 4380594 3585134 2947982 2462812
1230 2462812 2022711 1494642 938013 803305 1168046 1492310 1581273 1574861 1576569 1634558 1585993
1219 1585993 1217692 644757 73234 -379093 -622412 -651405 -655128 -598061 -347723 -157051
1209 -157051 -151910 -146181 -134591 -97902 59109 292373 548493 889859 1397834 1899846 2158716
1198B158716k2623j46550j65599k19438l13177m24922n08388n67231m49564j74976
1188h33752K01259M61272L02745r9283l20901k40713r4992J62946L82500L98850
1178C19931L87001L72083K81973J06775j06363k55069j53807M5702M372q6788
1168I15810r469J4178j50743l19483l62498k70993k28073l35514m01630l16193
1158a464608j93111r2434k8774R5610K57739K91731R086k77116j72140J75243
1148a398774M42128M85449L49262J93023J07759k0180k62221l41715k18323j22867
1138g86459p2268n779J32770L58228N76743N99056L53912O9375p1113j72959j88100
1127G93406j70475j15243M5137R9573Q687j31181k16374j18085Q9594J29547l4160
$$ plain form
1198 2158716 2136093 1989543 1823944 1604506 1291329 866407 358019 -209212 -658776 -833752
1188 -833752 -632493 -171221 131524 32241 -288660 -529373 -624365 -461419 -78919 319931
1178 319931 706932 1079015 1360988 1467763 1361400 1106331 952524 998226 1002598 915810
1168 915810 906341 920519 769776 450293 87795 -183198 -411271 -746785 -1148415 -1464608
1158 -1464608 -1657719 -1750153 -1778927 -1683317 -1425578 -1133847 -1124761 -1401877 -1574017 -1398774
1148 -1398774 -956646 -471197 -121935 71088 178847 158667 -103554 -445269 -663592 -786459
1138 -786459 -858727 -864506 -731736 -373508 203235 802291 1156203 1225578 1154465 981506 793406
1127 793406 622931 507688 552825 652398 661085 529904 313530 195445 285039 414586 380426
1116C80426j41245j40058j26612j92271l33803k83347P093L16463N66895P32524
1106G86065O32299L65342K06860Q9888j19428l36433m71878n68290n39125l59151
1096c13851q1259j2184j15636p6209J34087M13096O49854P45333N67745N4496
1086A965472m35592o23261n62196l79067l29519l98945k30559N4951L47966N16095
1076g4655L58446j6438k60302j71433K8852K72587N92385O41673K37334k42092
1066A366357m59076n24153n06616l45785j5098L33002N21284N40852K54934k86781
1056H78920p66361q62779n65724k18227j33130j22950J4825R8229R3110J59033
1046a425054K30130K65424K70805K91129J92999l269j32436j35191j31281j90871
$$ plain form
1116 380426 239181 99123 -27489 -219760 -553563 -836910 -829817 -513354 53541 786065
1106 786065 1418364 1783706 1990566 2080454 1961026 1624593 1152715 584425 45300 -313851
1096 -313851 -395110 -407294 -522930 -599139 -465052 -51956 597898 1343231 1910976 1965472
1086 1965472 1529880 906619 344423 -34644 -364163 -763108 -993667 -938716 -590750 -74655
1076 -74655 283791 267353 7051 -164382 -135530 137057 729442 1371115 1608449 1366357
1066 1366357 907281 383128 -123488 -469273 -484371 -151369 369915 910767 1165701 878920
1056 878920 112559 -750220 -1315944 -1534171 -1667301 -1790251 -1775426 -1677197 -1584087 -1425054
1046 -1425054 -1194924 -929500 -658695 -367566 -174567 -177836 -310272 -445463 -576744 -767615
1036g67615k05842k18934k44656l05945k79073j34263j54176l61502m19767k34727
1026c326500J17291M29127M79013K81994P9519L8287J90499M32417M79811L08695
1016d89847n8932m41797n30312l96014k17930O7935K94161K03112J17135K51305
1006a201184L43489L61753M33411M54309L68878K13761l6143j82279j74716q4912
996D96367p226L0886M5423q6409k82656k47721M4932K85494J06928l17815m50054
985c81851k08459L074q9010l50040l69256n7657K16597L03120L31738L20008K24609
974e7127r393l33836n02759m71271k40854K27641N57125M96038K77395J04903
964D7862K9496P8283J26801J38220n706k81722l51319j86352P8557L59942N42362
$$ plain form
1036 -767615 -973457 -1192391 -1437047 -1742992 -2022065 -2156328 -2310504 -2672006 -3091773 -3326500
1026 -3326500 -3209209 -2780082 -2301069 -2019075 -1939556 -1901269 -1710770 -1278353 -798542 -489847
1016 -489847 -548779 -990576 -1520888 -1916902 -2134832 -2066897 -1772736 -1569624 -1452489 -1201184
1006 -1201184 -857695 -495942 -62531 391778 760656 974417 938274 755995 581279 496367
996 496367 489141 520027 565450 479041 196385 -51336 -6404 279090 386018 68203 -381851
985 -381851 -590310 -587236 -676246 -1026286 -1395542 -1453199 -1236602 -933482 -601744 -281736 -57127
974 -57127 -66520 -400356 -903115 -1374386 -1615240 -1387599 -830474 -334436 -57041 47862
964 47862 77358 155641 282442 420662 414956 133234 -218085 -404437 -325880 34062 576424
953E76424N61070M06805J45451j32539l94356n49798o27890m75570j57993q1537
943g29933k62220l08571j06579L7124J0569j07097l19091n69105m63561L3264
933b785200L66173N03030O51380O22309L23234J6208M9561K66461K32408n3542
923A92022l34947m13356l10896j93402j07639j02300q0288j8395n9004j66135
913a594340j55706j83394l29724l15148j58842j0719P8688L46688N07892M51780
903a362825M57005M59506L90363K28115J11902J51668K54589K94233J57602j5159
893A126999k10442m78182l46127K21128N26985L43584O5815j11853j54183j31686
883H52038r4039r9390k53496l90405l29104k04056k95220l93035l54228n0730
$$ plain form
953 576424 1137494 1544299 1689750 1557211 1162855 613057 -14833 -490403 -648396 -729933
943 -729933 -992153 -1300724 -1407303 -1370179 -1359610 -1466707 -1785798 -2354903 -2818464 -2785200
933 -2785200 -2419027 -1915997 -1264617 -642308 -319074 -302866 -253305 13156 245564 192022
923 192022 -142925 -556281 -867177 -1060579 -1168218 -1270518 -1350806 -1369201 -1428205 -1594340
913 -1594340 -1750046 -1933440 -2263164 -2578312 -2737154 -2747873 -2669185 -2322497 -1814605 -1362825
903 -1362825 -905820 -446314 -55951 172164 284066 435734 690323 984556 1142158 1126999
893 1126999 916557 438375 92248 313376 840361 1183945 1249760 1137907 983724 852038
883 852038 757999 658609 405113 14708 -314396 -518452 -813672 -1206707 -1560935 -1611665
873a611665L74344N50983N13556M05713L20678J56831j16254k95575l02115j52081
863a55585P0796L35268M76446L11893j30394n22176n44884l90810l05289k08451
853a063186j7285O9841N2064o717j17401k42111m21004m86032k54509l3489K42158
842b277671O58003Q83917O95627L04142L8815r8387j70297j58593l3245J30187
832b7502K32153M57728O65009N29990K33045R8107O7340j54952m39219m06606
822A255093n9382K14286K13216P8100p8965k80704m24089l81146j43955J51335
812E43789J85599J3218j30889j87560j38853o0316q412j935J19094K21513J47028
801G02276r0502m86063o49569m22235j89096j2724K46199M65385M48033J58182
$$ plain form
873 -1611665 -1237321 -686338 -172782 232931 553609 710440 594186 298611 -3504 -155585
863 -155585 -84789 250479 726925 1038818 908424 386248 -158636 -549446 -854735 -1063186
853 -1063186 -1080471 -1010630 -958566 -965283 -1082684 -1324795 -1745799 -2231831 -2486340 -2519829 -2277671
842 -2277671 -1619668 -735751 -40124 264018 302833 204446 34149 -124444 -157689 -27502
832 -27502 204651 662379 1327388 1857378 2090423 2188530 2255870 2100918 1661699 1255093
822 1255093 1195711 1409997 1623213 1701313 1622348 1341644 917555 536409 392454 543789
812 543789 729388 742606 611717 424157 285304 224988 216576 214641 333735 555248 702276
801 702276 611774 125711 -523858 -946093 -1135189 -1147913 -901714 -436329 11704 169886
791A69886k24511l65821m7849L87382M42190J46918n9243L1948K60157L17316
781A058373Q8407k06429l42664l54257m10941m16054k09949j6168J88871L90882
771b29929L03246J10627K77683O59709P70011L65018k75773o94966p00759l25761
761B59106J42509K45972K9417l3084m8592k18449l13572k83064q8672K37008L75765
750C04344J67658r6612j07605l7269K3263L5001q8461j78067k48855m01649l62658
739i90910j36072K33962M87441M16815K78624P9547j06612o2723Q3555R1323n3086
728C21864k05008j93788J19814M52597N72409M65039J70692j34052k21280R7708
718A445995M20635K93917m1866j82910j35960K5814K12627K56083J24887n445
$$ plain form
791 169886 -54625 -420446 -468295 -80913 361277 508195 448952 480900 741057 1058373
781 1058373 1146780 940351 597687 243430 -167511 -583565 -793514 -809682 -620811 -229929
771 -229929 73317 183944 461627 1121336 1891347 2256365 1980592 1285626 584867 259106
761 259106 401615 647587 677004 643920 595328 376879 63307 -219757 -308429 -71421 304344
750 304344 472002 375390 267785 230516 253779 288780 200319 22252 -226603 -628252 -990910
739 -990910 -1126982 -893020 -405579 11236 289860 369407 262795 200072 283627 374950 321864
728 321864 116856 -76932 42882 495479 1067888 1532927 1703619 1569567 1348287 1445995
718 1445995 1866630 2160547 2118681 1935771 1799811 1825625 2038252 2294335 2419222 2413777
708B413777K9858K47551L33648N4338k27580k98585k78545j98807k54220n12766
698A308669p93280p75031m96254j87067l3747O3434K20765L34615L76362L42315
688C60781K16778O3187K5946R4127J75672K19809J84357p2379n05795q13316q04628
677h55461n66272k79082n2466K77678O52530O44356K40265j59888k77166j93559
667e69065r8894J07800K42502J15043q4940n0477J70164M27667N21761L28151
657A109712J16581k2289j07060l5438J05397K44194L23124J42264j15732j24937
647A635816n1444J1092l23j23875k51957k65899j72178r2130M3016K21800K04733
636A158651p2574k37740L2182L68601M55979M87165L84704j389l23327l61258
$$ plain form
708 2413777 2443635 2691186 3024834 3079172 2851592 2553007 2274462 2075655 1821435 1308669
698 1308669 515389 -259642 -755896 -942963 -976710 -913276 -692511 -357896 18466 360781
688 360781 577559 640746 666692 760819 936491 1156300 1340657 1268278 762483 -50833 -855461
677 -855461 -1421733 -1700815 -1753281 -1475603 -823073 -178717 61548 -98340 -375506 -569065
667 -569065 -667959 -560159 -317657 -202614 -287554 -338031 -167867 259800 781561 1109712
657 1109712 1226293 1204004 1096944 1061506 1166903 1411097 1734221 1876485 1760753 1635816
647 1635816 1584372 1595464 1595141 1471266 1219309 953410 781232 689102 732118 953918 1158651
636 1158651 1086077 848337 880519 1249120 1705099 2192264 2576968 2575579 2252252 1890994
626A890994l06199j95850n9429M1604J38260L30186N09285L82006N1161k65360
616B516658m99733m86658k03188L3575j7755j57369q7842K241j48636m07576n65194
605b1477m60794k39710o5440O2729K42303L82594K84730P0392L4134J24398J44798
594E58657J57030K31030K46878J76267L7403j27458l57913o37181o24818k97917
584f38022N074Q3137l5713k03861l19792j41799K01463M01286M90449M19589K95198
573E57009J81288J45662L16251M20998K73547r987k12579k21830j09102J27303
563A468560M03356L79807N8289l10226n37103m87146k63126j45334M718L33612
553I05407N88805O42568N68310L78085o321m80310o59077n83721n34461m10764
$$ plain form
626 1890994 1584795 1388945 1329516 1371120 1509380 1839566 2348851 2730857 2782018 2516658
616 2516658 2016925 1530267 1327079 1360654 1342899 1185530 1097688 1099929 951293 543717 -21477
605 -21477 -482271 -721981 -787421 -724692 -482389 -99795 184935 255327 289461 413859 558657
594 558657 715687 946717 1193595 1369862 1407265 1279807 921894 284713 -340105 -638022
584 -638022 -632948 -549811 -585524 -789385 -1109177 -1250976 -1049513 -648227 -157778 261811 557009
573 557009 738297 883959 1200210 1621208 1894755 1884768 1672189 1450359 1341257 1468560
563 1468560 1871916 2251723 2310012 1999786 1462683 975537 712411 567077 571795 905407
553 905407 1494212 2136780 2705090 3083175 3076854 2596544 1937467 1353746 819285 408521
543D08521j46307J18204K6780k94238m86532l54989N6098M30840N79670N01867
533H39914L99999M47494M20827L70996L69056L14854J01704k99090o06431n67941
523A791382l28436j79192j81874k34511o2421J42445R3805j12319k77609k40372
513D10898j7473K36103K49862J84644K31565J91932L8813j92353m49272m47323
503D37396k39365j16634J217Q5967J20037K64435L46646K11850P7661l3214k73864
492H82132m85866m26611j79902L0718J87377L21072N27906N80701L58962J63611
482A960100J29941N6619k53253m87242m02612j88162p4594k8686J42897N47819
472A402827Q12733N80626L37995L71224L26650R6335j35847k25231j50476N9124
$$ plain form
543 408521 262214 380418 407198 112960 -373572 -728561 -672463 -241623 338047 839914
533 839914 1239913 1687407 2108234 2479230 2848286 3163140 3264844 2965754 2359323 1791382
523 1791382 1462946 1283754 1101880 867369 804948 947393 1041198 928879 651270 410898
513 410898 393425 629528 879390 1064034 1295599 1487531 1526344 1333991 884719 437396
503 437396 198031 81397 82614 168581 288618 553053 899699 1111549 1189210 1155996 882132
492 882132 396266 -30345 -210247 -179529 7848 328920 856826 1437527 1796489 1960100
482 1960100 2090041 2146660 1893407 1406165 1003553 815391 740797 712111 855008 1402827
472 1402827 2215560 2796186 3134181 3505405 3832055 3928390 3792543 3567312 3416836 3475960
462C475960L78788O60927P35269N57226J88961j58391l59181m42029n25232m98195
452D014103k85414j43409j83965k62263l05063l85452m91999n52418m49271j12944
442H41905J54441J56563O383j00761j30952K5345M63391O61560L69960O1216n0976
431B458075q5702q2588k10001m49354m77212l23984k25716j67466r561J51277
421E77768L02663M64029M54744L01149R6184j67656m11031m44820k21411N9694
411A011313J59724J30014J09993J20760J46402L21645L99937K83691j8306l50973
401B314200l23040j69862k69218l34268j49115J27758L90673N97835O45540M49040
391C279543J88042J11617J03122o9137l09947k98647n9837J84941K62222m9899
$$ plain form
462 3475960 3854748 4515675 5250944 5808170 5997131 5838740 5479559 5037530 4512298 4014103
452 4014103 3728689 3585280 3401315 3139052 2833989 2448537 1956538 1404120 954849 841905
442 841905 996346 1152909 1159292 1058531 927579 952924 1416315 2077875 2447835 2509051 2458075
431 2458075 2372373 2289785 2079784 1630430 1153218 829234 603518 436052 426491 577768
421 577768 880431 1344460 1799204 2100353 2196537 2028881 1617850 1173030 951619 1011313
411 1011313 1171037 1301051 1411044 1531804 1678206 1999851 2399788 2683479 2665173 2314200
401 2314200 1991160 1821298 1552080 1217812 1068697 1196455 1587128 2184963 2830503 3279543
391 3279543 3467585 3579202 3682324 3613187 3303240 3004593 2944756 3129697 3391919 3342020
381C342020n53776o15979k26595J02029J96718J47544O0629p901k3866n2521r3055
370B275247p212K34609M32166L99969K04812J4759j81414l56049l88248k90882
360B337757j5275K80134K1623n19370p03379m92105j33606P7514Q0986R3132J94183
349A221594L28795K78402J69707R1725J3118j07460l48694m97943l92428j73317
339E83499J12209L55399L52187K97458K23982N1023p8324j25725k58569m11425
329A101714l97482k09196Q6605L00146M12245O02510O50624K91941k21849m46538
319B170720l68504j02968K42403M43564L11747m6004l32399l84956k87641j81710
309A464252j10287r1097m6117J47017M09731M15643K06285J35765K00291J28100
$$ plain form
381 3342020 2788244 2172265 1945670 2047699 2244417 2391961 2452590 2444689 2420823 2368302 2275247
370 2275247 2268035 2502644 2934810 3334779 3539591 3554350 3372936 3016887 2628639 2337757
360 2337757 2322482 2602616 2624239 2104869 1401490 909385 775779 853293 934279 1027411 1221594
349 1221594 1550389 1828791 1998498 2090223 2103341 1995881 1647187 1149244 756816 583499
339 583499 695708 1051107 1403294 1700752 1924734 1975757 1897433 1771708 1513139 1101714
329 1101714 704232 495036 581641 881787 1294032 1896542 2547166 2839107 2617258 2170720
319 2170720 1802216 1699248 1941651 2385215 2696962 2650958 2318559 1933603 1645962 1464252
309 1464252 1353965 1262868 1216751 1363768 1773499 2189142 2395427 2531192 2731483 2859583
299B859583n8762j22424r7836R708P3656k4028p237L05048O44138O41963L35216
288D559025n012k54275k55963l30421n15871n06993m13844l04531j15091m5515
278A811509m0968K18764M65052N58239N90263M33850J48654r5018k02310l43119
268C544916m35682l25598j19825J42910K21595R6728l6218n4947O676K5098P8062
257C143715K33190L86500M11812K51153k0341k17253l07362l54419n16644o54723
247B355628l81405m3786L7441j1794m061P8503P7278K3430L589q3076l33182m99683
235A218882l13191O339K79408L79086K99530J66324M9197K1281J53658L39912
225B600426L68144J09206k91102l50205n1707N6352k16025n98913p53736n90532
$$ plain form
299 2859583 2800821 2678397 2580561 2590269 2663925 2639897 2632660 2937708 3581846 4223809 4559025
288 4559025 4554013 4299738 4043775 3713354 3197483 2690490 2276646 1972115 1857024 1811509
278 1811509 1770541 1989305 2454357 3012596 3602859 4036709 4185363 4090345 3888035 3544916
268 3544916 3109234 2783636 2663811 2806721 3028316 3125044 3088826 3033879 3040555 3065653 3143715
257 3143715 3376905 3763405 4175217 4426370 4406029 4188776 3881414 3526995 3010351 2355628
247 2355628 1974223 1930437 1967878 1956084 1952023 2030526 2107804 2131234 2134823 2051747 1718565 1218882
235 1218882 905691 912030 1191438 1570524 1870054 2036378 2085575 2106856 2260514 2600426
225 2600426 2968570 3077776 2786674 2436469 2384762 2441114 2225089 1626176 872440 281908
215B81908k82402M1726J29513Q1018J12276K86314N25550O17910N34142L97277
205B725232J66411j03701j95341l5427J42494J55894J78447K61714L12892O3072
$$ plain form
215 281908 -494 41232 170745 251763 364039 650353 1175903 1793813 2327955 2725232
205 2725232 2891643 2787942 2592601 2557174 2699668 2855562 3034009 3295723 3608615 3671687
$$ [...]
##END NTUPLES=NMR SPECTRUM
##END=
