##TITLE=dept_SR3_OMe CH-,CH3- -up, CH2- -down
 1000 sc
 23.12.2019
##JCAMPDX= 6.0         $$ Bruker NMR JCAMP-DX V2.0
##DATA TYPE= NMR SPECTRUM
##DATA CLASS= NTUPLES
##ORIGIN= UXNMR, Bruker Analytische Messtechnik GmbH
##OWNER= root
$$ XWIN-NMR		Version 3.5
$$ Mon Dec 23 16:19:48 2019 Russian Standard Time (UT+4h)  she@DPX200
##.OBSERVE FREQUENCY= 50.327992884445
##.OBSERVE NUCLEUS= ^13C
##.ACQUISITION MODE= SIMULTANEOUS
##.ACQUISITION SCHEME= undefined
##.AVERAGES= 1000
##.DIGITISER RES= 17
##SPECTROMETER/DATA SYSTEM= spect
##.PULSE SEQUENCE= dept135
##.SOLVENT NAME= DMSO
##.SHIFT REFERENCE= (INTERNAL, DMSO, 0, 214.665)
##AUDIT TRAIL= $$ (NUMBER, WHEN, WHO, WHERE, WHAT)
$$ ##TITLE= Audit trail, XWIN-NMR		Version 3.5
$$ ##JCAMPDX= 5.01
$$ ##ORIGIN= Bruker BioSpin GmbH
$$ ##OWNER= she
$$ F:/spectra/data/she/nmr/depta/1/pdata/1/auditp.txt
$$ ##AUDIT TRAIL=  $$ (NUMBER, WHEN, WHO, WHERE, WHAT)
(   1,<2019-12-23 16:18:39.82 +0400>,<she>,<DPX200>,
      <created by zg, POWCHK disabled, PULCHK disabled
       terminated by command 'halt'
       configuration hash MD5:
       00 E9 B6 7A A2 85 ED C7 34 08 36 98 17 FE 4E 26
       data hash MD5: 16K
       6C 47 FC E5 89 5F 28 B1 B9 0B E3 E7 C6 7B DB F4>)
(   2,<2019-12-23 16:18:42.17 +0400>,<she>,<DPX200>,
      <Start of raw data processing
       efp BC_mod = 2 LB = 3.5 FT_mod = 6 PKNL = 1 PHC0 = -2924.703 PHC1 = -1067.401 SI = 16K 
       data hash MD5: 16K
       1B 7F 8F B3 5B CB 90 56 7C 2A DA 52 4C 10 B5 37>)
(   3,<2019-12-23 16:19:08.40 +0400>,<she>,<DPX200>,
      <pk PHC0 = -362.2006 PHC1 = -4.799999 
       data hash MD5: 16K
       81 4A A2 BE 9E 2E CD 8B 08 A3 2D FC F9 D6 EE FB>)
(   4,<2019-12-23 16:19:12.82 +0400>,<she>,<DPX200>,
      <abs ABSG = 5 
       data hash MD5: 16K
       BF 73 6A 5D E9 4B 4A F8 92 14 DE 9D 27 AC 2D 1A>)
$$ ##END=
$$ 
$$ hash MD5
$$ 4A 60 81 BD 6B E0 18 D9 57 0F 25 E5 70 E2 C1 14
##$RELAX= 
##$RELAX= 
##$RELAX= 
##$RELAX= 
##$RELAX= 
##$RELAX= 
##$RELAX= 
##$RELAX= 
$$ Bruker specific parameters
$$ --------------------------
##$DU= <F:/spectra>
##$EXPNO= 1
##$NAME= <depta>
##$PROCNO= 1
##$TYPE= <nmr>
##$USER= <she>
##$AMP= (0..31)
100 100 100 100 100 100 100 100 100 100 100 100 100 100 100 100 100 100 
100 100 100 100 100 100 100 100 100 100 100 100 100 100 
##$AQSEQ= 0
##$AQ_mod= 1
##$AUNM= <au_zg>
##$AUTOPOS= <>
##$BF1= 50.322709
##$BF2= 200.13
##$BF3= 200.13
##$BF4= 200.13
##$BF5= 200.13
##$BF6= 200.13
##$BF7= 200.13
##$BF8= 200.13
##$BYTORDA= 1
##$CFDGTYP= 0
##$CFRGTYP= 5
##$CHEMSTR= <none>
##$CNST= (0..31)
1 1 145 1 1 1 1 1 1 1 1 1 1 1 1 1 1 1 1 1 1 1 1 1 1 1 1 1 1 1 1 1 
##$CPDPRG= <>
##$CPDPRG1= <waltz16>
##$CPDPRG2= <waltz16>
##$CPDPRG3= <>
##$CPDPRG4= <mlev>
##$CPDPRG5= <mlev>
##$CPDPRG6= <mlev>
##$CPDPRG7= <mlev>
##$CPDPRG8= <mlev>
##$CPDPRGB= <>
##$CPDPRGT= <>
##$D= (0..31)
0 2 0.003448276 0 0 0 0 0 0 0 0 0 2e-05 0 0 0 0 0 0 0 0 0 0 0 0 0 0 0 
0 0 0 0 
##$DATE= 1577100831
##$DBL= (0..7)
120 120 120 120 120 120 120 120 
##$DBP= (0..7)
$$ [...]
##$SUBNAM2= <"">
##$SUBNAM3= <"">
##$SUBNAM4= <"">
##$SUBNAM5= <"">
##$SUBNAM6= <"">
##$SUBNAM7= <"">
##$SUBNAM8= <"">
##$SUBNAM9= <"">
##$SW= 219.3118970423
##$SWIBOX= (0..15)
0 1 3 0 0 0 0 0 0 0 0 0 0 0 0 0 
##$SW_h= 11037.527593819
##$TD= 16384
##$TD0= 1
##$TE= 0
##$TE2= 300
##$TE3= 300
##$TEG= 300
##$TL= (0..7)
120 120 120 120 120 120 120 120 
##$TP= (0..7)
150 150 150 150 150 150 150 150 
##$TP07= 0
##$TPNAME0= <>
##$TPNAME1= <>
##$TPNAME2= <>
##$TPNAME3= <>
##$TPNAME4= <>
##$TPNAME5= <>
##$TPNAME6= <>
##$TPNAME7= <>
##$TPOAL= (0..7)
0.5 0.5 0.5 0.5 0.5 0.5 0.5 0.5 
##$TPOFFS= (0..7)
0 0 0 0 0 0 0 0 
##$TUNHIN= 0
##$TUNHOUT= 0
##$TUNXOUT= 0
##$USERA1= <user>
##$USERA2= <user>
##$USERA3= <user>
##$USERA4= <user>
##$USERA5= <user>
##$V9= 5
##$VALIST= <valist>
##$VCLIST= <CCCCCCCCCCCCCCC>
##$VD= 0
##$VDLIST= <DDDDDDDDDDDDDDD>
##$VPLIST= <PPPPPPPPPPPPPPP>
##$VTLIST= <TTTTTTTTTTTTTTT>
##$WBST= 1024
##$WBSW= 2
##$XGAIN= (0..3)
0 0 0 0 
##$XL= 0
##$YL= 0
##$YMAX_a= 88847
##$YMIN_a= -93875
##$ZGOPTNS= <>
##$ZL1= 120
##$ZL2= 120
##$ZL3= 120
##$ZL4= 120
##$ABSF1= 214.6655
##$ABSF2= -4.669434
##$ABSG= 5
##$ABSL= 3
##$ALPHA= 0
##$AQORDER= 0
##$ASSFAC= 0
##$ASSFACI= 0
##$ASSFACX= 0
##$ASSWID= 0
##$AUNMP= <proc_1d>
##$AZFE= 0.1
##$AZFW= 0.1
##$BCFW= 0
##$BC_mod= 2
##$BYTORDP= 0
##$COROFFS= 0
##$CY= -3
##$DATMOD= 1
##$DC= 0
##$DFILT= <>
##$DTYPP= 0
##$F1P= 0
##$F2P= 0
##$FCOR= 0.5
##$FTSIZE= 16384
##$FT_mod= 6
##$GAMMA= 0
##$GB= 0
##$INTBC= 1
##$INTSCL= 0
##$ISEN= 128
##$LB= 3.5
##$LEV0= 0
##$LPBIN= 0
##$MAXI= 10000
##$MC2= 0
##$MEAN= 0
##$ME_mod= 0
##$MI= 0.4000791
##$NCOEF= 0
##$NC_proc= -6
##$NLEV= 6
##$NOISF1= 120.0001
##$NOISF2= 80.00006
##$NSP= 0
##$NTH_PI= 0
##$NZP= 0
##$OFFSET= 214.6655
##$PC= 4
##$PHC0= -3286.904
##$PHC1= -1072.201
##$PH_mod= 1
##$PKNL= yes
##$PPARMOD= 0
##$PSCAL= 0
##$PSIGN= 0
##$REVERSE= no
##$SF= 50.3227091
##$SI= 16384
##$SIGF1= 140
##$SIGF2= 120
##$SINO= 80
##$SIOLD= 32768
##$SREGLST= <13C.CDCl3>
##$SSB= 0
##$STSI= 16384
##$STSR= 0
##$SW_p= 11037.527593819
##$SYMM= 0
##$S_DEV= 0
##$TDeff= 16384
##$TDoff= 0
##$TI= <>
##$TILT= no
##$TM1= 0
##$TM2= 0
##$TOPLEV= 0
##$USERP1= <user>
##$USERP2= <user>
##$USERP3= <user>
##$USERP4= <user>
##$USERP5= <user>
##$WDW= 1
##$XDIM= 16384
##$YMAX_p= 189709404
##$YMIN_p= -324888589
$$ End of Bruker specific parameters
$$ ---------------------------------
##NTUPLES= NMR SPECTRUM
##VAR_NAME=  FREQUENCY,     SPECTRUM/REAL,   SPECTRUM/IMAG
##SYMBOL=    X,             R,               I
##VAR_TYPE=  INDEPENDENT,   DEPENDENT,       DEPENDENT
##VAR_FORM=  AFFN,          ASDF,            ASDF
##VAR_DIM=   16384,         16384,           16384
##UNITS=     HZ,            ARBITRARY UNITS, ARBITRARY UNITS
##FACTOR=    0.67371834180669, 1,            1
##FIRST=     10802.5493505904, 0,            0
##LAST=      -234.978243228581, 0,           0
##MIN=       -234.978243228581, -324888589,  0
##MAX=       10802.5493505904, 189709404,    0
$$ Real data points
##PAGE= N=1
##DATA TABLE= (X++(R..R)), XYDATA
$$ [...]
12683b148033p40130m24912m41058p45225o89752j9102O10497M73507j2673l24394
12673d461275j18855N04828J067878J382291J683020J927052J685865R90128M6082
12664D707014j241549k295524j963482j131125r04747o26774k9558R58547J850591
12655f76607J996075J443725L75720o97172j207907j197018j336393j380953p60228
12646c440758K43073R10360J155798J176730Q02366K06865k09954n59526o52793
12637c67839k82506J6086o4635l55706l08483L19456J082878J526576J608929
12628C174756J305914N45880j16728k16670j38169j86553l09227l51940j39535
12619C567728j18412p88490j816784k416749k246554j640523j091262p48378m87671
$$ y = [-2148033, -2888163, -3313075, -3754133, -4499358, -5189110, -5208212, -4597715, -4124208, -4136881, -4461275, -4580130, -4075302, -3007424, -1625133, 57887, 1984939, 3670804, 4660932, 4707014, 3465465, 1169941, -793541, -1924666, -2829413, -3456187, -3485745, -2527198, -676607, 1319468, 2763193, 3138913, 2441741, 1233834, 36816, -1299577, -2680530, -3440758, -3197685, -2287325, -1131527, 45203, 847569, 1054434, 844480, 284954, -367839, -650345, -634259, -698894, -1054600, -1363083, -1043627, 39251, 1565827, 3174756, 4480670, 5026550, 4909822, 4693152, 4554983, 4368430, 4059203, 3707263, 3567728, 3449316, 2660826, 844042, -1572707, -3819261, -5459784, -6551046, -7299424, -7787095]
12610g787095j52254L95646O60326P37011R26228R91583O54719K2918m36886n26091
12600d513895l26259p0032Q2230M98965J018858J016825N61005l3995l54233j07719
12590b228250L10182L25318j11401j82727K15052J83764k73806m83416j60414
12581b405698L46476L23780R3431k3077N7566K71361L63226L49268J88396J13103
12571c22168J6107n4562K91154R03703J390804J639443J643476J184535K51687
12562F944179p07364j330731j352944o84129L4477o23m06657m09235q2293q7204
12552A917476n2852K00428K0376n69395j025198q86280m18872r4618J31850M41432
12542c35653O18992M85425L97125J97834n87287j519793j438930l92022P29063
$$ y = [-7787095, -7939349, -7543703, -6883377, -6146366, -5220138, -4228555, -3573836, -3550918, -3987804, -4513895, -4840154, -4910186, -4827956, -4328991, -3310133, -2293308, -1732303, -1766298, -2120531, -2228250, -1918068, -1592750, -1704151, -1886878, -1671826, -1488062, -1761868, -2245284, -2405698, -2059222, -1735442, -1642011, -1665088, -1607522, -1336161, -972935, -623667, -435271, -322168, -306061, -360623, -69469, 834234, 2225038, 3864481, 5507957, 6692492, 6944179, 6236815, 4906084, 3553140, 2869011, 2903488, 2902865, 2496208, 2086973, 2004680, 1917476, 1864624, 2065052, 2085428, 1516033, 490835, -395445, -814317, -908935, -777085, -335653, 283339, 768764, 1165889, 1363723, 776436, -743357, -2182287, -2574309, -1845246]
12533a845246J590578J577921P11205k2269k94498p50777r86195r5823Q70989
12524G55885J026093L25190p93886j789768k170490j890373j363166p78703j23701
12515f802919M68516O85321M68851L24770O75480Q29100M47515n0048n95082r79209
12505d527705p41886J1858P79204R17055N68134K87674N0081j34222r6932l73970
12495c260709q00291n38885J52020L51870J15986P13619J776048J850918J118554
12486A479130P55665J145228J533543J171326L22329o22983j406818j641357j262043
12477A474020p42883m18318n99140p28453m53485q106N59079O90077R2p20638
12467i47755q38707m49368K49093N26955Q36972J437709J274293P64814N16115
$$ y = [-1845246, -254668, 1323253, 2034458, 2012189, 1717691, 966914, -19281, -115104, 755885, 1781978, 2107168, 1313282, -476486, -2646976, -4537349, -5900515, -6679218, -6802919, -6334403, -5649082, -5180231, -4855461, -4179981, -3350881, -2903366, -2953414, -3548496, -4527705, -5269591, -5257733, -4478529, -3561474, -2993340, -2705666, -2655585, -2789807, -2886739, -3260709, -4061000, -4599885, -4447865, -4095995, -3980009, -3266390, -1490342, 360576, 1479130, 2234795, 3380023, 4913566, 6084892, 6407221, 5784238, 4377420, 2736063, 1474020, 731137, 312819, -286321, -1014774, -1468259, -1476365, -917286, -227209, -227117, -947755, -1786462, -2235830, -1986737, -1459782, -622810, 814899, 2089192, 2854006, 3370121]
12458C370121J33603l13070n26033q17944o91233j66906m51310p43653l65321
12449e71746l81878j160369j772567j947522j907554j413056n8633J662616K474607
12440e076102K096529J355432O78387J68437J50683K10907o4700l49889l00395
12431a130711r6480J32219N07040Q24866L71295o22447j006556m63918L67641
12422a117051J027423J484011J620434J297858L32791l52722n30696r12735j164964
12413A684349o38718L07240J067923J175654P18324K03536j94962l31935j06057
12404C885354n4268n58626q22112l41318o0745o68062j108474l98416N50378R01775
12394A325486O58592J23801k4801J37319R099l42294n03365n39711n57380l61827
$$ y = [3370121, 3503724, 3190654, 2664621, 1846677, 1155444, 988538, 537228, -206425, -571746, -953624, -2113993, -3886560, -5834082, -7741636, -9154692, -9213325, -7550709, -5076102, -2979573, -1624141, -945754, -777317, -626634, -415727, -480427, -830316, -1130711, -1227191, -1094972, -587932, 236934, 608229, -14218, -1020774, -1484692, -1117051, -89628, 1394383, 3014817, 4312675, 4645466, 4292744, 3762048, 2849313, 1684349, 1045631, 1352871, 2420794, 3596448, 4314772, 4518308, 4323346, 3991411, 3885354, 3831086, 3272460, 2450348, 2109030, 2048285, 1380223, 271749, -126667, 423711, 1325486, 1984078, 2107879, 2083078, 2220397, 2229496, 1887202, 1383837, 844126, 286746, -75081]
12384g5081j46952j45393k99694n32653r12356p82515k56817l4444N7562K15055
12374b913288P29656J326964J310768P39094J31754J19335N42610P51202O92862
12365C430957L82325j22361p53116j041210r54057o16677j56637J26928M14155
12356G10307M45356k38883j163581j227084n70010J52340P06063P80434J92738
12347b12320p59421j168541r55699l98664N85822J526485J486584P36865K53752
12338A094863L45290P26624R66419P63477J29173n73044r55400j355953j604145
12329d62696j232710l27721R37904J880035J832766Q12109n66002j389485j279923
12320B04277p00785l61305m54046l28213J39345R391p22113r70539j180104j353628
$$ y = [-75081, -222033, -367426, -667120, -1199773, -2112129, -2894644, -3151461, -3185905, -3128343, -2913288, -2183632, -856668, 454100, 1193194, 1324948, 1444283, 1986893, 2738095, 3430957, 3813282, 3690921, 2937805, 1896595, 942538, 325861, 169224, 296152, 710307, 1155663, 916780, -246801, -1473885, -2043895, -1891555, -1185492, -405058, -212320, -971741, -2140282, -3095981, -3494645, -2908823, -1382338, 104246, 841111, 1094863, 1440153, 2166777, 3133196, 3896673, 4025846, 3452802, 2497402, 1141449, -462696, -1695406, -2023127, -1085223, 794812, 2627578, 3439687, 2873685, 1484200, 204277, -496508, -857813, -1311859, -1640072, -1500727, -1491336, -2213449, -3183988, -4364092, -5717720]
12310e717720o06973L76800J116056J647571J676015J161530L81849l49631r23077
12301a237580j146274o50898J56802J039251J405184O89041k38397n85628l24206
12292h92705r5485n3027P782o8798l67215q63198j062054p01991r1263N53571
12282c634383P05174K78706R5035q6643n66246n19697j29183J13741K42656M24963
12272c075877Q23006J051986O64257j74544j431278k453256k408144j614426q34295
12263i452571J5134R62025J726584J892822J143825N26340L79546M69618O34579
12254a702098K23192o44048q94075m12701r0182l35712m93734j19461Q9466m29549
12244d808902r37576m53107J14967j81176q79276j195405p45600L24485J254369
$$ y = [-5717720, -6324693, -5947893, -4831837, -3184266, -1508251, -346721, 35128, -314503, -1237580, -2383854, -3034752, -2877950, -1838699, -433515, 255526, 17129, -568499, -892705, -988190, -1041217, -1033435, -1102233, -1469448, -2332646, -3394700, -4096691, -4187954, -3634383, -2929209, -2650503, -2555468, -2642111, -3208357, -3728054, -3857237, -3743496, -3500840, -3075877, -2252871, -1200885, -536628, -711172, -2142450, -4595706, -7003850, -8618276, -9452571, -9437437, -8475412, -6748828, -4856006, -3712181, -3185841, -2806295, -2336677, -1702098, -1478906, -2122954, -3017029, -3429730, -3519912, -3855624, -4349358, -4468819, -4379353, -4808902, -5746478, -6199585, -6084618, -6265794, -7145070, -8340475, -9086075, -8761590, -7507221]
12235g507221J509041J509971J525384J404965J043825N47645j23277o16800n47060
12226a253527m26893o86390j076470j149757q41071m79307k07223L78989J074979
12217d666670J357073J305020R45782L52138l69339o48026j40143J79633J26762
12208a557770K04718L72774M99899N82577O94815N88231K98891J07764K17965
12199B009864N35013O99663N10593J37302l74383o02374k61974M3737N0200j35235
12189B612406o65191j252228r99131m15661m66933p26646o61610l41044J55479
12180b760559Q64569J470991J693630P92035n36235o73940M5876K21636O5822
12171A183825J60445K00514J233n01692r21211j165252j102583m67642K54232
$$ y = [-7507221, -5998180, -4488209, -2962825, -1557860, -514035, 33610, -89667, -706467, -1253527, -1680420, -2366810, -3443280, -4593037, -5434108, -5913415, -6120638, -5741649, -4666670, -3309597, -2004577, -1058795, -706657, -1075996, -1724022, -1864165, -1684532, -1557770, -1353052, -980278, -480379, 102198, 797013, 1385244, 1684135, 1791899, 2009864, 2544877, 3244540, 3755133, 3892435, 3518052, 2915678, 2653704, 2697441, 2747641, 2612406, 1947215, 694987, -304144, -719805, -1186738, -1913384, -2574994, -2916038, -2760559, -1895990, -424999, 1268631, 2060666, 1524431, 850491, 896367, 1118003, 1183825, 1344270, 1544784, 1546017, 1044325, 123114, -1042138, -2144721, -2612363, -2358131]
12162b358131O60543P97532R31266J239358J402495J264382Q58001N49553N55312
12153E900311M72179J05397m01595o09044m92821n72406r66154j129578r35960
12144A370329n64489j49792l15647j047974j602142r72966N18784J566019J615420
12135D17542O53291l29811l43424L35185O74300L90201Q0094l70853p99613p83093
12125g6181m25726L06306R70801O66442J05023J39105J41699k1850J72000L75388
12115B353007j2995o46720p04265j07356N18925M04257l02746q73606j165334
12106e36833j076317p63806n09372k80827K59959P64387R24996J004294J058956
12097H45437R18861K92650o08982r92257o11469j54958k44797n35284m0608R48155
$$ y = [-2358131, -1697588, -900056, 31210, 1270568, 2673063, 3937445, 4795446, 5344999, 5900311, 6372490, 6477887, 6076292, 5467248, 4974427, 4402021, 3435867, 2306289, 1370329, 805840, 656048, 340401, -707573, -2309715, -3282681, -2763897, -1197878, 417542, 1070833, 741022, 397598, 732783, 1407083, 1797284, 1877378, 1506525, 706912, -76181, -501907, -195601, 775200, 1441642, 1546665, 1685770, 1827469, 1805619, 1977619, 2353007, 2340012, 1693292, 989027, 881671, 1400596, 1804853, 1502107, 628501, -536833, -1613150, -2376956, -2886328, -3167155, -2907196, -2142809, -1217813, -213519, 845437, 1764298, 2056948, 1447966, 455709, -155760, -310718, -555515, -1090799, -1131407, -183252]
12087a83252J467534J255895J094933J140180J079346P80577n9453q30945j131792
12078D613023j533593j666091p57711L81745M06014l80971r61677j048599r11861
12069a859721n20139K70636R27197J219463J288081R19883J2995p39723q67512
12060F51160q79150r47943n34172M95207J002656L00813m66658o52758k72362
12051a303207M92746J044667R38221K69508j66495J22904M95435L46701k55487
12042A984993o84010r02030j209928q66861J16219P39054Q40630J024254J046817
12033B089138P61174L77759K93925M55998O7860q08942r48565k59353M07387M93753
12023B930134j4558n95991o79838n29349n50044l26287K30716Q55270R49976L68233
$$ y = [-183252, 1284282, 2540177, 3635110, 4775290, 5854636, 6635213, 6575760, 5744815, 4613023, 3079430, 1413339, 655628, 1037373, 1443387, 1062416, 100739, -947860, -1859721, -2379860, -2109224, -1182027, 37436, 1325517, 2245400, 2258395, 1518672, 651160, -227990, -1175933, -1710105, -1214898, -212242, 88571, -378087, -1030845, -1303207, -810461, 234206, 1172427, 1441935, 1275440, 1398344, 1893779, 2240480, 1984993, 1300983, 398953, -810975, -1677836, -1561617, -822563, 18067, 1042321, 2089138, 2850312, 3228071, 3521996, 3977994, 4045854, 3236912, 2288347, 2028994, 2436381, 2930134, 2915576, 2319585, 1639747, 1110398, 560354, 234067, 464783, 1320053, 2270029, 2638262]
12013B638262j31269l37832p88374j217900j049249o09160k53571N8754O9138
12004a621201L66619J158593J073192m8260j088923j322961j054120j112587j156710
11995d806358o82718J42208Q72061P65109j57066j054367j516340j143063k57557
11986g838091K27300N02680R45495Q50069N26146P33499J137140J111362Q14137
11977i90263O06128P09571J107481J271564Q54854j72064r43992o94653J07306
11968A855932O83596M89185R7242J4145J39215K32404l26629j411795j646457
11959A26838r85726n08251k42755Q3011O39807J112819R79638L34726k49563m21501
11949H69043j21433L62371P59409R75974Q61993K31913m62943p02621o02468j27337
$$ y = [2638262, 2506993, 2169161, 1380787, 162887, -886362, -1495522, -1749093, -1690339, -1621201, -1254582, -95989, 977203, 928943, -159980, -1482941, -2537061, -3649648, -4806358, -5489076, -5346868, -4474807, -3709698, -3866764, -4921131, -6437471, -7580534, -7838091, -7610791, -7108111, -6162616, -5312547, -4786401, -4052902, -2915762, -1804400, -990263, -384135, 325436, 1432917, 2704481, 3559335, 3387271, 2443279, 1748626, 1855932, 2539528, 3028713, 3125955, 3140100, 3279315, 3511719, 3185090, 1773295, 126838, -858888, -1367139, -1609894, -1526883, -887076, 225743, 1205381, 1540107, 1290544, 869043, 747610, 1109981, 1869390, 2845364, 3707357, 3939270, 3476327, 2773706, 2171238, 2043901]
11939B043901M63396L77461l61824o34909J24562R55614Q68736L19100n1445j51379
11929C953213q4039M1233k01955p81125q56746k86326j1672l23230p00944r73488
11919b25079j213333j156743p13210K2421M71401L93171O31481R08412O87773
11910a93706M0705p35910j017985j025443r31279n21932n5664Q5683R4185K83230
11900c978116L80539J07768k52532o2851O28638R73110N47287m9224j19117J71451
11890a653047N00634Q04638J123416J285472R61094N02085L92406K90772j72769
11881D034701r30776j325108q31309L8023O57463O88408M32503K43797J89653
11872C197355J96032M7641m66669r87867j220586j106350r29309j125789j323944
$$ y = [2043901, 2507297, 2884758, 2522934, 1888025, 2012587, 2968201, 3836937, 4156037, 4104592, 3953213, 3869174, 3910407, 3708452, 2927327, 2070581, 1784255, 1772583, 1449353, 748409, -225079, -1438412, -2595155, -3308365, -3285944, -2814543, -2421372, -1789891, -881479, -193706, -153001, -888911, -1906896, -2932339, -3863618, -4385550, -4441214, -4355531, -4261346, -3978116, -3597577, -3489809, -3742341, -3805192, -3176554, -2203444, -1656157, -1705381, -1824498, -1653047, -1152413, -347775, 775641, 2061113, 3022207, 3524292, 3916698, 4207470, 4034701, 3103925, 1778817, 947508, 985531, 1642994, 2331402, 2763905, 3007702, 3197355, 3393387, 3441028, 2974359, 1986492, 765906, -340444, -1269753, -2395542, -3719486]
11863c719486p94582L38847J385620J796912J550064P03916J91497N58260P61233
11854B772281K06148p72760j482064j488194j077860n73509j55262L34296Q47032
11845a389892J167677P31686n78256j449781j059658j11523P73460J051071Q18732
11836d6484O57175M36075O4201R0787Q70031J530384J175070J50962k53241p6419
11826D598541l64998p27450n81003j71352L38066M15658j79022n09594m41322
11817B377524o44246q99143q19722q06913q57915k74796M72950R33939J019297
11808E00975O48612K31574J55740P3580m04329q71837j116408q96441l28376L41580
11798a665330Q54097P25053N45272M19203l33979j066239j149971r18423m43716
$$ y = [-3719486, -4514068, -4175221, -2789601, -992689, 557375, 1261291, 1452788, 2011048, 2772281, 2978429, 2205669, 723605, -764589, -1842449, -2415958, -2571220, -2236924, -1389892, -222215, 509471, -68785, -1518566, -2578224, -2689747, -1916287, -865216, -46484, 610691, 1046766, 1110967, 1201754, 2071785, 3602169, 4777239, 4928201, 4674960, 4598541, 4233543, 3506093, 2925090, 2753738, 3091804, 3507462, 3328440, 2818846, 2377524, 1733278, 834135, 14413, -792500, -1650415, -1925211, -1452261, -518322, 500975, 1149587, 1381161, 1536901, 1610481, 1206152, 334315, -782093, -1678534, -2006910, -1665330, -811233, -86180, 459092, 878295, 544316, -521923, -1671894, -2590317, -3034033]
11789c034033j02682m24853j075832j405136j316475n84401L51649P47191R92578
11780e851994J268859R10293j84075p33074j36967J000045J568219J103301K92850
11771g62543k34545m70977m70515j60305k13209r79348j416188p45488K97497
11762e155621J219462J701748J655487J187924O65110M71395L35474O3056l12120
11753A831915j025924j683477j257249J42393J273694J293257K96440l54916j42412
11744C73721o800m67725r19994o35950l44067o00968o91155m83491q5946R4922
11734c767453m8947N1474M30848Q14339L62407m56347o14100l72528Q5792P06281
11724b808234J009692J003831Q35829O83529K50405l87137r50140j258763p82446
$$ y = [-3034033, -3136715, -3561568, -4637400, -6042536, -7359011, -7943412, -7591763, -6844572, -5851994, -4583135, -3672842, -3856917, -4589991, -4726958, -3726913, -2158694, -1055393, -762543, -997088, -1468065, -1938580, -2098885, -2312094, -3291442, -4707630, -5453118, -5155621, -3936159, -2234411, -578924, 609000, 1274110, 1745505, 2080979, 2144035, 1831915, 805991, -877486, -2134735, -1992342, -718648, 574609, 871049, 516133, 373721, 366921, -100804, -1020798, -1656748, -2000815, -2601783, -3292938, -3776429, -3862375, -3767453, -3816400, -3764926, -3334078, -2519739, -2157332, -2613679, -3227779, -3600307, -3514515, -2808234, -1798542, -794711, 41118, 724647, 975052, 587915, -362225, -1620988, -2403434]
11715b403434K12385O47746J95934o33114j388382j747662j329045r5310J177829
11706e363053J626537J494276J241803R47079O74951J46755o17718j045481r33481
11697a828332n85432l76338m13155l01621k70264n76475o49287k35876L41012
11688d895768P87225Q07587N26188J04596l11535o1670O58817O04182k9817k31727
11678b041922K48400M88066M53869P42642Q60423L62569o49814j538837j679381
11669b753985j050392j3551P45775J000695Q37391J12404o56246r97799p81791
11660c557499J48951J268517J337710M92445J0873N84250J249004J054499Q15821
11651C404571Q27439P27452N28115j00819p77383r01685p00603m58771k95085
$$ y = [-2403434, -2191049, -1543303, -1347369, -1980483, -3368865, -5116527, -6445572, -6540882, -5363053, -3736516, -2242240, -1000437, -53358, 621593, 768348, 150630, -894851, -1828332, -2413764, -2790102, -3203257, -3504878, -3775142, -4351617, -5000904, -5236780, -4895768, -4108543, -3300956, -2774768, -2670172, -2981707, -3043377, -2384560, -1780378, -1810195, -2041922, -1793522, -1305456, -851587, -108945, 751478, 1114047, 464233, -1074604, -2753985, -3804377, -3817928, -3072153, -2071458, -1234067, -1121663, -1777909, -2775708, -3557499, -3408548, -2140031, -802321, -309876, -299003, 285247, 1534251, 2588750, 3404571, 4232010, 4959462, 5487577, 5386758, 4609375, 3707690, 3007087, 2548316, 2253231]
11642B253231j58181j98209l56652j50590N31836J038134Q00671J16983k72816
11633C604407m26704o46427m10474L33590O03332K24471j09092j95647l06755
11624B670701n33110p16089o88397o67103r25250r84326p38411q02660j286549
11615d671194j253017n36203K16272O43037R28503J226758J197289R25323O62977
11606f60255P89667J062906J016082N86376j54237p98030o48783m6220K60564
11597A408070L64265M74000P51248O48184K17119J36950L44220O40671R15051
11588E899778R27331L77844o76000j177462o22525j12788k80410p41440q75288
11579B719040j000397j030158k08509Q39047J053366N27747j71765p96697r17511
$$ y = [2253231, 2095050, 1896841, 1540189, 1389599, 1921435, 2959569, 3760240, 3877223, 3604407, 3177703, 2531276, 2120802, 2454392, 3057724, 3282195, 3173103, 2977456, 2670701, 2137591, 1421502, 733105, 66002, -859248, -1843574, -2581985, -3384645, -4671194, -5924211, -6460414, -6244142, -5601105, -4672602, -3445844, -2248555, -1323232, -660255, 129412, 1192318, 2208400, 2794776, 2640539, 1842509, 1193726, 1147506, 1408070, 1772335, 2246335, 2997583, 3645767, 3862886, 3999836, 4344056, 4984727, 5899778, 6827109, 7204953, 6528953, 5351491, 4728966, 4616178, 4335768, 3594328, 2719040, 1718643, 688485, 479976, 1319023, 2372389, 2900136, 2728371, 1931674, 1014163]
11570A014163n00160k37032l61716n93324l32119O22509J147049Q77047L20562
11561A956979J8142N1606J29245Q9243j7510l43010o79947o58235l98603O6512
11551B14422L59208K83643K48085L92868M33272L15844L29736M11978Q8619o12909
11541B464766r36666p19561j49311N23087Q02860J221692J969009K270735J760278
11532I206889Q65017j59340j200156j282128m62551J3260J607l35471r72516j249870
11522D424741j069875o69115N3698M84292J55034l62071p73827j006564p91619
11513D44694l63386k95324o32129o78779l23993R4107P09298J178747J139282
11504A272517P34818K73311j35039o25214q76623p08267o91158k65556M62359
$$ y = [1014163, 514003, 276971, -84745, -678069, -1010188, -387679, 759370, 1636417, 1956979, 1975121, 2026727, 2155972, 2245215, 2227705, 1884695, 1204748, 546513, 147910, 214422, 573630, 857273, 1105358, 1498226, 1931498, 2247342, 2577078, 2989056, 3077675, 2464766, 1528100, 808539, 659228, 1182315, 1985175, 3206867, 5175876, 7446611, 9206889, 10071906, 9912566, 8712410, 7430282, 6967731, 6980991, 6982598, 6647127, 5674611, 4424741, 3354866, 2685751, 2739449, 3223741, 3378775, 3016704, 2242877, 1236313, 444694, 81308, -214016, -846145, -1524924, -1848917, -1754810, -1045512, 133235, 1272517, 2007335, 2280646, 2145607, 1520393, 643770, -64497, -755655, -1021211, -558852]
11495e58852O06359M83109N13033O48415N58568N41912R25440J129040N64416
11486E411440o72343j415644r80610P9514P22082M80926M7190j35702R861J84593
11476C731307J70171K63881L38560j8930m12477l03498N2401l03277j217190j337561
11466I63387p71139m65835n35844l69017k41279o86313q03672r122O47621Q40228
11456a430985J091848J186661Q71425L90763r3087r02021j279113p02515k15945
11447a082969r1452L254K81158O70636Q35395O36361M415n19298o67024m60202
11437c89726j62005p0355j85268k35735J09712P72748J096267R40227O95870L10894
11427B882629n9044m62926j070385j256768m62480O25401O66923p7632q61476
$$ y = [-558852, 47507, 530616, 1043649, 1692064, 2250632, 2792544, 3717984, 4847024, 5411440, 4739097, 3323453, 2342843, 2422357, 3144439, 3625365, 3672555, 3536853, 3546714, 3731307, 3901478, 4165359, 4503919, 4484989, 4072512, 3769014, 3821415, 3518138, 2300948, 963387, 192248, -273587, -809431, -1178448, -1419727, -2106040, -2909712, -2918834, -2271213, -1430985, -339137, 847524, 1718949, 2109712, 2016625, 1114604, -164509, -867024, -1082969, -1174421, -1171167, -890009, -219373, 616022, 1252383, 1256798, 737500, 70476, -389726, -551731, -622086, -807354, -1043089, -933377, -160629, 935638, 1875865, 2571735, 2882629, 2823585, 2360659, 1290274, 33506, -428974, 196427, 863350, 785718, -75758]
11418g5758j104612p83146l73631j38038j32587K52149P44815P07213K67522Q4161
11408e51912M69128P37181M64185Q0356m4770L96600J224098J265761M18514o23352
11398C835789j146247j366216j505333j243160o14381R6027P13516J204415J060675
11389A035085M46589j50433q69066j512314j494439j086623j029976j083775o73231
11380f418183L60072J401620J698332J314685Q00554M15915L05967N17736P47450
11371A144148J092102J277226N04150j083098k131839j788389o88913J13989N12230
11362a048394N91126L54346K75900J45627j9632J32519K70882M5871m87289p76675
11352e15719o46775n04438k61075K70217M90358K20051m80982q43312m009J200793
$$ y = [-75758, -1180370, -1963516, -2337147, -2475185, -2607772, -2355623, -1610808, -903595, -636073, -551912, -82784, 654397, 1118582, 1198938, 1154168, 1550768, 2774866, 4040627, 4459141, 3835789, 2689542, 1323326, -182007, -1425167, -2039548, -1943521, -1230005, -25590, 1035085, 1481674, 1331241, 462175, -1050139, -2544578, -3631201, -4661177, -5744952, -6418183, -6058111, -4656491, -2958159, -1643474, -842920, -427005, -121038, 396698, 1144148, 2236250, 3513476, 4017626, 2934528, 802689, -985700, -1674613, -1560624, -1048394, -457268, -102922, 172978, 318605, 298973, 431492, 702374, 748245, 260956, -515719, -1162494, -1666932, -1928007, -1657790, -1167432, -947381, -1428363, -2271675, -2275684, -1074891]
11342a074891J818391J631350J135897R19678M45298m47183j329272j632409j583136
11333a16277j405894r60904n84793n20769m65338j8665L89847O17721P31545O81448
11323a652079R62181J470215J525996J045967M20292r3577m06893p51548j037014
11314A483540p14804k04474l3389L42324Q38037O52202J55063L5115J88330M99868
11304C241812P68353N65134r1214n73952n58995N7076P17667Q26095N89978O21464
11294F163418R62721P00392k19116r33201j069984p47152l69347m29554n72179
11285C485998o56149q52453j092110j085529q10262n01614j98038K14548J217373
11276b78236J831877R32319j65444m06577l70665j74983L36480K76412k81693
$$ y = [-1074891, 743500, 2374850, 3510747, 4430425, 4875723, 4428540, 3099268, 1466859, -116277, -1522171, -2483075, -3067868, -3588637, -4053975, -4072640, -3682793, -3065072, -2333527, -1652079, -689898, 780317, 2306313, 3352280, 3772572, 3678995, 3272102, 2520554, 1483540, 768736, 564262, 530873, 873197, 1711234, 2363436, 2518499, 2553614, 2741944, 3241812, 4010165, 4575299, 4484085, 3910133, 3351138, 3408214, 4125881, 4951976, 5541954, 6163418, 7126139, 7826531, 7607415, 6674214, 5604230, 4857078, 4487731, 4058177, 3485998, 2829849, 1977396, 885286, -200243, -1010505, -1512119, -1710157, -1495609, -278236, 1553641, 2485960, 2320516, 1913939, 1543274, 1368291, 1704771, 1981183, 1699490]
11267A699490n29626m30565l30827k15417J46607N93875Q18830N32779J81966
11258B467112j85448o68140j060554j142840j084717j054169p84429j97876L24674
11249c386387O50530N58621L46787N46817O36222M09777J94878l6784k13982M330
11239b89191K46722q7308q98820j376349r89328J07694J105421J319836J125130
11230B63807Q32452L41263K5376M38180J226474J397310P49142n1407o16681r18598
11220C687318j149405j046115o12988j78385K9683j70098l70546k54054K69304
11211B04714P20172O72766J53142j99739l68992o56122q39342n39692p9209l94680
11201a326982q12967m86838m7688J52496M11831M08542J96072N38678R71604P65900
$$ y = [1699490, 1169864, 739299, 408472, 193055, 339662, 933537, 1752367, 2285146, 2467112, 2281664, 1613524, 552970, -589870, -1674587, -2728756, -3513185, -3711061, -3386387, -2735857, -2177236, -1830449, -1283632, -647410, -237633, -42755, -79539, -293521, -289191, -42469, -129777, -1028597, -2404946, -3394274, -3286580, -2181159, -861323, 263807, 1096259, 1437522, 1462898, 1901078, 3127552, 4524862, 5274004, 5222597, 4605916, 3687318, 2537913, 1491798, 878810, 700425, 730108, 560010, 189464, -64590, 204714, 924886, 1597652, 1750794, 1551055, 1182063, 525941, -313401, -853093, -932302, -1326982, -2139949, -2626787, -2674475, -2521979, -2110148, -1701606, -1505534, -966856, 4748, 770648]
11191G70648M5936l46202k96338k20323l35273l92363k34658M41303J664430K439202
11181C536362K462483J722499M74130j93346M3756K85069Q8325m71588r50424
11172F997266r32520n61532m52288o74280n66603l37559k64134k17327l03247
11163B687776l41430R2798P80625O88136j28676r04388q86461l69208j61587l09641
11153A147944m40077j51847N85760J424077J591733R52531M30444N09796J87906
11144F238267m68879l53428L97417P60824K61727o36414j302132j638292j650014
11135A609076j494785p84485L59724Q81104N99219K16418K30218P23583Q77697
11126C217769J26595o87703p72015q8653M46737N66520P37660P40319L60582m75429
$$ y = [770648, 816584, 470382, 174044, -46279, -381552, -773915, -1008573, -567270, 1097160, 3536362, 5998845, 7721344, 8195474, 8002128, 8045884, 8330953, 8419278, 7947690, 6997266, 6064746, 5503214, 5050926, 4376646, 3810043, 3472484, 3208350, 2991023, 2687776, 2346346, 2439144, 3219769, 3907905, 3779229, 2874841, 1988380, 1619172, 1457585, 1147944, 707867, 556020, 1141780, 2565857, 4157590, 5110121, 5540565, 6050361, 6238267, 5769388, 5415960, 5813377, 6574201, 6835928, 6199514, 4897382, 3259090, 1609076, 114291, -670194, -310470, 570634, 1169853, 1386271, 1616489, 2340072, 3217769, 3344364, 2656661, 1884646, 1795993, 2242730, 2809250, 3546910, 4287229, 4647811, 4172382]
11116D172382j209845j439633j086379n34547m16268k59448M37218Q18616L11877
11107G93973j46737K79260J069720P13728k24589k65674R6633J34114M9932j77321
11097B323039l63403m20932p38678q27359k94646j72097m47280l48803K17686
11088a072473P37920O02472K88299K39115j38777p95890p13252K31993Q94198
11079B73605O70321L90965O96069R91120O74971J86298l0267k4879j42453j6708
11069C669042R7552l24551n80983l20115J02712K83872J91498k71107j303796
11060A544124j792730j180633n16507L2382O57124P83499J54018m05333k54641
11051i78697L50722L40862k87789p55448j084694r95860k78002K63096M46058
$$ y = [4172382, 2962537, 1522904, 436525, -98022, -514290, -773738, -336520, 482096, 793973, 647236, 926496, 1996216, 2709944, 2485355, 2219681, 2316314, 2450428, 2500360, 2323039, 1959636, 1538704, 800026, -27333, -321979, -494076, -941356, -1290159, -1072473, -334553, 267919, 556218, 795333, 656556, -139334, -852586, -620593, 273605, 943926, 1334891, 2030960, 3022080, 3697051, 3883349, 3853082, 3828203, 3685750, 3669042, 3766594, 3442043, 2861060, 2540945, 2643657, 2927529, 3119027, 2847920, 1544124, -248606, -1429239, -1945746, -1913364, -1256240, -472741, -318723, -724056, -978697, -627975, -287113, -574902, -1330350, -2415044, -3410904, -3688906, -3425810, -2979752]
11042b979752N94333O57156N60591M77602M25723N65947J043765J337102Q28311
11033C510778j96256r44194j236071j520166j454502o51442J53262O20230P12836
11024a005525M49894O02515R36152Q93341P38658M81109j6765m97303l66065J68692
11014B384703P22033J177927J386569R74675J32413m33414l22585J02420q8532
11005F036209n77215q47798o42964J75943J29835j155695j868207j292063m20011
10996d61966J36542M72343O28778N58133J96304j946N1474n8555j86847j09460
10986A224800P5217O2114k6998l43187j058193j554606j288988m11022J96758
10977c124105k15011q28655q83384l67908L6724j58694m37031l73532J75123Q82330
$$ y = [-2979752, -2385419, -1728263, -1167672, -690070, -264347, 301600, 1345365, 2682467, 3510778, 3314522, 2370328, 1134257, -385909, -1840411, -2491853, -2338591, -1718361, -1005525, -555631, 46884, 983036, 1876377, 2615035, 3096144, 3079379, 2582076, 2216011, 2384703, 3106736, 4284663, 5671232, 6645907, 6778320, 6344906, 6022321, 6124741, 6036209, 5458994, 4611196, 3968232, 4144175, 4274010, 3118315, 1250108, -41955, -461966, -325424, 146919, 775697, 1333830, 1530134, 1528188, 1579662, 1521107, 1334260, 1224800, 1300017, 1362131, 1335133, 991946, -66247, -1620853, -2909841, -3320863, -3124105, -3339116, -4167771, -5051155, -5419063, -5382339, -5541033, -5978064, -6351596, -6176473, -5294143]
10967e294143R71246K48776M0586N12383M87006Q5429m5421r9344r5460J41628
10957c047314J95458J6336L01943R32231J262234J050710L76289j98501l5716
10948H53670M74073M05504J24715K73805P81122J271086J013535k7336j227490
10939C942684j888128j694583q65188l4115J96365j16227m72300o4047L68045
10930f27494n4738l96597o0581N50595O71813J82923n78637j085698o27522J55064
10920a870872J77867j988K4042j66185l01384k88686J06354O39367P53986L45781
10910e81718p5809j3484Q5384q4869j91379j33128L8052J97582r7379j41870P49736
10899b48882J432153J096890N21160J43465l51973j013697j148869j015144q58060
$$ y = [-5294143, -4322897, -4074121, -4033535, -3521152, -3034146, -2948717, -2994138, -3093482, -3188942, -3047314, -2851856, -2835520, -2533577, -1601346, -339112, 711598, 1087887, 889386, 853670, 1327743, 1733247, 1857962, 2131767, 2912889, 4183975, 5197510, 5170174, 3942684, 2054556, 359973, -505215, -539330, -342965, -459192, -931492, -995539, -627494, -682232, -1078829, -1139410, -588815, 82998, 265921, -312716, -1398414, -2025936, -1870872, -1693005, -1694993, -1670951, -1837136, -2138520, -2427206, -2320852, -1681485, -927499, -581718, -657527, -671011, -585627, -670496, -861875, -995003, -956951, -759369, -856748, -998618, -248882, 1183271, 2280161, 2801321, 2944786, 2592813, 1579116, 430247, -584897, -1442957]
10890a442957n45350j012446j767334j167878O52860J911612J939360J265990
10882a66143P60575O94953M80413j25947o16354n03773k85097n35136q32942q55894
10872a985345n71141p646O45659J107235J365210J749155J901423J506510M12147
10863F123207r65905j497681j532567j715196j503937m72903P23047P81421m50
10854f0964j62588Q54537J946910K234468J643219O19364k71669q88394j285725
10845D629158j230850p86291j94994M48417Q93892J114595Q53872N7611n27975
10836E257435m52339l89634n77155n78501l97462k95323p7024P0266k62995q31226
10826A466042r93256n02419J82290N06999M16747K54583L56273N75570J76641
$$ y = [-1442957, -1988307, -3000753, -4768087, -5935965, -5283105, -3371493, -1432133, -166143, 594432, 1289385, 1769798, 1643851, 1027497, 523724, 238627, -296509, -1129451, -1985345, -2556486, -2564132, -1918473, -811238, 553972, 2303127, 4204550, 5711060, 6123207, 5157302, 3659621, 2127054, 411858, -1092079, -1564982, -841935, -60514, -60964, -223552, 630985, 2577895, 4812363, 6455582, 7074946, 6803277, 5914883, 4629158, 3398308, 2612017, 2417023, 2865440, 3759332, 4873927, 5727799, 5785410, 5257435, 4805096, 4415462, 3838307, 3259806, 2862344, 2567021, 2489997, 2560263, 2297268, 1466042, 472786, -29633, 152657, 659656, 1076403, 1330986, 1687259, 2262829, 2439470]
10817B439470l97673j45945L43376L51827j5816k87669m74951p43445o94556l21503
10807E3115k42093r0547L98904L34530k95843o73371m35128J7005K27778J17413
10797e88237j24593j25830p7674l4265L19522M64422K59981L34595N26136L71311
10787A325368k41240q27341o37273l5744L93744N68876M39125L45125O61064Q71584
10777B863288M86102L65119N46368L55161j39556n78623l70972P8180J94401q7731
10767C711737k73413j64590l51272o81634n78630P0560O08979O47993M45694J662
10757C437086m47210o77021k68386P73654J333010J148904R60009J011353Q73808
10748H145207K29718n77113j106710j387075j573365j728178j654007j317967
$$ y = [2439470, 2041797, 1895852, 2239228, 2591055, 2575239, 2287570, 1812619, 1069174, 374618, 53115, -188978, -279525, 119379, 453909, 158066, -515305, -950433, -933428, -705650, -588237, -712830, -838660, -916334, -950599, -631077, -166655, 93326, 427921, 954057, 1325368, 1084128, 256787, -380486, -416230, -22486, 546390, 985515, 1330640, 1991704, 2863288, 3349390, 3714509, 4260877, 4616038, 4476482, 3897859, 3526887, 3605067, 3799468, 3711737, 3438324, 3273734, 2922462, 2240828, 1662198, 1732758, 2341737, 2989730, 3435424, 3437086, 2989876, 2312855, 2044469, 2818123, 4151133, 5300037, 6260046, 7271399, 8145207, 8374925, 7797812, 6691102, 5304027, 3730662, 2002484, 348477, -969490]
10740i69490q27579j27918L80018K43465p7147L95513J343008J496404J093306
10731B949580M72230l96422q71295m96303J13594P3357k00984m67733j164279
10722A1745j695891j225454p5631Q17828R26931L48255J54788Q44577J213831
10713A320979P16314k52574r78633j018353r73220j141207j365179j251378n88402
10704e531653K16265O98246O96381N07479M06342L88763L0773k18699M29830J109805
10694a266468P42647k7389n18607o66295p71763q60224m57341J69330M85828O04065
10684b566217N75986N98584L49464l27456o26387K2952P02002N57816M15362Q63708
10674E65814P18491L2756L6627L08946J36655n08152q55538o43550m69151m28382
$$ y = [-969490, -1797069, -1924987, -1544969, -1301504, -1378651, -983138, 359870, 1856274, 2949580, 3421810, 3025388, 2154093, 1657790, 1771384, 1844741, 1643757, 1176024, 11745, -1684146, -2909600, -2985231, -2167403, -1240472, -892217, -737429, 107148, 1320979, 2037293, 1784719, 806086, -212267, -1185487, -2326694, -3691873, -4943251, -5531653, -5315388, -4617142, -3920761, -3413282, -3006940, -2618177, -2587404, -2806103, -2376273, -1266468, -523821, -551210, -1069817, -1736112, -2507875, -3368099, -3825440, -3656110, -3170282, -2566217, -1990231, -1391647, -1042183, -1369639, -1996026, -1973074, -1271072, -713256, -297894, 565814, 1284305, 1317061, 1353688, 1662634, 1799289, 1291137, 435599, -207951, -677102, -1105484]
10664a105484j8736J065895K053984J893331J189767O66066M58683n5471n84282
10655E563753l15915j1699m6514o5476l3943j28778O919M27880M99725P4004o38548
10644E331408r09872m55392j89336l09927n67619o94221o36086o80005p21990
10635A66960p17812o88590m66662L94139J518639J628116Q75807K34918k83797
10626B661718m89596k58498J1911J73478K72052M75769Q24943Q02716L78722j10519
10616D742696n85663n86906j82418M5058j5085J69186L52384J78390R9402Q2695
10606D299739L9029J07867O6307j06921k46982m60747p51415q90893m72540K2861
10596A606305o4506p00436j420333j429524n77243J94985K06095p5148J24154
$$ y = [-1105484, -1124220, -58325, 1995659, 3888990, 5078757, 5744823, 6203506, 6148035, 5563753, 5247838, 5236139, 5189625, 5124149, 5090206, 4961428, 4968347, 5396227, 5895952, 5969956, 5331408, 4421536, 3966144, 3776808, 3466881, 2899262, 2205041, 1568955, 888950, 166960, -550852, -1239442, -1706104, -1311965, 206674, 1834790, 2710597, 2945515, 2661718, 2172122, 1913624, 1925535, 2099013, 2371065, 2846834, 3671777, 4474493, 4853215, 4742696, 4157033, 3570127, 3387709, 3432767, 3417682, 3586868, 3939252, 4117642, 4217044, 4299739, 4338768, 4446635, 4512942, 4406021, 4159039, 3698292, 2946877, 2055984, 1583444, 1606305, 1541799, 841363, -578970, -2008494, -2585737, -2390752, -2184657, -2259805, -2135651]
10587b135651P87143J284767J246654R70749N39147k19280r75505r31939j92398
10578C73687N44647Q96220Q07685M37571J26747j45608k93554k91263m84711p40614
10568A230807o13231N8566O65983Q81346R28617R00188N64736j19136n73679n42938
10558C381259n23436p34670r93568q82938o50524n12823j10479L38603O82326
10549f250Q12828P53237N49453J94904K24565P85372J148345M32657o43598p08399
10539C543114k23342k92321q47221j409542j500465j026050l24117L28784O88842
10530a062318Q55994P89412M01507L0698n1894k97596n23502l89663J2324L31292
10520I6254N05549K90010l88456p96993p65023m07775j01990n5518K43639P07305
$$ y = [-2135651, -1348508, -63741, 1182913, 2153662, 2692809, 2473529, 1498024, 566085, 373687, 918334, 1814554, 2622239, 3059810, 3186557, 3040949, 2747395, 2456132, 1971421, 1230807, 617576, 676142, 1342125, 2223471, 3152088, 4052276, 4617012, 4497876, 3924197, 3381259, 2857823, 2123153, 1129585, 246647, -403877, -916700, -1027179, -688576, -6250, 806578, 1559815, 2109268, 2304172, 2528737, 3314109, 4462454, 4895111, 4251513, 3543114, 3319772, 3027451, 2180230, 770688, -729777, -1755827, -2079944, -1751160, -1062318, -206324, 583088, 984595, 1015293, 963399, 665803, 142301, -247362, -235038, 96254, 601803, 891813, 503357, -293636, -1058659, -1466434, -1568424, -1623942, -1380303, -672998]
10510f72998J075533J230519N52759p58069j621086j437599j034146q05906l82039
10501c853032J48722L03462J76207L25769P62739J098551R62683M27316m21788
10492f9371p35659m5471P84137R09652J14131o66420n50447J93374Q16524J024162
10482A774612P71933M25493j14932o04951n03439l55696k36449N63802J465953
10473C186326J447904Q23410J52489l41518p28743o47564L88498J211588J147342
10464F639732Q74659M28460n12516r81500m53114k39715q06037j023970n14442
10455C411557L62330P42402J79326k14489j84550o29006j418899k003595k065926
10446a820850j304237k27087O69833J006710N80138L50194O56245J045967J372792
$$ y = [-672998, 402535, 1633054, 2185813, 1427744, -193342, -1630941, -2665087, -3470993, -3853032, -3704310, -3400848, -3224641, -2898872, -2136133, -1037582, -74899, 352417, -69371, -805030, -850501, -66364, 843288, 957419, 290999, -259448, -66074, 750450, 1774612, 2546545, 2972038, 2857106, 2252155, 1748716, 1393020, 1156571, 1720373, 3186326, 4634230, 5457640, 5610129, 5268611, 4539868, 3892304, 4280802, 5492390, 6639732, 7514391, 7942851, 7430335, 6448835, 5995721, 5756006, 4949969, 3925999, 3411557, 3773887, 4516289, 4695615, 4481126, 4296576, 3667570, 2248671, 245076, -1820850, -3125087, -3352174, -2682341, -1675631, -1095493, -745299, -89054, 956913, 2329705]
10437B329705J135632N90865K20627l52257j223559j884673j765336j005585O9367
10428a885214J150822J691056J272159J51443p04345o59733k03560n8281O5262
10419H19609L90833M52018r3101p83181j019671j008041o11858R1139M40142M07413
10409i14698L42345L29371m6983l27350j0490P85138J593741J732972Q37245l56488
10399C964803q29347o54852l97523k23402J31126J49768l84279j176144j629884
10390a049734j275460l92254N51438Q76744M58604J63888L46787L36722J38903
10381A55638J04087L71479P14406O54743J83362l72037o97415n15762j50378k29435
10371B18688n31382q62148r72751p30961l53552L39836J011529J107669O04576
$$ y = [2329705, 3465337, 4056202, 4276829, 3924572, 2701013, 816340, -948996, -1954581, -1885214, -734392, 956664, 2228823, 2380266, 1675921, 1016188, 812628, 754347, 819609, 1210442, 1662460, 1569359, 786178, -233493, -1241534, -1853392, -1762253, -1322111, -914698, -572353, -242982, -289965, -617315, -627805, 157333, 1751074, 3484046, 4321291, 3964803, 3135456, 2480604, 2083081, 1859679, 1990805, 2140573, 1756294, 580150, -1049734, -2325194, -2717448, -2166010, -1289266, -830662, -666774, -319987, 16735, 155638, 259725, 631204, 1345610, 2000353, 2183715, 1811678, 1114263, 598501, 448123, 218688, -312694, -1174842, -2147593, -2878554, -3232106, -2892270, -1880741, -773072, -168496]
10362a68496o2942k13577J93380N97772O11739L52703K9833j01074O7083K07030
10352A513451K24376K24831K93502K73856k61945j089715j366637r89973o01575
10343a779829J15340J049260J011746L57323J4460j99311o51930o65881j89568
10334i38390K60068L94317J57719j13228j60673m50161j021849q76702k5921M42862
10324b331958L66248J54044L14656Q85072J398045J817111J785407J180380L84571
10315E953576j04827l23313l84578j72740J01695K74727L34715k2846r27371j909849
10305B819189j898208o34961N40659J178861J305364Q30698j15957q71530q63224
10296B290891n81902l15642k17297j98391L34488O05301K89727N95340R90898
$$ y = [-168496, -231438, -445015, -251635, 346137, 957876, 1310579, 1340412, 1239338, 1306421, 1513451, 1737827, 1962658, 2256160, 2530016, 2268071, 1178356, -188281, -1178254, -1779829, -1664489, -615229, 396517, 753840, 768300, 568989, -82941, -748822, -938390, -678322, -284005, -126286, -239514, -400187, -850348, -1872197, -2748899, -2774820, -2331958, -1965710, -1811666, -1497010, -611938, 786107, 2603218, 4388625, 5569005, 5953576, 5848749, 5525436, 5140858, 4968118, 5069813, 5344540, 5679255, 5656409, 4729038, 2819189, 920981, 286020, 826679, 2005540, 3310904, 4141602, 4025645, 3154115, 2290891, 1708989, 1393347, 1176050, 977659, 1312147, 1917448, 2207175, 2802515, 3793413]
10287C793413O83892K28230j45721p19332j249167j101656m02054K55012N25273
10278A867890K84183N4503P939L30612J005005J228737P79612K08589m66240j412786
10268C888044k019940j784140j307277j298017j196177n45000J18408K56728P5651
10259c811720K54181Q67131J297386J146443N65729l0849l88441o14636q70366
10250a585142r27407o86556j44496P24047J106078Q24320M10372L76788K70120
10241C68124m95519j081317o79335M4089L45350M57569J75001l1857O3510j56373
10231i90758o65876r21833o27481J79052J058969J733853J652991O33921p57427
10222A295411j301427l99344N73921P96448O36742M79287K50891Q4655N8343p4680
$$ y = [3793413, 4477305, 4705535, 4559814, 3840482, 2591315, 1489659, 1087605, 1342617, 1867890, 2152073, 2206576, 2214515, 2545127, 3550132, 4778869, 5558481, 5767070, 5300830, 3888044, 1868104, 83964, -1223313, -2521330, -3717507, -4262507, -4144099, -3887371, -3811720, -3557539, -2690408, -1393022, -246579, 319150, 288301, -100140, -714776, -1585142, -2512549, -3199105, -3343601, -2619554, -1513476, -689156, -278784, 98004, 368124, -127395, -1208712, -1888047, -1843958, -1498608, -1041039, -866038, -897895, -834385, -990758, -1656634, -2578467, -3205948, -3026896, -1967927, -234074, 1418917, 2052838, 1295411, -6016, -405360, 168561, 965009, 1601751, 2081038, 2331929, 2416584, 2474927, 2400247]
10212B400247l90872o34407l63445Q1052j19838n59671o10506n64094n59942j22494
10202a443970N29558O98818L05863k76685m31488k8754L41071J09989j67717k57178
10192f20493m51975p23965o99085k7169P04500R78600J009199J053011J085716
10183B308339Q33976M47839r9660j234545k071620j647419m47018N74997J018866
10174c16245R29742O44611L11068j32629q05636j028409q37849o51487p7450L14743
10164a649541K40192j04174n8839P36276J386131J092280L69684J46005J35713
10155B293727j70815k73308L4702L47208Q51685J285463R66127K96019m05067
10146E225741j163628j269982q21598m81677n80035o36810l66447n51048j280342
$$ y = [2400247, 2009375, 1374968, 1011523, 1092575, 972737, 413066, -197440, -761534, -1321476, -1443970, -914412, -215594, 90269, -186416, -617904, -646658, -305587, -195598, -363315, -620493, -1072468, -1796433, -2495518, -2522687, -1818187, -839587, 169612, 1222623, 2308339, 3142315, 3590154, 3490494, 2255949, 184329, -1463090, -1910108, -1335111, -316245, 613497, 1258108, 1569176, 1436547, 630911, -397498, -1235347, -1886834, -1964284, -1649541, -1409349, -1513523, -1572362, -836086, 550045, 1642325, 2012009, 2158014, 2293727, 2122912, 1849604, 1884306, 2231514, 3083199, 4368662, 5334789, 5630808, 5225741, 4062113, 2792131, 1970533, 1488856, 908821, 272011, -94436, -645484, -1925826]
10137a925826j514869n75296O26466Q40835O37089Q24287J209082R58789J18897
10128A199454l23667m50969n95897r08219q64117l16372J08819M24126O16169
10119a110673L42559j43987k46616m67847r61871r21933l72663m9892N5906K80983
10109c596034O84358J023517Q90561N82536Q03607J212987R54942N2458r46044
10100A662888j376813q29449j16298n0085k16535m4635J0700l36989l77565j46170
10090a820951j88755o15392r34729p36862m01689q7637L83828R72906J509193
10081a920088J522175J069568P90576N38505M15487Q35980R10303L74489j45719
10072D391276m21142m54744j35000J26343j90217q06053j192327j128859m87728
$$ y = [-1925826, -3440695, -4015991, -3389525, -2548690, -1911601, -1087314, 121768, 1080557, 1199454, 875787, 424818, -171079, -1079298, -1943415, -2259787, -2150968, -1726842, -1110673, -768114, -912101, -1158717, -1626564, -2588435, -3510368, -3883031, -3932923, -3877017, -3596034, -2911676, -1888159, -997598, -415062, 388545, 1601532, 2556474, 2608932, 1662888, 286075, -543374, -659672, -709757, -926292, -970927, -960227, -1297216, -1674781, -1820951, -2009706, -2625098, -3559827, -4296689, -4698378, -4786015, -4402187, -3429281, -1920088, -397913, 671655, 1462231, 2000736, 2416223, 3252203, 4162506, 4536995, 4391276, 3970134, 3515390, 3380390, 3506733, 3316516, 2510463, 1318136, 189277, -298451]
10063b98451J4963o8237q4806j74572o06336q52654o04799J35341R01776R65547
10053f72228L88503J6076j00015k63692J72481J019150J108476M64598k13758
10044A919591q18868j456340k035247k254008j706088j108859r08891n51495m52788
10035i372993p92941l73096N51935R66302J200582J104597O39533K55114k50479
10026f071446j145756j956513j651076p82242n24664n93149m63846m47396p71651
10017a4407739p07557j49599J83623j53101n90003r92246j259877r41441o73503
10008a9691443p36230q44379j050229j583085k288867k814811k848959k561960
10000c4419963k541146k877812l450869m689554o145587p342466q987982j1344941
$$ y = [-298451, -283488, -351725, -436531, -611103, -1217439, -2070093, -2674892, -2539551, -1637775, -672228, -283725, -267649, -367664, -631356, -458875, 560275, 1668751, 2133349, 1919591, 1100723, -355617, -2390864, -4644872, -6350960, -7459819, -8368710, -8920205, -9372993, -10165934, -10539030, -9987095, -9020793, -7820211, -6715614, -6076081, -5820967, -6071446, -7217202, -9173715, -10824791, -11607033, -12131697, -12724846, -13188692, -13636088, -14407739, -15115296, -15264895, -15081272, -15234373, -15824376, -16816622, -18076499, -19017940, -19691443, -20427673, -21272052, -22322281, -23905366, -26194233, -29009044, -31858003, -34419963, -36961109, -39838921, -43289790, -47979344, -54124931, -61467397, -70455379, -81800320]
9992h1800320j3925939j6888111k0840554k6136513l1888718l6371181l5989478
9985b63840814k5038987j114295K5748663M0162570L9611652L1386644K1702248
9978a31382319J2571701M829832r22813n478267r912335j4168478j8046978k1995642
9970a84505299k5891594k8581377k8021541k2947250j6562902j2272257o106369
9963c24888589Q454251K9632897M5464136M8163955M2086554L3552266K5455036
9956i2079494J8899324J3963509J0520078Q629599P464893O331326M969360L308136
9948a7993269J809574R62519N33490O68131J256039J974125K594809K460587J668600
9939d065395P13864j0061j83966J04890m9971n34545o13894n0829O09955O10423
$$ y = [-81800320, -95726259, -112614370, -133454924, -159591437, -191480155, -227851336, -263840814, -288879801, -289994096, -264245433, -224082863, -184471211, -153084567, -131382319, -118810618, -113980786, -114903599, -120381866, -130294201, -144462679, -162509657, -184505299, -210396893, -238978270, -266999811, -289947061, -306509963, -318782220, -324888589, -316434338, -286801441, -241337305, -193173350, -151086796, -117534530, -92079494, -73180170, -59216661, -48696583, -40066984, -32602091, -26270765, -21301405, -17993269, -16183695, -15221176, -14687686, -14019555, -12763516, -10789391, -8194582, -5733995, -4065395, -3351531, -3361592, -3545558, -3440668, -3490639, -4025184, -4639078, -4689907, -4079952, -3469529]
9929c469529J73598K99122N80091J51588n66496o70518k78673l14711q31228j670233
9919f596989k381541k199468r42882O36417J798761J949315J151380J82488n11354
9910f913873n68180j96601J84311K32590K02556N65395O93164L33001p0815J39337
9900e399115P98947R18553L31564j7265N29279J246480J510183J436495J198698
9891B553819Q61101K05937o78920j128081p67888j14638R1794R9774M4704k49493
9881I18109p44940j115234j136618j113161j087539j052597j099075j259838j424292
9872i115185j572836j509077m43767J625140L107500L085089K410139J706144
9864g06853J090484O66932O8755m12172k44091R9408j0673m81641n88128q2007
$$ y = [-3469529, -3295931, -2996809, -2416718, -2265130, -2831626, -3502144, -3780817, -4095528, -4926756, -6596989, -8978530, -11177998, -12120880, -11484463, -9685702, -7736387, -6585007, -6402519, -6913873, -7482053, -7678654, -7494343, -7261753, -7059197, -6493802, -5800638, -5467637, -5538452, -5399115, -4600168, -3681615, -3350051, -3367316, -2838037, -1591557, -81374, 1355121, 2553819, 3414920, 3620857, 2941937, 1813856, 1045968, 931330, 1023124, 1122898, 1167602, 918109, 173169, -942065, -2078683, -3191844, -4279383, -5331980, -6431055, -7690893, -9115185, -10688021, -12197098, -12640865, -11015725, -7908225, -4823136, -2412997, -706853, 383631, 1050563, 1119318, 707146, 463055, 562463, 551790, 70149, -517979, -599986]
9854e99986l5885n99377j268287j772057j338143M339J242738J690464J613276
9845a062918J467696J099061N52632L48895M86676O92531O99270M19321K78511
9836D981675L39059L87498L47150P375n67449j397632k093517k056134j245116
9827a297091l76051K34009N15554N61507P01046J001203J129721P08407O08554
9818C786859J171807J363240N96515r6649j44178o0331j7264j63210k76642o09624
9808E550523j413456j584353j047807p38150q00090r80544q53163m91668l26508
9799b685216k16194Q0943M98131R40381J047882Q96544Q90458J071767R58623
9790C483319M97768J43150l26176j133475j839054k037842j619521n12707N74490
$$ y = [-599986, -635871, -1235248, -2503535, -4275592, -5613735, -5609396, -4366658, -2676194, -1062918, 404778, 1503839, 2056471, 2405366, 2892042, 3584573, 4283843, 4703164, 4981675, 5320734, 5708232, 6055382, 6062757, 5495308, 4097676, 2004159, -51975, -1297091, -1673142, -1439133, -923579, -362072, 338974, 1340177, 2469898, 3178305, 3786859, 4958666, 6321906, 6918421, 6821772, 6677594, 6617263, 6599999, 6436789, 6160147, 5550523, 4137067, 2552714, 1504907, 766757, -33333, -1013877, -1867040, -2358708, -2685216, -2901410, -2820467, -2322336, -1381955, -334073, 562471, 1452929, 2524696, 3483319, 3981087, 4124237, 3798061, 2664586, 825532, -1212310, -2831831, -3344538, -2770048]
9781b770048P40555L47881K04674L50008J52935k30415p74231j694293j828417
9772e501351o64111O58619R79071N84470L21322N28288J252205J431907R55464
9763E45884P15595R84758J362711J363548P12639k74034q94574r84385p41101
9754B791041l53618J24429K32983K7566j02506j71623K98q675l27755j78276J99367
9743B233231K12387j06703m25648m16331m15715p87873r61726p17728m07049Q708
9733a784447M96485Q23335O37157N7162j94474o6150J99564N72027R57423R61377
9723B659459K10661q61860j318840j494988j385060j68122J231163J561965Q03368
9714A237746J81470N33916Q38758P84504P81595O43813J67435k96824n27870n20437
$$ y = [-2770048, -2029493, -1681612, -1476938, -1126930, -973995, -1204410, -1978641, -3672934, -5501351, -6165462, -5506843, -4527772, -3943302, -3621980, -3093692, -1841487, -409580, 545884, 1261479, 2246237, 3608948, 4972496, 5685135, 5411101, 4516527, 3532142, 2791041, 2437423, 2561852, 2794835, 2822401, 2719895, 2548272, 2548570, 2539895, 2212140, 2033864, 2233231, 2445618, 2338915, 1913267, 1496936, 1081221, 293348, -668378, -1386106, -1793155, -1784447, -1287962, -464627, 172530, 229692, 35218, -30932, 168632, 740659, 1698082, 2659459, 2870120, 2008260, 689420, -805568, -2190628, -2358750, -1127587, 434378, 1237746, 1419216, 1953132, 2791890, 3576394, 4357989, 5001802, 5169237, 4872413, 4344543, 3824106]
9704C824106q06941j151969o66215j0626M50730P55453O24878J26013o60741j379756
9694A104932j150338k03727L54924L33097J47144k02579o44297p15609l56651
9685a333104j1539M5249L68677R75028J390160J377575R93168P30087Q54368Q59055
9675F248724M48517m8729J24204N84585R972j403782k119117j632317j109374
9666A102683l97461P55948J397719J069019J18172p69446j389152j542215j093933
9657g48666k97534K97957J46587k48736o81415j153989j143786l35489O71484
9648c493587J131549J164934J136849J104080J191717J189947Q39026L00620j10302
9639D454833J5840K52779j14958p33634r60053j039731r62301l37279K28715J31545
$$ y = [3824106, 3017165, 1865196, 1198981, 1188355, 1639085, 2394538, 3019416, 3145429, 2484688, 1104932, -45406, -249133, 105791, 438888, 586032, 383453, -260844, -976453, -1333104, -1344643, -1299394, -930717, 44311, 1434471, 2812046, 3805214, 4535301, 5389669, 6248724, 6697241, 6648512, 6772716, 7357301, 7367273, 5963491, 3844374, 2212057, 1102683, 705222, 1461170, 2858889, 3927908, 4046080, 3276634, 1887482, 345267, -748666, -1046200, -748243, -601656, -850392, -1531807, -2685796, -3829582, -4165071, -3493587, -2362038, -1197104, -60255, 1043825, 2235542, 3425489, 4264515, 4565135, 4454833, 4470673, 4723452, 4608494, 3874860, 2914807, 1875076, 912775, 575496, 804211, 935756]
9629I35756l22434r05010j388208r48138p7036L43015O96186J300664J897403
9620A532198K201761K021087J159947J69636n23765q33049j102927j201058j030528
9611B393302r54993p41039m90656m30235l92089j37065P7040j10675m53002m86959
9601a726371j85170J28359K21825K99402N26603L59806q4421o0534K37363K68139
9591a4999J39304P3169O7276J74179M39362P60587P82189K78112l38352m43185
9581A917642J03612O39449Q93311J033416Q99695j42200j215968j140274n47530
9572B441153l61930l72337J00463J92818k34202m56199q7277N66949P03193K20270
9562B712901R9287L35667L58540L38703L06979L36109J82009n52162j259482j088800
$$ y = [935756, 613322, -291688, -1679896, -2628034, -2705070, -2362055, -1665869, -365205, 1532198, 3733959, 5755046, 6914993, 7084629, 6560864, 5727815, 4624888, 3423830, 2393302, 1438309, 697270, 206614, -223621, -615710, -752775, -675735, -786410, -1239412, -1726371, -1911541, -1783182, -1561357, -1261955, -735352, -375546, -459967, -520501, -283138, -14999, 124305, 197474, 264750, 438929, 878291, 1638878, 2421067, 2699179, 2360827, 1917642, 2021254, 2660703, 3554014, 4587430, 5487125, 5344925, 4128957, 2988683, 2441153, 2079223, 1706886, 1807349, 2000167, 1765965, 1309766, 1222489, 1789438, 2492631, 2712901, 2812188, 3147855, 3506395, 3845098, 4152077, 4488186, 4670195, 4118033, 2858551, 1769751]
9552A769751m72713j42995l67955n72179n01297n34708m30749r1824K67155O04483
9542d73031Q54187R01399J055958J120603J096981N75297l73507q81208m61991
9533C414688J52867J86924J92707M91616P32780M30732j05619n53818q06132n35870
9523C600875J49626N87545Q84432R57186P71931N22220K64533P2257l65820j158588
9513F286197j435535r73772o49552o81981o34208l36304j94900l98750m99488
9504D81707n3506M48959P6235p93315q95494j51832L31568J76630L5783Q0703
9494b62562O7752j59771l95213m04430m06955l19314M80738J570322J689863Q64021
9484B724451p076j90231L23733P88531M20860l72637o32351m0249P84204R70042
$$ y = [1769751, 1297038, 1154043, 786088, 213909, -287388, -822096, -1252845, -1344669, -1077514, -473031, 381156, 1282555, 2338513, 3459116, 4556097, 5131394, 4757887, 3876679, 3414688, 3567555, 3754479, 3947186, 4438802, 5171582, 5602314, 5496695, 4942877, 4136745, 3600875, 3750501, 4338046, 5222478, 6179664, 6951595, 7473815, 7738348, 7810605, 7444785, 6286197, 4850662, 3876890, 3227338, 2545357, 1911149, 1574845, 1379945, 981195, 481707, 428201, 877160, 953395, 160080, -735414, -887246, -555678, -379048, -343265, -262562, -194810, -354581, -749794, -1154224, -1561179, -1880493, -1399755, 170567, 1860430, 2724451, 2717375, 2527144, 2850877, 3639408, 4060268, 3687631, 3055280, 3015031, 3799235, 4769277]
9474D769277L02710o29998r50193r55685j175566j440811j301220m20811L57979
9465a444318K25571k92705m47598j84240Q586j45453o5626N49243R22058O96751
9455a77731L82094J69906N42419J415135J467407P03030M83301R77174R34574
9446F897309o4612q49121p54066m70904l25696l71638n13749m86970m27826P2501
9436B705228J127368J940409J767463R67946O1400q99039j382240j073676p34649
9427D480210r36893j018086m89341O7412J77512L6076k81967l39030l9988L82947
9417B038852Q53672R67159N22427O151l06129n08943o70144o51550k45883J41869
9407B147481J43927l5032k39435l46994k88441k20668j78832R4243M68802O25004
$$ y = [4769277, 5071987, 4441989, 3491796, 2536111, 1360545, -80266, -1381486, -1802297, -1444318, -1218747, -1511452, -1959050, -2143290, -2134704, -2280157, -2345783, -1796540, -874482, -177731, 204363, 374269, 916688, 2331823, 3799230, 4502260, 4985561, 5962735, 6897309, 6832697, 5983576, 5229510, 4758606, 4432910, 4061272, 3547523, 3060553, 2632727, 2705228, 3832596, 5773005, 7540468, 8508414, 8569814, 7670775, 6288535, 5214859, 4480210, 3543317, 2525231, 2035890, 2103302, 2280814, 2316890, 2034923, 1695893, 1655905, 2038852, 2892524, 3859683, 4382110, 4388261, 4082132, 3573189, 2903045, 2251495, 2005612, 2147481, 2291408, 2256376, 2016941, 1669947, 1381506, 1160838, 982006, 1076249, 1545051, 2170055]
9397B170055O54509N03197j34392q26955r62247o94893o32885o28276k49518J96577
9387f04828J39730M7277L14594K26320k07349l72307l42239j85754K56634M62691
9377b65231L06309j31801p19467p72779m49686m54351M2797Q34796P22240l7464
9367i24637p97755p09399J20601M88881N36194P44560O30946K30247J22908P54241
9357A196787J683572J843062R57601j45778p63675r54317r47959n76698k5499
9348B267096J4397j70500N0765k3371k52075n9399k00715l26066m0322l65845
9338H93965o74676m31827n1592J36917J31504N57668Q98849O60578L91946K53918
9328B767250M6544r748L12981J028462J640530J361446N20042m72621j177450
$$ y = [2170055, 2824564, 3327761, 3193369, 2366414, 1404167, 709274, 76389, -551887, -801405, -604828, -465098, -417821, -103227, 123093, -84256, -456563, -798802, -984556, -727922, -265231, 41078, -90723, -810190, -1582969, -2032655, -2487006, -2444209, -1609413, -887173, -924637, -1722392, -2431791, -2311190, -1822309, -1286115, -541555, 89391, 319638, 442546, 1196787, 2880359, 4723421, 5681022, 5535244, 4771569, 3817252, 2869293, 2292595, 2267096, 2281493, 2110993, 2161758, 2138387, 1886312, 1826913, 1626198, 1300132, 1259810, 893965, 219289, -212538, -264130, -127213, 4291, 561959, 1460808, 2121386, 2513332, 2767250, 2813794, 2804046, 3117027, 4145489, 5786019, 7147465, 7667507, 7194886, 6017436]
9319F017436j066032o32214n90916n64694r1940M71067O34153J09302j15236J05576
9309D276502K35180L77549M61445M62966N36111L79993l11955j148157j270265
9300C999369j154144r94844l77355P10210J206838Q09044M06344J92771J73692
9291D971925K88003J234m22344n64320l93082K4677K77161N68918J153517J548992
9281G454681J138548N24861K97646K23721M9269m76141j163782j335131q05560
9272E908112j00929L88323N32774L62674O8803j88742l51603j084302k047940
9263C487170k282852j207726J28193M04144l159l54222n71119r54688q15639J05816
9253b064082N69960K98536J48545J17438k0556K74332R50327J212465J068177
$$ y = [6017436, 4951404, 4319190, 3728274, 3163580, 3071640, 3542707, 4176860, 4286162, 4170926, 4276502, 4511682, 4889231, 5350676, 5813642, 6349753, 6729746, 6417791, 5269634, 3999369, 2845225, 1850381, 1473026, 2183236, 3390074, 4199118, 4605462, 4798233, 4971925, 5259928, 5261162, 4838818, 4274498, 3881416, 3906093, 4183254, 4752172, 5905689, 7454681, 8593229, 9118090, 9415736, 9639457, 9688726, 9212585, 8048803, 6713672, 5908112, 5807183, 6195506, 6728280, 7090954, 7159757, 6971015, 6619412, 5535110, 3487170, 1204318, -3408, 124785, 528929, 525770, 171548, -399571, -1354259, -2169898, -2064082, -1494122, -1195586, -1047041, -929603, -950159, -675827, 274500, 1486965, 2555142]
9244B555142P27193R1496m33889m17697J99894J104125J771671J725650J257247
9235H580832L63035o33191q50530l94741k35837l25030m87956o61467p53967r14715
9225C686433r43099p34071l02101N3563L11428M24259K06177l68738r13873j137719
9215B82259j029521p66553k48093O01246R46512M95944j63778o34422o59516l59363
9205a535285l3563m6224j50014m2523K76112L64844J38949L2558N0966R7511M42066
9194d04603O92622N83093K11007l48410p89397r68285l63122Q37727J597311J545242
9184B593185J162195P11133l8133q29582q68608j54125N22402N50756N1235l51580
9174C348878N784P92292J050635L50929q03393j584409j612381j265369q08867
$$ y = [2555142, 3282335, 3373831, 2939942, 2522245, 2722139, 3826264, 5597935, 7323585, 8580832, 8943867, 8310676, 7460146, 7065405, 6829568, 6504538, 6016582, 5355115, 4601148, 3686433, 2743334, 2009263, 1707162, 1760725, 2072153, 2496412, 2702589, 2333851, 1419978, 282259, -747262, -1513815, -1761908, -1160662, -214150, 281794, 118016, -516406, -1175922, -1535285, -1568848, -1615072, -1765086, -1807609, -1531497, -1166653, -1027704, -995146, -944180, -846669, -404603, 288019, 871112, 1082119, 733709, -55688, -1023973, -1387095, -549368, 1047943, 2593185, 3755380, 4466513, 4428380, 3598798, 2730190, 2576065, 3098467, 3649223, 3700458, 3348878, 3354662, 4146954, 5197589, 5548518, 4745125, 3160716, 1548335, 282966, -525901]
9165e25901p4160N30652N11587j21321n00416k89840L8733K04390L25280M63985
9155E62989K88089p4121k78372k30519j95730k18303J84301J157662J779830J325750
9145D301576K55966p02306j070577q60394n59676n53280o47303l55576K56141
9136F4571O78930Q65885R27860O73272K08446l81940j149703j343285n10724M79663
9126E12975Q71547P97327M01423j32823m09748l92397l44321j63317J9070j57052
9116A002684j93364J35083N97111P51490L78091k56613q07652j160456j318170
9107h71796j184083p23443q0963L05794N58173P46877N20167K17431L59268J184927
9097A032352J859556J797193J436486J068447J113358J198497L50797r92016j684096
$$ y = [-525901, -600061, -69409, 442178, 320857, -179559, -469399, -430666, -226276, 99004, 562989, 851078, 776957, 498585, 268066, 72336, -145967, 38334, 1195996, 2975826, 4301576, 4557542, 3855236, 2784659, 1924265, 1364589, 811309, 164006, -191570, 64571, 743501, 1609386, 2537246, 3210518, 3418964, 3037024, 1887321, 544036, 33312, 512975, 1384522, 2181849, 2583272, 2450449, 2040701, 1648304, 1303983, 1140666, 1159736, 1002684, 809320, 944403, 1541514, 2293004, 2671095, 2414482, 1606830, 446374, -871796, -2055879, -2779322, -2860285, -2554491, -1996318, -1249441, -729274, -511843, -152575, 1032352, 2891908, 4689101, 6125587, 7194034, 8307392, 9505889, 9856686, 8864670, 7180574]
9088G180574j269205l86977M5595k17825j135745j779943j350955m06321L43482
9079A022680N92694L14960L38339P00748N98679J84037K4786J711j58590k92052
9069C327992M0612Q1646m32035n70112l97890J78769P05327N39751J8966j77721
9059C315305L00060P78997J042258Q52737K30509k19243p69761j393078j501886
9050B635898j147081o55693q6828L49045N82746P88339R71741Q58067K25662o79337
9040C842559j073735r67152q23447q65101r84644j134504j512944j417157m23248
9031e359373P56180J500932J504918J051472R96612J069399J067931J014778M04118
9022D006967m12982o18093l04320j6158K81200N18967m2826j207978j401315m02021
$$ y = [7180574, 5911369, 5524392, 5569987, 5352162, 4216417, 2436474, 1085519, 679198, 1022680, 1615374, 1930334, 2268673, 2969421, 3568100, 3752137, 3776923, 3778634, 3620044, 3327992, 3368604, 3450250, 3018215, 2448103, 2050213, 2228982, 2934309, 3474060, 3493026, 3315305, 3615365, 4394362, 5436620, 6289357, 6519866, 6300623, 5530862, 4137784, 2635898, 1488817, 833124, 746296, 1095341, 1678087, 2466426, 3438167, 4296234, 4521896, 3842559, 2768824, 1801672, 978225, 113124, -871520, -2006024, -3518968, -4936125, -5359373, -4603193, -3102261, -1597343, -545871, 450741, 1520140, 2588071, 3602849, 4006967, 3593985, 2975892, 2671572, 2655414, 2936614, 3455581, 3412755, 2204777, 803462, 401441]
9012D01441O91669J238697J070303J06336p42688q38702l44495J55167R1919k4800
9002A804847J59885M32211Q19181J132525J294226J403272Q64401r4552o53676
8993G162320j050039j129014o49753M6571L24512m18055j358691j609095j317559
8984A197p25289Q7032M81070p367p59103q59070j27105N71345N96905L87173R0615
8973b62597j78502j85460K63210P83546Q63506O88262N82945P14569R48272O62047
8963D879798n6671k25835M12744J304430J732000J525350N80202m80079r92234
8954H679705j253469j278647r30397l66210r6620j57126n15494j045161j321959
8945A714622r39169n20863l06797K05980N42780L35328P2777J56131O32436J129111
$$ y = [401441, 1093110, 2331807, 3402110, 3508446, 2765758, 1927056, 1582561, 1737728, 1829647, 1804847, 1964732, 2396943, 3216124, 4348649, 5642875, 7046147, 7910548, 7815996, 7162320, 6112281, 4983267, 4333514, 4380085, 4704597, 4286542, 2927851, 1318756, 1197, -724092, -637060, -155990, -163357, -922460, -1781530, -1908635, -1337290, -740385, -353212, -262597, -441099, -626559, -363349, 420197, 1283703, 1971965, 2554910, 3269479, 4217751, 4879798, 4823127, 4597292, 5010036, 6314466, 8046466, 9571816, 10152018, 9671939, 8679705, 7426236, 6147589, 5217192, 4850982, 4754362, 4597236, 4081742, 3036581, 1714622, 775453, 254590, -52207, 153773, 696553, 1031881, 1104658, 1260789, 1893225, 3022336]
8935C022336R81853L50273j89141o56689j039972q33636L8789R08978J144170
8926C726961Q44419L50449j36187m04047l07905K88875J064921J426584J210756
8917H064826K17364j002561j322190p80211j42371J80839J55474m294q3167j62693
8907E121016k98403l76135k36826k67017n68362o55692n22294k95247j87864j62051
8897A551125j73764j87742r4080J45310M35604J66726k05764j75722j86917j73498
8887A101278J36274O38221P56888J78639o96322q67511m41748k26284m67969p69143
8877f57677o91991l37037k2881R9006K45839M95437L50316r5877n85906q19709
8867b020480k97928O88232R50438M99464K39461K39629K80552J70773q2069K2460
$$ y = [3022336, 4004189, 4354462, 4165321, 3508632, 2468660, 1635024, 1673813, 2582791, 3726961, 4571380, 4921829, 4785642, 4381595, 4073690, 4362565, 5427486, 6854070, 8064826, 8282190, 7279629, 5957439, 5177228, 5034857, 5215696, 5371170, 5366876, 5283709, 5121016, 4822613, 4446478, 4209652, 3942635, 3374273, 2718581, 2196287, 1901040, 1713176, 1551125, 1377361, 1189619, 1095539, 1240849, 1676453, 1843179, 1637415, 1461693, 1274776, 1101278, 1237552, 1875773, 2632661, 2811300, 2114978, 1247467, 805719, 579435, 111466, -657677, -1349668, -1686705, -1709586, -1610580, -1364741, -869304, -518988, -614865, -1200771, -2020480, -2318408, -1630176, -679738, -180274, 59187, 298816, 579368, 750141, 668072, 690532]
8857F90532O59167J410084J714923J766471J569983O92529o73479j504333j428901
8848D896976j199965j026316p26634n53503l54695K12096J006625J533525J211371
8839D999480L45241l76506o06890m09880l18303n67706q55849r28068p10305j70923
8829D00291M93817J059636J126206Q61888P10105N1268p99709j319803j491149
8820A092550j040456P218Q81586J190668J128049Q62429Q61786R07543O40020
8811F531393R2596n57983q17067n93009K09735J091776J241526R51611P42145
8802H892723K31825o27474r69925n59779K555K78084J68046k68352r22740j045207
8792E179756o94382j92954K03732J76121j93354q34364j092085o73804o15868
$$ y = [690532, 1349699, 2759783, 4474706, 6241177, 7811160, 8503689, 7830210, 6325877, 4896976, 3697011, 2670695, 1944061, 1390558, 1035863, 1247959, 2254584, 3788109, 4999480, 5344721, 4968215, 4361325, 3951445, 3633142, 3065436, 2209587, 1281519, 571214, 400291, 894108, 1953744, 3079950, 3941838, 4651943, 4703211, 3903502, 2583699, 1092550, 52094, 59312, 940898, 2131566, 3259615, 4122044, 4983830, 5891373, 6531393, 6623989, 6066006, 5248939, 4655930, 4865665, 5957441, 7198967, 8150578, 8892723, 9124548, 8497074, 7527149, 6967370, 6969925, 7248009, 7416055, 7147703, 6224963, 5179756, 4485374, 4292420, 4496152, 4672273, 4478919, 3644555, 2552470, 1878666, 1262798]
8783A262798j090151j155568q71349o00151j29405O35830J201490J324889J323392
8774A901775J061800M45755j3696l27149p73288j089637r06079l07422M24693
8765D16752J121454J431567J159591O63227J20934m43393o29615k81740j46208
8756C412569l86350k02886J0693l63827j040963j616930j674693r06695k28835
8747b997917J31611M29473L84063R0022o7131K70941O60557P46326M82872o7455
8737F3362j49695L65002O45945L68002M27073Q56997P81497K02258k81640l22663
8727B956138l29112k70614K02020M78967M7566n11083o88377o51264o60836n65887
8717G518k25698P8193J91395R2101p204J9700K52344N96540O72744M96800J81967
$$ y = [1262798, 172647, -982921, -1854270, -2454421, -2583826, -1947996, -746506, 578383, 1901775, 2963575, 3409330, 3395634, 3068485, 2295197, 1205560, 299481, -7941, 416752, 1538206, 2969773, 4129364, 4792591, 4913525, 4470132, 3840517, 3558777, 3412569, 3026219, 2823333, 2834026, 2470199, 1429236, -187694, -1862387, -2769082, -2997917, -2866306, -2436833, -2052770, -1962748, -2029879, -1758938, -1098381, -352055, 130817, 63362, -86333, 278669, 924614, 1292616, 1719689, 2576686, 3358183, 3560441, 3278801, 2956138, 2627026, 2356412, 2558432, 3037399, 3084965, 2573882, 1885505, 1234241, 573405, 7518, -218180, -139987, 51408, 143509, 136305, 156005, 408349, 1004889, 1677633, 2174433, 2356400]
8706B356400k21983k49719J62746K14820k60559n74984n94376r55188j202968
8697a325811q28447l5311R09076J603948J368159N83415j98381r39368q82529
8688B54751R7277P66107P37955N07957M02494L94526J72828j06064j18846j01787
8678C007198m7643Q4717p1748l86122n27982o22655p45762q29448o35647j86462
8668i61554K64646M74105J76650m44873o92777o0799R50084J551804J369851L48758
8658B975895p68262j091769o50815l88339m34944L8840P63856J092095P39864
8649B276421j77626o74315k63544J73794J62956K01246L27722L8373p40560j241856
8639H2611q30196K37429R02315N63156M0751N0389l00124j374908j723129j205764
$$ y = [2356400, 2134417, 1884698, 2047444, 2262264, 2001705, 1426721, 832345, -122843, -1325811, -2154258, -2189569, -1280493, 323455, 1691614, 2275029, 2076648, 1137280, 254751, 352028, 1118135, 1856090, 2364047, 2766541, 3161067, 3333895, 3227831, 3108985, 3007198, 2959555, 3044272, 2972524, 2586402, 2058420, 1435765, 690003, -139445, -775092, -961554, -696908, -222803, -46153, -491026, -1183803, -1244602, -294518, 1257286, 2627137, 2975895, 2207633, 1115864, 465049, 76710, -358234, -319394, 444462, 1536557, 2276421, 2098795, 1424480, 1160936, 1334730, 1497686, 1698932, 2026654, 2065027, 1324467, 82611, -747585, -510156, 392159, 955315, 996066, 1046455, 746331, -628577, -2351706, -3557470]
8629c557470o61209j92505J80757K52556j32982m27354m31490j52882L07356P71063
8619d044160J004289O79854J37278K76916R97864J123167O71363J34846J4022
8610I95439M64284N87003J7394m48897l95387l40791n61701l74814K85731L04135
8600E32396k04233k17467l3722k58835j10304O87964J273115J078629P14501P97348
8590D259392R30358P96372L48969k16540m42052n23669n92518m73945n76520o79093
8580B830754r03185j137171r31281l80062M54627R15823M42762r6125Q1292O40909
8570A918343O16659j19751p22192r85328r25585q13704j104800j347525j057053
8561d540936n06262l68479l64187k54034L7762P86380J629545J683649J021969
$$ y = [-3557470, -4218679, -4411184, -4230427, -3977871, -4110853, -4538207, -4969697, -5122579, -4815223, -4044160, -3039871, -2360017, -2222739, -1945823, -947959, 175208, 846571, 981417, 995439, 1459723, 2046726, 2064120, 1615223, 1219836, 879045, 317344, -57470, 228261, 532396, 328163, 110696, 76974, -181861, -292165, 395799, 1668914, 2747543, 3462044, 4259392, 5189750, 5986122, 6335091, 6118551, 5676499, 5152830, 4560312, 4086367, 3509847, 2830754, 1927569, 790398, -140883, -520945, -66318, 849505, 1292267, 1196142, 1277434, 1918343, 2535002, 2415251, 1693059, 707731, -217854, -1031558, -2136358, -3483883, -4540936, -5047198, -5415677, -5779864, -6033898, -5996136, -5209756, -3580211, -1896562, -874593]
8552h74593M20420j639n57805q42007p47175n78392k31563K79822Q52576J093708
8542a186648Q58135N63048L36310j47253o87991p76389n05508L0166J084359J657045
8532A225274J054491J22580k73075n9410L65379R74813J444023J450065J261734
8523G565874Q06769J86556k56853n87821r88844j165573j193102j259054j162271
8514A945681j057153j124932r74889o49838n95535n45019m25701j85589L26581
8505c286394O97086N23117N0402q3737m2533j53314n09242r67199p94712L09932
8495d256594J491408J903810J440747P68258M1235m99730k60046L39738O27252
8486A596078M61134k25089j106781j569073j323634q53724p91916n44407M91374
$$ y = [-874593, -454173, -455812, -1013617, -1855624, -2602799, -3181191, -3412754, -3132932, -2280356, -1186648, -328513, 234535, 570845, 423592, -264399, -1040788, -1546296, -1516130, -431771, 1225274, 2279765, 2402345, 2129270, 2069860, 2435239, 3410052, 4854075, 6304140, 7565874, 8372643, 8559199, 8302346, 7714525, 6725681, 5560108, 4367006, 3107952, 1945681, 888528, -236404, -1211293, -1861131, -2456666, -3001685, -3427386, -3612975, -3286394, -2589308, -2066191, -2015789, -2099526, -2142059, -2295373, -2804615, -3771814, -4566526, -4256594, -2765186, -861376, 579371, 1347629, 1388864, 889134, 629088, 968826, 1596078, 2057212, 1832123, 725342, -843731, -2167365, -3021089, -3813005, -4357412, -3866038]
8477c866038J591934J710717J213092Q06347O76802P56816R84950J046688M79048
8468E400356k33667n05665l04768J83233L64607j35314p86439q48427n19472m18135
8458B196309n57157o15407n52251l08557m6955j80691m68513o32150q28858p48018
8448b742248j48240N99578P88053J42380m19753j18900M68668O11059P70267O42116
8438E92980M1544k22708q3440R7397P9190j80609l17472q7072O9737m043L5564
8427B1068K09959j57985o05442p67179j087930j045454k50811L36788M35692P03540
8417b207754P72300J58150M562P36841J254475J320328J428855J294154N97244
8408E359155k25156o79832o13596n69706p24084p55830o19084o21900m56091J42114
$$ y = [-3866038, -2274104, -563387, 649705, 1456052, 2132854, 2889670, 3874620, 4921308, 5400356, 5166689, 4661024, 4356256, 4539489, 4904096, 4768782, 3982343, 3133916, 2614444, 2196309, 1639152, 1023745, 471494, 162937, 115982, -64709, -533222, -1165372, -1994230, -2742248, -2890488, -2290910, -1502857, -1360477, -1780230, -1899130, -1430462, -819403, -49136, 592980, 634524, 411816, 328376, 425773, 504963, 324354, 6882, -80190, -10453, -14496, 21068, 231027, 73042, -532400, -1299579, -2387509, -3432963, -3683774, -3346986, -2911294, -2207754, -1435454, -1277304, -1272742, -535901, 718574, 2038902, 3467757, 4761911, 5359155, 5133999, 4454167, 3840571, 3270865, 2546781, 1790951, 1171867, 549967, 93876, 235990]
8398B35990M65107L55471J77026q9488k25443k10648p9932L74437N18524k9497
8388A491547n89692r09860p22478n59015q23160j071963j238929j427688j554689
8379g405927j077249l58608p1205J77630Q26163J065302N67950J3568K96287J274423
8369d691666J728712J280259O32406N07034N11889P71896J297380J095038N87910
8360C720858M32757J60594n4783l60626n41342m4717M80377L30469k20392n31905
8350C371290n60121n24343o37443p81660p47014l62295L26272M78524o0507l03601
8340A99102r8671K57575N36477L48332j96610r18829j330217j145732r30418r66466
8330d245457n64072L78457J056103Q51212K05835p1845m26186o52521o5956K69223
$$ y = [235990, 701097, 1056568, 1233594, 1144106, 918663, 708015, 628083, 1002520, 1521044, 1491547, 901855, -8005, -730483, -1289498, -2112658, -3184621, -4423550, -5851238, -7405927, -8483176, -8841784, -8912989, -8735359, -7909196, -6843894, -6275944, -6262376, -5966089, -4691666, -2962954, -1682695, -1050289, -543255, -31366, 740530, 2037910, 3132948, 3720858, 4153615, 4314209, 4259426, 3898800, 3357458, 3312741, 3793118, 4123587, 3903195, 3371290, 2811169, 2286826, 1649383, 867723, 120709, -241586, 84686, 563210, 502703, 199102, 100431, 358006, 894483, 1242815, 1046205, 127376, -1202841, -2348573, -3278991, -4245457, -4809529, -4431072, -3374969, -2523757, -2317922, -2389767, -2815953, -3468474, -3534430, -3265207]
8320c265207l41333j127694j272950o89666M50512J506888J647364P89385k78371
8311b581072o47654o87545m74847J27225L98512j61062p07558l63250L52977O14922
8301d129352O90163P93573R79036J252674R37979j67249j203555j457288j522583
8292c826602j773356j605611p54951J40862L60698N16833J032404J524210J445614
8283b939899L42677r70622j184970p37535j76030M24141O94192N89329L83092
8274c575625K20148k81982m89038k39861R1171N15992O07134J19845l92899p05978
8264d131093q69115n59284K54466P07197M95963N7568k38435r9513J89864K56453
8254c935929N30396R57808Q02061K47622J66883M10128M42759K56717m0867j20175
$$ y = [-3265207, -3606540, -4734234, -6007184, -6696850, -6246338, -4739450, -3092086, -2302701, -2581072, -3228726, -3916271, -4391118, -4263893, -3865381, -4026443, -4734001, -5097251, -4744274, -4129352, -3439189, -2645616, -1666580, -413906, 524073, 356824, -846731, -2304019, -3826602, -5599958, -7205569, -7960520, -7819658, -7458960, -6942127, -5909723, -4385513, -2939899, -2597222, -3567844, -4752814, -5490349, -5666379, -5242238, -4548046, -3958717, -3575625, -3355477, -3637459, -4126497, -4366358, -4275187, -3759195, -3152061, -3032216, -3425115, -4131093, -5000208, -5559492, -5305026, -4597829, -4101866, -4044298, -4282733, -4382246, -4192382, -3935929, -3405533, -2447725, -1645664, -1398042, -1231159, -821031, -378272, -121555, -162422, -282597]
8244b82597J80557N93265L32800l65093p72995p26741m20443k37684k68924r9973
8234b067828K25693O20334R14147Q94523M33940j64002k33763L71012Q37794N09223
8224B341073j36733k99925k01423o89446j279619p64767M76838P97681M21407
8215F65086M90930O04944M84444J15569l98163m85562j92974j47471o69750r39521
8205d72468l50810M70670P28042K06645l87147m27180k72716l39029l59718M417
8195a199294M98030Q51457J041426P45800L3999j69630l4595m91425p62220k53855
8185B59693k702k95276m41859K9280P01084J116771R05703K07921k07362m64847
8175A808406o97681o55617l87713j58559L8170K84160J98288l26172o47887n92044
$$ y = [-282597, -102040, 491225, 824025, 458932, -314063, -1040804, -1461247, -1698931, -1967855, -2067828, -1842135, -1221801, -307654, 586869, 1020809, 856807, 623044, 994056, 1831850, 2341073, 2204340, 1904415, 1702992, 1013546, -266073, -1030840, -554002, 243679, 665086, 1156016, 1760960, 2245404, 2360973, 1962810, 1477248, 1284274, 1136803, 467053, -472468, -823278, -352608, 375434, 582079, 194932, -232248, -504964, -843993, -1203711, -1199294, -701264, 150193, 1191619, 1937419, 1971418, 1801788, 1767193, 1275768, 513548, 259693, 256991, -38285, -480144, -450864, 250220, 1366991, 2272694, 2480615, 2273253, 1808406, 1110725, 455108, 67395, -91164, -52994, 231166, 429454, 103282, -544605, -1136649]
8165a136649m40211N9615P46735R51185K77695q15994j253684p45026k45401L425
8155b598310L88885M23790j30056q38572j156105q48425l35822K93546Q50015
8146c951054J224085Q93995j75321n27764k72271K4524N47496Q52221P91354N74260
8136a8475O35324J105204J227419M46336l59873o98924r09344r45986n36463L33620
8126B78838R60601J120957Q56593K03979n64042q98533o53619m91801m80016J6431
8116C49388L19764P0384k78776n06150n74168n05859m78225o78457o18894j25357
8106c026350N18580P29549L29683k83690q80050j153187o34784L06926O20478
8097c472845K57137q1469J16868K19056k18818k52190J32963L02215K32033j66153
$$ y = [-1136649, -1576860, -1517245, -770510, 180675, 458370, -357624, -1611308, -2356334, -2601735, -2598310, -2209425, -1785635, -1915691, -2754263, -3910368, -4758793, -5094615, -4801069, -3951054, -2726969, -1832974, -2008295, -2536059, -2808330, -2783806, -2236310, -1384089, -592735, -18475, 616849, 1722053, 2949472, 3395808, 3035935, 2337011, 1427667, 481681, -54782, 278838, 1239439, 2360396, 3216989, 3420968, 2856926, 1958393, 1304774, 812973, 332957, 349388, 669152, 739536, 460760, -45390, -619558, -1125417, -1603642, -2282099, -2900993, -3026350, -2507770, -1778221, -1448538, -1732228, -2612278, -3765465, -4400249, -4093323, -3472845, -3215708, -3297177, -3180309, -2961253, -3180071, -3432261, -3299298, -2997083, -2765050, -2931203]
8087b931203n40914l07212K25475O05218N79097O19030R58958J104979Q59507
8078A172935J8433q38597r15272l48051L07506L58409j05657m47214m48987J91443
8068a055052Q48571M18209n08531p89141k45334N36945P24596M29027K45145K95285
8058H99720N60630Q78546J071220N99255j79708m79733l93516k55864j24072k36367
8048B340111o55169p59122j30656N10828K16995m48980p74131r32104o39199L4982
8038a236445P13520Q61278M34125k33888j051373j292447r84330o67338n24620
8029c981518n93772m75340J69651R31947J487731J432402O21602j08762j40834
8020f56893J89988J22784k47086p46174j545388j779263r37229J96759P52435
$$ y = [-2931203, -3472117, -3779329, -3553854, -2948636, -2369539, -1750509, -791551, 313428, 1172935, 1191368, 352771, -562501, -910552, -603046, -244637, -350294, -797508, -1246495, -1055052, -206481, 211728, -296803, -1085944, -1331278, -794333, -69737, 359290, 604435, 899720, 1460350, 2338896, 3410116, 4009371, 3829663, 3349930, 2956414, 2700550, 2576478, 2340111, 1684942, 925820, 795164, 1305992, 1522987, 1074007, 299876, -632228, -1271427, -1236445, -522925, 338353, 772478, 538590, -512783, -1805230, -2789560, -3456898, -3981518, -4575290, -5050630, -4880979, -3949032, -2461301, -1028899, -407297, -516059, -656893, -466905, -344121, -591207, -1337381, -2882769, -4662032, -5599261, -5402502, -4650067]
8011d650067O04190N1184k75603m09627m23950j55509K43084N09522L34269J0827
8001d161680k05233l93689l23628M04771J166859J008791M46630J71451R7596
7992a788132K34348L57609L85706K44904p4899j38613K19735M96880N32713M66059
7982I36310J89567l36619p14830l01790M08149O84123N92184K78611r7403n7109
7972A581193j4248k48411j81794L8696n56909j394644j566253r48280L88951J745204
7962a156495J881552R39410m394q83957j523726j188338j80050O20091R23452
7953e72455Q24512O32031L94264J29252j44849J62124R83165P16363m12991j030056
7943A681360j079381p92856k24953j419m50810q53602m23431K00897P6466j74835
$$ y = [-4650067, -4045877, -3994693, -4270296, -4679923, -5103873, -5259382, -5016298, -4506776, -4172507, -4161680, -4366913, -4760602, -5084230, -4679459, -3512600, -2503809, -2057179, -1885728, -1788132, -1553784, -1196175, -810469, -565565, -640464, -779077, -559342, -62462, 470251, 936310, 1125877, 789258, 74428, -227362, 180787, 864910, 1457094, 1735705, 1638302, 1581193, 1566945, 1318534, 1136740, 1175436, 618527, -776117, -2342370, -3290650, -2901699, -1156495, 725057, 1664467, 1660073, 776116, -747610, -1935948, -2115998, -1495907, -572455, 252057, 884088, 1278352, 1407604, 1262755, 1424879, 2408044, 3124407, 2711416, 1681360, 601979, -190877, -415830, -417249, -868059, -1721661, -2145092, -1944195, -1867729, -2042564]
7933b042564P021J40819j05867m12460o27726m36904P8576K38432L16580M51435
7923b392658L21117L82903N60642M95011M13218P45223J207495J264825Q95714
7914C893490J34187q36571j426087j536911j214127j97445Q33894J139169Q39142
7905A628741L9195n63991l50474L83750Q33018M99447R612Q9700N40507Q73897
7895C983402P13675J08871o14699j021136j393396j675772j357995o00271p30
7886a858051M15120N59806J4146n43055l19654O05163J477959J320737M87670
7877B159841l15943p58615o40396j89845L83674N38840P37718J003644O45486
7868C564404k92980j571255k292521j724776o16420O2143O74664J476924J828843
$$ y = [-2042564, -2035543, -1894724, -2000591, -2413051, -3040777, -3477681, -3399105, -3160673, -2844093, -2392658, -2071541, -1688638, -1127996, -632985, -219767, 525456, 1732951, 2997776, 3893490, 4027677, 3191106, 1765019, 228108, -986019, -1183464, -349570, 789599, 1628741, 1667936, 1103945, 753471, 1137221, 1970239, 2469686, 2479298, 2568998, 3109505, 3983402, 4697077, 4805948, 4191249, 3170113, 1776717, 100945, -1257050, -1857321, -1858051, -1442931, -883125, -868979, -1412034, -1731688, -1126525, 351434, 1672171, 2159841, 1843898, 1085283, 444887, 255042, 638716, 1177556, 1915274, 2918918, 3564404, 3271424, 1700169, -592352, -2317128, -2933548, -2871405, -2196741, -719817, 1109026]
7859A109026J220335j21626j072256j035092o62169k67180M19581Q85568N08345
7850I84532J43543M63749O35579Q3912n79456q88195q17653n10174l98741o70864
7840a553768j127466j182307l25546N30288N21963N14180N62623K16688K3746
7831a819599k08035o53723n75471J84592Q46258J219747Q73906r1793o10732m82100
7821a316950n6411L93790L93669K16790L55676N95555Q95201J256707J272306
7812D006333N20298n13070r41134o08623j87320n476m43577p33521n4330P76452
7802A816032R91810N73588o3381o43600j210890j551111j315470m89844K36489
7793a656377R67961J532164J208504J53548p94819r82021m99867M089J60439K65487
$$ y = [1109026, 2329361, 2207735, 1135479, 100387, -561782, -828962, -409381, 476187, 984532, 1128075, 1591824, 2227403, 2311315, 1731859, 843664, 26011, -484163, -882904, -1553768, -2681234, -3863541, -4189087, -3658799, -3136836, -2622656, -2060033, -1843345, -1819599, -2027634, -2681357, -3256828, -3072236, -2225978, -1006231, -132325, -224118, -834850, -1316950, -1373361, -979571, -585902, -369112, -13436, 582119, 1477320, 2734027, 4006333, 4526631, 4013561, 3072427, 2463804, 2276484, 2271008, 1827431, 1093910, 1039580, 1816032, 2807842, 3381430, 3318049, 2674449, 1463559, -87552, -1403022, -1892866, -1656377, -688416, 843748, 2052252, 2205800, 1410981, 428960, -70907, -66818, 93621, 359108]
7783C59108M26051L70812N12331P41332P26555N27374j08788j015823j362928
7774A176024j418838j277696k83436R77824J197436L38232l71755m55884k57214
7765c75307O0027k6471q18786j293653r95755o12925l16981K91537R37750R75463
7755b175101O64087R1860o26201j045433q62027j2272O21857O22578Q77086J467261
7745c76305J347310O45971K17460L82322O08605K55741p87794j978637k150743
7736a836070j053892J82262J197449J920997K044978J128945k59514j135377j146633
7727A043145p61898k50654K55433J43960l10167m45956k61286N47216J354195
7718A313988J084861K19709l43171o8605N51423N93599J88417j41J41250P1657
$$ y = [359108, 785159, 1155971, 1668302, 2409634, 3136189, 3663563, 3554775, 2538952, 1176024, -242814, -1520510, -1803946, -826122, 371314, 709546, 337791, -118093, -375307, -315280, -341751, -1160537, -2454190, -3449945, -4062870, -4379851, -4088314, -3150564, -2175101, -1511014, -1419154, -2045355, -3090788, -3952815, -3965087, -3343230, -2720652, -1843566, -376305, 971005, 1616976, 1834436, 2216758, 2825363, 3081104, 2293310, 314673, -1836070, -2889962, -2707700, -1510251, 410746, 2455724, 3584669, 3325155, 2189778, 1043145, 281247, 30593, 286026, 429986, 119819, -326137, -587423, -40207, 1313988, 2398849, 2618558, 2275387, 2206782, 2758205, 3351804, 3540221, 3540080, 3681330, 3752987]
7708C752987m04599j050857j428215j242089o75901j60094P8808l0421k02790
7699a363171J50702N10621K98869j5688k02682k36280J81017M24675O8763n58723
7689g41897q59586m12607L73147Q48318J066528J252380J125625M78531k80279
7680B850160p37034o82196n76017q09370r76994r08839n88367m7338P63115J187536
7670e25344P34166J45943j39839j0498L54130P4109p35215j137905r78489p43166
7660b962108m06855o1081k36308o95017p80489l84324m3572M15026J433231K329964
7650a391533K385261J624475P19057J86915l08056j210734k152373k176855j065396
7641c389239K09780P57566O50088O39631N36315J45388L64120J229951J262414
$$ y = [3752987, 3348388, 2297531, 869316, -372773, -1048674, -1208768, -1129960, -1160381, -1363171, -1212469, -701848, -402979, -418667, -621349, -857629, -676612, -251937, -183174, -741897, -1601483, -2014090, -1640943, -792625, 273903, 1526283, 2651908, 3130439, 2850160, 2113126, 1430930, 854913, 45543, -931451, -1840290, -2428657, -2475995, -1712880, -525344, 208822, 354765, 214926, 204428, 558558, 632667, -102548, -1240453, -2218942, -2962108, -3368963, -3430044, -3666352, -4361369, -5141858, -5526182, -5569754, -5154728, -3721497, -1391533, 993728, 2618203, 3337260, 3524175, 3216119, 2005385, -146988, -2323843, -3389239, -3179459, -2421893, -1771805, -1132174, -595859, -450471, -86351, 1143600, 2406014]
7632B406014K15370p09379o70352l19486m93150n83890l46385j01114j9101k49545
7622h71018q83787j068960m17006K72495M76279N47934P13203R05062J268323
7613I42525J316412P61515K12914j32116k94441l23453j28755j45907n89969o74482
7603I44243m40683j10051Q473j06251j99377j80424J48416M71762L48586n2017
7593H32677k59576j30503M97252J076471Q09879j15939q82380j119920j076815
7584c68854r45604q33453o09678L1257N60689P88754J128843J285755R90173M02386
7574B430268k84224r60846j251697j018771p71524o54673l78960L18110J140831
7565a431486J537317R65706Q3322k12142k70746m24920m97941m23831j85890J02492
$$ y = [2406014, 2621384, 1912005, 1241653, 922167, 429017, -154873, -501258, -602372, -621473, -871018, -1754805, -2823765, -3240771, -2968276, -2491997, -1944063, -1230860, -325798, 942525, 2258937, 3020452, 3233366, 3101250, 2806809, 2483356, 2354601, 2208694, 1618725, 944243, 503560, 393509, 401982, 295731, 96354, -84070, 64346, 536108, 884694, 832677, 573101, 442598, 939850, 2016321, 2826200, 2710261, 1827881, 707961, -368854, -1314458, -2147911, -2757589, -2726332, -2165643, -1376889, -248046, 1037709, 2027882, 2430268, 2146044, 1185198, -66499, -1085270, -1856794, -2511467, -2890427, -2572317, -1431486, 105831, 1071537, 1154859, 942717, 671971, 247051, -250890, -674721, -860611, -758119]
7555g58119r8349m22637l78261m21266p01657n22224L1200O07873Q41742R15843
7545i05855J249087J281635Q40646N65696L19539l43870j190760j586045j233338
7536a003265n71120O4330L51232J15763l48127n18806j34117L25118M63639K28998
7526a026355l91669j144050r62414O2461N37830K69620p2020k52374j78940L84100
7516b773811J095612J194511Q24660P67291O29663K86818O09551J369418J288209
7507E291922L00413l28034l66884l49472k66099m28768p32722j240643j506731
7498C72982j171834p38107q52478r81436k30408P83796J187555R21706M29503
7489b78721J91830K34574L32099J84221j56415m69654o58066j168008k201751
$$ y = [-758119, -856468, -1279105, -1657366, -2078632, -2780289, -3302513, -3271313, -2663440, -1821698, -905855, 343232, 1624867, 2465513, 3031209, 3350748, 3006878, 1816118, 230073, -1003265, -1574385, -1510055, -1158823, -1043060, -1391187, -1909993, -2044110, -1718992, -1255353, -1026355, -1418024, -2562074, -3524488, -3462027, -2924197, -2654577, -2726597, -2978971, -3157911, -2773811, -1678199, -483688, 340972, 1108263, 1737926, 2024744, 2634295, 4003713, 5291922, 5592335, 5264301, 4897417, 4547945, 4281846, 3853078, 3120356, 1879713, 372982, -798852, -1536959, -2389437, -3370873, -3601281, -2817485, -1629930, -708224, -278721, -86891, 147683, 479782, 664003, 507588, 37934, -620132, -1788140, -3989891]
7480c989891k586217j673724l60610O82201J521839J727263J243411L22514m02476
7471c515690j57703K82833R3153l13489j42629Q30747J497884J421848R88029
7462I84983M54417Q4547n5693K072j70185o80813p92300m48167r8382j998K11570
7451e09949N19158N91658R65192R49129j06827j031933r67820l72979o5502j33461
7441a63334p42703j330400j066614l06130O5281j55192k54789o3301K98148P84477
7431b934557P86347K77819J21275L64461L63071L46459M12592J03406n08555o97720
7421a365402k25157K18764L10792K33933k34700r51767j010905j65103O94575
7412b494970P95445K22286m04589r30940j568579j453078o12035J69320Q55631
$$ y = [-3989891, -6576108, -8249832, -8610442, -7928241, -6406402, -4679139, -3435728, -3113214, -3515690, -3673393, -3390560, -3297407, -3610896, -3753525, -2922778, -1424894, -3046, 984983, 1439400, 1523947, 1468254, 1470326, 1300141, 619328, -172972, -621139, -719521, -721519, -509949, 9209, 600867, 1566059, 2515188, 2408361, 1376428, 408608, 35629, -29873, -163334, -906037, -2236437, -3303051, -3609181, -3543900, -3699092, -3953881, -4017182, -3719034, -2934557, -2148210, -1870391, -1749116, -1384655, -1021584, -675125, -262533, -159127, -667682, -1365402, -1590559, -1371795, -1061003, -827070, -1061770, -2013537, -3024442, -3189545, -2494970, -1699525, -1477239, -1881828, -2812768, -4381347, -5834425, -6446460, -6277140, -5421509]
7403e421509J267814R33873N55796Q26790J135121R38963L61366Q2252M61184
7394A141650P94867Q3617r57361j467267j553103j390380q36915r9047N31178
7385c752761J118602J595060J547562Q15647J24693k57950l72608o4270J09615
7376H63590L09511O18005O93189M07764l80246j014212j356190j251324n03057
7367a612970J63964K20064l0367k05031m86728j051962j248230p16169k46405
7358e213834L9347L59383N80843N28556M19816M56005L47433L67624Q13043J502033
7348B00249K113721J967278O47003m44432p63149r24170n98021j47303l45687
7339A705489q04260r91723q38469n75958j7760J99714l7207L10510O98063N65386
$$ y = [-5421509, -4153695, -3219822, -2664026, -1837236, -702115, 236848, 598214, 680466, 1141650, 1936517, 2020134, 1062773, -404494, -1957597, -3347977, -4184892, -4283939, -3752761, -2634159, -1039099, 508463, 1324110, 1448803, 1190853, 818245, 753975, 863590, 1173101, 1791106, 2484295, 2892059, 2511813, 1497601, 141411, -1109913, -1612970, -1449006, -1228942, -1259309, -1464340, -1951068, -3003030, -4251260, -4967429, -5213834, -5174487, -4815104, -4234261, -3705705, -3285889, -2829884, -2482451, -2114827, -1301784, 200249, 2313970, 4281248, 4928251, 4483819, 3720670, 2796500, 2198479, 2051176, 1705489, 901229, -90494, -928963, -1504921, -1522681, -1322967, -1360174, -1049664, -351601, 213785]
7329B13785M92343J65044l20285q2116K10162J85108k25678q73784j143977r64167
7319b343565l25845L57471M58974L03971j911o23889r14299j25284O66051M12221
7309b136105j53496k77102J66475Q90030J311520R94831O26191M74251j25073
7300A771522p94966q77264m45377l38783p83534q55914p19867p73082o22384O681
7290d432968J72246j97943K5808N52394P62312R29399J206871J270438R91201
7281A279758L67013o36680j592710k196852k377118j869025p48700K09694M18210
7272g146410j45720p34094n10022K87208J018762J653088J511487J052134R16129
7263b097438P19777N41276J57465m45673r10473j171513p70118J70797N68736
$$ y = [213785, 706128, 871172, 550887, 468771, 678933, 864041, 638363, -235421, -1379398, -2343565, -2669410, -2311939, -1852965, -1548994, -1550905, -2174794, -3089093, -3214377, -2548326, -2136105, -2289601, -2566703, -2400228, -1510198, -198678, 796153, 1422344, 1896595, 1771522, 976556, 99292, -346085, -684868, -1468402, -2324316, -3044183, -3817265, -4439649, -4432968, -4260722, -4458665, -4432857, -3880463, -3118151, -2188752, -981881, 288557, 1279758, 1646771, 1010091, -582619, -2779471, -5156589, -7025614, -7774314, -7564620, -7146410, -7292130, -8026224, -8536246, -8249038, -7230276, -5577188, -4065701, -3013567, -2097438, -1377661, -836385, -678920, -1124593, -2035066, -3206579, -3976697, -3805900, -3237164]
7254c237164L02142J73071L49056J90006j75549l05660L7563P12706J415772J790251
7244A252194J498443N54788k75150o98808n08823j42127m71685j113838j257146
7235a162152o50375K3610J25204P4560K02078m57j25225L65420O68493Q4289p40091
7224a134646j041408o45889r3496K6101J48799M95816M93413j20660q47590p89475
7214c509035K27304J243799J567159J377160R07757N94212P35726P50093L69456
7205D263631L2476m8044K17179K23087q1648l9005Q3305j34725m60419o52721
7195C403116j038093j459412j082403o18352q38902j137457q97652k52146K50827
7186c670474M82204N66206M84625O11726R58629P84762M35642J89105m55802j117854
$$ y = [-3237164, -2935022, -2761951, -2412895, -2222889, -2398438, -2704098, -2666535, -1953829, -538057, 1252194, 2750637, 3305425, 3030275, 2331467, 1822644, 1680517, 1208832, 94994, -1162152, -1812527, -1788917, -1663713, -1589153, -1387075, -1387532, -1512757, -1147337, -478844, -394555, -1134646, -2176054, -2821943, -2915439, -2889338, -2740539, -2244723, -1751310, -1871970, -2719560, -3509035, -3281731, -2037932, -470773, 906387, 1814144, 2408356, 3144082, 3894175, 4263631, 4296107, 4248063, 4465242, 4688329, 4606681, 4567676, 4650981, 4516256, 4055837, 3403116, 2365023, 905611, -176792, -795144, -1634046, -2771503, -3669155, -3921301, -3670474, -3188270, -2622064, -2137439, -1525713, -567084, 217678, 653320, 842425, 386623, -731231]
7176g31231q27721k67294j47612k17808n08653o87860l70162J28484O81454Q96475
7166b051928Q79816O50355k40781j092378j242513j284594j172092m81374J09770
$$ y = [-731231, -1558952, -1826246, -1973858, -2191666, -2700319, -3388179, -3758341, -3629857, -2948403, -2051928, -1172112, -521757, -762538, -1854916, -3097429, -4382023, -5554115, -6035489, -5925719]
$$ [...]
##END NTUPLES=NMR SPECTRUM
##END=
