##TITLE=dept_SR167_30 CH-,CH3- -up, CH2- -down
 CDCl3, 2560 sc
 10.05.2023
##JCAMPDX= 6.0         $$ Bruker NMR JCAMP-DX V2.0
##DATA TYPE= NMR SPECTRUM
##DATA CLASS= NTUPLES
##ORIGIN= UXNMR, Bruker Analytische Messtechnik GmbH
##OWNER= root
$$ XWIN-NMR		Version 3.5
$$ Wed May 10 16:17:04 2023 Russian Standard Time (UT+4h)  she@DPX200
##.OBSERVE FREQUENCY= 50.327992884445
##.OBSERVE NUCLEUS= ^13C
##.ACQUISITION MODE= SIMULTANEOUS
##.ACQUISITION SCHEME= undefined
##.AVERAGES= 2563
##.DIGITISER RES= 17
##SPECTROMETER/DATA SYSTEM= spect
##.PULSE SEQUENCE= dept135
##.SOLVENT NAME= CDCl3
##.SHIFT REFERENCE= (INTERNAL, CDCl3, 0, 214.665)
##AUDIT TRAIL= $$ (NUMBER, WHEN, WHO, WHERE, WHAT)
$$ ##TITLE= Audit trail, XWIN-NMR		Version 3.5
$$ ##JCAMPDX= 5.01
$$ ##ORIGIN= Bruker BioSpin GmbH
$$ ##OWNER= she
$$ F:/spectra/data/she/nmr/depta/1/pdata/1/auditp.txt
$$ ##AUDIT TRAIL=  $$ (NUMBER, WHEN, WHO, WHERE, WHAT)
(   1,<2023-05-10 16:15:55.75 +0400>,<she>,<DPX200>,
      <created by zg, POWCHK disabled, PULCHK disabled
       terminated by command 'halt'
       configuration hash MD5:
       00 E9 B6 7A A2 85 ED C7 34 08 36 98 17 FE 4E 26
       data hash MD5: 16K
       BA DD 7A 78 2B 18 F3 3C E4 CC 2F 22 6F 39 DF 15>)
(   2,<2023-05-10 16:16:00.17 +0400>,<she>,<DPX200>,
      <Start of raw data processing
       efp BC_mod = 2 LB = 3.5 FT_mod = 6 PKNL = 1 PHC0 = -3641.36 PHC1 = -1085.8 SI = 16K 
       data hash MD5: 16K
       B4 CC EC AC 19 00 9C CF C2 A8 A6 C7 17 B8 BD 66>)
(   3,<2023-05-10 16:16:22.45 +0400>,<she>,<DPX200>,
      <pk PHC0 = -23.92821 PHC1 = 24.6 
       data hash MD5: 16K
       B8 CC DF 3B 0F B3 58 D6 6B A1 A5 28 62 D8 26 99>)
(   4,<2023-05-10 16:16:26.09 +0400>,<she>,<DPX200>,
      <abs ABSG = 5 
       data hash MD5: 16K
       27 7E B1 67 F6 46 B8 69 45 D6 52 6B DB 73 46 7F>)
$$ ##END=
$$ 
$$ hash MD5
$$ C2 50 BF F4 9F 33 54 F5 A2 39 FB 58 E2 37 91 38
##$RELAX= 
##$RELAX= 
##$RELAX= 
##$RELAX= 
##$RELAX= 
##$RELAX= 
##$RELAX= 
##$RELAX= 
$$ Bruker specific parameters
$$ --------------------------
##$DU= <F:/spectra>
##$EXPNO= 1
##$NAME= <depta>
##$PROCNO= 1
##$TYPE= <nmr>
##$USER= <she>
##$AMP= (0..31)
100 100 100 100 100 100 100 100 100 100 100 100 100 100 100 100 100 100 
100 100 100 100 100 100 100 100 100 100 100 100 100 100 
##$AQSEQ= 0
##$AQ_mod= 1
##$AUNM= <au_zg>
##$AUTOPOS= <>
##$BF1= 50.322709
##$BF2= 200.13
##$BF3= 200.13
##$BF4= 200.13
##$BF5= 200.13
##$BF6= 200.13
##$BF7= 200.13
##$BF8= 200.13
##$BYTORDA= 1
##$CFDGTYP= 0
##$CFRGTYP= 5
##$CHEMSTR= <none>
##$CNST= (0..31)
1 1 145 1 1 1 1 1 1 1 1 1 1 1 1 1 1 1 1 1 1 1 1 1 1 1 1 1 1 1 1 1 
##$CPDPRG= <>
##$CPDPRG1= <waltz16>
##$CPDPRG2= <waltz16>
##$CPDPRG3= <>
##$CPDPRG4= <mlev>
##$CPDPRG5= <mlev>
##$CPDPRG6= <mlev>
##$CPDPRG7= <mlev>
##$CPDPRG8= <mlev>
##$CPDPRGB= <>
##$CPDPRGT= <>
##$D= (0..31)
0 2 0.003448276 0 0 0 0 0 0 0 0 0 2e-05 0 0 0 0 0 0 0 0 0 0 0 0 0 0 0 
0 0 0 0 
##$DATE= 1683713874
##$DBL= (0..7)
120 120 120 120 120 120 120 120 
##$DBP= (0..7)
$$ [...]
##$SUBNAM2= <"">
##$SUBNAM3= <"">
##$SUBNAM4= <"">
##$SUBNAM5= <"">
##$SUBNAM6= <"">
##$SUBNAM7= <"">
##$SUBNAM8= <"">
##$SUBNAM9= <"">
##$SW= 219.3118970423
##$SWIBOX= (0..15)
0 1 3 0 0 0 0 0 0 0 0 0 0 0 0 0 
##$SW_h= 11037.527593819
##$TD= 16384
##$TD0= 1
##$TE= 0
##$TE2= 300
##$TE3= 300
##$TEG= 300
##$TL= (0..7)
120 120 120 120 120 120 120 120 
##$TP= (0..7)
150 150 150 150 150 150 150 150 
##$TP07= 0
##$TPNAME0= <>
##$TPNAME1= <>
##$TPNAME2= <>
##$TPNAME3= <>
##$TPNAME4= <>
##$TPNAME5= <>
##$TPNAME6= <>
##$TPNAME7= <>
##$TPOAL= (0..7)
0.5 0.5 0.5 0.5 0.5 0.5 0.5 0.5 
##$TPOFFS= (0..7)
0 0 0 0 0 0 0 0 
##$TUNHIN= 0
##$TUNHOUT= 0
##$TUNXOUT= 0
##$USERA1= <user>
##$USERA2= <user>
##$USERA3= <user>
##$USERA4= <user>
##$USERA5= <user>
##$V9= 5
##$VALIST= <valist>
##$VCLIST= <CCCCCCCCCCCCCCC>
##$VD= 0
##$VDLIST= <DDDDDDDDDDDDDDD>
##$VPLIST= <PPPPPPPPPPPPPPP>
##$VTLIST= <TTTTTTTTTTTTTTT>
##$WBST= 1024
##$WBSW= 2
##$XGAIN= (0..3)
0 0 0 0 
##$XL= 0
##$YL= 0
##$YMAX_a= 3140686
##$YMIN_a= -3165248
##$ZGOPTNS= <>
##$ZL1= 120
##$ZL2= 120
##$ZL3= 120
##$ZL4= 120
##$ABSF1= 214.6655
##$ABSF2= -4.669434
##$ABSG= 5
##$ABSL= 3
##$ALPHA= 0
##$AQORDER= 0
##$ASSFAC= 0
##$ASSFACI= 0
##$ASSFACX= 0
##$ASSWID= 0
##$AUNMP= <proc_1d>
##$AZFE= 0.1
##$AZFW= 0.1
##$BCFW= 0
##$BC_mod= 2
##$BYTORDP= 0
##$COROFFS= 0
##$CY= -3
##$DATMOD= 1
##$DC= 0
##$DFILT= <>
##$DTYPP= 0
##$F1P= 0
##$F2P= 0
##$FCOR= 0.5
##$FTSIZE= 16384
##$FT_mod= 6
##$GAMMA= 0
##$GB= 0
##$INTBC= 1
##$INTSCL= 0
##$ISEN= 128
##$LB= 3.5
##$LEV0= 0
##$LPBIN= 0
##$MAXI= 10000
##$MC2= 0
##$MEAN= 0
##$ME_mod= 0
##$MI= 0.4000791
##$NCOEF= 0
##$NC_proc= 0
##$NLEV= 6
##$NOISF1= 120.0001
##$NOISF2= 80.00006
##$NSP= 0
##$NTH_PI= 0
##$NZP= 0
##$OFFSET= 214.6655
##$PC= 4
##$PHC0= -3665.288
##$PHC1= -1061.2
##$PH_mod= 1
##$PKNL= yes
##$PPARMOD= 0
##$PSCAL= 0
##$PSIGN= 0
##$REVERSE= no
##$SF= 50.3227091
##$SI= 16384
##$SIGF1= 140
##$SIGF2= 120
##$SINO= 80
##$SIOLD= 32768
##$SREGLST= <13C.CDCl3>
##$SSB= 0
##$STSI= 16384
##$STSR= 0
##$SW_p= 11037.527593819
##$SYMM= 0
##$S_DEV= 0
##$TDeff= 16384
##$TDoff= 0
##$TI= <>
##$TILT= no
##$TM1= 0
##$TM2= 0
##$TOPLEV= 0
##$USERP1= <user>
##$USERP2= <user>
##$USERP3= <user>
##$USERP4= <user>
##$USERP5= <user>
##$WDW= 1
##$XDIM= 16384
##$YMAX_p= 296941952
##$YMIN_p= -73034359
$$ End of Bruker specific parameters
$$ ---------------------------------
##NTUPLES= NMR SPECTRUM
##VAR_NAME=  FREQUENCY,     SPECTRUM/REAL,   SPECTRUM/IMAG
##SYMBOL=    X,             R,               I
##VAR_TYPE=  INDEPENDENT,   DEPENDENT,       DEPENDENT
##VAR_FORM=  AFFN,          ASDF,            ASDF
##VAR_DIM=   16384,         16384,           16384
##UNITS=     HZ,            ARBITRARY UNITS, ARBITRARY UNITS
##FACTOR=    0.67371834180669, 1,            1
##FIRST=     10802.5493505904, 0,            0
##LAST=      -234.978243228581, 0,           0
##MIN=       -234.978243228581, -73034359,   0
##MAX=       10802.5493505904, 296941952,    0
$$ Real data points
##PAGE= N=1
##DATA TABLE= (X++(R..R)), XYDATA
$$ [...]
14958 -1755177 -2317856 -2657759 -2797451 -2979481 -3370252 -3860053 -4133995 -3882722 -3348175
14949 -3348175 -3084647 -2999220 -2667336 -2096082 -1604670 -1379775 -1467043 -1717559 -1839021 -1741743
14939 -1741743 -1466881 -1076319 -708278 -599407 -800559 -1200012 -1865754 -2754698 -3383028
14930 -3383028 -3344987 -3028627 -3056129 -3297716 -3181761 -2568066 -1708136 -645839 497844
14921 497844 1353430 1906184 2335723 2608182 2704577 2763402 2876272 2649770 1790364 761188
14911 761188 222781 405608 1233011 2273455 2900919 2891636 2334144 1516483 884506 572969
14901 572969 370871 228409 265054 553031 1076984 1632526 2077350 2426206 2542369 2285816
14891 2285816 1808521 1445946 1408998 1681675 1988246 2000557 1661544 952956 -39502 -906203
14881 -906203 -1281853 -1239805 -926633 -280643 387425 644795 454476 27101 -521549 -996807
14871 -996807 -1203539 -1169033 -961465 -669921 -519747 -480884 -316881 103168 643819 856899
14861 856899 679911 370716 32018 -119234 64570 421335 785822 1122505 1356718 1246075
14851 1246075 810565 514176 616735 1054204 1548418 1814599 1844579 1620167 1338140 1242360
14841 1242360 1362363 1506001 1372980 902927 17949 -993934 -1679024 -2060516 -2194284
14832 -2194284 -1966530 -1466581 -977895 -607943 -399374 -243106 -49433 -44859 -282014 -488155
14822 -488155 -336957 212615 753261 1141890 1552464 1685551 1243096 584853 140870 95491
14812 95491 272978 282685 -3782 -300260 -333576 -157897 4504 145975 160714 -239131
14802 -239131 -908098 -1420921 -1604264 -1670947 -1989942 -2453267 -2692327 -2619487 -2191719 -1448447
14792 -1448447 -728088 -635978 -1225311 -1948671 -2341193 -2316255 -2138400 -2192391 -2546817 -2863682
14782 -2863682 -2943729 -2863241 -2520378 -1946339 -1492894 -1273460 -985950 -389006 417441 1118506
14772 1118506 1417924 1331424 1045142 584988 -121294 -1029083 -1972997 -2581023 -2373853 -1308393
14762 -1308393 46372 1118571 1798626 2243298 2498378 2414688 1984820 1307363 362073
14753 362073 -639053 -1356329 -1645956 -1602515 -1426573 -1502107 -1691824 -1446762 -635622 381882
14743 381882 1240057 1883765 2183307 2023301 1584138 1194325 836624 339889 -57566 -125264
14733 -125264 107364 356752 262150 -200821 -748650 -1354124 -2106601 -2787543 -3179184 -3335276
14723 -3335276 -3335598 -3216120 -2942169 -2303057 -1411613 -696500 -402910 -236196 208711 868050
14713 868050 1322208 1419587 1371157 1195548 815944 362923 -42746 -380272 -634197 -666240
14703 -666240 -641666 -791703 -916697 -701109 -221681 327181 931442 1474186 1643293 1276402
14693 1276402 539385 -351625 -1055244 -1414194 -1577122 -1562211 -1314739 -1106432 -1161217 -1327443
14683 -1327443 -1436618 -1572298 -1724947 -1564803 -1043161 -537748 -130811 270844 433762
14674 433762 489706 762423 1375569 1998029 2187326 2070271 1960401 1886015 1646479 1230191
14664 1230191 862277 792321 1151238 1792304 2244937 2446007 2730884 3007224 2925226 2444106
14654 2444106 1975750 1794185 1706110 1356043 573730 -442665 -1400783 -2113187 -2263398
14645 -2263398 -1753759 -1048096 -481591 34406 752388 1572772 2128298 2191974 1968191 1776694
14635 1776694 1718296 1954022 2553273 3296726 3793355 3912935 3762185 3659942 3872580 4101520
14625 4101520 3822253 3101129 2272997 1530423 1154525 1017170 645402 -21539 -851395
14616 -851395 -1817575 -2654282 -3045202 -3089530 -3266029 -3743704 -4044068 -3973124 -3706022 -3212487
14606 -3212487 -2520396 -1870312 -1495162 -1438612 -1612145 -1871321 -2179731 -2362104 -2178006 -1433217
14596 -1433217 -380596 395934 789347 1023526 1237071 1397630 1478164 1520108 1552592 1469481
14586 1469481 1244216 964997 622537 398528 683862 1433357 2020966 1989586 1525861 895969
14576 895969 360629 194110 214195 140058 68517 207699 640166 1259742 1777878 1684159
14566 1684159 829267 -218211 -940620 -1442807 -1916917 -2344235 -2550644 -2511828 -2603567 -2978358
14556 -2978358 -3609834 -4053975 -3908470 -3435756 -2967372 -2529117 -1887472 -1213792 -908149
14547 -908149 -1061226 -1612948 -2212256 -2419473 -2076577 -1318760 -402309 378829 742945 647231
14537 647231 224921 -407551 -1068028 -1430569 -1546368 -1663018 -1809553 -1904794 -1748840 -1416808
14527 -1416808 -1053551 -542083 150261 771786 958131 560821 -218290 -643191 -128843
14518 -128843 615888 810605 561000 277560 145625 263676 710081 1203941 1526529 1682221
14508 1682221 1738411 1672875 1483863 1331773 1230976 1220084 1516268 2107622 2797672 3501645
14498 3501645 3927661 3746311 3173664 2822008 2944371 3179173 3019504 2457674 1931046
14489 1931046 1553711 1039673 291864 -214937 -156787 98946 217386 227561 47667 -454624
14479 -454624 -1085997 -1484803 -1574404 -1293540 -687153 16177 640468 1192334 1825579 2207360
14469 2207360 1869290 1098192 593623 468071 574869 847958 1214652 1826551 2608309
14460 2608309 3174196 3266039 2780942 2032400 1444369 969243 385580 -205527 -442863 -285784
14450 -285784 -43545 267217 637261 874850 931507 895261 902232 779479 320203 -334573
14440 -334573 -872140 -1225968 -1697208 -2397185 -3209815 -3904524 -4343080 -4726895 -5095032 -5340601
14430 -5340601 -5315347 -4811351 -4022481 -3383530 -3085460 -3095176 -3376736 -3570669 -3340211 -2873956
14420 -2873956 -2342451 -1652245 -888177 -468098 -632207 -1186745 -1840927 -2300320 -2219205 -1868005
14410 -1868005 -1790178 -1880659 -1888680 -1984082 -2238854 -2371319 -2032989 -1203020 -86979 1084223
14400 1084223 2031744 2437024 2351156 2128427 1997583 2028660 2252692 2695196 3144893 3370871
14390 3370871 3356034 3166534 2894809 2640958 2396884 2121022 1761068 1301032 816472 275089
14380 275089 -357283 -846971 -963673 -776472 -472690 -147128 55013 -89639 -481791 -934452
14370 -934452 -1279999 -1254298 -931361 -779466 -991115 -1327205 -1726351 -2230757 -2636740 -2611569
14360 -2611569 -2170936 -1640591 -1111163 -552710 -112318 129264 92860 -196055 -445638 -492241
14350 -492241 -402218 -306693 -182779 -57292 -130580 -608525 -1395526 -2274697 -2995969 -3119892
14340 -3119892 -2497281 -1399261 -243981 759970 1438711 1449278 908067 275445 -42788
14331 -42788 65869 507242 1376742 2559693 3405998 3371096 2689280 1911380 1126622 314790
14321 314790 -343504 -791419 -986486 -1025829 -1204598 -1446153 -1488150 -1313823 -850758 -263424
14311 -263424 4221 -229985 -545006 -662430 -679234 -517013 -198304 282117 959055 1453773
14301 1453773 1317630 832362 382733 131010 125455 312108 658120 968484 1071700 1069875
14291 1069875 1022062 835311 683906 787844 844373 464831 -172862 -809150 -1561493 -2416619
14281 -2416619 -3128721 -3681160 -4128664 -4349027 -4468849 -4748700 -5032949 -4948535 -4352821 -3371005
14271 -3371005 -2171305 -1025050 -291409 -228326 -339857 11171 964731 2015564 2538298
14262 2538298 2391826 1915333 1549749 1133330 337788 -694524 -1648999 -2234225 -2329826
14253 -2329826 -2252222 -2215545 -1878696 -994038 -10186 441745 260079 -430815 -1219723 -1429494
14243 -1429494 -873037 101788 1069012 1817932 2300812 2587209 2677975 2494734 2043729 1480198
14233 1480198 928448 545208 491150 576478 429706 14193 -521959 -938414 -912992 -528155
14223 -528155 -127898 129985 122133 -141363 -232002 -108158 -59597 42223 284825 371661
14213 371661 26022 -565646 -744413 -203503 630349 1331045 1580353 1126694 265335 -397446
14203 -397446 -875508 -1295398 -1455961 -1344526 -999847 -530012 49240 731284 1244871 1482506
14193 1482506 1529449 1339501 927381 558615 542627 637235 615653 631066 558652 130790
14183 130790 -470778 -921194 -1084977 -895027 -403986 356109 977180 1073432 974181 1033352
14173 1033352 1027280 681005 22161 -673385 -1187096 -1726566 -2145607 -1846564 -996678 -178368
14163 -178368 236866 90912 -437543 -918214 -1327296 -2116704 -3152802 -3753808 -3736662 -3324352
14153 -3324352 -2771121 -2430265 -2395300 -2319559 -2062755 -1881892 -1890390 -1793920 -1272517 -643409
14143 -643409 -415718 -506876 -419437 -139841 -11501 4133 89587 193579 294896 344129
14133 344129 210752 -33215 -288292 -478814 -673662 -626862 -123764 494117 1030025 1387305
14123 1387305 1467331 1414436 1473781 1632264 1682593 1745259 2036540 2375809 2463828 2294345
14113 2294345 1990938 1545593 1011371 523833 285348 519035 857829 774498 349677 -139257
14103 -139257 -489026 -469274 140997 1153667 2072045 2642530 2637148 1813096 574058 -452334
14093 -452334 -1203473 -1695388 -1732757 -1426479 -1063318 -732921 -319964 201890 762593 1237257
14083 1237257 1602538 2039080 2608179 3071091 3102080 2690771 2003812 1348951 894464 432761
14073 432761 -424008 -1512701 -2119240 -2049294 -1583148 -757084 248526 1099658 1589937
14064 1589937 1490689 938680 508219 560434 891014 1222649 1577233 1786364 1331897 531000
14054 531000 -4377 -344731 -645269 -1006098 -1409477 -1601912 -1461772 -1144662 -686848 22077
14044 22077 705068 1151480 1543105 1949873 2265278 2184642 1555507 731859 55719 -412229
14034 -412229 -640301 -652073 -466580 -204898 -140275 -334331 -592448 -811236 -928349 -854269
14024 -854269 -444863 262442 949684 1450855 1880055 2399436 3037460 3497368 3475630 2992329
14014 2992329 2257027 1700811 1669863 1906589 2063750 2108530 1951961 1464046 706821 -322955
14004 -322955 -1364485 -1691744 -1196618 -419185 89360 280170 329152 309803 322144 460092
13994 460092 877591 1515049 2031583 2204247 2176399 2219711 2218872 1937806 1344910 528291
13984 528291 -419893 -1291759 -1576504 -1096113 -375175 20295 -51653 -406816 -700108 -717013
13974 -717013 -554172 -636400 -1103306 -1522331 -1576426 -1354412 -963848 -313210 701378 1847760
13964 1847760 2449147 2280914 1987905 2062203 2254194 2330859 2179436 1743310 1145729 638224
13954 638224 446702 575970 775880 1062359 1433641 1739541 2024039 2263806 2524086 2749375
13944 2749375 2764022 2344433 1295835 12530 -959991 -1503303 -1918110 -2325896 -2403518
13935 -2403518 -2099032 -1535717 -840049 -309262 21733 279960 274214 -41513 -408709 -629245
13925 -629245 -675485 -562755 -472929 -358446 -108141 239239 734319 1585561 2715699 3469477
13915 3469477 3499257 2940317 2148150 1595811 1442842 1672462 2102372 2307410 2218443 2041246
13905 2041246 1843848 1616569 1550937 1742044 1951706 2004665 1923627 1710989 1588813 1792087
13895 1792087 1941920 1704345 1293969 1088764 1184686 1362408 1351050 1159981 1072168 1172239
13885 1172239 1237215 1224601 1352763 1772162 2460319 3128822 3328423 2891431 2070553 1308247
13875 1308247 841955 570513 427797 454278 724180 1142126 1467493 1596442 1610216 1605377
13865 1605377 1599129 1581689 1546240 1519649 1424301 1001068 128577 -979610 -1857710 -2297059
13855 -2297059 -2622853 -3032091 -3306178 -3208784 -2626371 -1746767 -997420 -367526 454043 1398606
13845 1398606 2290719 3155374 3766578 3785048 3355491 3087508 3298891 3771631 4131557 4196013
13835 4196013 4056020 3893543 3773104 3740113 3791098 3837867 3945641 3903238 3393610 2559078
13825 2559078 1750383 1163298 791977 402842 -225072 -845161 -1099037 -1041761 -940124 -888270
13815 -888270 -847739 -916812 -1116439 -1311372 -1396404 -1190788 -660459 -132296 100583 48332
13805 48332 17042 368103 843335 941748 680897 464928 467113 571765 450695 22793
13795 22793 -294958 -185610 136754 441411 943373 1683074 2263620 2409828 2208167 1790094
13785 1790094 1241191 696949 320685 296633 529347 748451 1033475 1228776 850709 111328
13775 111328 -196135 210813 836996 1338338 1756685 2088296 2365907 2558990 2530011 2203654
13765 2203654 1937572 2012872 2111906 1965725 1690473 1635254 2071636 2597050 2745908 2573538
13755 2573538 2397427 2353122 2321392 2230509 2045284 1718869 1182240 705736 620930 919628
13745 919628 1387928 1926781 2592992 3225614 3499422 3320577 2911104 2487804 2147685 1910534
13735 1910534 1492549 852619 417079 168015 -68492 -110088 126769 541696 863327 625110
13725 625110 -213628 -874849 -897808 -560749 -218417 202449 832308 1412819 1637983 1354511
13715 1354511 775018 185270 -316403 -710966 -902492 -1061739 -1503480 -2125972 -2610816
13706 -2610816 -2621180 -1956654 -1046168 -656724 -748824 -724643 -713496 -893472 -1186721 -1517735
13696 -1517735 -1687279 -1770970 -1770352 -1391780 -536751 429585 1063353 1231759 965280 635443
13686 635443 602965 882562 1208718 1407408 1417893 1303285 1116758 954296 865522 694605
13676 694605 388343 134224 264271 935535 1790563 2219968 2204147 2163572 2325839 2557309
13666 2557309 2609097 2237088 1406537 553777 107917 -168864 -516820 -836685 -1292137 -2035252
13656 -2035252 -2825168 -3170874 -2831577 -2195242 -1601658 -1132058 -857802 -752994 -454542
13647 -454542 166008 829295 1192104 1251316 1067466 519800 -208218 -654527 -542299 40696
13637 40696 578794 672123 345478 -352773 -1115990 -1608890 -1821047 -1809182 -1650540 -1331385
13627 -1331385 -879288 -601521 -426921 -93539 56927 -312524 -861838 -1074248 -786407
13618 -786407 -133446 426664 539862 175206 -555662 -1289758 -1681870 -1622291 -1320670 -1089242
13608 -1089242 -950072 -734726 -468842 -302015 -340527 -514381 -655123 -480413 27404 584271
13598 584271 1081052 1474701 1548569 1336445 1067105 830728 887349 1293204 1658237 1751693
13588 1751693 1698876 1694430 1987318 2479669 2743492 2483011 1627479 558682 -97035 -314192
13578 -314192 -563573 -1128882 -1821610 -2544994 -3102124 -3315047 -3231813 -2937188 -2471194 -1912689
13568 -1912689 -1377965 -968534 -806863 -907346 -1256501 -1602801 -1684647 -1723756 -2009304 -2287595
13558 -2287595 -2144526 -1681921 -1430628 -1320783 -944964 -417654 11416 282905 294236 238319
13548 238319 655032 1733300 2843563 3340572 3187797 2576563 1855796 1392807 1275532
13539 1275532 1257398 1069919 786108 612013 659665 833969 983498 1112913 1054333 694104
13529 694104 270107 -91670 -377369 -607338 -843389 -922606 -745346 -412347 -58232 166243
13519 166243 444521 923677 1243421 1091194 609246 67222 -250726 -101230 151304 -65759
13509 -65759 -553503 -893167 -964041 -791162 -528256 -188283 363773 765264 629898 138993
13499 138993 -257557 -278420 -219586 -406183 -750186 -1027770 -929090 -419962 200997 728714
13489 728714 992636 916109 734174 900670 1451838 2047347 2483705 2815000 3160383 3412515
13479 3412515 3226924 2851995 2849339 3140021 3408888 3646871 3953327 4272831 4451043 4422704
13469 4422704 4445280 4559230 4444749 3946561 3349420 2926931 2555437 2008256 1253394 686242
13459 686242 642226 989174 1525566 1935164 2030226 2131840 2420471 2486983 2009416 1307898
13449 1307898 895551 1023491 1590042 2207692 2752805 3311236 3666893 3755247 3728994 3445625
13439 3445625 2768238 2102885 1756972 1700409 1803776 1894687 2062185 2445467 2800479 2969003
13429 2969003 2967808 2773023 2414747 1960655 1476131 1040977 693377 305483 -326264 -1159731
13419 -1159731 -1773376 -1861931 -1448016 -750323 -151433 53251 -180753 -647213 -944831 -900386
13409 -900386 -741768 -774433 -1153607 -1534571 -1548704 -1320885 -1141118 -1325964 -1842894 -2160051
13399 -2160051 -1918991 -1212475 -176273 839241 1236695 876831 170113 -432804 -754764
13390 -754764 -822555 -649577 -338936 -227018 -287808 -69749 451746 839228 718825 -22760
13380 -22760 -983169 -1534367 -1619726 -1449653 -1175453 -1051747 -1147884 -1301515 -1490689 -1795394
13370 -1795394 -2136264 -2239443 -1882009 -1132797 -369062 13912 51525 -56267 -239881 -402218
13360 -402218 -395535 -100200 368109 924680 1600856 2245510 2466486 2245965 1995761 2140662
13350 2140662 2680550 3199373 3546429 3665208 3596263 3633206 3887982 4130937 4100947 3754786
13340 3754786 3202622 2630711 2252200 2224407 2267857 1889278 1151631 636378 563197 637385
13330 637385 467022 47596 -481761 -1168172 -1735247 -1758602 -1327194 -695906 -170684 32010
13320 32010 34879 6496 -87340 -197848 -143248 173593 600552 801536 737044 501889 364038
13309 364038 452373 806903 1571491 2136841 1836611 1003830 62547 -735997 -1107242 -1010618
13299 -1010618 -743794 -374383 152530 528070 553834 452807 549141 730085 691827 540919
13289 540919 598125 978774 1551865 1932531 1807088 1338019 894951 773927 876455 1058298
13279 1058298 1242440 1256637 1243702 1434846 1745899 2022378 2213404 2146298 1807902 1446080
13269 1446080 1117621 651576 100489 -387685 -603567 -430719 -157695 -36945 -44335 93597
13259 93597 558947 1187598 1747697 2175249 2502172 2761081 2902693 2853025 2860969 3072098
13249 3072098 3324667 3582860 3704658 3547050 3154569 2793263 2636368 2495680 2217129
13240 2217129 1763548 1190355 628863 112942 -297631 -723180 -1074154 -968459 -480903
13231 -480903 -47368 188227 231199 198795 377519 832468 1054614 746010 265431 -40366
13221 -40366 -128124 -257255 -595715 -1222183 -2144715 -2869391 -3061407 -2832164 -2235027 -1415268
13211 -1415268 -573854 250066 853536 995716 853006 665973 456594 348432 406749 333480
13201 333480 21455 -410490 -766428 -675896 11160 985725 1864494 2506746 2863948 2958146
13191 2958146 2869338 2616634 2144291 1754156 1811486 2137950 2581781 3126557 3646144 3979770
13181 3979770 4041524 3904253 3764307 3523130 2894361 2305822 2359659 2813353 3268153 3540995
13171 3540995 3611426 3701354 3872591 3880364 3658807 3351314 3145360 2949340 2478706 1891443
13161 1891443 1494136 1233569 1175823 1401233 1723146 1963662 2074088 2262502 2478066 2641182
13151 2641182 2805759 2829660 2785450 2743026 2557001 2206521 1834423 1338571 674291 -23093
13141 -23093 -606569 -1020273 -1368308 -1793586 -2067161 -1921071 -1622359 -1402966 -1323192 -1330728
13131 -1330728 -1361860 -1386201 -1323328 -1192221 -1052691 -952006 -910550 -789295 -664586 -765284
13121 -765284 -978641 -942006 -602526 -161901 359413 952705 1296171 1144699 761037 314430
13111 314430 46387 296661 999330 1866101 2604346 2892080 2594933 1887021 1045543 216318
13101 216318 -556264 -1152866 -1588234 -1796396 -1714351 -1647214 -1706607 -1663539 -1598543 -1682265 -1729718
13090 -1729718 -1532049 -1210193 -1048367 -1039547 -775216 -235037 169376 283858 11046 -460691
13080 -460691 -570295 63313 1190284 2125531 2312096 1895357 1350873 935672 778506
13071 778506 945085 1359218 1777170 1878233 1630505 1115223 224458 -929963 -1818142
13062 -1818142 -2099202 -1984460 -1613940 -1018937 -273082 491116 969183 1264956 1382351
13053 1382351 1079550 749954 708061 671627 286318 -369116 -720404 -249031 839621 1760125
13043 1760125 1958575 1686576 1373131 1149655 925701 508114 -26844 -215290 -100303
13034 -100303 34597 149916 -22547 -599679 -1212735 -1637988 -1825559 -1713052 -1259457 -614246
13024 -614246 -12026 785743 1824668 2714494 3282758 3522344 3469364 3176069 2571557 1856217
13014 1856217 1411375 1061463 705592 732117 1224027 1929264 2624523 3079089 2907385 1959428
13004 1959428 796982 44677 -137052 164670 674599 1156497 1587319 1808982 1722647
12995 1722647 1416498 1065769 862704 850846 971728 1043958 991665 923170 983555 1010541
12985 1010541 751905 453777 350978 378107 488771 728233 931677 746081 355980 157142
12975 157142 35695 -196925 -562862 -1071441 -1620678 -2052763 -2302559 -2320070 -2329277 -2279903
12965 -2279903 -1931833 -1533932 -1471806 -1745386 -2019317 -2154919 -2098986 -1626319 -751299 160885
12955 160885 761223 988233 1021452 1112267 1338078 1476389 1338202 1134657 992109 569138
12945 569138 -79130 -493096 -734954 -1097349 -1583086 -2064460 -2336060 -2336915 -2277947 -2553124
12935 -2553124 -3211990 -3735990 -3564720 -2575734 -1097068 260606 1069683 1281612 1134869
12926 1134869 928600 755593 481218 68056 -393394 -957748 -1638501 -2408665 -3262672
12917 -3262672 -3807473 -3930086 -3823967 -3512315 -3098553 -2596051 -1964095 -1365215 -1013751
12908 -1013751 -959839 -1173117 -1428659 -1323443 -806370 -220156 117523 403805 918869 1311727
12898 1311727 1306634 1171317 1254951 1496437 1609315 1489185 1335865 1231615 915133 276332
12888 276332 -608760 -1438954 -2014066 -2470540 -2691397 -2415359 -1583758 -656330 -190976 -189843
12878 -189843 -420089 -657079 -751592 -746885 -777656 -734189 -346578 189450 480031 592865
12868 592865 736821 736716 461260 160887 17396 340673 1097117 1740569 2000507 1995129
12858 1995129 1810572 1486313 938320 325481 47948 -23759 5475 262428 694431 1265356
12848 1265356 1770921 1905770 1655630 1226287 794489 625250 1089417 2195066 3336593
12839 3336593 3999672 3984924 3270760 2236884 1182206 281999 -440812 -987890 -1350958
12830 -1350958 -1639486 -1851885 -1802914 -1454447 -1117669 -963022 -874919 -773987 -576721 -37679
12820 -37679 852413 1948462 3110258 3851517 3814164 3147641 2327251 1755471 1739123 2272252
12810 2272252 2740750 2644760 2131434 1748677 1737017 1734906 1426221 988838 740766 729413
12800 729413 726588 700547 957799 1511965 2074847 2524167 2755343 2846104 3080951 3231271
12790 3231271 2926238 2472886 2338975 2583779 2993955 3366367 3418999 3156291 2922575 2816802
12780 2816802 2686638 2340079 1770256 1308120 1207666 1380949 1720173 2188336 2677744
12771 2677744 2894266 2706001 2342139 2109258 1984358 1730846 1475133 1453414 1543578 1482906
12761 1482906 1086039 424980 -180953 -577343 -948340 -1260093 -1387468 -1228167 -577310
12752 -577310 415197 1245961 1663016 1762580 1618951 949469 -231929 -1303560 -1652634
12743 -1652634 -1490066 -1392296 -1342572 -1168385 -956854 -771098 -551235 -231503 326891 1067203
12733 1067203 1728083 2168804 2330049 2272957 2306651 2494053 2416921 1929826 1516656 1517969
12723 1517969 1633882 1597479 1456726 1305609 1091566 771452 357014 30656 -101320 -370558
12713 -370558 -983596 -1642046 -1969321 -1925620 -1630303 -1182725 -793197 -829068 -1311675 -1840527
12703 -1840527 -1987344 -1791539 -1634960 -1716485 -1861782 -1846660 -1551110 -984615 -380415 27773
12693 27773 179835 71255 -459560 -1253213 -1594270 -1242611 -677934 -321664 -302916 -472584
12683 -472584 -355112 261473 1056597 1735358 2147034 2328328 2543670 2745133 2790856 2756860
12673 2756860 2691011 2559427 2388822 2406183 2618551 2874507 3061903 3126535 2960337 2523075
12663 2523075 2019703 1569085 1129696 639184 180648 -171958 -394390 -385792 -74452 484726
12653 484726 1229460 1985440 2483750 2705465 2891867 3185273 3448544 3527116 3314780 2851439
12643 2851439 2406365 2029111 1604281 1252994 1080750 1039561 1227162 1645040 2227072 2895368
12633 2895368 3357696 3207226 2407058 1419053 718251 429264 360556 404858 523260 669528
12623 669528 877219 1120175 1236102 1131470 933700 837690 942615 967575 923452 958570
12613 958570 1004127 1093207 1429485 1863774 1920421 1533940 901055 194237 -428512 -681424
12603 -681424 -526277 -293863 -349602 -716893 -1033975 -1163031 -1268427 -1277049 -1080284 -812255
12593 -812255 -802499 -1063712 -1220130 -1113151 -901330 -614316 -41946 849932 1840586 2681210
12583 2681210 3104720 3164497 3086931 2774120 2234562 1608518 1116513 915165 833718 814870
12573 814870 796950 576657 201010 -120046 -285840 -276254 115960 902106 1790870 2482508
12563 2482508 2694535 2631173 2805693 3331801 3908585 4166582 3879772 2981750 1835571
12554 1835571 1043706 947968 1406638 2006578 2464223 2642914 2677181 2834333 3179444 3442692
12544 3442692 3499293 3494809 3446274 3136972 2429975 1611086 1173782 1324578 1663816 1631072
12534 1631072 1283127 957379 875973 1048318 1309655 1395453 1316558 1292722 1379641 1578784
12524 1578784 1759321 1985350 2311463 2565479 2797784 3181912 3666341 3989718 3815311
12515 3815311 3182460 2563856 2229990 2103829 1955763 1665411 1320121 1170270 1412366
12506 1412366 1927213 2367359 2434185 2154157 1660088 1087377 633090 308180 186247 285301
12496 285301 460373 553204 602278 732893 976337 1351194 1630795 1383614 786554 281256
12486 281256 -65226 -312149 -361469 -409 429349 681577 1088405 1662887 2172822 2720981
12476 2720981 3272575 3668862 3832853 3643084 3168735 2518617 1700970 906583 324968
12467 324968 1975 -95857 -5291 200968 236536 -138339 -885265 -1559653 -1594168 -1144463
12457 -1144463 -888594 -1083590 -1432098 -1474140 -1197188 -878874 -549275 -297327 -289779 -494387
12447 -494387 -751048 -961336 -1055443 -831833 -262379 374835 781237 781582 421658 18596
12437 18596 -153487 -198123 -278843 -415731 -662961 -885659 -663993 -96168 348742 543192
12427 543192 753503 1281151 2071390 2697956 2837540 2511039 1914976 1329421 935653 630694
12417 630694 167656 -152257 16525 444644 854024 1226681 1601570 2044046 2620485 3185676
12407 3185676 3481421 3295876 2656192 1885205 1520673 1686132 1959100 1984499 1813463 1713386
12397 1713386 1825705 2048845 2180951 2217470 2096412 1708183 1184732 634695 241190 142387
12387 142387 59210 -256282 -546675 -572375 -430139 -282680 -388929 -736168 -1066805 -1161122
12377 -1161122 -931506 -706448 -724835 -847430 -1138376 -1680881 -2121461 -2323908 -2224091 -1685264
12367 -1685264 -1075226 -777577 -801405 -882841 -666609 -270063 26597 246414 480990 724247
12357 724247 960172 1432722 1994259 2132713 1892815 1740489 1911020 2410985 3076429 3554264
12347 3554264 3595535 3301462 3060966 3186133 3398562 3385486 3243305 2889278 2329581 1737088
12337 1737088 1065230 390157 -13969 6836 224216 289702 158355 113839 373731 747134
12327 747134 968854 963532 845781 899788 1473685 2275984 2609206 2284833 1672381 1211496
12317 1211496 1051631 1107154 1135144 1114945 1280061 1612027 1837308 1724673 1267702 501774
12307 501774 -212961 -304925 221153 988237 1556703 1703046 1700334 1688073 1508231 1250121
12297 1250121 1069288 804383 443180 256745 328104 394249 233964 -219115 -846742 -1319076
12287 -1319076 -1227031 -464205 539662 1400149 2002037 2281130 2241603 2007579 1772007 1870283
12277 1870283 2269092 2636724 2743296 2489587 1839634 977180 391783 256975 156342
12268 156342 -177530 -481273 -493486 -376074 -401065 -600120 -771125 -722884 -408060 64913
12258 64913 472809 614364 401217 -21882 -251323 -142888 29355 15703 -107999 -114845
12248 -114845 73623 430673 856015 1232791 1618896 2167869 2794152 3165205 3268951 3134557
12238 3134557 2707626 2215737 1739932 1285234 1053839 1076816 1183442 1291135 1575077 1947791
12228 1947791 2090153 1948632 1628422 1236364 853637 655551 734991 1051257 1527051 2078220
12218 2078220 2573424 2970001 3437716 3839550 3711673 3001168 1984742 949224 -7632
12209 -7632 -716621 -981810 -922392 -861161 -912738 -815474 -286619 465837 1056269 1318347 1257592
12198 1257592 1186135 1206498 1112518 892984 535887 29505 -480822 -812182 -953382 -917964
12188 -917964 -692821 -465091 -514813 -793595 -957336 -935602 -1147639 -1611972 -2132252 -2519257
12178 -2519257 -2535383 -2172749 -1503542 -765571 -366876 -397501 -526391 -467417 -115826 401926
12168 401926 872634 1033174 955401 982401 990793 811965 559330 242866 -105977 -300200
12158 -300200 -294679 -128263 255773 609992 567034 340234 316256 503953 615979 516407
12148 516407 609996 1013735 1415559 1549629 1345436 987624 784335 826736 772619 321589
12138 321589 -330323 -929535 -1468975 -1998757 -2499328 -3064948 -3690854 -4056387 -3842709 -2919182
12128 -2919182 -1467033 -126805 441597 264811 -124325 -289262 9138 419817 380726
12119 380726 -86433 -860459 -1598951 -1934308 -1920715 -1925191 -2251038 -2819402 -3407504 -3624205
12109 -3624205 -3095213 -1839347 -543357 345093 1014643 1505948 1743843 1646807 1284565
12100 1284565 1076448 1228329 1480320 1642900 1545483 1177300 946868 1016976 1365441 1784195
12090 1784195 1757869 1252590 675160 235472 163831 543904 1021961 1243081 1225073 1125899
12080 1125899 979652 989796 1237825 1270323 874508 427137 213209 200022 273544 324984
12070 324984 336786 332588 430857 689549 824541 778093 781944 972818 1273013 1321397 848398
12059 848398 -39387 -880717 -1263547 -1057032 -464544 130483 596291 1086119 1575263 1932128
12049 1932128 1915417 1413450 719251 41868 -514483 -675086 -400345 165837 981314 1689043
12039 1689043 1986416 1846645 1404240 879575 378189 -30722 -244451 -183859 12521 219716
12029 219716 464481 554727 528272 597992 680589 638036 564825 541007 595692 657632 540289
12018 540289 356615 417787 675308 860409 864042 855011 929012 1192680 1540312 1707374 1676378
12007 1676378 1534064 1345886 1193079 1127183 1182983 1346458 1558158 1824714 2055249 2076713
11997 2076713 1949557 1797243 1588074 1455781 1460546 1313621 897077 347814 10533 390137
11987 390137 1513652 2846974 3869737 4235158 4031386 3743509 3573556 3473587 3329617
11978 3329617 3018273 2495914 1868669 1473101 1275816 836418 187201 -313005 -395499 15202
11968 15202 751116 1350035 1621932 1818523 1928529 1663896 1209509 1046068 1399307 1990027
11958 1990027 2169548 1887618 1694285 1729497 1673546 1399679 1192699 1211672 1059266 376336
11948 376336 -607840 -1446511 -1782338 -1663333 -1386264 -972689 -522521 -217759 170192 766624
11938 766624 1220385 1362124 1414399 1790328 2563483 3262675 3491638 3225232 2781890 2663101
11928 2663101 3290117 4412975 5011823 4567227 3612546 2629187 1656708 811646 177085
11919 177085 -264097 -447057 -308897 68009 437710 389098 -227092 -895538 -1254702 -1333369
11909 -1333369 -1166384 -799937 -509168 -567222 -715963 -562391 -146960 284060 552784 718621
11899 718621 1065122 1514753 1567824 1180997 603829 -98068 -977304 -1905964 -2535438 -2736640
11889 -2736640 -2614918 -2310655 -1872192 -1345788 -892915 -366716 400392 1080031 1284142
11880 1284142 945103 347181 -257488 -532768 -231095 408727 984349 1474269 1877954
11871 1877954 1826489 1200920 559619 372383 408164 271433 -121966 -466763 -473444 -346835
11861 -346835 -333982 -334487 -212895 20643 357383 847870 1409793 1795681 1710359 1195181
11851 1195181 638530 176089 -291105 -820099 -1355705 -1791524 -2206349 -2715285 -3181014
11842 -3181014 -3140774 -2403338 -1338736 -287621 618197 1403579 2125195 2540467 2370418
11833 2370418 1416594 -107417 -1418704 -1927200 -1667492 -918594 56615 1059430 1935218
11824 1935218 2246365 1862189 970190 -190374 -1198140 -1625503 -1493331 -1212022 -917241
11815 -917241 -443649 256508 1007593 1600024 1983043 2091778 1765957 1357752 1457012 2040788
11805 2040788 2501265 2407635 1796749 1155282 678804 267479 46598 1991 3421 50175
11795 50175 232356 375390 310898 74055 -58231 40041 121083 -8835 -223277 -292765
11785 -292765 -197856 -225929 -779156 -1812445 -2930910 -3738517 -3962393 -3640867 -3042614 -2296702
11775 -2296702 -1379599 -569501 -370337 -1092179 -2344054 -3272492 -3542933 -3358786 -2880411
11766 -2880411 -2297995 -1753111 -1160545 -363682 409243 792971 609710 -46106 -583211
11757 -583211 -611656 -399276 -181241 92826 459085 721121 802684 917987 1033497 972836
11747 972836 719088 597653 830653 1172626 1544181 2071016 2469879 2713454 3116181 3504298
11737 3504298 3564420 3243449 2733046 2358795 2159170 1977903 1782559 1476957 1123254 918611
11727 918611 646192 183450 -372937 -773792 -687806 -257202 144584 311611 242946 54323
11717 54323 -166627 -379639 -392064 -70433 422634 830757 939974 871438 806393 652321
11707 652321 687517 1049688 1246522 1100710 872797 778287 993538 1193454 918064 426050
11697 426050 264269 527671 838763 1178220 1564393 1800603 1844575 1845854 1844047 1611792
11687 1611792 1064080 498782 177496 150670 301179 526175 844221 1195426 1298844 858590
11677 858590 -59527 -1173521 -2186861 -2895863 -3098077 -2682631 -1850105 -966867 -257000
11668 -257000 341652 760810 1046124 1454272 1816658 1685413 1156157 720026 813205 1611873
11658 1611873 2737837 3447386 3303536 2573782 1906960 1751756 1881940 1892178 1705384
11649 1705384 1441544 1371917 1485234 1622124 1755703 1845433 1745046 1092230 141922 -612255
11639 -612255 -1340411 -2215523 -2755522 -2552397 -2053790 -1707934 -1396123 -1067716 -803867 -652096
11629 -652096 -645893 -846161 -1160061 -1412071 -1628551 -1587752 -853012 420143 1752040 2806290
11619 2806290 3520812 4013443 4384484 4515933 4195448 3569341 2818204 2109595 1750549
11610 1750549 1758561 1928712 2071747 2000561 1728712 1360886 1007224 898472 993757 1102732
11600 1102732 1049656 852271 690348 504278 85790 -567447 -1243289 -1621141 -1531784 -1272347
11590 -1272347 -1203018 -1509108 -1995701 -2146174 -1833594 -1348337 -899738 -715252 -701438 -628932
11580 -628932 -538622 -554177 -501383 -255505 105031 579116 977923 1141848 1058293 877129
11570 877129 663354 475779 414295 330955 20505 -469291 -960370 -1230018 -1198445 -1156985
11560 -1156985 -1286991 -1357715 -1272824 -1118242 -1006493 -792217 -471354 -366300 -605823 -1141212
11550 -1141212 -1843342 -2502515 -2852064 -2764408 -2454768 -2227739 -2179682 -2177211 -1905077 -1409624
11540 -1409624 -968738 -826997 -963543 -1275720 -1527932 -1529436 -1418667 -1322410 -1241473 -1207655
11530 -1207655 -1250986 -1341819 -1455308 -1612952 -1833855 -2162592 -2596945 -3159015 -3738632 -4092718
11520 -4092718 -4063799 -3619646 -2964297 -2289997 -1628048 -1021634 -524668 -309504 -277141 -216413
11510 -216413 -162818 -47573 10704 -338810 -921445 -1300496 -1428697 -1300324 -983367 -640159
11500 -640159 -265356 152194 516621 703815 569419 114842 -408856 -735541 -930280 -1121450
11490 -1121450 -1239862 -1127137 -852590 -559931 -428064 -451349 -357614 -99300 -14891 -159121
11480 -159121 -402118 -731202 -1038183 -1186211 -1274931 -1586466 -2037146 -2278360 -2198951 -1812577
11470 -1812577 -1245089 -655471 -203664 11127 155093 574530 1261037 1710499 1801688 1752353
11460 1752353 1847465 2118307 2152214 1612384 672815 -115229 -376956 -184070 130211 342869
11450 342869 402147 306515 284513 507856 756392 740713 555781 538936 689680 814124
11440 814124 1075837 1553671 1941630 1984143 1858995 1849534 1887047 1810315 1804589 1905160 1818768
11429 1818768 1331184 536168 -333951 -1171874 -1666023 -1486222 -916600 -520327 -338207
11420 -338207 -33614 550200 1277642 1950223 2488033 2757322 2519034 1778331 1074265 830163
11410 830163 776307 534345 58071 -395540 -709873 -1008384 -1248067 -1160266 -800050 -435306
11400 -435306 -399584 -847246 -1366794 -1688784 -2026578 -2483513 -2803300 -2815509 -2539435 -2144217
11390 -2144217 -1683991 -1275391 -1068650 -1004689 -1069426 -1182560 -1320747 -1329118 -1004987 -351253
11380 -351253 472734 1192550 1715015 2230215 2857379 3365659 3406273 3039407 2651507 2340034
11370 2340034 1882101 1196871 650857 628609 896198 1338090 2019839 2643940 3076140 3342061
11360 3342061 3337824 3112374 2929533 2941373 3048979 3013058 2536171 1622900 675728 -275824
11350 -275824 -1353621 -2164244 -2262713 -1773021 -1270681 -1275925 -1604104 -1967973 -2509227 -3093113
11340 -3093113 -3426130 -3221726 -2452454 -1551254 -820891 -288719 99087 460746 950396
11331 950396 1344345 1193649 702690 276796 51241 21849 37512 107935 362413 597957
11321 597957 615033 673020 890721 1028753 1023318 995245 746041 125838 -589741 -1031016
11311 -1031016 -903606 -104446 1074950 2041683 2406257 2420145 2415172 2215371 1821246 1531127
11301 1531127 1708892 2209955 2264578 1680418 1004006 629063 690762 1080629 1344093 1460737
11291 1460737 1658630 1681194 1256037 522290 -83325 -352046 -563003 -982068 -1393242 -1518452
11281 -1518452 -1502127 -1592201 -1817298 -1946665 -1679949 -1152066 -1030215 -1500985 -2122131 -2477878
11271 -2477878 -2458204 -2070360 -1315110 -347749 378146 392965 -106886 -521317 -550788 -574571
11261 -574571 -1035436 -1512280 -1498267 -1127943 -622440 -58469 420134 930375 1582781 2139721
11251 2139721 2488807 2479548 1912594 783100 -961572 -3061456 -4724993 -5432767 -5270941
11242 -5270941 -4459014 -3278492 -2230577 -1669952 -1361993 -841352 -108923 503456 783439
11233 783439 813223 895516 1118160 1332840 1446530 1545751 1804025 2199301 2395403 2278098
11223 2278098 1956430 1544204 1068887 366087 -526216 -1309442 -1686176 -1711079 -1751205 -1833550
11213 -1833550 -1678123 -1357744 -1182833 -1294617 -1650225 -2165840 -2595240 -2682619 -2280060 -1569531
11203 -1569531 -1094718 -1207502 -1550380 -1498719 -1131753 -826935 -755587 -966578 -1468601 -2187097
11193 -2187097 -2983521 -3641664 -3848908 -3795334 -3979979 -4465554 -4943776 -5049152 -4714499 -4113160
11183 -4113160 -3539815 -3386651 -3452434 -3108262 -2410024 -1955728 -1916445 -2073174 -2242166 -2456535
11173 -2456535 -2732958 -2845259 -2516664 -1647273 -518068 309874 537460 317839 -20255
11164 -20255 -353791 -573790 -718814 -1030592 -1476728 -1953447 -2411121 -2739404 -2789832 -2439198
11154 -2439198 -1841589 -1443291 -1483818 -1753319 -2056551 -2241397 -2109755 -1872303 -1765486 -1724351
11144 -1724351 -1774186 -2020954 -2350440 -2478237 -2304106 -2039173 -1924699 -1896922 -1874975 -1706076
11134 -1706076 -1222330 -448104 533356 1593239 2494643 3089278 3488013 3743328 3665795
11125 3665795 3093285 2203708 1282157 406604 -343468 -635456 -324743 212653 717027
11116 717027 1176290 1592735 2025945 2321287 2344908 2127447 1805520 1381909 884571 474802
11106 474802 188669 125089 116853 -204666 -816007 -1423872 -1951877 -2404980 -2435559 -1910787
11096 -1910787 -1484704 -1633492 -1940197 -1979579 -1906315 -2295277 -3068970 -3685106 -3743755 -3078871
11086 -3078871 -2036644 -1094504 -443652 -284903 -683931 -1530573 -2497087 -3036348 -3015476
11077 -3015476 -2667253 -2358382 -2229763 -2118159 -2060434 -2183527 -2361872 -2439512 -2524695 -2762322
11067 -2762322 -2919632 -2601122 -1704923 -530390 366068 517310 166675 -110688 -134879
11058 -134879 68288 313912 300354 -21327 -773111 -1991190 -3113587 -3672979 -3810387
11049 -3810387 -3480459 -2551824 -1436813 -655902 -346057 -293942 -67105 440914 824248
11040 824248 729505 90343 -790892 -1359627 -1364053 -1025798 -641127 -358562 -282758 -473773
11030 -473773 -906600 -1405594 -1729264 -1833721 -1771711 -1591582 -1634660 -1917257 -2080660 -1980328
11020 -1980328 -1760403 -1665801 -1632828 -1583900 -1558063 -1463233 -1368613 -1303427 -1148059 -902982 -553316
11009 -553316 -101278 364242 841006 1307956 1472258 1270657 1008804 939503 1137143 1683994
10999 1683994 2255008 2401607 2246727 1982772 1636965 1189649 699013 387959 349883 387386
10989 387386 461059 688290 967718 1304515 1779438 2357377 2866544 3025690 2800009 2476286
10979 2476286 2266421 2203072 2094910 1698931 901080 -130980 -899453 -1355239 -1705340
10970 -1705340 -1968760 -2402873 -3277870 -4257898 -4773513 -4683673 -4101375 -3278233 -2552436 -1973815
10960 -1973815 -1465889 -1166942 -1377729 -1986414 -2466495 -2681340 -2887741 -3379237 -3974849
10951 -3974849 -4131460 -3678654 -2908467 -2115593 -1367598 -822286 -674993 -708476 -778901 -1116149
10941 -1116149 -1385160 -1146052 -651620 -471778 -879846 -1405924 -1517950 -1279133 -858099
10932 -858099 -224716 576095 1305258 1730999 1826855 1729124 1527009 1196649 700304 176193
10922 176193 -202439 -256908 196005 991295 1731435 2186831 2466364 2465874 1876385 1120611
10912 1120611 813241 624940 163796 -307233 -618385 -783164 -700718 -384382 -191651 -368140
10902 -368140 -633873 -805777 -804564 -577204 -200333 323300 937977 1537603 1942958 1818911
10892 1818911 1307527 852192 521037 158256 -173455 -108068 199562 333240 399228 682750
10882 682750 1089510 1340875 1584481 1940121 2209182 2331566 2511454 2764659 2857650 2718288
10872 2718288 2495399 2355503 2255015 1956375 1338496 624653 32336 -286650 -205978 12015
10862 12015 -161377 -674377 -1139344 -1370344 -1347412 -1134156 -820397 -546883 -489902 -559647
10852 -559647 -525447 -459825 -407062 -299891 -126283 153531 543877 792320 715230 393096
10842 393096 -15259 -414652 -982058 -1652374 -1934846 -1693928 -1409081 -1566785 -2103014 -2612736
10832 -2612736 -2662889 -2228073 -1824324 -1650898 -1558222 -1499834 -1332330 -929854 -577488 -493474
10822 -493474 -554812 -439827 -224433 -216030 -270421 -219505 -45392 -9789 -210592 -348350 -434974
10811 -434974 -594690 -620399 -272115 318200 737798 552788 -161754 -649063 -641085 -585458
10801 -585458 -888204 -1443477 -1786293 -1866869 -1900399 -1918753 -2143178 -2598331 -2874010 -2645590
10791 -2645590 -1996444 -1329692 -891585 -780763 -878519 -860504 -671434 -561830 -671002 -1160681
10781 -1160681 -1940597 -2553113 -2698956 -2408012 -1936057 -1688391 -1619160 -1482486 -1473024 -1748220
10771 -1748220 -2147408 -2440476 -2554270 -2522055 -2275710 -1787445 -1184647 -650141 -411033 -503958
10761 -503958 -633250 -632990 -630239 -683803 -773097 -976710 -1395116 -1858711 -2140037 -2440027 -3088515
10750 -3088515 -4024818 -4731060 -4685535 -4062997 -3491729 -3274460 -3226787 -3117588 -2936597 -2598443
10740 -2598443 -2111045 -1886270 -2111941 -2505539 -2653860 -2583136 -2622485 -2967872 -3386725 -3355271
10730 -3355271 -2855533 -2232866 -1697817 -1228827 -754583 -449489 -290724 -87456 93334
10721 93334 -45208 -524093 -1185565 -1864162 -2453459 -3080626 -3835165 -4509769 -4777935 -4632925
10711 -4632925 -4516143 -4406101 -3959384 -3430365 -3147810 -3042352 -3062813 -3160488 -3173432 -2925514
10701 -2925514 -2292451 -1579103 -1328694 -1473752 -1421878 -889854 33457 959268 1622396 2052306
10691 2052306 2109738 1727917 1143088 635232 118673 -629073 -1407897 -2017470 -2497446 -2895680
10681 -2895680 -3182086 -3369765 -3480636 -3525306 -3604490 -3630713 -3153023 -2121197 -1132550 -662823
10671 -662823 -754952 -1121342 -1337233 -1310663 -1136780 -1010876 -971948 -806315 -404107 54511
10661 54511 262872 34930 -513507 -1028454 -1469469 -1901805 -2125962 -2062530 -1920370 -1851774
10651 -1851774 -1761214 -1700934 -1700812 -1537220 -1274670 -1020055 -671169 -391079 -445891 -634064
10641 -634064 -905718 -1338297 -1692238 -1853155 -1757130 -1403998 -920498 -548458 -363352 -123785
10631 -123785 286696 719277 910315 680116 -49058 -903227 -1494008 -1957279 -2540372 -3135053
10621 -3135053 -3446627 -3389045 -2875087 -2027285 -1199650 -612013 -326804 -271224 -271876 -322408
10611 -322408 -605503 -1084625 -1568601 -1933236 -2051167 -1854652 -1448403 -1067497 -771955 -514942
10601 -514942 -443777 -677985 -1011780 -1090163 -800492 -372596 -167320 -508684 -989687 -855435
10591 -855435 -362323 -60258 33029 150020 460046 870497 1167977 1236460 1117324 918778
10581 918778 703129 542526 638219 960779 1434745 2077196 2607490 2748657 2450222 1770907
10571 1770907 784971 -183796 -872687 -1229420 -1384362 -1558332 -1829844 -2305527 -2859056
10562 -2859056 -3190348 -3116932 -2792824 -2407812 -1932346 -1439711 -1145776 -1203934 -1422563 -1420612
10552 -1420612 -1132924 -573247 114707 720990 1052262 887671 143995 -922374 -1791476
10543 -1791476 -2068619 -2052000 -2135336 -2217809 -2153575 -1925039 -1598931 -1239859 -933294 -792398
10533 -792398 -880841 -904726 -704605 -347243 45746 371871 387906 -153990 -1112329 -2112793
10523 -2112793 -2813385 -3043540 -2751460 -2077518 -1554493 -1377519 -1292522 -1219250 -1324521 -1651377
10513 -1651377 -1870207 -1906703 -2021963 -2111104 -2060436 -2165264 -2512978 -2768643 -2639501 -2047419
10503 -2047419 -1262832 -792442 -700616 -938473 -1600673 -2352249 -2761079 -2859241 -2631524 -1961454
10493 -1961454 -1261924 -1021072 -1106508 -1124785 -1180111 -1428129 -1746345 -2111951 -2588454 -3054022
10483 -3054022 -3354703 -3467283 -3240819 -2699139 -2085756 -1590451 -1278276 -1291453 -1468156 -1575835
10473 -1575835 -1741671 -2190373 -2871416 -3340369 -3407830 -3501004 -3899081 -4292408 -4426533 -4347304
10463 -4347304 -4195638 -4044994 -3641837 -2956129 -2218031 -1535486 -1117607 -1037386 -1088249 -1053311
10453 -1053311 -568933 500260 1741572 2734415 3449758 3984499 4131318 3608757 2636733
10444 2636733 1859935 1581069 1469609 1398514 1634418 2130567 2493707 2329244 1709877 1090107
10434 1090107 684021 326371 -236527 -1050713 -1793379 -2240358 -2195689 -1782677 -1503607 -1396828
10424 -1396828 -1315462 -1550534 -2211736 -2807610 -2828840 -2380313 -1797045 -1320495 -1110002 -1000401
10414 -1000401 -690903 -161302 313082 541469 513074 434388 523886 519646 158591 -335468
10404 -335468 -610859 -416025 147010 700340 943392 788106 377262 -96503 -360403 -177700
10394 -177700 374200 1046608 1464317 1398057 1065853 751897 439592 208747 153600 9273
10384 9273 -436513 -1139258 -1730684 -1820980 -1615097 -1518008 -1581866 -1540843 -1280048 -980779 -803107
10373 -803107 -777592 -852825 -1059292 -1265174 -1347025 -1425229 -1455193 -1329114 -1012402 -546909
10363 -546909 -269324 -308196 -314658 -140467 80139 267361 402247 477014 507577 411486 108877
10352 108877 -194075 -456670 -778174 -1003929 -1032910 -896925 -752228 -676506 -456927 -116609
10342 -116609 21532 -57658 -185295 -285601 -278062 -192565 -162326 -73836 116136 156520 208011
10331 208011 420644 770496 1374061 2074549 2382862 2121983 1553570 1091596 852990 656966
10321 656966 499170 637161 964332 986904 542792 -278557 -1335019 -2542870 -3552333
10312 -3552333 -4074616 -4191247 -4149631 -3838500 -2992666 -1870972 -936974 -320207 68423
10303 68423 305587 398278 335187 258924 396785 585643 479327 287340 257751 199932 70961
10292 70961 18831 48508 81840 39959 -120470 -284577 -237159 -60674 188136 536483 863819
10281 863819 952699 651771 110872 -536214 -1091412 -1433374 -1892816 -2774189 -3820709 -4646801
10271 -4646801 -5168556 -5491944 -5718206 -5853839 -5919700 -6027463 -6030474 -5655832 -4916673 -3888171
10261 -3888171 -2782942 -1940621 -1485130 -1350303 -1366610 -1471053 -1760949 -2036860 -2072156 -1972234
10251 -1972234 -1926078 -2134436 -2467391 -2510241 -2279286 -2058444 -1811817 -1768386 -2229304 -2798296
10241 -2798296 -3067120 -3112847 -2995713 -2759694 -2652917 -2761328 -3038902 -3593848 -4372378 -5046550
10231 -5046550 -5312846 -5117729 -4697696 -4174786 -3557477 -3095666 -3082962 -3366962 -3585472 -3523816
10221 -3523816 -3123287 -2519185 -1743156 -863809 -76133 525153 967433 1386437 1765095
10212 1765095 1889844 1710965 1266709 697222 385798 287932 50891 -221930 -301152 -295065
10202 -295065 -301485 -228388 -197750 -415313 -889131 -1545637 -2225166 -2504390 -2268228 -2009042
10192 -2009042 -2000461 -2140668 -2318752 -2280532 -1643355 -622559 159480 355898 -148390 -1073134
10182 -1073134 -1845474 -2298194 -2395712 -2061190 -1505590 -1003224 -853176 -1197167 -1789589 -2298609
10172 -2298609 -2628861 -2854734 -3082471 -3497824 -4099678 -4627562 -4968212 -5287883 -5625292
10163 -5625292 -5654690 -5151574 -4436612 -3747904 -3118334 -2815391 -3030923 -3423079 -3762198 -3854410
10153 -3854410 -3465797 -2769766 -2114377 -1766567 -1343189 -542898 55089 121756 -142159 -623326
10143 -623326 -1144642 -1507722 -1657109 -1705332 -1869651 -2247407 -2734473 -3050844 -2890898 -2225838
10133 -2225838 -1349106 -498998 310304 903682 1091320 946035 672784 501644 369969
10124 369969 50129 -350762 -464632 -319368 -318459 -579043 -1128403 -1599850 -1503035 -866648
10114 -866648 134221 1092939 1515891 1294890 864564 851250 1353097 1789624 1638130 874138
10104 874138 -75556 -650754 -903644 -1207091 -1488492 -1397721 -939435 -589860 -609925 -791253
10094 -791253 -842749 -678772 -460361 -280791 -41542 244081 538594 714678 588309 114856
10084 114856 -300780 -212050 231842 470488 130580 -541312 -1157282 -1470556 -1578113 -1597186
10074 -1597186 -1389959 -962503 -314379 336953 578796 275187 -183458 -525064 -718412
10065 -718412 -593751 -130971 508591 1046121 1382052 1596459 1907225 2360124 2681992 2911529
10055 2911529 3332417 3964524 4353512 4244743 4017801 4006071 4111962 4185496 4128833 3965875
10045 3965875 3779632 3669795 3789910 4243426 5024301 6036996 7221840 8539223 9971878
10036 9971878 11542487 13211485 14986003 17018704 19553504 22576951 25916147 29594757
10028 29594757 33215309 35693018 36206485 35444843 34704968 34630168 35587992 37937946 41960777
10019 41960777 47945420 56229599 67093373 80604606 97341506 117968635 142621823
10012 142621823 170644823 199720050 225514326 244378431 257291062 268232915 278459363
10005 278459363 287902217 296071441 296941952 282832552 257700048 234037976 219817529
9998 219817529 216457783 220422907 224092466 220108194 204419549 178456500 149670966 124052536
9990 124052536 103644799 88396589 77508194 70707714 67662969 67115379 66994708 64748109
9982 64748109 59273504 52361033 46082855 41164891 37933531 36522750 36727301 38265303
9974 38265303 41034135 45023108 50518977 57725278 66769728 77534719 87930830 92328897
9966 92328897 86112458 72883599 59175742 47804363 39176933 33040080 28719039 25566732
9958 25566732 23243335 21390081 19757667 18396618 17284635 16169906 15073062 14329817
9950 14329817 13998182 13950221 14170058 14430308 14537036 14644623 15089256 16075466 17796663
9941 17796663 20346161 23939849 28922331 35697892 44370265 54411231 64263337 69920786
9933 69920786 67043281 57082738 45428993 35455501 28053910 22888660 19158000 16271683
9925 16271683 14055561 12461677 11421437 10805217 10376835 10198424 10376479 10809052 11435015
9916 11435015 12337972 13762947 15980572 18853028 22467412 27092140 32589597 38877549
9908 38877549 45771541 51859017 54203189 50900707 43516021 35053970 27224002 20807324
9900 20807324 15994974 12391815 9536230 7368255 5952062 4968051 4004745 2944147
9892 2944147 1996765 1596051 1712856 1922020 2094647 2168495 2023567 1609152 920928 83525
9882 83525 -618114 -1205345 -1771870 -1991055 -1839023 -1859700 -2040159 -2026744 -2029244 -2431013 -3098087
9871 -3098087 -3817607 -4659366 -5482376 -5987979 -5943961 -5227470 -4173039 -3329142 -2805397 -2424741
9861 -2424741 -1923562 -1237616 -578397 -144736 -257779 -1119675 -2465454 -3638466 -4292124
9852 -4292124 -4533092 -4487881 -4177807 -3544228 -2763753 -2144732 -1830541 -1687580 -1641384 -1880549
9842 -1880549 -2222141 -2168201 -1819685 -1586703 -1634042 -1890428 -2144822 -2145096 -1920146 -1504478
9832 -1504478 -1007346 -622651 -492183 -604190 -771679 -631786 -170597 107671 -217408 -1022716
9822 -1022716 -1719196 -1973195 -1854775 -1624905 -1537784 -1616511 -1704116 -1668501 -1521922 -1292843
9812 -1292843 -1055189 -781740 -408968 271598 1121252 1425382 909909 16915 -671052 -1030785
9802 -1030785 -1185327 -1082972 -708240 -236499 33882 -192765 -836339 -1422674 -1578798 -1282471
9792 -1282471 -913869 -920882 -1472239 -2407812 -3416438 -4370487 -5047124 -5195627 -4708958 -3893001
9782 -3893001 -3343258 -3127765 -3044336 -3137990 -3577389 -4021865 -3881322 -3194808 -2431589 -2114835
9772 -2114835 -2460639 -3027906 -3218690 -2852332 -2246366 -1845918 -1812896 -1760163 -1282054 -541765
9762 -541765 -124435 -205599 -92575 403731 811575 960160 1005177 1043431 914541 366528
9752 366528 -477854 -1317844 -2017347 -2320588 -1869927 -1057831 -504057 -302484 -357848 -496846
9742 -496846 -418072 -91575 144099 96524 -208994 -549057 -647679 -610477 -696265 -928621 -1259216
9731 -1259216 -1502844 -1431654 -1190378 -1191944 -1506230 -1925045 -2202630 -2205078 -1905876 -1311925
9721 -1311925 -430372 550172 1371123 1842211 1808048 1124862 -68409 -1236250 -1978436
9712 -1978436 -2394733 -2744527 -2982962 -3076149 -3186123 -3280234 -3257769 -3114188 -2619795 -1653737
9702 -1653737 -554168 259701 701377 982118 1246660 1463768 1409094 966641 350599 -317035
9692 -317035 -982547 -1594275 -2012822 -2042344 -1615333 -951580 -432301 -467300 -1106163 -1986249
9682 -1986249 -2848825 -3453496 -3462312 -2926350 -2184122 -1590581 -1279005 -1197760 -1330657 -1591716
9672 -1591716 -1716579 -1789053 -2233612 -2870600 -3055792 -2878099 -2866900 -2912454 -2739054 -2364689
9662 -2364689 -2007386 -1768131 -1576013 -1454573 -1414573 -1687559 -2220229 -2582438 -2666603 -2380616
9652 -2380616 -1742665 -1083313 -751721 -683066 -606547 -518252 -508076 -652037 -993041 -1717674
9642 -1717674 -2509040 -2790233 -2657327 -2422292 -2239003 -2155669 -2068694 -1795684 -1451907 -1231888
9632 -1231888 -992281 -740014 -791133 -1115688 -1479309 -1708823 -1764692 -1732741 -1704238 -1882100
9622 -1882100 -2332591 -2964593 -3724993 -4501285 -5015560 -5137997 -4853031 -4287982 -3866254 -3702715
9612 -3702715 -3708140 -3862069 -4063572 -4072178 -3817963 -3390978 -2941709 -2579418 -2419529 -2589041
9602 -2589041 -2896593 -2915708 -2398656 -1504323 -643533 -282214 -493499 -845314 -955172 -741062
9592 -741062 -343686 4823 149951 169746 192328 195953 136842 11438 -463143 -1360196 -2388815
9581 -2388815 -3162971 -3475757 -3433853 -3112161 -2588595 -2139379 -1942882 -2043424 -2490738 -3118054
9571 -3118054 -3740525 -4119637 -4192047 -4204955 -4446356 -4858219 -5046551 -4802307 -4377673 -3894346
9561 -3894346 -3235847 -2436308 -1889769 -1743321 -1645849 -1299453 -786584 -522075 -832665 -1383108
9551 -1383108 -1527754 -1400418 -1568486 -2123427 -2812487 -3423563 -3884905 -4207414 -4198588 -4070110
9541 -4070110 -4427537 -5267990 -5920309 -6002245 -5789993 -5664240 -5462343 -4761864 -3661340 -2454563
9531 -2454563 -1437217 -1106133 -1472858 -2029206 -2459377 -2716328 -2727134 -2578491 -2414479 -2020867
9521 -2020867 -1412101 -928606 -575186 -108961 618019 1401276 1947609 2083916 1784807 1230937
9511 1230937 784558 832429 1288079 1465762 955350 140497 -450436 -556432 -350438 -83190
9501 -83190 303504 582333 393075 -86534 -515564 -818330 -991849 -942696 -642510 -509175
9491 -509175 -900563 -1556534 -2075949 -2463601 -2816798 -2982289 -2886135 -2670579 -2480368 -2226041
9481 -2226041 -1693151 -1022160 -823047 -1484516 -2588855 -3282999 -3121610 -2446780 -2035989
9472 -2035989 -2118527 -2390694 -2702964 -2733572 -2231212 -1697005 -1749267 -2375877 -2993544 -3147025
9462 -3147025 -3033215 -2987692 -2909841 -2654347 -2217907 -1569036 -789124 -69817 296974 252530
9452 252530 61554 -134248 -422817 -721819 -807216 -647498 -459954 -415797 -445446 -287411
9442 -287411 223990 558179 129421 -645967 -1092397 -1069887 -644967 -70349 384261 563181
9432 563181 445391 87045 -376021 -743446 -865861 -779921 -642461 -562540 -684166 -1077373
9422 -1077373 -1559885 -1863402 -1853046 -1547205 -1157894 -813649 -530399 -503689 -811847 -1137745
9412 -1137745 -1175538 -898991 -497324 -194252 -177879 -632972 -1409758 -2172717 -2625952 -2810022
9402 -2810022 -2954689 -3033571 -2951999 -2652854 -2031914 -1077708 -178548 342350 597901 761677
9392 761677 874495 906416 943860 972825 771826 355052 -17694 -297567 -680532 -1360213
9382 -1360213 -2221250 -2689871 -2484078 -1991740 -1714463 -1789273 -1938302 -1722167 -1089450 -560090
9372 -560090 -541944 -846700 -1034759 -978683 -726740 -551355 -762222 -1026924 -969224 -784105
9362 -784105 -777723 -865084 -827853 -778219 -878518 -1285387 -2006042 -2676549 -3244498 -3916345 -4555560
9351 -4555560 -4833148 -4612600 -4309443 -4231111 -4201919 -4097559 -3965869 -3865834 -3698471 -3375148
9341 -3375148 -3086122 -3119907 -3454902 -3849583 -4020194 -3795885 -3296885 -2715291 -2186595 -1820650
9331 -1820650 -1598747 -1447220 -1402082 -1370647 -1249711 -1215457 -1496670 -1971003 -2208877 -2128647
9321 -2128647 -1894124 -1612059 -1575322 -1843188 -2261336 -2735260 -3242236 -3642656 -3767626 -3806913
9311 -3806913 -3980358 -4082265 -3865693 -3334836 -2528025 -1733697 -1133154 -710972 -507479 -496327
9301 -496327 -496382 -554707 -811898 -1170447 -1448889 -1454865 -1290553 -1288014 -1488954 -1781503 -1989663
9290 -1989663 -1983528 -1934693 -2120464 -2549060 -2905350 -2788714 -2119208 -1155563 -242536 452075
9280 452075 865857 1067962 1248396 1407793 1430552 1236680 937923 608117 249389 2902
9270 2902 85403 227342 -114228 -657217 -831705 -594718 -26123 824605 1590349 1716667
9260 1716667 801204 -564503 -1402184 -1550131 -1352304 -1182307 -1215037 -1212959 -830288 -177118
9250 -177118 288914 210581 -240615 -789279 -1491656 -2384170 -3184500 -3570117 -3443523 -3031900
9240 -3031900 -2613173 -2386875 -2507312 -2958161 -3210420 -2767988 -1797186 -766217 -125836
9231 -125836 -196967 -1028851 -1984785 -2345807 -2149186 -1836759 -1580477 -1184192 -560065 73369
9221 73369 448749 466540 368417 274648 37706 -387349 -1010949 -1458373 -1387252 -1017416 -703747
9210 -703747 -504156 -354135 -459580 -857934 -1292941 -1733564 -2258985 -2757466 -3033408 -2925255
9200 -2925255 -2370777 -1568226 -795760 -160687 248708 412601 554343 846158 1181221 1315114
9190 1315114 1075257 709893 529333 548140 524847 279724 -147257 -603966 -1001510 -1273660
9180 -1273660 -1246476 -948472 -738679 -827465 -1135156 -1443848 -1521763 -1467239 -1289372 -959518
9170 -959518 -578953 -188831 242291 603085 678970 528880 431613 568140 870201 1109858
9160 1109858 1146359 827209 -8234 -1102730 -1978042 -2270570 -1826891 -1062048 -510043 -370804
9150 -370804 -670297 -1140103 -1442337 -1630129 -1848772 -2059550 -2170028 -2229863 -2277932 -2003194
9140 -2003194 -1355348 -431446 537442 1153682 1374618 1463518 1460375 1251317 1091558 1042573
9130 1042573 992523 928465 935798 858891 342617 -595397 -1600168 -2192296 -2170785 -1949504
9120 -1949504 -2066554 -2535951 -2899557 -2809680 -2463252 -2084996 -1780905 -1700813 -1744620 -1697594
9110 -1697594 -1552550 -1455188 -1313876 -778145 273275 1420544 2085439 2150616 1754550 1166874
9100 1166874 613200 62028 -376795 -613358 -694599 -646327 -481696 -316367 -479330 -1044977
9090 -1044977 -1811595 -2608841 -3116500 -2898025 -2042503 -1017820 -131651 439652 655783
9081 655783 634504 523026 164835 -543175 -1283545 -1727381 -1975296 -2276883 -2563205 -2638980
9071 -2638980 -2665215 -2910811 -3208850 -3258376 -2978245 -2671185 -2627980 -2806934 -3119778 -3522515
9061 -3522515 -3901940 -4100368 -3861362 -3063275 -2121014 -1424643 -908004 -475554 -123856 215102
9051 215102 467064 468885 289669 247439 319002 272683 -36084 -605335 -1289696 -1812067 -1858489
9040 -1858489 -1496289 -1137186 -957725 -908551 -786710 -349244 363980 998342 1293751 1437657
9030 1437657 1614026 1730915 1601689 1233437 603437 -257664 -1188961 -1825537 -1893606 -1350631
9020 -1350631 -534526 -6046 257875 538586 889030 1259955 1518412 1453475 1184663 993313
9010 993313 866859 434409 -516495 -1486525 -1875858 -1772644 -1737946 -1996320 -2343661 -2497320
9000 -2497320 -2370097 -2106203 -1771875 -1325813 -1026263 -1102533 -1382641 -1664827 -2007412 -2466593
8990 -2466593 -2824591 -2667163 -2076776 -1518565 -1040787 -632269 -481422 -671180 -871127 -719415
8980 -719415 -467278 -605061 -1129581 -1557160 -1660967 -1736595 -2087798 -2558456 -3103994 -3623801
8970 -3623801 -3845971 -3620271 -2968938 -2117213 -1471151 -1284368 -1403478 -1669373 -1929451 -2073988
8960 -2073988 -2052199 -1866353 -1631672 -1612663 -1838287 -1907697 -1776654 -1761008 -1759907 -1706926 -1797139
8949 -1797139 -2012084 -2160181 -2341539 -2469724 -2328679 -2244330 -2411393 -2558478 -2580197 -2503093
8939 -2503093 -2357112 -2273477 -2480339 -3159558 -4083262 -4868547 -5398612 -5633826 -5365361 -4494767
8929 -4494767 -3454167 -2787811 -2622168 -2743814 -2860887 -2881052 -3007372 -3498734 -4031552 -4026427
8919 -4026427 -3670634 -3505563 -3587530 -3763029 -4035079 -4343256 -4576103 -4414932 -3653717 -2639183
8909 -2639183 -1762911 -1010570 -299862 305940 640417 666672 489948 15690 -823308 -1905691
8899 -1905691 -2901519 -3431119 -3582272 -3696807 -3955679 -4239272 -4387640 -4256126 -3780821 -3114146
8889 -3114146 -2292541 -1350273 -473648 185228 504264 534912 246726 -444562 -1147138 -1389511
8879 -1389511 -1167962 -792252 -589187 -695976 -983143 -1321145 -1684081 -2112732 -2588399 -3027047
8869 -3027047 -3322684 -3372338 -3033477 -2408659 -1724616 -975770 -282715 -65369 -459346 -1183696
8859 -1183696 -1961135 -2470491 -2436644 -2061601 -1641652 -1176275 -648260 -284136 -222362 -342954
8849 -342954 -428782 -173965 484318 1328806 2050002 2425923 2243278 1494836 555532 -228785
8839 -228785 -727607 -1044491 -1400038 -1708790 -1668170 -1278800 -660767 223992 1193564 1937387
8829 1937387 2214672 2235324 2345888 2699312 3318022 4015933 4489770 4504721 4218837 3711015
8819 3711015 2935692 2121066 1572634 1117493 753474 656172 554114 280000 -2876 -76397
8809 -76397 139808 414844 421042 208447 -181245 -1067204 -2382667 -3663903 -4416609 -4418717
8799 -4418717 -3997236 -3554160 -3040441 -2458349 -1884007 -1165013 -387500 190442 391400 273590
8789 273590 110230 -99075 -262641 63426 961139 1762441 1940398 1776399 1574232 1188093
8779 1188093 424493 -583671 -1336895 -1762586 -1978943 -1809143 -1245172 -473908 251100
8770 251100 765008 768992 117834 -790774 -1387094 -1379744 -872110 -318412 -83717 -122354 -351067
8759 -351067 -615857 -568002 -211257 126437 352126 642547 1034471 1436813 1877437 2319188
8749 2319188 2625842 2797532 3023378 3309774 3441758 3291245 2886499 2490290 2188715 1608554
8739 1608554 610809 -492303 -1466408 -2221517 -2708925 -2852171 -2757472 -2803011 -2993528 -2948334
8729 -2948334 -2620596 -2186510 -1866746 -1819368 -1941719 -1975912 -1739227 -1337669 -860188 -411137
8719 -411137 -56853 30500 -446386 -1238034 -1744275 -1800670 -1763191 -1882204 -2192286 -2584388
8709 -2584388 -2881793 -3003187 -2977359 -2674289 -2155221 -1567378 -939585 -294455 268109 695410
8699 695410 1077456 1329526 1331671 1288276 1388261 1444117 1162529 716680 416373 183751 48378
8688 48378 11292 -93466 -272277 -340249 -281275 -240857 -299125 -600098 -1180694 -1801996 -2284475
8677 -2284475 -2668247 -2996844 -3142998 -3054962 -3063528 -3386495 -3758286 -4008677 -4375217 -4851127
8667 -4851127 -5006715 -4739704 -4259847 -3804777 -3524204 -3141650 -2675729 -2483603 -2425409 -2126977
8657 -2126977 -1606670 -962829 -270373 306414 250009 -768124 -2140197 -3243950 -4045298
8648 -4045298 -4679328 -4992453 -4849932 -4492995 -4256685 -4287430 -4652343 -5176584 -5363189 -5023154
8638 -5023154 -4354487 -3558955 -2684281 -1941731 -1582745 -1507770 -1509771 -1514077 -1563544 -1804067 -2176204
8627 -2176204 -2258225 -2104583 -2001727 -2064241 -2180966 -2170984 -2136375 -2338379 -2728646 -3259912
8617 -3259912 -3725735 -3761655 -3308205 -2462510 -1419353 -664866 -359187 -239578 -81586 196413
8607 196413 463120 524084 397354 78378 -577312 -1409508 -1814414 -1416780 -545959 193376
8597 193376 554387 900479 1405199 1759455 1737708 1550864 1382613 1144028 786756 596934
8587 596934 730412 934016 1010683 867882 370366 -292370 -844676 -1073775 -901602 -581972
8577 -581972 -407628 -440505 -465113 -351908 -231932 -257880 -265363 -125342 21502 -76817 -467418
8566 -467418 -977295 -1473743 -1726761 -1643505 -1498893 -1642951 -2088250 -2520878 -2657099 -2537807
8556 -2537807 -2393404 -2225697 -1821186 -1188438 -523463 -55411 -27243 -313606 -586744 -897295
8546 -897295 -1270990 -1438094 -1336249 -1118007 -903432 -608007 -192589 261242 539028 472341
8536 472341 98827 -444503 -798940 -801462 -784371 -942528 -1181545 -1231856 -1022450 -888523
8526 -888523 -1039645 -1219655 -1067961 -967354 -1394310 -2017619 -2373060 -2504866 -2581099 -2629248
8516 -2629248 -2713621 -2851338 -2826168 -2590713 -2233002 -1869149 -1590764 -1165307 -392189 512170
8506 512170 1254486 1631766 1609458 1444739 1327256 1216381 1087720 1244823 1611263 1719806
8496 1719806 1455302 809558 -72817 -845579 -1330246 -1565685 -1482039 -1113846 -765830 -642553
8486 -642553 -557499 -106337 516968 872211 1164490 1531467 1762832 1790332 1527093 955955
8476 955955 368146 -290954 -1249940 -2263011 -2763978 -2713417 -2501768 -2487287 -2806812 -3243476
8466 -3243476 -3676290 -4001908 -3953550 -3644340 -3397223 -3397686 -3664613 -3851688 -3691668 -3241060
8456 -3241060 -2579078 -1998461 -1886159 -2229661 -2760886 -3395055 -4236056 -5189182 -6054209 -6544822
8446 -6544822 -6414828 -5598026 -4404484 -3361980 -2828002 -2785976 -2985623 -3142511 -3000809
8437 -3000809 -2475361 -1702717 -981454 -409735 147559 595835 944165 1234383 1363819 1326105
8427 1326105 1133328 786249 350043 32858 -223107 -222256 213613 825707 1491703 1923335
8417 1923335 1838536 1296562 703445 652119 970060 1145196 1124912 1049844 1122462 1412546
8407 1412546 1750711 1824935 1526985 1043152 334576 -572943 -1247743 -1465779 -1578227 -1823229
8397 -1823229 -2203778 -2855802 -3778084 -4611838 -4844623 -4444726 -3806167 -3283197 -2725382 -1976544
8387 -1976544 -1435228 -1355906 -1670125 -2122175 -2232792 -1860628 -1268952 -819179 -773484 -1143156
8377 -1143156 -1663411 -2196032 -2584398 -2712548 -2657094 -2511338 -2410497 -2415148 -2338818 -1936795
8367 -1936795 -1277475 -505065 133123 431678 497146 261187 -187029 -393925 -52514 717108
8357 717108 1349657 1493813 1306132 1075139 891854 740879 651507 734621 832319 400151
8347 400151 -598365 -1677883 -2271359 -2186207 -1819372 -1528781 -1261768 -1042126 -959604 -799506
8337 -799506 -325700 218286 539912 748421 782248 612988 493613 574714 589886 335508
8327 335508 90823 15846 52619 256894 672411 1253157 1796436 1899200 1359587 555520
8317 555520 105711 242551 745584 1276103 1544935 1381784 918663 478750 227394 164246
8307 164246 188956 300670 529284 809920 1132019 1283784 851318 -49795 -896227 -1538889
8297 -1538889 -1989534 -2180705 -2168649 -2033199 -1929693 -1947601 -1903893 -1688330 -1558775 -1809582
8287 -1809582 -2148213 -2178891 -1775510 -975870 -198272 270867 571720 772701 751956 465565
8277 465565 136150 169623 560753 1067811 1476629 1649234 1642267 1494894 1230442 829342
8267 829342 228095 -433948 -947315 -1165905 -1046204 -650082 -243737 -290444 -746470 -1094541
8257 -1094541 -1149928 -958687 -669792 -476564 -283230 -7663 229092 453884 678005 812710
8247 812710 652785 110415 -544457 -1172305 -1691596 -1839815 -1546501 -967265 -436225 -78323
8237 -78323 176630 229097 -47311 -461269 -536922 -256987 -26104 -133898 -453685 -802601
8227 -802601 -1111880 -1284704 -1328949 -1277934 -1175551 -853068 -134074 547983 1047503 1485818
8217 1485818 1631836 1477719 1315181 1307994 1417962 1309835 616523 -427168 -1177545 -1457198
8207 -1457198 -1575030 -1514001 -1278520 -1061333 -757638 -214044 408237 889086 1134337 1207149
8197 1207149 1157914 942522 489266 -368992 -1494748 -2160500 -1898691 -1210649 -809077 -707261
8187 -707261 -444935 124334 487629 342860 -81187 -385679 -337205 -223436 -122815 201742
8177 201742 821298 1588277 2227054 2629226 2931088 3095190 2963348 2776212 2751047 2575922
8167 2575922 2013038 1187581 275115 -585327 -1116457 -1172729 -851026 -335351 188247 581352
8157 581352 838421 1150986 1570573 1843282 1862830 1862716 2005648 2163872 2142893 2094673 2091148
8146 2091148 2070906 2218321 2503385 2507087 2124655 1980340 2445853 3076131 3365096 3296927
8136 3296927 3033312 2620948 2114389 1578573 936752 162868 -551609 -1072039 -1402465 -1604562
8126 -1604562 -1726712 -1910083 -2248808 -2687010 -3142934 -3346087 -3021925 -2476164 -2122674 -1875130
8116 -1875130 -1611993 -1407643 -1337348 -1482335 -1886747 -2253716 -2223678 -1926791 -1746000 -1657122
8106 -1657122 -1326284 -810021 -464828 -626555 -969523 -836652 -171410 717958 1493271 1963280
8096 1963280 2127545 2356703 2818157 3143345 3115413 2626994 1779461 794426 -187440 -864738
8086 -864738 -1173032 -1232272 -1215831 -1273228 -1488955 -1681726 -1634617 -1358896 -1060982 -723782
8076 -723782 -258163 223224 713711 1168955 1638559 1986788 2000027 1944368 2135348 2467153
8066 2467153 2544452 2327713 2208997 2327515 2348497 2073728 1702908 1432800 1032172 371481
8056 371481 -348805 -810049 -1043216 -1393972 -1719315 -1717226 -1355228 -866122 -486592 -249939
8046 -249939 -107760 -171170 -461048 -687741 -466479 -52996 253905 589265 1013498 1308214
8036 1308214 1246904 828757 24519 -1098105 -2087083 -2431730 -2149407 -1758866 -1509814 -1124971
8026 -1124971 -374810 478109 882933 520862 -315992 -961242 -1127563 -1049245 -787444 -405266
8016 -405266 -77964 136316 147701 124198 337711 668420 780481 446481 -214890 -987334
8006 -987334 -1819313 -2407082 -2624639 -2596180 -2310247 -2049962 -1972813 -1930057 -1848935 -1708441
7996 -1708441 -1546475 -1375156 -1366497 -1778491 -2470607 -2946046 -2821664 -2145098 -1263925 -505660
7986 -505660 78578 505028 560796 223132 -105875 -282410 -438571 -443553 -182766 334075
7976 334075 729097 548305 -68799 -621200 -765617 -581469 -294424 46026 500403 832665
7966 832665 693128 194386 -232322 -331096 -213236 -114940 -270635 -533133 -731531 -968671
7956 -968671 -1230256 -1492998 -1736106 -1838111 -1692870 -1323496 -1039206 -1175855 -1671537 -2132488
7946 -2132488 -2340946 -2414435 -2257708 -1827974 -1336116 -1125269 -1327221 -1440742 -1044469 -249810
7936 -249810 658363 1382533 1770107 1908543 1870096 1649242 1342583 1083819 829136 598840
7926 598840 436052 230121 -159011 -807167 -1540636 -1847486 -1346644 -166859 1151397
7917 1151397 2255118 3080241 3530621 3664472 3643368 3454861 2992500 2455717 2130746 1926182
7907 1926182 1508554 766643 -79611 -856837 -1509064 -2074754 -2438323 -2431806 -2176664 -1748967
7897 -1748967 -1072785 -425941 -252211 -667302 -1444718 -2114642 -2379732 -2214754 -1756375 -1279741
7887 -1279741 -1005592 -870122 -785668 -630192 -366451 -214374 -257941 -138558 291927 744207
7877 744207 813324 377845 -71990 -219530 -298569 -681740 -1183010 -1427747 -1445307 -1489474
7867 -1489474 -1697730 -1847359 -1582828 -959169 -282074 491103 1422375 2187223 2523330 2532195
7857 2532195 2194444 1518149 748422 251204 -83712 -709287 -1401508 -1524509 -1065196 -473262
7847 -473262 100829 637519 964363 882328 422299 -132669 -308190 159621 974851 1648982
7837 1648982 2047270 2354203 2588258 2600264 2379655 2087919 1882738 1848818 1926754 1975569
7827 1975569 1953719 1803804 1431805 972435 613275 314851 -55477 -274007 -137287 4461
7817 4461 -222086 -404603 -88518 489222 814468 761377 690638 774600 984485 1399672 1860445
7806 1860445 2097766 2146513 1906587 1478185 1088442 611873 78622 -174889 21629 624221
7796 624221 1178679 1239544 842168 169986 -547198 -909435 -759199 -305569 179517 569971
7786 569971 709120 368435 -361511 -1070691 -1418699 -1536756 -1569737 -1483236 -1038259 -251964
7776 -251964 430414 775195 879860 866534 832306 986729 1406080 2183568 3139144 3816273
7766 3816273 4107078 4105053 3797530 3357171 2841160 1964699 813749 -57457 -418921 -518974
7756 -518974 -581989 -595857 -483028 -280832 -65854 125429 427768 848781 1090262 966796
7746 966796 696091 376866 -214215 -905527 -1421506 -1800424 -2110194 -2325355 -2220788 -1587754
7736 -1587754 -453428 876466 1739628 1832445 1537246 1252102 984561 513629 -119422
7727 -119422 -409807 -247262 -174510 -373226 -347599 64282 527718 813492 901927 884205
7717 884205 821646 827525 1120050 1447153 1280415 722858 288914 39128 -402794 -1064961
7707 -1064961 -1657301 -1898613 -1705447 -1237621 -628008 1741 395189 388494 195401 6152
7697 6152 -145225 -137275 18981 135492 49787 -194752 -488642 -772760 -905379 -932884 -1075238
7686 -1075238 -1266225 -1275677 -1201265 -1213210 -1186042 -1189304 -1329870 -1534995 -1622218 -1266491 -378399
7675 -378399 660752 1385305 1577612 1373234 1118452 934361 785872 671309 699980 873588
7665 873588 1116315 1520123 2050851 2438552 2467393 2061204 1375803 804269 365778 -111755
7655 -111755 -652227 -1250736 -1706412 -1903387 -1901611 -1657354 -1147992 -686790 -729395 -1116532
7645 -1116532 -1396786 -1297731 -815849 -90789 661646 1185371 1427588 1484817 1267903 865595
7635 865595 373377 -215692 -916911 -1597645 -1995862 -2165292 -2261632 -2359425 -2376853 -2254841
7625 -2254841 -2081094 -1919500 -1942728 -2216013 -2540483 -2627847 -2461301 -2326602 -2368526 -2411238
7615 -2411238 -2227311 -1547537 -337064 1152991 2581863 3455652 3598440 3337134 2981111
7606 2981111 2730611 2679533 2709074 2765362 2882936 3046377 3261986 3469366 3586624 3569979
7596 3569979 3355765 2944075 2564210 2349678 2152386 1817847 1327845 1004307 1104851 1593933
7586 1593933 2185155 2591833 2542350 1952300 1248146 964705 983668 817510 350500 -40946
7576 -40946 -127922 57821 494114 1026681 1314384 1218148 1001586 785801 478516 147174
7566 147174 6249 202038 498961 605240 360391 -60764 -466248 -684964 -506393 -73598
7556 -73598 232571 201581 -6712 -90878 -4264 -38636 -221372 -208105 95573 452908 644809
7545 644809 686550 668621 576954 298411 78751 240248 767337 1401126 1910068 2475938
7535 2475938 3029287 3287035 3386830 3616110 3900973 3943505 3795450 3532754 3001695 2259228
7525 2259228 1568212 1146516 1085968 1337622 1778951 2146283 2213075 2091993 1932656 1748085
7515 1748085 1570977 1252291 798458 311974 -133310 -277062 -77915 232457 485063 566232
7505 566232 551673 469753 189513 -118111 -250474 -372314 -530437 -710299 -997192 -1290398
7495 -1290398 -1499304 -1751712 -1720070 -1041335 -8989 868341 1356582 1477744 1225481 632806
7485 632806 -142625 -657242 -708552 -508936 -408723 -258893 119343 545692 827581 872956
7475 872956 743154 638968 647988 540639 56503 -387445 -414998 -365742 -531893 -739962
7465 -739962 -892789 -994806 -863554 -584124 -570154 -809641 -911116 -740308 -540614 -588940
7455 -588940 -858458 -1076615 -1040077 -743102 -284049 329889 953043 1400992 1681974 1668018
7445 1668018 1302135 911634 724780 587134 517645 672183 1068715 1577260 1897545 1694409
7435 1694409 1053721 409110 48072 144511 392607 269673 -282307 -771336 -636549 -86097
7425 -86097 148149 -150837 -521287 -508355 -52518 677837 1273867 1165658 612928 96683
7415 96683 -431941 -1120804 -1987865 -2700722 -3099546 -3208836 -3089003 -2892138 -2680350 -2354197
7405 -2354197 -1952255 -1496213 -783015 270864 1255345 1724817 1773986 1610900 1367262 1068253
7395 1068253 610183 168311 -7642 76588 286091 586305 952290 1252686 1385709 1435919
7385 1435919 1721424 2336030 2820953 2688065 2116300 1632569 1481050 1568429 1812955 2154324
7375 2154324 2599310 2844284 2467820 1775619 1221912 862992 718623 866586 1215830 1454688
7365 1454688 1613383 1898049 2265225 2474587 2415121 2430884 2718457 3072084 3363912 3546911
7355 3546911 3563812 3425614 3151964 2884277 2839213 2898120 2958879 3209498 3582118 3666159
7345 3666159 3299332 2607672 1776545 1142341 736727 332899 -39446 -237166 -119303 234774
7335 234774 588410 817217 848175 573935 176343 506 27202 148314 351731 506763
7325 506763 631823 741961 837991 1027070 1216017 1313298 1507457 1797836 1785891 1371899
7315 1371899 1034393 1142973 1446665 1457603 1214774 954512 761596 747361 863797 766689
7305 766689 410792 180150 440152 1178651 2093441 2916778 3540277 3929496 4007194 3880009
7295 3880009 3715618 3442879 2946092 2418845 2091494 1983380 2122831 2568396 3101793 3404239
7285 3404239 3425946 3406746 3667042 4289786 4984158 5403167 5271611 4644079 4033122 3705390
7275 3705390 3488849 3425224 3392641 3187419 2924545 2874343 3144495 3478082 3460675 2986183
7265 2986183 2494886 2183638 1786949 1126324 414494 31405 -50087 -20573 138037 405969
7255 405969 826128 1379174 1970355 2689251 3372105 3679567 3579121 3227041 2834610 2452544
7245 2452544 2074308 1776984 1652357 1649724 1652047 1641433 1516270 1177451 739253 348398
7235 348398 -150634 -874145 -1497510 -1564854 -1120570 -545952 136054 1106094 2233738 3032779
7225 3032779 3217609 3001771 2773558 2618884 2375871 1831197 1040009 393041 42419 -105130
7215 -105130 13697 283075 343837 124369 -250440 -748576 -1365428 -1799611 -1829089 -1598856
7205 -1598856 -1264089 -887128 -392098 283087 792694 824399 613797 522455 332371 3867
7195 3867 -225762 -580251 -1024367 -1164814 -921588 -499619 -27433 451170 890408 1413569
7185 1413569 1973686 2244767 2150500 1812996 1270601 664971 310903 394433 664534 720113
7175 720113 495824 255991 155335 235207 406436 555661 707799 1150262 1804920 2459588
7165 2459588 3282398 4157579 4796871 5046504 5119088 5259959 5200202 4699658 3889377 2961633
7155 2961633 2308563 2168182 2202204 2161546 2155219 2234308 2130232 1696118 1131971 645412
7145 645412 412131 408268 349197 134849 -179750 -667082 -1205465 -1424036 -1013235 -353102
7135 -353102 17694 314682 805383 1236260 1345069 1163925 891219 617573 470900 455569
7125 455569 379499 -17707 -662029 -1215498 -1367361 -1058066 -518574 -80907 70264 120951
7115 120951 144567 169051 217586 212132 235266 422462 890414 1576448 2176982 2433154 2407212
7104 2407212 2130501 1567614 1007683 751299 758103 732067 763607 1294349 2135229 2606563
7094 2606563 2606450 2476790 2494541 2636374 2474181 1645051 431009 -486586 -645344 -113469
7084 -113469 715586 1383854 1649108 1712637 1717952 1624378 1747315 2134715 2519959 2782068
7074 2782068 2804493 2635957 2423575 2266912 2152169 2008914 1956322 2069470 2014714 1697208
7064 1697208 1344759 996721 516186 -59250 -597927 -1120872 -1787551 -2451031 -2867837 -2824858
7054 -2824858 -2350788 -1772173 -1304618 -1046450 -959954 -778227 -589117 -771419 -1271542 -1538801
7044 -1538801 -1273923 -952134 -846860 -845037 -770976 -465927 88438 543315 524537 73014
7034 73014 -439842 -771599 -724666 -251658 308973 430099 50181 -400207 -917290 -1529232
7024 -1529232 -1841510 -1714186 -1346024 -945911 -712794 -615139 -693150 -1103186 -1730430 -2473500
7014 -2473500 -3202086 -3597869 -3404903 -2596419 -1668738 -1132644 -1052246 -1226601 -1314179 -1296691
7004 -1296691 -1329814 -1274640 -952188 -464402 158410 904843 1503720 1763526 1600551 1133030
6994 1133030 667199 442987 710007 1381203 1969864 2309833 2648207 3076010 3128187 2637416
6984 2637416 2112168 1679227 1421759 1677047 2400551 2990296 3057609 2718374 2124804 1316678
6974 1316678 540381 12457 -272512 -391233 -441255 -426523 -238877 321378 1241776 2431635
6964 2431635 3532003 4024410 3738349 2932882 2044700 1472306 1282012 1264830 1351968 1561842
6954 1561842 2027222 2776810 3426388 3651522 3359156 2749425 2189088 1799218 1535483 1349273
6944 1349273 1224188 1140942 1036122 833239 563767 270475 -53126 -239510 -154476 132218
6934 132218 641986 1428978 2308880 2892443 2946330 2657715 2107499 1331913 492329 -304517
6924 -304517 -887163 -947312 -365967 617656 1586712 2101892 2157369 2081991 1980227 1831326
6914 1831326 1673791 1517644 1363032 1225034 1142853 1314583 1685173 1914430 1968609 2056689
6904 2056689 2208249 2108370 1583798 1064519 910409 916045 899992 961796 1226479 1631829
6894 1631829 1949451 2102476 2123840 1850366 1513423 1404042 1368245 1436862 1835509 2333034
6884 2333034 2488537 2153358 1475103 767846 386013 460624 835095 1264669 1521896 1507380
6874 1507380 1253892 899589 525044 26159 -477706 -794476 -859129 -744796 -687118 -964490
6864 -964490 -1486560 -1912718 -2067977 -1746259 -1024519 -242712 381000 820173 1288045 1910263
6854 1910263 2501477 2742303 2608199 2509665 2697297 2985417 3110155 3204446 3490203 3770829
6844 3770829 3749729 3399408 3126324 3197608 3497576 3909106 4190381 4077017 3585488 2953657
6834 2953657 2383914 2107921 2043564 1984878 2015439 2339258 2755177 3023156 3236002 3408326
6824 3408326 3379972 3231148 3041187 2721031 2464609 2481340 2504573 2290691 2045258 1787666
6814 1787666 1505749 1219875 906215 664715 558894 568696 780741 1201223 1629474 2000230
6804 2000230 2423707 2816328 3084429 3187719 3102760 2894016 2474246 1799061 1150014 706628
6794 706628 339498 56798 -128283 -448009 -922856 -1326664 -1611688 -1777015 -1732204 -1465039
6784 -1465039 -1014756 -337519 490422 1237345 1828175 2085508 1914678 1539387 1360118 1564358
6774 1564358 1826941 1703144 1200696 797645 751314 809297 861481 1109241 1440762 1640783
6764 1640783 1686538 1555366 1068242 327866 -333947 -698703 -800344 -798992 -674654 -467691
6754 -467691 -301861 -181211 224402 1275783 2560534 3399967 3493844 2950745 2266718 1843223
6744 1843223 1730105 1818973 2017954 2280352 2475535 2523863 2417414 2449576 2709841 2812270
6734 2812270 2496126 1908502 1444628 1194010 1119190 1123421 984713 701320 569173 658618
6724 658618 578136 190774 -293688 -735571 -989600 -946869 -832861 -795592 -620056 -269155
6714 -269155 234239 829009 1154092 1060572 698201 128187 -347784 -541220 -693414 -768727
6704 -768727 -519115 135541 866559 1320017 1705657 2072512 2164198 2042747 1971248 2070508
6694 2070508 2340902 3007652 3912197 4489285 4655792 4606615 4272329 3690228 3036699 2366994
6684 2366994 1707698 1188350 888572 672464 411766 -11662 -349161 -291603 -61050 18936
6674 18936 -95151 -317634 -391182 -81009 567262 1288321 1978563 2643398 2929850 2599002
6664 2599002 2020019 1655541 1658781 1752800 1619524 1296552 1157161 1307583 1509959 1591936
6654 1591936 1705990 2131927 2693346 2964485 2803797 2238423 1527975 1123599 1120081 1317849
6644 1317849 1671345 1906695 1814283 1796529 2004053 2076386 1895571 1534626 1003359 329991
6634 329991 -305034 -702260 -975717 -1219610 -1172270 -524441 460356 1396645 1919959 1881191
6624 1881191 1745152 1883300 2392283 3165887 4018616 4759031 5066468 4830966 4362606 3723207
6614 3723207 2918374 2417033 2392815 2600094 2699780 2696081 2838055 3036346 3102655 3029828 2715389
6603 2715389 2244305 1654590 1075756 740167 775381 1107329 1512573 2002042 2594997 3103490
6593 3103490 3339751 3433098 3425059 3285233 3036448 2589878 2197985 2016629 1895975 1948884
6583 1948884 2169621 2428605 2758364 3037370 3064355 2953933 2863330 2815861 2776450 2642957
6573 2642957 2284344 1706754 1216933 944293 827867 880604 1059286 1171242 1137703 795722
6563 795722 171309 -99014 251849 831072 1165114 1123901 989240 1081963 1307278 1310967
6553 1310967 936798 458817 274597 259600 74710 -392480 -1151180 -1874618 -2074593 -1585062
6543 -1585062 -730359 175524 931295 1221355 1102380 1146327 1522525 1997213 2322930 2472435
6533 2472435 2577739 2380826 1696849 863738 135141 -398341 -652585 -644133 -419072 -138943
6523 -138943 -24021 -67899 -73609 -104664 -306452 -499993 -445490 -122160 247572 586796 1032173
6512 1032173 1722904 2461587 2714626 2169184 1057259 -81280 -728501 -705926 -315443
6503 -315443 36060 188358 104643 -251830 -704695 -889024 -664310 -164337 541021 1354962
6493 1354962 2008897 2361406 2671519 3013806 3106317 2764900 2133394 1336242 687601 446690
6483 446690 546985 617215 358507 -17065 -365987 -670167 -816336 -801516 -653669 -507989
6473 -507989 -420525 -399755 -357940 -363060 -509308 -546509 -564767 -833727 -1237374 -1558696 -1507270
6462 -1507270 -768876 373274 1258485 1652005 1745392 1802346 2087891 2585750 2890004 2792838
6452 2792838 2438593 2173768 2144523 2123454 2106506 2172129 2260137 2358988 2566000 2754204 2655392
6441 2655392 2300771 1980028 1786311 1499842 1053293 640729 572923 981530 1565711 1988138
6431 1988138 2191193 2200652 2107159 2177462 2501815 2746748 2580924 2120328 1578795 1309207
6421 1309207 1664349 2387270 2872073 2783879 2295539 1586260 919144 645103 558119 357158
6411 357158 191432 209970 430624 749491 972648 1057531 919463 720090 608044 423609
6401 423609 239461 135048 65833 129077 491127 1114854 1838889 2392715 2698018 3006809
6391 3006809 3334916 3752971 4309070 4795286 5030218 5011903 4788756 4381140 3760575 2998876
6381 2998876 2318343 1786124 1283898 667796 -103996 -718240 -842698 -586930 -358184 -176931
6371 -176931 246239 915785 1627705 2177903 2616838 2859769 2644165 2095594 1468576 1069171
6361 1069171 1028267 1219801 1593107 2199422 2761170 2723519 2206693 1725848 1515207 1512295
6351 1512295 1436838 1147595 912593 1018178 1259156 1418964 1427330 1374058 1519254 1977539
6341 1977539 2434317 2493414 2332332 2270550 2252291 2125295 1944090 1869741 1839607 1767633 1598684
6330 1598684 1168691 417809 -479760 -1105771 -1331420 -1344826 -1144703 -697032 -369272 -364585
6320 -364585 -429175 -359639 -504828 -1242372 -2124103 -2366528 -1938570 -1327322 -968453 -1049483
6310 -1049483 -1407844 -1605257 -1402243 -1034799 -661956 -334774 -166194 -251598 -381035 -359120
6300 -359120 -459031 -840123 -1358749 -1792435 -2066770 -2215744 -2276985 -2204647 -1819719 -1161712
6290 -1161712 -451014 67192 230008 146656 80761 129643 173632 -57922 -640397 -1173423
6280 -1173423 -1161974 -715526 -348614 -206500 -440176 -918287 -1217988 -1270772 -1043765 -427693
6270 -427693 514035 1375559 1813005 1987850 2113763 2273312 2388531 2437337 2625412 2995006
6260 2995006 3221861 3027007 2585917 2324136 2256904 2289539 2375842 2382021 2129950 1701723
6250 1701723 1409176 1080037 712894 607684 789536 1073793 1177157 1045880 954911 1072269
6240 1072269 1352854 1687331 1926145 2093448 2394790 2839514 3280708 3599059 3798261 3978866
6230 3978866 4090190 3970410 3590560 3113209 2704528 2222655 1558151 879001 339767 94868
6220 94868 248335 582147 866574 1068241 1357866 1674430 1803580 1818873 1915984 2037994
6210 2037994 1755091 947200 16854 -535528 -490888 -115699 290457 544388 539378 287565
6200 287565 -29807 -183610 -10575 488689 1162948 1746741 2119252 2452499 2760081 2868680
6190 2868680 2689278 2144087 1438158 1130141 1458321 2098170 2502430 2467920 2244603 1932525
6180 1932525 1541937 1286140 1428832 1808658 2153128 2356789 2391923 2414470 2291183 1876041
6170 1876041 1247267 503357 -130852 -455216 -514294 -359205 89088 670280 1028488 1230796
6160 1230796 1423278 1650776 2091726 2748730 3287003 3624202 3898898 4246773 4684394 5082079
6150 5082079 5502109 5899017 5994197 5746229 5409075 5192982 5091814 4957140 4795146 4467791
6140 4467791 3676195 2659838 1843655 1344760 985878 724850 516488 366505 580053
6131 580053 1341895 2244057 2753736 2758723 2340541 1823519 1542481 1627076 1697703 1518734
6121 1518734 1404141 1372427 1357727 1415730 1579105 1807681 1991068 2080387 2137662 2261437
6111 2261437 2546627 2871500 3115280 3375238 3661225 3890657 3741665 3088185 2515888 2414806
6101 2414806 2410033 2079542 1371297 649611 48984 -747103 -1724276 -2392061 -2456314 -1994983
6091 -1994983 -1337351 -979771 -1112274 -1411706 -1693793 -1985681 -2015589 -1572876 -725946 373483
6081 373483 1354211 1877339 1939766 1913160 2063330 2245716 2511813 2934790 3373702 3564228
6071 3564228 3357632 2935681 2570767 2360966 2291902 2365979 2365971 2239849 2115233 2179996 2443940
6060 2443940 2523707 2144871 1554331 1069231 910238 1217297 1935151 2827234 3533973 3646924
6050 3646924 3192379 2751345 2577406 2610046 2737609 2880282 3117588 3449768 3489878 3048842
6040 3048842 2473035 2108962 1851530 1519707 1099340 594751 206573 -67177 -340673 -692654
6030 -692654 -1118944 -1432448 -1323091 -906543 -412117 223028 989074 1622539 1758112 1529623
6020 1529623 1526233 1961871 2482152 2708664 2706353 2815977 3113313 3464061 3640815 3695599
6010 3695599 3915310 4211302 4288327 4297185 4275743 3984084 3308124 2383388 1578097 1154525
6000 1154525 934083 574922 121663 -28289 219946 740914 1226092 1408190 1280868 770185
5990 770185 -41786 -770949 -1011373 -628838 -96861 145003 -22995 -514800 -970509 -1146396
5980 -1146396 -1249288 -1362128 -1333960 -1117475 -760510 -424194 -105894 214934 373412 267012
5970 267012 52174 -72179 146986 834081 1639296 2138771 2084408 1541445 915024 384393
5960 384393 -141227 -506372 -496341 -57103 625096 1155227 1318506 995369 367692 -38180
5950 -38180 -12926 200373 341463 307163 178478 64255 108703 339235 787367 1486750
5940 1486750 2225164 2691768 2898074 3042960 3142490 2884251 2216101 1583214 1325856 1349083
5930 1349083 1671129 2437977 3275901 3681036 3703988 3628774 3613585 3612112 3549415 3448118 3293184
5919 3293184 3209981 3249046 3209759 3030055 2837176 2703360 2646019 2571732 2443320 2176168
5909 2176168 1764038 1336978 1031440 1182353 1754635 2423598 3177078 3964356 4596334 5083379
5899 5083379 5407409 5169253 4219010 3054728 2158962 1487502 776050 54128 -452610
5890 -452610 -543659 -246494 104440 362314 509826 499416 435674 450736 658422 976868
5880 976868 1047394 812970 579945 445898 272398 279 -254517 -281083 -17711 236854
5870 236854 227043 -96105 -766597 -1458337 -1501342 -702278 547636 1633656 2082036 2001841
5860 2001841 1797966 1639803 1531229 1494006 1332143 893545 523700 309085 99605 -179122
5850 -179122 -437538 -599892 -686952 -657497 -576689 -394195 -188607 -188831 -363690 -606239 -926719
5839 -926719 -1147255 -1196986 -1170142 -1127802 -1223546 -1699240 -2466724 -2978218 -2672733 -1805159
5829 -1805159 -966781 -411150 -149926 -13239 80978 78015 67911 174319 407396 635435
5819 635435 740578 844878 1268101 1908420 2266600 2204920 2163875 2467649 2914772 3182751
5809 3182751 3149312 2824109 2331613 1887982 1553422 1215007 594938 -27672 -120030 371795
5799 371795 1201862 1854844 2050158 2069464 2312746 2802297 3313779 3733001 3967957 3852887
5789 3852887 3451133 3201702 3309800 3595777 3746420 3733572 3716581 3526831 3035534 2404816
5779 2404816 1913338 1833384 2215113 2949636 3710655 4076054 4167086 4234492 4194602 3953562
5769 3953562 3596438 3411495 3510860 3563432 3433988 3450516 3664208 3943287 4295748 4614666
5759 4614666 4653504 4248500 3490098 2671440 1991860 1582299 1492226 1751485 2190567 2609734
5749 2609734 3246358 4004762 4332358 4019936 3316191 2510249 1785319 1557138 1792437 2051704
5739 2051704 2100945 2041957 2103921 2116418 1982370 1831326 1654981 1522628 1518057 1537192 1416710
5728 1416710 1114421 797125 781746 1058764 1087575 757557 566052 756156 1108785 1339985
5718 1339985 1270323 995326 864841 895000 851821 995861 1500255 1988678 2342907 2595335
5708 2595335 2535604 2111309 1627745 1344210 1231359 1053517 723555 407742 265296 301976
5698 301976 536786 955878 1385601 1691694 1887515 1961766 1860021 1581764 1212014 680304
5688 680304 84519 -252716 -113521 551817 1275237 1438811 1005707 452088 231378 421784
5678 421784 916313 1427555 1635107 1384265 891563 604576 641386 708017 478390 123225
5668 123225 -111216 -173747 -195898 -246669 -175773 93865 515445 1019578 1396117 1618666
5658 1618666 1887568 2147046 2155618 1759792 1136763 777676 966070 1555010 2094980 2265033
5648 2265033 2069601 1509741 832731 457433 467879 806354 1135474 1304533 1267187 993183
5638 993183 684956 436100 43437 -730604 -1714277 -2496469 -2896622 -2765650 -2254763 -1614909
5628 -1614909 -1003104 -404563 279222 797384 959677 835742 566443 303483 327748 600698
5618 600698 711023 510801 63487 -472377 -718866 -457626 -397 507983 985963 1125654
5608 1125654 845012 346952 -264204 -1033852 -1873233 -2790174 -3753686 -4570002 -5084482 -5384596
5598 -5384596 -5706590 -5961287 -5800195 -5091320 -4138174 -3312253 -2862194 -2882104 -3058535 -3293923
5588 -3293923 -3727184 -4685945 -6450393 -8870736 -11676383 -14873115 -18581246 -22793357 -27344008
5579 -27344008 -31588402 -34027298 -33259926 -29564005 -24756736 -20296336 -16703306 -14136752
5571 -14136752 -12323312 -10777185 -9513721 -8927439 -8893289 -8733304 -8187999 -7679349 -7348829
5562 -7348829 -6978553 -6535928 -6030712 -5813589 -5989337 -6103006 -5995665 -5733152 -5334410 -5060921
5552 -5060921 -5004928 -4949834 -4943405 -5444039 -6534956 -7920503 -9512132 -11285209 -13338099
5543 -13338099 -15910670 -19239187 -23457837 -29007205 -36131329 -44457646 -53264401 -60567498
5535 -60567498 -62930442 -58318088 -49020651 -39372415 -31738536 -26029989 -21696964 -18731199
5527 -18731199 -16957935 -15937856 -15668084 -16282011 -17792107 -20035942 -23053107 -27266500
5519 -27266500 -33236580 -41309140 -51683305 -63290820 -72342236 -73034359 -63782737 -50352353
5511 -50352353 -38299456 -29138202 -22660927 -18223209 -14956915 -12347249 -10256436 -8585327
5503 -8585327 -7172137 -6130032 -5503087 -4984138 -4347247 -3691368 -3282656 -3167598 -3212091
5494 -3212091 -3232078 -3055596 -2686168 -2095299 -1264280 -423655 155294 351165 280513 442953
5484 442953 934276 1426630 1772547 1761340 1144714 85209 -948805 -1567501 -1706181 -1403001
5474 -1403001 -773445 -51889 562864 1089895 1527754 1684131 1507268 1242755 1190326 1265202
5464 1265202 1200171 1070373 1147440 1310616 1364807 1270521 988144 789812 870811 917107 761226
5453 761226 527812 429560 473358 365031 111440 182969 648208 1101450 1319994 1124848
5443 1124848 549247 -170803 -899697 -1342466 -1303868 -995176 -654755 -299477 178028 807842
5433 807842 1589655 2262727 2451665 2229096 1907828 1525338 1098713 899458 1076074 1331990
5423 1331990 1470557 1429999 1022006 233960 -648459 -1306375 -1699033 -2001494 -2335121 -2666831
5413 -2666831 -2819224 -2538789 -1895824 -1148192 -522937 -237417 -387482 -823385 -1286859 -1622289
5403 -1622289 -1880891 -2106271 -2272297 -2287795 -2006516 -1408140 -812605 -533139 -390536 -93503
5393 -93503 191314 79191 -532912 -1449562 -2231895 -2494679 -2268270 -1929013 -1720184 -1706181
5383 -1706181 -1860225 -1892266 -1734062 -1471172 -1331846 -1642332 -1940439 -1841581 -1457981 -922139
5373 -922139 -343745 168557 401524 242295 -81737 -453793 -939882 -1429087 -1687607 -1572619
5363 -1572619 -1260073 -1008300 -1000362 -1307783 -1897987 -2614160 -3169901 -3415821 -3245147 -2676673
5353 -2676673 -1898084 -1131590 -392754 433798 1094243 1393096 1553952 1859611 2205318 2384917
5343 2384917 2325256 1946533 1335839 558102 -222578 -576552 -277535 393460 875800 988123
5333 988123 850648 476945 -115977 -628323 -785860 -695622 -604134 -578654 -686874 -807759
5323 -807759 -798688 -749943 -639300 -415342 -262354 -276630 -348143 -455309 -604071 -728924 -844593
5312 -844593 -1084483 -1670145 -2387222 -2763064 -2788699 -2571132 -2148912 -1597583 -994803 -425973
5302 -425973 113369 633220 1058847 1234867 1177775 1171989 1180726 936758 372742 -522611 -1560264
5291 -1560264 -2282113 -2328276 -1760959 -944144 -143141 492427 974883 1372467 1420597 934008
5281 934008 446592 532186 886583 1016773 1056155 1173873 1169227 892325 385912 -132681
5271 -132681 -651673 -1388763 -2154178 -2587420 -2655394 -2488281 -2202582 -1731653 -1076837 -286374
5261 -286374 645171 1631533 2439614 2791818 2677826 2490637 2539626 2784196 2836900 2508755
5251 2508755 2215441 2195193 2097491 1720223 1268210 908296 623496 299795 -67320 -466233
5241 -466233 -704159 -619510 -345463 -82230 87717 138230 47190 -153838 -416218 -723496
5231 -723496 -941887 -1091106 -1099821 -889846 -712518 -745520 -811333 -1034712 -1650617 -2397278
5221 -2397278 -2819369 -2645602 -2077621 -1448296 -797194 -138532 474773 1086890 1642639 2045767
5211 2045767 2395642 2863498 3302643 3614390 3948337 4223223 4211483 3969115 3554385 2892870
5201 2892870 2101499 1401751 853614 212016 -678984 -1481099 -1730611 -1433464 -985322 -727118
5191 -727118 -803209 -995816 -804166 -332469 -181664 -521340 -905967 -852995 -411469 66253
5181 66253 451098 934581 1364929 1312187 998355 936422 1213832 1563523 1853710 1997668
5171 1997668 1788735 1087899 302858 -120368 -306729 -172124 324226 831594 1143583 1151783
5161 1151783 1035820 1024487 1118020 1414601 2024345 2672604 3022647 3018294 2754386 2341412
5151 2341412 1988570 1960967 2165037 2453742 2684978 2661646 2425364 2142357 1920904 1936267
5141 1936267 2331739 2773499 2703042 2280858 2023622 2092223 2435618 2962323 3367913 3347766
5131 3347766 2828627 2149478 1712455 1590400 1748381 2035237 2221859 2381224 2596111 2573721
5121 2573721 2055786 1381340 927158 550405 101901 -117800 110333 363262 336709 233066
5111 233066 54297 -265401 -470054 -246672 503218 1439648 2036903 2103383 1932104 1901302
5101 1901302 1947182 1797403 1350423 790433 398485 141971 -324647 -1026031 -1665465 -1772215
5091 -1772215 -1239151 -609672 -246630 -113597 18355 51895 -192456 -461900 -658778 -909350
5081 -909350 -1165575 -1138870 -617274 105014 639843 1056857 1524702 1881572 2145635 2267287
5071 2267287 1979936 1331629 678677 193028 -146053 -375759 -526065 -568238 -482875 -339070
5061 -339070 -141575 -98557 -352235 -676577 -832096 -852077 -1010223 -1294212 -1255804 -677602
5051 -677602 106068 805932 1222629 1275233 1315925 1517607 1693477 1667565 1383583 913809
5041 913809 471009 152802 -105273 -50519 501925 1335582 2164642 2822471 3172730 3153707
5031 3153707 2910759 2794247 2901456 3107014 3328366 3467004 3370398 3002573 2554512 2293880
5021 2293880 2167313 1989899 2018183 2536924 3272864 3661315 3419825 2841691 2215817 1402782
5011 1402782 178002 -1088432 -1855883 -2058062 -1792434 -1258812 -697074 -127470 354156
5002 354156 659415 696525 344655 -237227 -732366 -838664 -618748 -380001 -207765 69159
4992 69159 603343 1287317 1860297 2095256 1823227 1245835 825947 516934 196290 174530
$$ [...]
##END NTUPLES=NMR SPECTRUM
##END=
