##TITLE=dept_SR164_TFA CH-,CH3- -up, CH2- -down
 CDCl3, 2400 sc
 19.05.2023
##JCAMPDX= 6.0         $$ Bruker NMR JCAMP-DX V2.0
##DATA TYPE= NMR SPECTRUM
##DATA CLASS= NTUPLES
##ORIGIN= UXNMR, Bruker Analytische Messtechnik GmbH
##OWNER= root
$$ XWIN-NMR		Version 3.5
$$ Fri May 19 16:32:59 2023 Russian Standard Time (UT+4h)  she@DPX200
##.OBSERVE FREQUENCY= 50.327992884445
##.OBSERVE NUCLEUS= ^13C
##.ACQUISITION MODE= SIMULTANEOUS
##.ACQUISITION SCHEME= undefined
##.AVERAGES= 2401
##.DIGITISER RES= 17
##SPECTROMETER/DATA SYSTEM= spect
##.PULSE SEQUENCE= dept135
##.SOLVENT NAME= CDCl3
##.SHIFT REFERENCE= (INTERNAL, CDCl3, 0, 214.665)
##AUDIT TRAIL= $$ (NUMBER, WHEN, WHO, WHERE, WHAT)
$$ ##TITLE= Audit trail, XWIN-NMR		Version 3.5
$$ ##JCAMPDX= 5.01
$$ ##ORIGIN= Bruker BioSpin GmbH
$$ ##OWNER= she
$$ F:/spectra/data/she/nmr/depta/1/pdata/1/auditp.txt
$$ ##AUDIT TRAIL=  $$ (NUMBER, WHEN, WHO, WHERE, WHAT)
(   1,<2023-05-19 16:31:14.12 +0400>,<she>,<DPX200>,
      <created by zg, POWCHK disabled, PULCHK disabled
       terminated by command 'halt'
       configuration hash MD5:
       00 E9 B6 7A A2 85 ED C7 34 08 36 98 17 FE 4E 26
       data hash MD5: 16K
       BC E7 B4 F6 06 98 C1 ED 01 F5 53 EA 89 29 82 0D>)
(   2,<2023-05-19 16:31:18.03 +0400>,<she>,<DPX200>,
      <Start of raw data processing
       efp BC_mod = 2 LB = 3.5 FT_mod = 6 PKNL = 1 PHC0 = -3665.288 PHC1 = -1061.2 SI = 16K 
       data hash MD5: 16K
       AD 85 1E FE DF 65 49 99 19 76 13 34 C8 A4 DE F7>)
(   3,<2023-05-19 16:31:45.10 +0400>,<she>,<DPX200>,
      <pk PHC0 = -62.15345 PHC1 = 4.399993 
       data hash MD5: 16K
       D7 58 55 C6 EB 73 26 64 BE CD 96 38 CD A9 8C 15>)
(   4,<2023-05-19 16:32:10.59 +0400>,<she>,<DPX200>,
      <abs ABSG = 5 
       data hash MD5: 16K
       C9 75 BB EF BD 3D BA D5 3E 18 00 78 64 F1 9C 10>)
$$ ##END=
$$ 
$$ hash MD5
$$ 5E 89 B8 35 3C 57 54 6C 77 E8 52 8F CD 59 EB 7B
##$RELAX= 
##$RELAX= 
##$RELAX= 
##$RELAX= 
##$RELAX= 
##$RELAX= 
##$RELAX= 
##$RELAX= 
$$ Bruker specific parameters
$$ --------------------------
##$DU= <F:/spectra>
##$EXPNO= 1
##$NAME= <depta>
##$PROCNO= 1
##$TYPE= <nmr>
##$USER= <she>
##$AMP= (0..31)
100 100 100 100 100 100 100 100 100 100 100 100 100 100 100 100 100 100 
100 100 100 100 100 100 100 100 100 100 100 100 100 100 
##$AQSEQ= 0
##$AQ_mod= 1
##$AUNM= <au_zg>
##$AUTOPOS= <>
##$BF1= 50.322709
##$BF2= 200.13
##$BF3= 200.13
##$BF4= 200.13
##$BF5= 200.13
##$BF6= 200.13
##$BF7= 200.13
##$BF8= 200.13
##$BYTORDA= 1
##$CFDGTYP= 0
##$CFRGTYP= 5
##$CHEMSTR= <none>
##$CNST= (0..31)
1 1 145 1 1 1 1 1 1 1 1 1 1 1 1 1 1 1 1 1 1 1 1 1 1 1 1 1 1 1 1 1 
##$CPDPRG= <>
##$CPDPRG1= <waltz16>
##$CPDPRG2= <waltz16>
##$CPDPRG3= <>
##$CPDPRG4= <mlev>
##$CPDPRG5= <mlev>
##$CPDPRG6= <mlev>
##$CPDPRG7= <mlev>
##$CPDPRG8= <mlev>
##$CPDPRGB= <>
##$CPDPRGT= <>
##$D= (0..31)
0 2 0.003448276 0 0 0 0 0 0 0 0 0 2e-05 0 0 0 0 0 0 0 0 0 0 0 0 0 0 0 
0 0 0 0 
##$DATE= 1684492824
##$DBL= (0..7)
120 120 120 120 120 120 120 120 
##$DBP= (0..7)
$$ [...]
##$SUBNAM2= <"">
##$SUBNAM3= <"">
##$SUBNAM4= <"">
##$SUBNAM5= <"">
##$SUBNAM6= <"">
##$SUBNAM7= <"">
##$SUBNAM8= <"">
##$SUBNAM9= <"">
##$SW= 219.3118970423
##$SWIBOX= (0..15)
0 1 3 0 0 0 0 0 0 0 0 0 0 0 0 0 
##$SW_h= 11037.527593819
##$TD= 16384
##$TD0= 1
##$TE= 0
##$TE2= 300
##$TE3= 300
##$TEG= 300
##$TL= (0..7)
120 120 120 120 120 120 120 120 
##$TP= (0..7)
150 150 150 150 150 150 150 150 
##$TP07= 0
##$TPNAME0= <>
##$TPNAME1= <>
##$TPNAME2= <>
##$TPNAME3= <>
##$TPNAME4= <>
##$TPNAME5= <>
##$TPNAME6= <>
##$TPNAME7= <>
##$TPOAL= (0..7)
0.5 0.5 0.5 0.5 0.5 0.5 0.5 0.5 
##$TPOFFS= (0..7)
0 0 0 0 0 0 0 0 
##$TUNHIN= 0
##$TUNHOUT= 0
##$TUNXOUT= 0
##$USERA1= <user>
##$USERA2= <user>
##$USERA3= <user>
##$USERA4= <user>
##$USERA5= <user>
##$V9= 5
##$VALIST= <valist>
##$VCLIST= <CCCCCCCCCCCCCCC>
##$VD= 0
##$VDLIST= <DDDDDDDDDDDDDDD>
##$VPLIST= <PPPPPPPPPPPPPPP>
##$VTLIST= <TTTTTTTTTTTTTTT>
##$WBST= 1024
##$WBSW= 2
##$XGAIN= (0..3)
0 0 0 0 
##$XL= 0
##$YL= 0
##$YMAX_a= 5597115
##$YMIN_a= -3876125
##$ZGOPTNS= <>
##$ZL1= 120
##$ZL2= 120
##$ZL3= 120
##$ZL4= 120
##$ABSF1= 214.6655
##$ABSF2= -4.669434
##$ABSG= 5
##$ABSL= 3
##$ALPHA= 0
##$AQORDER= 0
##$ASSFAC= 0
##$ASSFACI= 0
##$ASSFACX= 0
##$ASSWID= 0
##$AUNMP= <proc_1d>
##$AZFE= 0.1
##$AZFW= 0.1
##$BCFW= 0
##$BC_mod= 2
##$BYTORDP= 0
##$COROFFS= 0
##$CY= -3
##$DATMOD= 1
##$DC= 0
##$DFILT= <>
##$DTYPP= 0
##$F1P= 0
##$F2P= 0
##$FCOR= 0.5
##$FTSIZE= 16384
##$FT_mod= 6
##$GAMMA= 0
##$GB= 0
##$INTBC= 1
##$INTSCL= 0
##$ISEN= 128
##$LB= 3.5
##$LEV0= 0
##$LPBIN= 0
##$MAXI= 10000
##$MC2= 0
##$MEAN= 0
##$ME_mod= 0
##$MI= 0.4000791
##$NCOEF= 0
##$NC_proc= -1
##$NLEV= 6
##$NOISF1= 120.0001
##$NOISF2= 80.00006
##$NSP= 0
##$NTH_PI= 0
##$NZP= 0
##$OFFSET= 214.6655
##$PC= 4
##$PHC0= -3727.442
##$PHC1= -1056.8
##$PH_mod= 1
##$PKNL= yes
##$PPARMOD= 0
##$PSCAL= 0
##$PSIGN= 0
##$REVERSE= no
##$SF= 50.3227091
##$SI= 16384
##$SIGF1= 140
##$SIGF2= 120
##$SINO= 80
##$SIOLD= 32768
##$SREGLST= <13C.CDCl3>
##$SSB= 0
##$STSI= 16384
##$STSR= 0
##$SW_p= 11037.527593819
##$SYMM= 0
##$S_DEV= 0
##$TDeff= 16384
##$TDoff= 0
##$TI= <>
##$TILT= no
##$TM1= 0
##$TM2= 0
##$TOPLEV= 0
##$USERP1= <user>
##$USERP2= <user>
##$USERP3= <user>
##$USERP4= <user>
##$USERP5= <user>
##$WDW= 1
##$XDIM= 16384
##$YMAX_p= 454122119
##$YMIN_p= -85525019
$$ End of Bruker specific parameters
$$ ---------------------------------
##NTUPLES= NMR SPECTRUM
##VAR_NAME=  FREQUENCY,     SPECTRUM/REAL,   SPECTRUM/IMAG
##SYMBOL=    X,             R,               I
##VAR_TYPE=  INDEPENDENT,   DEPENDENT,       DEPENDENT
##VAR_FORM=  AFFN,          ASDF,            ASDF
##VAR_DIM=   16384,         16384,           16384
##UNITS=     HZ,            ARBITRARY UNITS, ARBITRARY UNITS
##FACTOR=    0.67371834180669, 1,            1
##FIRST=     10802.5493505904, 0,            0
##LAST=      -234.978243228581, 0,           0
##MIN=       -234.978243228581, -85525019,   0
##MAX=       10802.5493505904, 454122119,    0
$$ Real data points
##PAGE= N=1
##DATA TABLE= (X++(R..R)), XYDATA
$$ [...]
$$ plain form
12665 502056 -230383 -301679 107439 735263 1098855 588081 -84211 61548 811550 1597160
12655 1597160 2609085 4331651 6476206 7779361 7619669 6288529 4285435 2223061
12647 2223061 651008 -344074 -1005021 -1284254 -1032633 -328321 257825 320607 -180377
12638 -180377 -985307 -1814484 -2449828 -2599705 -2317762 -1509779 -179753 911520 1163017
12629 1163017 741750 618019 1604096 3063897 4091615 4613676 4703809 4528009 4822105
12620 4822105 5455607 5407841 4440300 3341489 2427670 1621949 1235255 1329488 1727668 2450622
12610 2450622 3633883 5039750 5977419 5982347 5096267 3892603 3223419 3314382 3618934
12601 3618934 3740026 3902307 4331874 4676740 4433047 3780569 3480172 3986861 4876819
$$ packed form
12665E02056p32439p1296M09118O27824L63592n10774o72292J45759P50002P85610
12655A597160J011925J722566K144555J303155j59692j331140k003094k062374
12647B223061j572053r95082o60947k79233K51621P04312N86146O2782n00984
12638a80377q04930q29177o35344j49877K81943Q07983J330026J091273K51497
12629A163017m21267j23731R86077J459801J027718N22061R0133j75800K94096
12620D822105O33502m7766r67541j098811r13819q05721l86694R4233L98180P22954
12610B450622J183261J405867R37669M928q86080j203664o69184R0963L04552
12601C618934J21092J62281M29567L44866k43693o52478l00397N06689Q89958
$$ plain form
12592 4876819 5504713 5610750 5301785 4571196 3196615 1406983 -195386 -1080641 -1183881
12583 -1183881 -966742 -837172 -810130 -341430 683398 1808289 2765911 3700763 4972307
12574 4972307 6514480 8108720 9296918 9537474 8725229 7054035 4985030 3135272
12566 3135272 1491460 -20666 -1010379 -1544206 -2247408 -3232011 -3832776 -3570830 -2266029
12557 -2266029 -136799 1566532 2269579 2578894 2772423 2825157 2891142 3220909 3612612
12548 3612612 3778503 3616623 3080632 2117625 717552 -546816 -748386 135083 1088264
12539 1088264 1372113 1084859 143624 -1019245 -1678171 -1664663 -1143730 -632156 -481704
12530 -481704 -729406 -1198090 -1569591 -1554603 -1127128 -156986 1412916 2765302 2960004
$$ packed form
12592D876819O27894J06037l08965p30589j374581j789632j602369q85255j03240
12583a183881K17139J29570K7042M68700J024828J124891R57622R34852J271544
12574D972307J542173J594240J188198K40556q12245j671194k069005j849758
12566C135272j643812j512126r89713n33827p03202r84603o00765K61946J304801
12557b266029K129230J703331P03047L09315J93529N2734O5985L29767L91703
12548C612612J65891j61880n35991r63007j400073j264368k01570Q83469R53181
12539A088264K83849k87254r41235j162869o58926J3508N20933N11574J50452
12530d81704k47702m68684l71501J4988M27475R70142J569902J352386J94702
$$ plain form
12521 2960004 1756225 -134033 -1697767 -2252214 -1682185 -200967 1895954 3882963
12513 3882963 5145275 5489949 5166917 4696560 4337128 3986545 3471547 2666786 1752436
12504 1752436 1131385 685827 320792 153776 99544 -33584 -170300 -312221 -794795 -1472428
12494 -1472428 -2156544 -2667420 -2669987 -2391953 -2250461 -1919573 -1203142 -222556 1074421 2422875
12484 2422875 3583220 4391211 4296007 3239863 1601691 -56953 -921461 -699342 110861
12475 110861 776178 898248 414284 -338288 -788529 -727088 -479946 121052 1386380 2974398
12465 2974398 3897214 3824818 3044164 2021943 1244230 548877 -187999 -410370 -178456
12456 -178456 68456 469754 1156173 2147965 3433036 4367577 4432117 3673099 2482843
$$ packed form
12521B960004j203779j890258j563734n54447N70029J481218K096921J987009
12513C882963J262312L44674l23032m70357l59432l50583n14998q04761r14350
12504A752436o21051m45558l65035j67016n4232j33128j36716j41921m82574o77633
12494a472428o84116n10876k567K78034J41492L30888P16431R80586J296977J348454
12484B422875J160345Q07991r5204j056144j638172j658644q64508K22119Q10203
12475A10861O65317J22070m83964p52572m50241O1441K47142O00998J265328J588018
12465B974398R22816p2396p80654j022221p77713o95353p36876k22371K31914
12456a78456K46912M01298O86419R91792J285071R34541O4540p59018j190256
$$ plain form
12447 2482843 1554878 901627 30347 -731914 -577637 318644 1131730 1443863 1554891
12438 1554891 1770692 1633955 592119 -1065545 -2627227 -3357495 -2765232 -1285836 361127
12429 361127 2018157 3502554 4529148 4773444 4618915 4742081 5028299 5048016 4857213
12420 4857213 4490978 3922738 3476701 3444829 3941697 4868444 5827174 6423073 6756199 7011366
12410 7011366 7120454 7239156 7430552 7269588 6298297 4913374 3922514 3700690 3869016
12401 3869016 4059833 4200305 4074862 3468131 2763942 2354821 2341754 2792357 3358424 3878429
12391 3878429 4120807 3698128 2929265 2531932 2903230 3799437 4557090 4638615 4158376 3672271
12381 3672271 3493046 3526304 3364778 2932237 2876139 3842629 5478690 6579043 6350367
$$ packed form
12447B482843r27965o53251q71280p62261J54277Q96281Q13086L12133J11028
12438A554891K15801j36737j041836j657664j561682p30268N92263J479396J646963
12429C61127J657030J484397J026594K44296j54529J23166K86218J9717j90803
12420D857213l66235n68240m46037l1872M96868R26747R58730N95899L33126K55167
12410G011366J09088J18702J91396j60964r71291j384923r90860k21824J68326
12401C869016J90817J40472j25443o06731p04189m09121j3067M50603N66067N20005
12391C878429K42378m22679p68863l97333L71298Q96207P57653Q1525m80239m86105
12381C672271j79225L3258j61526m32541n6098R66490J636061J100353k28676
$$ plain form
12372 6350367 4912704 2873151 1285112 803422 1069821 1617908 2505984 3549987 4336051
12363 4336051 4887846 5594213 6606226 7561530 8293589 8623914 8232152 7368166 6723760
12354 6723760 6452034 5923872 4931708 4157941 4129313 4299258 4113452 4117896 4779080 5484359
12344 5484359 5663225 5950066 6802222 7852262 9146084 10447642 11285417 11672680 11412852
12335 11412852 10732646 10270686 9832805 8688853 7150176 6005331 5450176 5415187 5740999
12326 5740999 6054556 6073525 5749698 4866702 3201107 1362395 -97594 -1445586 -2476211
12317 -2476211 -2690214 -2229331 -1747045 -1667691 -1767445 -1939987 -2081067 -1841915 -1291460 -692302
12307 -692302 437587 2182887 3835742 4963896 5477863 5375900 4518432 3042305 1577613
$$ packed form
12372F350367j437663k039553j588039m81690K66399N48087Q88076J044003P86064
12363D336051N51795P06367J012013R55304P32059L30325l91762q63986o44406
12354F723760k71726n28162r92164p73767k8628J69945j85806M444O61184P05279
12344E484359J78866K86841Q52156J050040J293822J301558Q37775L87263k59828
12335A1412852o80206m61960m37881j143952j538677j144845n55155l4989L25812
12326E740999L13557J8969l23827q82996j665595j838712j459989j347992j030625
12317b476211k14003M60883M82286P9354r9754j72542j41080K39152N50455N99158
12307f92302J129889J745300J652855J128154N13967j01963q57468j476127j464692
$$ plain form
12298 1577613 630838 9231 -729385 -1347672 -1470358 -957595 -168212 243590 333306 187699
12288 187699 141294 936329 2219325 3013568 3225120 3521726 3919548 3678877 3061736 2536585
12278 2536585 1851136 606926 -641825 -782873 -33058 534711 636465 582142 652491
12269 652491 649544 -1821 -1421452 -2999867 -3911954 -3972535 -3357727 -2158502 -1003374
12260 -1003374 -453881 -626218 -1083754 -1064923 -378315 536352 1236294 1401089 1342783 1742752
12250 1742752 2431744 2817941 2960528 3311939 3992136 4428418 4557989 4707381 4534785
12241 4534785 3781962 2678125 1213740 -411857 -1385710 -1642821 -2006608 -2705013 -3120464
12232 -3120464 -3154867 -3231258 -3109802 -2447686 -1781237 -1585571 -1366484 -750238 -452620 -819869
$$ packed form
12298A577613r46775o21607p38616o18287j22686N12763P89383M11802Q9716j45607
12288A87699m6405P95035J282996P94243K11552K96606L97822k40671o17141n25151
12278B536585o85449j244210j248751j41048P49815N67769J01754n4323P0349
12269F52491k947o51365j419631j578415r12087o0581O14808J199225J155128
12260a003374N49493j72337m57536J8831O86608R14667O99942J64795n8306L99969
12250A742752O88992L86197J42587L51411O80197M36282J29571J49392j72596
12241D534785p52823j103837j464385j625597r73853k57111l63787o98405m15451
12232c120464l4403p6391J21456O62116O66449J95666K19087O16246K97618l67249
$$ plain form
12222 -819869 -1515851 -1805386 -1349392 -472925 522052 1236021 1618464 1598388 1160868 512242
12212 512242 96156 310723 983758 1647708 1586064 575245 -836397 -2080258 -3098541
12203 -3098541 -3865186 -3934632 -3070135 -1522290 124339 972566 744980 108538 -434633
12194 -434633 -705785 -707921 -357284 469079 1909219 3482580 4491889 4646556 3837355
12185 3837355 2637718 1648969 693650 -353087 -871221 -616743 -113714 585794 1568211
12176 1568211 2507223 3108675 3151024 2616956 1729615 615138 -614551 -1276240 -977309
12167 -977309 -456834 -317474 -278543 -363032 -798064 -1494406 -1968550 -1949310 -1694539 -1416263
12157 -1416263 -1468879 -2451471 -3826004 -4335648 -3521511 -1633925 367244 1285331 1049209
$$ packed form
12222h19869o95982k89535M55994Q76467R94977P13969L82443k0076m37520o48626
12212E12242m16086K14567O73035O63950o1644j010819j411642j243861j018283
12203c098541p66645o9446Q64497J547845J646629Q48227k27586o36442n43171
12194d34633k71152k136L50637Q26363J440140J573361J009309J54667q09201
12185C837355j199637r88749r55319j046737n18134K54478N03029O99508R82417
12176A568211R39012O01452M2349n34068q87341j114477j229689o61689K98931
12167i77309N20475J39360L8931q4489m35032o96342m74144J9240K54771K78276
12157a416263n2616r82592j374533n09644Q14137J887586K001169R18087k36122
$$ plain form
12148 1049209 444942 -79298 -569956 -813462 -777189 -799087 -1008329 -1015586 -337357 936200
12138 936200 2260837 2709334 1994609 930485 102289 -569299 -1481342 -2685776 -3916165
12129 -3916165 -4754726 -5138432 -5209269 -4874874 -4255926 -3705968 -3615190 -4006884 -4552536 -4881489
12119 -4881489 -4742268 -3974570 -2945312 -2168405 -1680845 -1166932 -300242 755109 1603027
12110 1603027 1942752 1923044 1884345 1825805 1479110 660540 -225323 -671614 -898879 -1117951
12100 -1117951 -1082308 -928514 -982943 -922307 -302686 693853 1775620 2725229 2875019 2073023
12090 2073023 886100 -461428 -1812527 -2484434 -2103724 -1400976 -1259736 -1477771 -1563856
12081 -1563856 -1881650 -2798023 -3767644 -3944913 -3737200 -3727037 -3729621 -3265672 -2384256 -1533383
$$ packed form
12148A049209o04267n24240m90658k43506L6273k1898k09242p257O78229J273557
12138I36200J324637M48497p14725j064124q28196o71588r12043j204434j230389
12129c916165q38561l83706p0837L34395O18948N49958R0778l91694n45652l28953
12119d881489J39221P67698J029258P76907M87560N13913Q66690J055351Q47918
12110A603027L39725j9708l8699n8540l46695q18570q85863m46291k27265k19072
12100a117951L5643J53794n4429O0636O19621R96539J081767R49609J49790q01996
12090B073023j186923j347528j351099o71907L80710P02748J41240k18035q6085
12081a563856l17794r16373r69621j77269K07713J0163k584M63949Q81416Q50873
$$ plain form
12071 -1533383 -812038 -39033 842954 1556650 2114687 2876065 3864930 4647977 4680438 3594307
12061 3594307 1760707 605683 1008981 2479689 4024248 4739525 4398760 3453488 2538474
12052 2538474 2209307 2738048 3839590 4754030 4724419 3654135 2472518 2072323 2372683
12043 2372683 2887352 3621391 4771553 5705079 5486497 3847243 1774289 325162 -318345
12034 -318345 -14426 1297189 2950353 4197647 4870469 5066978 5231319 5342746 5147490
12025 5147490 4877081 4618899 4220236 3621970 2932951 2372649 1826289 1431432 1647133
12016 1647133 2224480 2718038 3190626 4047085 5339743 6850824 8195815 9100494 9685294
12007 9685294 9831845 9620561 9547836 9678365 9363230 8230813 6616512 4768494 3062098
$$ packed form
12071a533383P21345P73005Q81987P13696N58037P61378R88865P83047L2461j086131
12061C594307j833600j155024M03298J470708J544559P15277l40765r45272r15014
12052B538474l29167N28741J101542R14440k9611j070284j181617m00195L00360
12043B372683N14669P34039J150162R33526k18582j639254k072954j449127o43507
12034c18345L03919J311615J653164J247294O72822J96509J64341J11427j95256
12025E147490k70409k58182l98663n98266o89019n60302n46360l94857K15701
12016A647133N77347M93558M72588Q56459J292658J511081J344991R04679N84800
12007I685294J46551k11284p2725J30529l15135j132417j614301j848018j706396
$$ plain form
11998 3062098 1875278 1217071 1382217 2100397 2781534 2969814 2585348 1886616 1121368
11989 1121368 395878 -92229 -75512 359240 870150 1205051 1227750 874656 446342 292889
11979 292889 336136 258941 -332462 -1288947 -2228969 -3231695 -4081008 -4851761 -5960329 -7061183
11969 -7061183 -7699256 -7856082 -7374381 -6258219 -4692523 -3020531 -1533815 -166647 1168295
11960 1168295 2035464 1884605 1101869 495066 143505 135311 457562 986928 1821203 2966731
11950 2966731 3913687 4162825 4101139 4238247 4435532 4380000 3871825 3030218 2223374 1665982
11940 1665982 1288514 1225307 1724665 2086668 1430629 231800 -669552 -962241 -302397
11931 -302397 1362635 3165123 4435369 4820520 4123869 2725549 983563 -408763 -695905
$$ packed form
11998C062098j186820o58207J65146P18180O81137J88280l84466o98732p65248
11989A121368p25490m88107J6717M34752N10910L34901K2699l53094m28314j53453
11979B92889M3247p7195n91403r56485r40022j002726q49313p70753j108568j100854
11969g061183o38073j56826M81701J116162J565696J671992J486716J367168J334942
11960A168295Q67169j50859p82736o06803l51561q194L22251N29366Q34275J145528
11950B966731R46956K49138o1686J37108J97285n5532n08175q41607q06844n57392
11940A665982l77468o3207M99358L62003o56039j198829r01352k92689O59844
11931c02397J665032J802488J270246L85151o96651j398320j741986j392326k87142
$$ plain form
11922 -695905 -195288 209516 279794 13041 -709956 -1644194 -2171602 -1983245 -977843 572065
11912 572065 1954068 2710270 2646393 2062739 1224922 607046 635428 864691 961300 949213
11902 949213 821615 665752 501545 158193 -47935 368844 1138197 1626534 1457828 718454
11892 718454 197132 372703 572046 50337 -1070409 -2269815 -3152715 -3635809 -3550103
11883 -3550103 -2795585 -1665809 -469441 683477 1411974 1231415 377751 -356583 -454333
11874 -454333 132274 1024827 1348210 570460 -594704 -1272425 -1279840 -780771 -420206 -542072
11864 -542072 -691515 -459895 194140 1072262 1918213 2703395 3365380 3965819 4569941 4893589
11854 4893589 4865579 4563487 4006298 3184503 2162063 1115250 365830 152100 215783
$$ packed form
11922f95905N00617M04804P0278k66753p22997r34238n27408J88357J005402J549908
11912E72065J382003P56202o3877n83654q37817o17876K8382K29263R6609j2087
11902I49213j27598j55863j64207l43352k06128M16779P69353M88337j68706p39374
11892G18454n21322J75571J99343n21709j120746j199406q82900m83094Q5706
11883c550103P54518J129776J196368J152918P28497j80559q53664p34334r7750
11874d54333N86607Q92553L23383p77750j165164o77721p415M99069L60565j21866
11864e42072j49443K31620O54035Q78122Q45951P85182O61985O00439O04122L23648
11854D893589k8010l02092n57189q21795j022440j046813p49420k13730O3683
$$ plain form
11845 215783 206351 266946 402280 240137 -397388 -1472414 -2562330 -3152951 -3078331 -2721088
11835 -2721088 -2620951 -2854998 -3221625 -3702077 -4574949 -5760150 -6391859 -6141626 -5303649
11826 -5303649 -4093449 -3001162 -2608394 -2962379 -3604819 -4314957 -4892054 -5034532 -4631420
11817 -4631420 -3921130 -3390157 -3092128 -2746396 -2156365 -1428297 -989263 -958336 -918924 -691523
11807 -691523 -236190 413364 934188 995732 760205 982621 1871621 2790873 2990214 2467427
11797 2467427 1824226 1274836 723795 215474 116749 311152 172021 -397286 -838735 -812746
11787 -812746 -238727 829046 1931026 2613168 2365254 1107038 -283367 -849200 -636748
11778 -636748 -136302 105930 118042 204366 80833 -270903 -173861 782228 2287979 3416292
$$ packed form
11845B15783r432O0595J35334j62143o37525j075026j089916n90621P4620L57243
11835b721088J00137k34047l66627m80452q72872j185201o31709K50233Q37977
11826e303649J210200J092287L92768l53985o42440p10138n77097j42478M03112
11817d631420P10290N30973K98029L45732N90031P28068M39034L0927L9412K27401
11807f91523M55333O49554N20824O1544k35527K22416Q89000R19252J99341n22787
11797B467427o43201n49390n51041n08321r8725J94403j39131n69307m41449K5989
11787h12746N74019J067773J101980O82142k47914j258216j390405n65833K12452
11778f36748N00446K42232J2112Q6324j23533l51736R7042R56089J505751J128313
$$ plain form
11768 3416292 3539191 2935449 1911663 969767 460095 181081 289342 1039161 2085982
11759 2085982 2824889 2962608 2429746 1276224 -116429 -1474311 -2711807 -3513810 -3709476
11750 -3709476 -3677149 -3152469 -1874833 -534008 326607 703103 836459 1048801 1524909
11741 1524909 2033294 1881471 705738 -1078045 -2797091 -4033776 -4625736 -4429657 -3937076
11732 -3937076 -3646529 -3078179 -2224060 -1786520 -1825238 -1550582 -978565 -1251862 -2342517
11723 -2342517 -3509868 -4811560 -6061774 -6936575 -7245783 -6651527 -5546404 -4707629 -4774822
11714 -4774822 -5515071 -6125707 -6351232 -5973062 -5059702 -4266143 -3667099 -2749705 -1398964
11705 -1398964 -326689 -572059 -1877881 -3067437 -3674540 -3867213 -3912130 -3636995 -2983962
$$ packed form
11768C416292J22899o03742j023786r41896n09672k79014J08261P49819J046821
11759B085982P38907J37719n32862j153522j392653j357882j237496q02003j95666
11750c709476L2327N24680J277636J340825Q60615L76496J33356K12342M76108
11741A524909N08385j51823j175733j783783j719046j236685n91960J96079M92581
11732c937076K90547N68350Q54119M37540l8718K74656N72017k73297j090655
11723b342517j167351j301692j250214q74801l09208N94256J105123Q38775o7193
11714d774822p40249o10636k25525L78170R13360P93559N99044R17394J350741
11705a398964J072275k45370j305822j189556o07103j92673m4917K75135O53033
$$ plain form
11696 -2983962 -2090863 -1185248 -930265 -1205066 -938090 -170108 487416 994816 1118552
11687 1118552 930794 1201161 2177383 3000664 2971080 2328168 2141343 2670973 3115576 3241675
11677 3241675 3328738 3694173 4246295 4313299 3395990 1620892 -422095 -2240332 -3215691
11668 -3215691 -2888490 -1591235 -260350 507596 1123568 1977218 2643881 2964222 3282593
11659 3282593 3618109 3837209 3944851 4066962 4208858 4051807 3476739 3320241 3703350
11650 3703350 3608831 2786966 1918490 1428559 1444256 1587408 1319546 606818 -415215 -1594476
11640 -1594476 -2513807 -2639372 -2055403 -1507307 -1241479 -649577 710241 2456950 3749330
11631 3749330 4103501 3509092 2169279 434170 -1174357 -2446113 -3340391 -3669534 -3417188
$$ packed form
11696b983962Q93099R05615K54983k74801K66976P67982O57524N07400J23736
11687A118552j87758K70367R76222Q23281k9584o42912j86825N29630M44603J26099
11677C241675Q7063L65435N52122O7004r17309j775098k042987j818237r75359
11668c215691L27201J297255J330885P67946O15972Q53650O66663L20341L18371
11659C282593L35516K19100J07642J22111J41896j57051n75068j56498L83109
11650C703350r4519q21865q68476m89931J5697J43152k67862p12728j022033j179261
11640a594476r19331j25565N83969N48096K65828N91902J359818J746709J292380
11631C749330L54171n94409j339813j735109j608527j271756q94278l29143K52346
$$ plain form
11622 -3417188 -2458774 -1073558 80097 714019 765564 317257 -266552 -704858 -893760
11613 -893760 -712062 -309155 -462351 -1641080 -3348276 -4875434 -5691203 -5582565 -4753629
11604 -4753629 -3491920 -1894992 -177479 1452765 2761515 3791061 4937465 6061831
11596 6061831 6539938 6040983 4608398 2587132 518583 -1236700 -2480435 -3208977 -3631361
11587 -3631361 -3957984 -4414990 -5060075 -5689705 -5924326 -5662800 -5098557 -4659041 -4545609
11578 -4545609 -4289669 -3752971 -3294304 -3131296 -3207094 -3350854 -3073569 -2014344 -1282427
11569 -1282427 -1721355 -2360423 -2172706 -1190844 -113976 642467 1049320 1035062 668408
11560 668408 175312 -290518 -838515 -1285635 -1568094 -1844077 -2410691 -3173238 -3431824 -2911628
$$ packed form
11622c417188R58414J385216J153655O33922N1545m48307n83809m38306j88902
11613h93760J81698M02907j53196j178729j707196j527158q15769J08638Q28936
11604d753629J261709J596928J717513J630244J308750J029546J146404J124366
11596F061831M78107m98955j432585k021266k068549j755283j243735p28542m22384
11587c631361l26623m57006o45085o29630k34621K61526N64243M39516J13432
11578d545609K55940N36698M58667J63008p5798j43760K77285J059225P31917
11569a282427m38928o39068J87717R81862J076868P56443M06853j4258l66654
11560F68408m93096m65830n47997m47120k82459k75983n66614p62547k58586N20196
$$ plain form
11550 -2911628 -2052417 -1425819 -1369228 -2088334 -3365143 -4162179 -3379130 -1397261 372815
11541 372815 998228 637158 -136606 -713585 -473204 498986 1530771 2215806 2206749 1575132
11531 1575132 898065 366239 -83302 -540139 -459960 492035 1517984 1818058 1614533
11522 1614533 1560720 1659288 1296521 639862 392357 352228 250718 67998 75826 712790
11512 712790 1818157 3033346 3926526 4406696 4822958 4919373 4471339 3943687 3528070
11503 3528070 2592160 887329 -802070 -1677130 -1813438 -1469069 -710576 235063 772968
11494 772968 566721 -22987 -657929 -1477707 -2317229 -2699232 -2679838 -2483426 -2218445 -1958678
11484 -1958678 -1481980 -881615 -393779 178875 835943 1022160 538316 60207 -223266
$$ packed form
11550b911628Q59211O26598N6591p19106j276809p97036P83049J981869J770076
11541C72815O25413l61070p73764n76979K40381R72190J031785O85035r057o31617
11531A575132o77067n31826m49541m56837Q0179R51995J025949L00074k03525
11522A614533n3813R8568l62767o56659k47505m0129j01510j82720P828O36964
11512G12790J105367J215189Q93180M80170M16262R6415m48034n27652m15617
11503C528070r35910j704831j689399q75060j36308L44369P58493R45639N37905
11494G72968k06247n89708o34942q19778q39522l82003J9394J96412K64981K59767
11484a958678M76698O00365M87836N72654O57068J86217m83844m78109k83473
$$ plain form
11475 -223266 -1038869 -2759668 -4815053 -6386504 -7304733 -7903184 -8454764 -8875260 -8889013
11466 -8889013 -8366856 -7620183 -6965808 -6387493 -6106001 -6513115 -7339381 -7729320 -7433384
11457 -7433384 -6733931 -5883527 -5164153 -4509789 -3359907 -1688650 -101585 1261804 2414118
11448 2414118 2979031 2768513 2115417 1585390 1310962 1186421 1464860 2342460 3561441
11439 3561441 4679557 5007617 4314113 3337775 2917668 3174298 3226169 2816349 2528302
11430 2528302 2605020 2749502 2417836 1682758 876200 43916 -398530 -384620 -640257 -1498048
11420 -1498048 -2511101 -3292311 -3554813 -3211118 -2585744 -1683995 -783337 -211087 319715
11411 319715 846842 1122326 1315231 1314839 1227880 1450568 1747537 1724561 1535207 1451254 1037479
$$ packed form
11475b23266q15603j720799k055385j571451r18229n98451n51580m20496j3753
11466h889013N22157P46673O54375N78315K81492m07114q26266l89939K95936
11457g433384O99453Q50404P19374O54364J149882J671257J587065J363389J152314
11448B414118N64913k10518o53096n30027k74428j24541K78439Q77600J218981
11439C561441J118116L28060o93504r76338m20107K56630N1871m09820k88047
11430B528302P6718J44482l31666p35078q06558q32284m42446J3910k55637q57791
11420a498048j013053p81210k62502L43695O25374R01749R00658N72250N30802
11411C19715N27127K75484J92905l92q6959K22688K96969k2976j89354q3953m13775
$$ plain form
11400 1037479 -126225 -1714328 -3047247 -3519537 -3148592 -2380055 -1771584 -1560710 -1465422
11391 -1465422 -1136114 -815550 -978402 -1482731 -2292775 -3227170 -3547785 -3033452 -2294269
11382 -2294269 -1831995 -1766941 -2137202 -2609331 -2681896 -2685596 -2978606 -3312147 -4004791 -5409744
11372 -5409744 -7137421 -8453188 -8615423 -7577697 -6142225 -4963487 -4116947 -3625670 -3508435
11363 -3508435 -3791956 -4236349 -4675985 -4967238 -4754918 -4238064 -4141364 -4519948 -4752905 -4728992
11353 -4728992 -4677565 -4526077 -4308405 -4340645 -4270914 -3757825 -3573943 -4131339 -5045625 -6023338
11343 -6023338 -6357259 -5766571 -5168972 -5396217 -6198670 -7128116 -7933837 -8424889 -8667486
11334 -8667486 -8648092 -8197008 -7303865 -6212112 -5284446 -4632820 -4337264 -4465335 -4914623
$$ packed form
11400A037479j163704j588103j332919m72290L70945P68537O08471K10874R5288
11391a465422L29308L20564j62852n04329q10044r34395l20615N14333P39183
11382b294269M62274O5054l70261m72129p2565l700k93010l33541o92644j404953
11372e409744j727677j315767j62235J037726J435472J178738Q46540M91277J17235
11363c508435k83521m44393m39636k91253K12320N16854R6700l78584k32957K3913
11353d728992N1427J51488K17672l2240O9731N13089J83882n57396r14286r77713
11343f023338l33921N90688N97599k27245q02453r29446q05721m91052k42597
11334h667486J9394M51084Q93143J091753R27666O51626K95556j28071m49288
$$ plain form
11325 -4914623 -5332384 -5469008 -5238079 -4325927 -2883439 -1411977 -316610 -139501 -668047
11316 -668047 -1476492 -2760276 -3895807 -3992168 -3095649 -2095022 -1616613 -1967308 -3197325
11307 -3197325 -4784540 -6133027 -6599053 -5841963 -4457838 -3198557 -2345582 -1960642 -2240289
11298 -2240289 -3249464 -4346671 -5189576 -5894899 -6151769 -5575652 -4580963 -3596733 -2693287
11289 -2693287 -1673362 -651427 -358130 -844404 -1671686 -2189938 -2170085 -2377047 -3030916
11280 -3030916 -3505332 -3455823 -3321226 -3662443 -4566344 -5689116 -6257039 -5876837 -5025777
11271 -5025777 -4445003 -4592866 -5459038 -6261512 -6263764 -5774695 -5802953 -6482237 -7094097 -7023050
11261 -7023050 -6526664 -6454047 -7066360 -7789874 -7994155 -7528589 -6694339 -5475344 -3777816
$$ packed form
11325d914623m17761j36624K30929R12152J442488J471462J095367J77109n28546
11316f68047q08445j283784j135531r6361Q96519J000627M78409l50695j230017
11307c197325j587215j348487m66026P57090J384125J259281Q52975L84940k79647
11298b240289j009175j097207q42905p05323k56870N76117R94689R84230R03446
11289b693287J019925J021935K93297m86274q27282n18252J9853k06962o53869
11280c030916m74416M9509J34597l41217r03901j122772n67923L80202Q51060
11271e025777N80774j47863q66172q02474k252M89069k8258o79284o11860P1047
11261g023050M96386P2617o12313p23514k04281M65566Q34250J218995J697528
$$ plain form
11252 -3777816 -2289610 -1597938 -1555025 -1344905 -688854 -24750 268721 -63964 -883114
11243 -883114 -1496887 -1957921 -2801902 -3490778 -3316037 -2453945 -1479699 -646431 -286600 -888726
11233 -888726 -2038096 -3071682 -3732464 -4114383 -4554846 -4749297 -4388708 -3506889 -2515165
11224 -2515165 -1982569 -1853297 -1597247 -1053911 -780647 -1154963 -1911345 -2420779 -2348978 -1661293
11214 -1661293 -537629 473357 811005 612074 639424 1344022 2216494 2342828 1355850
11205 1355850 26916 -773395 -1081751 -1590416 -2329130 -2568074 -2048298 -1266346 -627469
11196 -627469 235340 1248834 1864036 1636551 595647 -588717 -1217272 -1442365 -1798012
11187 -1798012 -2073007 -1756272 -898315 -332457 -579305 -962537 -773076 -299043 94797
$$ packed form
11252c777816J488206O91672M2913K10120O56051O64104K93471l32685q19150
11243h83114o13773m61034q43981o88876J74741Q62092R74246Q33268L59831o02126
11233h88726j149370j033586o60782l81919m40463j94451L60589Q81819R91724
11224b515165N32596J29272K56050N43336K73264l74316p56382n09434P1801O87685
11214a661293J123664J010986L37648j98931K7350P04598Q72472J26334r86978
11205A355850j328934q00311l08356n08665p38714k38944N19776P81952O38877
11196f27469Q62809J013494O15202k27485j040904j184364o28555k25093l55647
11187a798012k74995L16735Q57957N65858k46848l83232J89461M74033L93840
$$ plain form
11178 94797 574588 1277030 1965953 2380729 2706446 2956681 3073154 3386860 3753897 3542764
11168 3542764 2624928 1578976 770119 99697 -593913 -1384066 -2058352 -2462465 -2557923
11159 -2557923 -2175710 -1285894 -90311 811946 915082 539179 402951 361218 -637291
11150 -637291 -2902431 -5678576 -8200734 -9799617 -10325554 -10465052 -10394667 -9864061 -9116601
11141 -9116601 -8346098 -7600570 -7344703 -7737048 -8125369 -8282614 -8711997 -9489787 -9957820
11132 -9957820 -9453229 -7934894 -6075687 -4851556 -4543293 -4587093 -4323884 -3608273 -2926341
11123 -2926341 -2768207 -2905637 -2775166 -2267130 -1850114 -1828282 -2152439 -2969194 -4225400
11114 -4225400 -5215257 -5295535 -4546084 -3669227 -2770032 -1530234 -468458 -120525 -261875
$$ packed form
11178I4797M79791P02442O88923M14776L25717K50235J16473L13706L67037k11133
11168C542764r17836j045952q08857o70422o93610p90153o74286m04113r5458
11159b557923L82213Q89816J195583R02257J03136l75903j36228m1733r98509
11150f37291k265140k776145k522158j598883n25937j39498P0385N30606P47460
11141i116601P70503P45528K55867l92345l88321j57245m29383p77790m68033
11132i957820N04591J518335J859207J224131L08263m3800K63209P15611O81932
11123b926341J58134j37430J30471N08036M17016K1832l24157q16755j256206
11114d225400r89857q0278P49451Q76857Q99195J239798J061776L47933j41350
$$ plain form
11105 -261875 -284306 -39589 -223261 -1001863 -1783979 -2134967 -2389062 -2875136 -2948638 -2241352
11095 -2241352 -1376069 -1043872 -1318645 -1970879 -2564998 -2840937 -2786288 -2381659 -2010789 -2226095
11085 -2226095 -3309165 -4870857 -6056094 -6760608 -7321039 -7666911 -7487723 -7290667 -7478435
11076 -7478435 -7767746 -7755496 -7293111 -6821396 -6138656 -4647796 -2821468 -1652138 -1174179
11067 -1174179 -973558 -996284 -1274616 -1657360 -1697812 -1311332 -1177573 -1633244 -2348253 -3185841
11057 -3185841 -3848797 -4056495 -4122922 -4503210 -4694502 -3908098 -2659389 -1900615 -2020799
11048 -2020799 -2889636 -3851356 -4456749 -5212442 -6301429 -7236401 -7748075 -7725115 -7217087
11039 -7217087 -6296472 -4892478 -2943937 -933663 257997 453784 236958 209398 219850
$$ packed form
11105b61875k2431K44717j83672p78602p82116l50988k54095m86074p3502P07286
11095b241352Q65283L32197k74773o52234n94119k75939N4649M04629L70870k15306
11085b226095j083070j561692j185237p04514n60431l45872J79188J97056j87768
11076g478435k89311J2250M62385M71715O82740J490860J826328J169330M77959
11067a174179K00621k2726k78332l82744m0452L86480J33759m55671p15009q37588
11057c185841o62956k07698o6427l80288j91292P86404J248709P58774j20184
11048b020799q68837r61720o05393p55693j088987r34972n11674K2960N08028
11039g217087R20615J403994J948541K010274J191660J95787k16826k7560J0452
$$ plain form
11030 219850 -88819 -642750 -1437473 -2325210 -2981753 -3316187 -3631375 -3968354 -3957284 -3702766
11020 -3702766 -3427756 -3211543 -3183326 -3743319 -4760550 -5774751 -6719038 -7270372 -7377651
11011 -7377651 -7252178 -7060203 -7114524 -7076231 -6361735 -5543657 -4903897 -4099929 -3048433 -1842645
11001 -1842645 -933562 -775564 -1185073 -1750617 -2135329 -1973313 -1407483 -860745 -481372
10992 -481372 -62091 285803 275423 575738 1614112 2284354 1483863 -361031 -2234266
10983 -2234266 -3621799 -4180550 -4182841 -4206529 -4228457 -3966533 -2987083 -1234971 352347 1446402
10973 1446402 2066281 1693318 375173 -1414559 -3200598 -4399093 -5125740 -5885211 -6568735
10964 -6568735 -6745447 -6474439 -6121639 -5723889 -5278065 -4770453 -4320499 -4311645 -4746477 -5268993
$$ packed form
11030B19850l08669n53931p94723q87737o56543l34434l15188l36979J1070K54518
11020c702766K75010K16213K8217n59993j017231j014201r44287n51334j07279
11011g377651J25473J91975n4321L8293P14496Q18078O39760Q03968J051496J205788
11001a842645R09083J57998m09509n65544l84712J62016N65830N46738L79373
10992d81372M19281L47894j0380L00315J038374O70242q00491j844894j873235
10983b234266j387533n58751k291k3688k1928K61924R79450J752112J587318J094055
10973A446402O19879l72963j318145j789732j786039j198495p26647p59471o83524
10964f568735j76712K71008L52800L97750M45824N07612M49954Q854m34832n22516
$$ plain form
10954 -5268993 -5683419 -5831131 -5500883 -4843681 -4333605 -4487262 -5308937 -6231712 -6659049
10945 -6659049 -6285202 -5372406 -4241405 -3284455 -2989207 -3767462 -4697574 -4309686 -2820026
10936 -2820026 -1130383 340824 1594227 2703158 3422908 3564258 3371503 3241244 2935904
10927 2935904 1991393 632999 -894962 -2451392 -3463945 -3602485 -3367279 -2825030 -1971535
10918 -1971535 -1469648 -1560829 -1994421 -2502313 -3034320 -3629882 -3827629 -3202968 -1962549
10909 -1962549 -611329 698986 1609555 1521867 603832 -711454 -2023685 -3048590 -4142668
10900 -4142668 -5844175 -7607278 -8453466 -8204060 -7414794 -6813215 -6571100 -6387051 -5945559
10891 -5945559 -5196358 -4648471 -4642320 -4804686 -4880341 -5314168 -6055542 -6298995 -5810018 -4991122
$$ packed form
10954e268993m14426j47712L30248O57202N10076j53657q21675r22775m27337
10945f659049L73847R12796J131001R56950K95248p78255r30112L87888J489660
10936b820026J689643J471207J253403J108931P19750J41350j92755j30259l05340
10927B935904r44511j358394j527961j556430j012553j38540K35206N42249Q53495
10918a971535N01887r1181m33592n07892n32007n95562j97747O24661J240419
10909a962549J351220J310315R10569q7688r18035j315286j312231j024905j094078
10900d142668j701507j763103q46188K49406P89266O01579K42115J84049M41492
10891e945559P49201N47887O151j62366p5655m33827p41374k43453M88977Q18896
$$ plain form
10881 -4991122 -4232753 -3737329 -3659297 -3635134 -3583619 -3889360 -4549531 -5481119 -6442055 -6911693
10871 -6911693 -6642097 -5731286 -4448393 -3617285 -3706760 -4431803 -5511283 -6694660 -7742742
10862 -7742742 -8349600 -8230475 -7568313 -6752454 -5789188 -4774223 -3848763 -3171175 -2835509
10853 -2835509 -2335488 -1519804 -422113 892508 2085227 2915149 3193004 2998139 2091144
10844 2091144 366590 -1395973 -2738875 -3773141 -4436182 -4642433 -4819026 -5349611 -5756086
10835 -5756086 -5568268 -5018912 -4562686 -4213381 -3687512 -2764646 -1428830 -15413 1075860
10826 1075860 1626502 1665756 1521961 1419047 1084670 74269 -1547202 -3168884 -4352384
10817 -4352384 -4787368 -4102201 -2522599 -762671 932773 2381881 3209560 3017614 1911632
$$ packed form
10881d991122P58369M95424P8032K4163N1515l05741o60171r31588r60936m69638
10871f911693K69596R10811J282893Q31108q9475p25043j079480j183377j048082
10862g742742o06858J19125O62162Q15859R63266J014965R25460O77588L35666
10853b835509N00021Q15684J097691J314621J192719Q29922K77855j94865r06995
10844B091144j724554j762563j342902j034266o63041k06251j76593n30585m06475
10835e756086J87818N49356M56226L49305N25869R22866J335816J413417J091273
10826A075860N50642L9254j43795j02914l34377j010401j621471j621682j183500
10817d352384m34984O85167J579602J759928J695444J449108Q27679j91946j105982
$$ plain form
10808 1911632 703365 -40598 -749994 -1597440 -2017205 -1805289 -1239907 -502422 633796
10799 633796 1804189 1984219 1019032 -170308 -380515 196712 358148 -422461 -1859264
10790 -1859264 -3252995 -3811937 -3416822 -2842413 -2648477 -2527499 -1961384 -950049 170911
10781 170911 1053985 1540910 1595225 1400475 996553 187605 -697829 -1196917 -1213207 -1025153
10771 -1025153 -1068664 -1151303 -958665 -561151 -400921 -797597 -1509384 -2031608 -2417630 -3196069
10761 -3196069 -4395649 -5513171 -6094746 -6020567 -5655234 -5186783 -4354939 -2943764 -1690426
10752 -1690426 -1275894 -1428588 -1601166 -2043113 -2951320 -3942263 -4628773 -4961122 -5216493
10743 -5216493 -5322003 -4853808 -4075450 -3517021 -3115777 -2775698 -2637344 -2760547 -3052826
$$ packed form
10808A911632j208267p43963p09396q47446m19765K11916N65382P37485J136218
10799F33796J170393J80030r65187j189340k10207N77227J61436p80609j436803
10790a859264j393731n58942L95115N74409J93936J20978N66115J011335J120960
10781A70911Q83074M86925N4315j94750m03922q08948q85434m99088j6290J88054
10771a025153m3511q2639J92638L97514J60230l96676p11787n22224l86022p78439
10761c196069j199580j117522n81575P4179L65333M68451Q31844J411175J253338
10752a690426M14532j52694j72578m41947r08207r90943o86510l32349k55371
10743e216493j05510M68195P78358N58429M01244L40079J38354j23203k92279
$$ plain form
10734 -3052826 -2959799 -2267115 -1751788 -1964826 -2859051 -4068067 -5133092 -5777134 -5682723
10725 -5682723 -4528807 -3075172 -2189323 -1916803 -1814029 -1617573 -1408826 -1202868 -820397
10716 -820397 -416457 -151862 155323 311401 -89906 -817555 -1632621 -2455866 -3135843 -3358602
10706 -3358602 -3276401 -3245196 -3299265 -3719094 -4532296 -5471077 -6253337 -6536716 -6324843 -6092138
10696 -6092138 -6100028 -6312457 -6602991 -7034209 -7540492 -7773274 -7335320 -6048759 -4394721
10687 -4394721 -3186057 -2655170 -2362884 -2037312 -1615179 -1082939 -832771 -1132980 -2090483
10678 -2090483 -3579457 -4813828 -5273863 -5050511 -4355073 -3725152 -3421605 -3398350 -3299278
10669 -3299278 -2676537 -1706229 -738448 -201451 169885 588204 575033 -19099 -812876 -1270476
$$ packed form
10734c052826R3027O92684N15327k13038q94225j209016j065025o44042R4411
10725e682723J153916J453635Q85849K72520J02774J96456K08747K05958L82471
10716h20397M03940K64595L07185J56078m01307p27649q15066q23245o79977k22759
10706c358602Q2201L1205n4069m19829q13202r38781p82260k83379K11873K32705
10696f092138p890k12429k90534m31218n06283k32782M37954J286561J654038
10687d394721J208664N30887K92286L25572M22133N32240K50168l00209r57503
10678b090483j488974j234371m60035K23352O95438O29921L03547K3255R9072
10669c299278O22741R70308R67781N36997L71336M18319j3171n94132p93777m57600
$$ plain form
10659 -1270476 -1197711 -1111412 -1236939 -1287681 -1302807 -1644987 -2540256 -3697619 -4513796 -4871618
10649 -4871618 -5080139 -5570446 -6517953 -7317597 -7292265 -6860139 -6784338 -6912370 -6354149 -5064709
10639 -5064709 -3662076 -2000955 -32399 1895570 3853374 5512873 5903653 4666340
10631 4666340 2569064 842265 6516 -14391 687332 1965624 3327249 3756236 3047608
10622 3047608 2064441 1515855 1334736 938874 349938 -242874 -886549 -1540965 -2122411
10613 -2122411 -2633693 -3187743 -3789811 -4373926 -5153232 -5902928 -6486316 -6872623 -6864542 -6633619
10603 -6633619 -6446218 -6422380 -6392586 -6069320 -5334747 -4423403 -3702261 -3586275 -4170292 -4914463
10593 -4914463 -5336639 -5688842 -6139295 -6473968 -6649917 -6585328 -6250381 -6117254 -6683401 -7576999
$$ packed form
10659a270476P2765Q6299j25527n0742j5126l42180q95269j157363q16177l57822
10649d871618k08521m90307r47507p99644K5332M32126P5801j28032N58221J289440
10639e064709J402633J661121J968556J927969J957804J659499L90780j237313
10631D666340k097276j726799q35749k0907P01723J278292J361625M28987p08628
10622C047608r83167n48586j81119l95862n88936n92812o43675o54416n81446
10613b122411n11282n54050o02068n84115p79306p49696n83388l86307Q081K30923
10603f633619J87401K3838K9794L23266P34573R11344P21142J15986n84017p44171
10593d914463m22176l52203m50453l34673j75949O4589L34947J33127n66147q93598
$$ plain form
10583 -7576999 -7952304 -7515116 -6656921 -5746816 -4817780 -4264182 -4450725 -4898421 -5184748
10574 -5184748 -5191540 -4639871 -3367528 -1756770 -578685 98525 728537 1413633 2145158
10565 2145158 2784927 3255486 3544504 3684641 3824397 3741881 3155743 2507149 2352997 2486914
10555 2486914 2601549 3000351 3544667 3745615 3601936 3263586 2868463 2496050 2027251
10546 2027251 1160430 338488 329713 881914 1035430 344955 -417270 -394844 353396 1409763
10536 1409763 2422968 3110701 3318821 3094009 2352253 1031885 -221366 -731851 -332030
10527 -332030 208450 319527 328454 378451 119107 -878849 -2317754 -3295360 -3260205 -2517558
10517 -2517558 -1925480 -1942893 -2391287 -2829370 -2674007 -2155563 -2281422 -2926336 -3120987 -2758048
$$ packed form
10583g576999l75305M37188Q58195R10105R29036N53598j86543m47696k86327
10574e184748o792N51669J272343J610758J178085O77210O30012O85096P31525
10565B145158O39769M70559K89018J40137J39756q2516n86138o48594j54152J33917
10555B486914J14635L98802N44316K00948j43679l38350l95123l72413m68799
10546B027251q66821q21942q775N52201J53516o90475p62225K2426P48240J056367
10536A409763J013205O87733K08120k24812p41756j320368j253251n10485L99821
10527c32030N40480J11077Q927M9997k59344r97956j438905r77606L5155P42647
10517b517558N92078j7413m48394m38083J55363N18444j25859o44914j94651L62939
$$ plain form
10507 -2758048 -2559614 -2981767 -3755513 -4375701 -4679422 -4972450 -5311025 -5289182 -4710632 -3817411
10497 -3817411 -2948388 -2232541 -1915073 -2306142 -3278461 -4236851 -4685976 -4748449 -4508306 -3738007
10487 -3738007 -2606823 -1327960 -276868 -94346 -722973 -1713095 -2613339 -3320898 -3946241
10478 -3946241 -4797779 -6240547 -7911911 -8948476 -8586413 -7132730 -5922818 -5117341 -4068850
10469 -4068850 -2467691 -663990 667973 1083629 886107 545394 -85926 -1059202 -1742950
10460 -1742950 -1695465 -1271132 -873153 -520431 -172403 288381 819520 1336443 1805481 2073617
10450 2073617 2027175 1477517 341873 -989383 -1574157 -1250191 -1125755 -1702017 -2675710
10441 -2675710 -3677938 -4323202 -4840331 -5310508 -5342806 -4963341 -4539841 -4019452 -3479047
$$ packed form
10507b758048J98434m22153p73746o20188l03721k93028l38575K1843N78550Q93221
10497c817411Q69023P15847L17468l91069r72319r58390m49125o2473K40143P70299
10487c738007J131184J278863J051092J82522o28627r90122r00244p07559o25343
10478c946241q51538j442768j671364j036565L62063J453683J209912Q05477J048491
10469d068850J601159J803701J331963M15656j97522l40713o31320r73276o83748
10460a742950M7485M24333L97979L52722L48028M60784N31139N16923M69038K68136
10450B073617m6442n49658j135644j331256n84774L23966J24436n76262r73693
10441b675710j002228o45264n17129m70177l2298L79465M23500N20389N40405
$$ plain form
10432 -3479047 -3150443 -2961141 -2791732 -2761618 -3016835 -3354043 -3374510 -3360121 -3583022 -3795538
10422 -3795538 -3733144 -3318555 -2974980 -3084543 -3399817 -3575938 -3632185 -3572089 -3781399 -4639690
10412 -4639690 -5650289 -6121553 -5953416 -5457765 -4703766 -3744945 -2685163 -1737606 -1369505
10403 -1369505 -1496747 -1630960 -1532865 -1385271 -1499008 -2153396 -3378618 -4904071 -6392888
10394 -6392888 -7397518 -7956335 -8333917 -8442832 -8291636 -8156472 -7855764 -6903724 -5389718
10385 -5389718 -3834063 -2716953 -2166712 -1944007 -1883235 -1555505 -992806 -638303 -511778
10376 -511778 -560138 -936303 -1791034 -2851937 -3786125 -4694973 -5633994 -6089764 -5963178 -5410127
10366 -5410127 -4680250 -4170632 -3620418 -2727182 -2154875 -2449893 -3376402 -4270646 -4494418
$$ packed form
10432c479047L28604J89302J69409L0114k55217l37208k0467J4389k22901k12516
10422c795538O2394M14589L43575j09563l15274j76121n6247O0096k09310q58291
10412d639690j010599m71264J68137M95651P53999R58821J059782R47557L68101
10403a369505j27242j34213R8095J47594j13737o54388j225222j525453j488817
10394f392888j004630n58817l77582j08915J51196J35164L00708R52040J514006
10385e389718J555655J117110N50241K22705O0772L27730N62699L54503J26525
10376e11778m8360l76165q54731j060903r34188r08848r39021m55770J26586N53051
10366e410127P29877N09618N50214Q93236N72307k95018r26509q94244k23772
$$ plain form
10357 -4494418 -3773883 -2220263 -521338 631150 1207165 1062289 261077 -473957 -791952
10348 -791952 -569899 2299 366398 104305 -670986 -1549390 -2163717 -2538257 -2818909 -2866222
10338 -2866222 -2766734 -2533557 -1847377 -857602 -19365 648547 1364032 1899866 2053206 2153347
10328 2153347 2462089 2942187 3653732 4889283 6326708 7022515 6716776 5689886 4333563
10319 4333563 3028637 2070738 1475051 1221272 1141868 788526 346800 -171735 -926080
10310 -926080 -1608139 -2150072 -3044675 -4277313 -5033906 -4969980 -4556275 -3947056 -2698264
10301 -2698264 -908647 474687 523441 -768803 -2409559 -3331100 -3043985 -1953861 -653158
10292 -653158 493147 1185817 1446751 1231296 765571 476971 283570 73599 -160501
$$ packed form
10357d494418P20535J553620J698925J152488N76015j44876q01212p35034l17995
10348g91952K22053N72198L64099k62093p75291q78404o14327l74540k80652m7313
10338b866222R9488K33177O86180R89775Q38237O67912P15485N35834J53340J00141
10328B153347L08742M80098P11545J235551J437425O95807l05739j026890j356323
10319D333563j304926r57899n95687k53779p9404l53342m41726n18535p54345
10310i26080o82059n41933q94603j232638p56593O3926M13705O09219J248792
10301b698264J789617J383334M8754j292244j640756r21541K87115J090124J300703
10292f53158J146305O92670K60934k15455m65725k88600j93401k09971k34100
$$ plain form
10283 -160501 -377687 -332883 -92789 96887 236109 476444 1085474 1860926 2201162 2113857
10273 2113857 1981977 1851519 1279643 231480 -494113 -845388 -1374946 -2383269 -3706107
10264 -3706107 -4421316 -4053490 -3190395 -2198687 -1150575 -687734 -904228 -857328 -308798
10255 -308798 229986 259841 -197052 -673031 -727361 -506517 -219765 -18271 -621896 -2278878
10245 -2278878 -4305593 -5743442 -6281603 -6643313 -7417234 -8259886 -8845001 -9103255 -8571007
10236 -8571007 -7300449 -5778148 -4420584 -3532793 -2651035 -1377426 -250224 286466 194238
10227 194238 -831911 -2283811 -3140575 -3229240 -3062499 -2836515 -2589131 -2579758 -2764783 -2991444
10217 -2991444 -3728578 -4892446 -5650101 -5574705 -4850057 -3953431 -3229229 -2870144 -3030538
$$ packed form
10283a60501k17186M4804K40094J89676J39222K40335O09030P75452L40236q7305
10273B113857j31880j30458n71876j048163p25593l51275n29558j008323j322838
10264c706107p15209L67826Q63095R91708J048112M62841k16494M6900N48530
10255c08798N38784K9855m56893m75979n4330K20844K86752K01494o03625j656982
10245b278878k026715j437849n38161l61710p73921q42652n85115k58254N32248
10236h571007J270558J522301J357564Q87791Q81758J273609J127202N36690r2228
10227A94238j026149j451900q56764q8665J66741K25984K47384R373j85025k26661
10217b991444p37134j163868p57655P5396P24648Q96626P24202L59085j60394
$$ plain form
10208 -3030538 -3618741 -4166161 -4338509 -4101115 -3519465 -2863428 -2202626 -1839676 -2151917
10199 -2151917 -3007221 -3973913 -4717269 -4930614 -4579408 -4288717 -4267182 -4352360 -4417773 -4186152
10189 -4186152 -3452958 -2051338 -56779 1777318 2812891 3420463 4343043 5509052 6553896
10180 6553896 6979080 6409457 5209830 3806969 2318948 1100374 776100 1310196 2383126
10171 2383126 3732493 5617827 8044826 10432450 12609677 14466527 15061887 13590668
10163 13590668 11105970 8892900 7048834 5390614 3942602 2761178 1741244 1250063
10155 1250063 1547273 2065455 2091973 1565978 866187 486808 918714 1949226 2970554
10146 2970554 3393192 2966800 2070218 975991 -446764 -1566096 -1283892 409130 2385298
$$ packed form
10208c030538n88203n47420j72348K37394N81650O56037O60802L62950l12241
10199b151917q55304r66692p43356k13345L51206K90691K1535q5178o5413K31621
10189d186152P33194J401620J994559J834097J035573O07572R22580J166009J044844
10180F553896M25184n69623j199627j402861j488021j218574l24274N34096J072930
10171B383126J349367J885334K426999K387624K177227J856850N95360j471219
10163A3590668k484698k213070j844066j658220j448012j181424j019934m91181
10155A250063K97210N18182K6518n25995o99791l79379M31906J030512J021328
10146B970554M22638m26392q96582j094227j422755j119332K82204J693022J976168
$$ plain form
10137 2385298 3815878 4717864 5428947 5945829 6400652 6997506 7429982 7517604 7636516
10128 7636516 7682496 7040750 5824522 4767143 4010058 3523473 3582284 4210561 4757812
10119 4757812 4553700 3709171 2887342 2664497 3014332 3590440 4169458 4655383 5064590
10110 5064590 5729394 7005375 8710418 10285323 11718682 13400052 15601024 18153420
10102 18153420 20495908 22618404 25125068 28757080 33814003 39234450 42432792 41009741
10094 41009741 36177421 31025389 26656904 23039813 20603492 19710764 19930179 20408328
10086 20408328 20671306 20739640 20672943 20948644 22203854 24057489 25608387 26695039 27725821
10077 27725821 28724143 29651078 30644798 31435829 32005341 32576013 33241315 34030030 35150704
$$ packed form
10137B385298J430580R01986P11083N16882M54823N96854M32476Q7622J18912
10128G636516M5980o41746j216228j057379p57085m86585N8811O28277N47251
10119D757812k04112q44529q21829k22845L49835N76108N79018M85925M09207
10110E064590O64804J275981J705043J574905J433359J681370K200972K552396
10102A8153420K342488K122496K506664L632012N056923N420447L198342j423051
10094D1009741m832320n152032m368485l617091k436321q92728K19415M78149
10086B0408328K62978O8334o6697K75701J255210J853635J550898J086652J030782
10077B7725821R98322R26935R93720P91031N69512N70672O65302P88715J120674
$$ plain form
10068 35150704 36629621 37935927 38381137 38126112 37975074 38310314 39307100 40727238 42262863
10059 42262863 44067632 45608909 46346734 46871619 47982189 49850704 52146048 54485946
10051 54485946 56533777 58074326 59373287 60684324 61472778 61828046 62235684 62626093 63113152
10042 63113152 63657615 64094522 64696640 65516664 66224691 67061181 68653265 71006021 73982601
10033 73982601 77903929 82854145 89059136 96709697 105419373 114967497 125170173 135814096
10025 135814096 147136188 159919288 175207546 194050347 217717971 247052979 281735288
10018 281735288 319894291 357472037 388058821 406622023 415058812 420513599 429233211
10011 429233211 441361578 449718095 446318271 429040869 401730414 370846359 341997573
$$ packed form
10068C5150704J478917J306306M45210k55025j51038L35240R96786J420138J535625
10059D2262863J804769J541277P37825N24885J110570J868515K295344K339898
10051E4485946K047831J540549J298961J311037P88454L55268M07638L90409M87059
10042F3113152N44463M36907O02118Q20024P08027Q36490J592084K352756K976580
10033G3982601L921328M950216O204991P650561Q709676R548124J0202676J0643923
10025A35814096J1322092J2783100J5288258J8842801K3667624K9335008L4682309
10018B81735288L8159003L7577746L0586784J8563202Q436789N454787Q719612
10011D29233211J2128367Q356517l399824j7277402k7310455l0884055k8848786
$$ plain form
10004 341997573 318388870 301333125 291400547 288597460 292395286 302140692 317406510
9997 317406510 337923058 362287445 387327314 409769751 428691492 444391345 454122119
9990 454122119 450224645 426281199 385057606 336142446 288333142 246132429 211128105
9983 211128105 183616622 162641185 146294678 132838925 121016029 110607484 101878408
9976 101878408 94755870 89806070 87379216 86801331 87126901 88041253 90196945 94118850
9968 94118850 99182237 104224671 108163970 110386518 111359988 111902135 111471863 109049370 104820160
9959 104820160 99652249 94221925 88873121 83976747 79850264 76514767 73760081 71606479
9951 71606479 70116876 68893034 67346560 65279776 63023171 60801928 58587529 56716639
$$ packed form
10004C41997573k3608703j7055745r932578k803087L797826R745406J5265818
9997C17406510K0516548K4364387K5039869K2442437J8921741J5699853R730774
9990D54122119l897474k3943446m1223593m8915160m7809304m2200713l5004324
9983B11128105k7511483k0975437j6346507j3455753j1822896j0408545q729076
9976A01878408p122538m949800k426854n77885L25570R14352K155692L921905
9968I4118850N063387N042434L939299K222548R73470N42147m30272k422493m229210
9959A04820160n167911n430324n348804m896374m126483l335497k754686k153602
9951G1606479j489603j223842j546474k066784k256605k221243k214399j870890
$$ plain form
9943 56716639 55779284 55839264 56305893 57005730 57980837 59316496 60931275 62614645 65026902
9934 65026902 68774120 74224270 81511607 90362900 100492818 110647453 118552934 123030683
9926 123030683 125222364 126559956 126939620 124887665 118771238 109426441 100193538 93404515
9918 93404515 89224791 87124601 86672320 87489504 89729315 94042596 100574407 108920014
9910 108920014 118156909 125981243 128957044 124911709 114691034 100988357 86634163 73589666
9902 73589666 62536910 53420773 46183199 40809513 36998032 34017359 31514065 29605451
9894 29605451 28846910 29932044 32628479 36073729 39720438 43818878 47924722 49244985
9886 49244985 45672827 38724206 31129955 25087107 20946912 17891477 15897580 14774280
$$ packed form
9943E6716639r37355N9980M66629O99837R75107J335659J614779J683370K412257
9934F5026902L747218N450150P287337Q851293J0129918J0154635P905481M477749
9926A23030683K191681J337592L79664k051955o116427r344797r232903o789023
9918I3404515m179724k100190m52281Q17184K239811M313281O531811Q345607
9910A08920014R236895P824334K975801m045335j0220675j3702677j4354194j3044497
9902G3589666j1052756r116137p237574n373686l811481k980673k503294j908614
9894B9605451p58541J085134K696435L445250L646709M098440M105844J320263
9886D9244985l572158o948621p594251o042848m140195l055435j993897j123300
$$ plain form
9878 14774280 13760656 12648170 11944120 12023750 12639172 13457747 14229105 14502846 14416652
9869 14416652 14484539 14798152 15156103 15189495 14860198 14399880 13982343 13420002 12673409 11929635
9859 11929635 11271579 10434901 9303819 8425037 7999096 7570598 6678671 5304879 3609801
9850 3609801 2000291 1066328 990612 1825276 3150820 3877229 3427989 2460102 1749848
9841 1749848 1223863 609118 61987 -313735 -791867 -1429202 -1813392 -1714161 -1310482 -726146
9831 -726146 -237046 -149611 -346837 -364762 1695 384642 329248 -688862 -2360595 -3828146
9821 -3828146 -4671355 -4751299 -4106630 -3507682 -3585904 -3914988 -4194340 -4058566 -3047896 -1818042
9811 -1818042 -1055554 -484264 302648 1148049 1539030 1553212 1935816 2835121 3674182 3842177
$$ packed form
9878A4774280j013624j112486p04050P9630O15422Q18575P71358K73741q6194
9869A4416652O7887L13613L57951L3392l29297m60318m17537n62341p46593p43774
9859A1929635o58056q36678j131082q78782m25941m28498q91927j373792j695078
9850C609801j609510r33963p5716Q34664J325544P26409m49240r67887p10254
9841A749848n25985o14745n47131l75722m78132o37335l84190R9231M03679N84336
9831g26146M89100Q7435j97226j7925L66457L82947n5394j018110j671733j467551
9821c828146q43209p9944O44669N98948p8222l29084k79352J35774J010670J229854
9811a818042P62488N71290P86912Q45401L90981J4182L82604Q99305Q39061J67995
$$ plain form
9801 3842177 3205372 2118557 615790 -1293675 -3322232 -4916168 -5710819 -5727935 -5331592
9792 -5331592 -4931793 -4671609 -4889360 -5610281 -6174193 -6365187 -6282173 -6257109 -6326210 -6468095
9782 -6468095 -6694918 -6824975 -6784434 -6655980 -6316674 -5610127 -5147616 -5385149 -5927170 -6182802
9772 -6182802 -5807790 -5142770 -4870834 -5079454 -5367936 -5750227 -6508703 -7502567 -8413333 -9232581
9762 -9232581 -10015397 -10570514 -10594005 -9999171 -9192138 -8666676 -8733193 -9170169 -9001209 -7653924
9752 -7653924 -5661156 -3659806 -2162025 -1761891 -2207778 -2810538 -3335465 -3929337 -4582538
9743 -4582538 -4865731 -4777289 -4685007 -4529338 -4066295 -3824729 -4197524 -4748935 -5085587 -4990447
9733 -4990447 -4820994 -4996839 -5239824 -5336307 -5237434 -5031766 -4828036 -4653997 -4773626 -5043995
$$ packed form
9801C842177o36805j086815j502767j909465k028557j593936p94651j7116L96343
9792e331592L99799K60184k17751p20921n63912j90994Q3014K5064o9101j41885
9782f468095k26823j30057M0541J28454L39306P06547M62511k37533n42021k55632
9772f182802L75012O65020K71936k08620k88482l82291p58476r93864r10766q19248
9762i232581p82816n55117k3491N94834Q07033N25462o6517m36976J68960J347285
9752g653924J992768K001350J497781M00134m45887o02760n24927n93872o53201
9743d582538k83193Q8442R2282J55669M63043K41566l72795n51411l36652R5140
9733d990447J69453j75845k42985r6483R8873K05668K03730J74039j19629k70369
$$ plain form
9723 -5043995 -5244708 -5221247 -5020218 -5197492 -5746684 -6113119 -6289915 -6495672 -6568979 -6089319
9713 -6089319 -5025658 -3936355 -3397315 -3558227 -4024349 -4666373 -5309477 -5321011 -4494107
9704 -4494107 -3393631 -2382632 -1604547 -1065532 -743695 -416116 213251 1084036 1543289
9695 1543289 935763 -493725 -2028280 -2882792 -3031983 -2944974 -2793881 -2541259 -2168555
9686 -2168555 -2019114 -2213082 -2511294 -2868243 -2949047 -2392515 -1358085 -530269 -232256 134587
9676 134587 1041488 1962712 2176981 1718072 1055009 377977 -131205 -307393 -318889 -159497
9666 -159497 81722 110250 -264209 -883304 -1277360 -1593155 -2196065 -2834053 -3268583 -3127967
9656 -3127967 -2132436 -881978 -212418 -131582 -250181 -828322 -2178723 -3956177 -5468603
$$ packed form
9723e043995k00713K3461K01029j77274n49192l66435j76796k05757p3307M79660
9713f089319J063661J089303N39040j60912m66122o42024o43104j1534Q26904
9704d494107J100476J010999P78085N39015L21837L27579O29367Q70785M59253
9695A543289o07526j429488j534555q54512j49191Q7009J51093K52622L72704
9686b168555J49441j93968k98212l56949q0804N56532J034430Q27816K98013L66843
9676A34587R06901R21224K14269m58909o63063o77032n09182j76188j1496J59392
9666a59497K41219K8528l74459o19095l94056l15795o02910o37988m34530J40616
9656c127967R95531J250458O69560Q0836j18599n78141j350401j777454j512426
$$ plain form
9647 -5468603 -6262164 -6483615 -6377295 -5721861 -4382971 -3073049 -2369078 -2198358 -2459258
9638 -2459258 -2866639 -2928865 -2570034 -2358542 -2396887 -2249940 -1951200 -1772879 -1822745 -1783443
9628 -1783443 -1445808 -1079964 -828190 -776329 -1117760 -1659326 -2141596 -2480717 -2614935 -2383751
9618 -2383751 -1935780 -1447334 -801350 326327 1706359 2405083 1996385 448746 -1651449
9609 -1651449 -3752306 -5842977 -7618757 -8615509 -8285908 -6459125 -4093522 -2197458 -865405
9600 -865405 -6319 612171 1204197 1414496 1046103 410837 -127944 -661188 -1256045 -1734448
9590 -1734448 -1858563 -1633870 -1428294 -1338993 -1151391 -1002377 -1086737 -1205382 -1164044 -1169564
9580 -1169564 -1153566 -1027977 -995190 -838969 -346273 -35695 -565021 -1795466 -3009005 -3503756
$$ packed form
9647e468603p93561k21451J06320O55434J338890J309922P03971J70720k60900
9638b459258m07381o2226L58831K11492l8345J46947K98740J78321m9866L9302
9628a783443L37635L65844K51774N1861l41431n41566m82270l39121j34218K31184
9618b383751M47971M88446O45984J127677J380032O98724m08698j547639k100195
9609a651449k100857k090671j775780r96752L29601J826783K365603J896064J332053
9600h65405Q59086O18490N92026K10299l68393o35266n38781n33244n94857m78403
9590a734448j24115K24693K05576Q9301J87602J49014q4360j18645M1338n520
9580a169564J5998J25589L2787J56221M92696L10578n29326j230445j213539m94751
$$ plain form
9570 -3503756 -2879520 -1968517 -1944430 -2609622 -3174384 -3396188 -3558509 -3789037 -4148550 -4387261
9560 -4387261 -4177782 -3720968 -3501375 -3701641 -3736898 -3214934 -2688547 -2216950 -1411714 -416807
9550 -416807 -128698 -1252971 -3141593 -4606752 -5108373 -4737459 -4162107 -3726971 -3028157
9541 -3028157 -2057420 -1287741 -912678 -1300659 -2722192 -4416400 -5530455 -6010087 -5980224
9532 -5980224 -5233081 -4325797 -4031338 -4254133 -4578314 -4541639 -4063643 -3977400 -4446855 -4566315
9522 -4566315 -4051995 -3258938 -2727603 -2500708 -2247763 -1809619 -1229150 -671697 -162822 -71908
9512 -71908 -398913 -620535 -993108 -1740098 -2279942 -1965314 -736737 716482 1845781
9503 1845781 2598908 2882256 2630362 1993322 873512 -611958 -1805911 -2159110 -1649726
$$ packed form
9570c503756O24236R11003K4087o65192n64762k21804j62321k30528l59513k38711
9560d387261K09479M56814K19593k00266l5257N21964N26387M71597Q05236R94907
9550d16807K88109j124273j888622j465159n01621L70914N75352M35136O98814
9541c028157R70737P69679L75063l87981j421533j694208j114055m79632K9863
9532e980224P47143R07284K94459k22795l24181L6675M77996Q6243m69455j19460
9522d566315N14320P93057N31335K26895K52945M38144N80469N57453N08875R0914
9512g1908l27005k21622l72573p46990n39844L14628J228577J453219J129299
9503A845781P53127K83348k51894o37040j119810j485470j193953l53199N09384
$$ plain form
9494 -1649726 -834349 -394105 -541930 -1427984 -3143612 -4968113 -6210708 -6641009 -6386721
9485 -6386721 -5989628 -5732395 -5505518 -5232176 -5297763 -5941996 -6773957 -7055817 -6288516 -4837810
9475 -4837810 -3627047 -3088893 -3007420 -3162833 -3106756 -2594409 -2146110 -1968758 -1627001 -1103027
9465 -1103027 -555379 218828 825068 753847 113472 -656755 -1434179 -2481795 -3451392 -3792182
9455 -3792182 -3670382 -3626148 -3954751 -4557787 -5230307 -5478352 -4725279 -3627419 -3299293 -3591452
9445 -3591452 -3879006 -3583773 -3011604 -2939255 -3273972 -3891662 -4873235 -5806534 -5915433 -5354626
9435 -5354626 -4573996 -3336735 -1810958 -1016221 -1224374 -1286793 -584246 234371 184559 -785365
9425 -785365 -2037562 -3002021 -3299235 -3083005 -2633934 -2093452 -1425546 -850888 -350899 230343
$$ packed form
9494a649726Q15377M40244j47825q86054j715628j824501j242595m30301K54288
9485f386721L97093K57233K26877K73342o5587o44233q31961k81860P67301J450706
9475d837810J210763N38154Q1473j55413N6077N12347M48299J77352L41757N23974
9465a103027N47648P74207O06240p1221o40375p70227p77424j047616r69597l40790
9455c792182J21800M4234l28603o03036o72520k48045P53073J097860L28126k92159
9445c591452k87554K95233N72169P2349l34717o17690r81573r33299j08899N60807
9435e354626P80630J237261J525777P94737k08153o2419P02547Q18617m9812r69924
9425g85365j252197r64459k97214K16230M49071N40482O67906N74658M99989N81242
$$ plain form
9415 230343 370853 -403272 -1307579 -1351117 -443549 729855 1458013 1141842 -232507 -1701865
9405 -1701865 -2206328 -1736248 -1168919 -1099204 -1344140 -1573350 -1938509 -2543211 -3271967 -3921636
9395 -3921636 -4318836 -4149351 -3278836 -2121592 -1204615 -842760 -1299081 -2605135 -4217554
9386 -4217554 -5375305 -5907182 -6152133 -6415433 -6199349 -5332867 -4686278 -4695173 -4979064 -5307417
9376 -5307417 -5824593 -6212149 -5809230 -4829057 -3527378 -2014768 -728462 146228 719193
9367 719193 914362 711655 634840 631061 193546 -825601 -2199927 -3444119 -4218224 -4780770
9357 -4780770 -5334451 -5862353 -6655463 -7749324 -8413727 -7664048 -5411152 -2744251 -571527
9348 -571527 1043330 2043085 2386559 2505152 2888089 3737687 4491367 4484325 3545709 1870885
$$ packed form
9415B30343J40510p74125r04307m3538R07568J173404P28158l16171j374349j469358
9405a701865n04463M70080N67329O9715k44936k29210l65159o04702p28756o49669
9395c921636l97200J69485Q70515J157244R16977L61855m56321j306054j612419
9386d217554j157751n31877k44951k63300K16084Q66482O46589q895k83891l28353
9376e307417n17176l87556M02919R80173J301679J512610J286306Q74690N72965
9367G19193J95169k02707p6815l779m37515j019147j374326j244192p74105n62546
9357d780770n53681n27902p93110j093861o64403P49679K252896K666901K172724
9348e71527J614857R99755L43474J18593L82937Q49598P53680p042r38616j674824
$$ plain form
9338 1870885 66938 -1067825 -964356 86841 1180666 1631085 1120129 -144259 -1237514
9329 -1237514 -1756895 -1914239 -2003986 -2417479 -3124753 -4061021 -5217805 -6347386 -7057332
9320 -7057332 -6951633 -6084304 -4982767 -3978566 -2959414 -1884253 -1080478 -675278 -520189
9311 -520189 -591747 -938010 -1573996 -2311117 -3022649 -4023196 -5195306 -5752784 -5116881 -3556741
9301 -3556741 -1839388 -459542 330708 674941 705949 199677 -894855 -2462473 -3859300
9292 -3859300 -4644842 -5001909 -5381507 -6008111 -6428496 -6115465 -5121377 -4008853 -3216425
9283 -3216425 -2603929 -2323991 -2833825 -3547183 -3952682 -4211358 -4335502 -4145065 -3947035 -4071066
9273 -4071066 -4451373 -5049747 -5738483 -6459844 -7194334 -7622324 -7115360 -5669895 -4193238
$$ packed form
9338A870885j803947j134763J03469J051197J093825M50419n10956j264388j093255
9329a237514n19381j57344q9747m13493p07274r36268j156784j129581p09946
9320g057332J05699Q67329J101537J004201J019152J075161Q03775M05200J55089
9311e20189p1558l46263o35986p37121p11532j000547j172110n57478O35903J560140
9301c556741J717353J379846P90250L44233L1008n06272j094532j567618j396827
9292c859300p85542l57067l79598o26604m20385L13031R94088J112524P92428
9283c216425O12496K79938n09834p13358m05499k58676j24144J90437J98030j24031
9273d071066l80307n98374o88736p21361p34490m27990N06964J445465J476657
$$ plain form
9264 -4193238 -3376523 -3467486 -4018776 -4137305 -3580337 -2920660 -2338007 -1388905 13491 1644905
9254 1644905 2944860 3129909 2300392 1561634 1624118 1874295 1674898 826036 -534765
9245 -534765 -1972635 -3148865 -4113752 -4804476 -4739810 -3879995 -2718655 -1593748 -593963
9236 -593963 -65979 -101102 -408166 -976656 -1621679 -1644732 -1262463 -1022213 -594073 217378
9226 217378 726524 99593 -1671519 -3729714 -5173577 -5501609 -5202739 -5165245 -5675389
9217 -5675389 -6624101 -7630325 -8178555 -7925668 -7033611 -6264290 -6007099 -5920746 -6028574 -6573651
9207 -6573651 -7238134 -7902192 -8383414 -8316606 -7512316 -6025552 -4652553 -3863273 -3261233
9198 -3261233 -2608201 -2169317 -1995454 -1671344 -1016006 -220362 379118 309972 69225 261494
$$ packed form
9264d193238Q16715r0963n51290j18529N56968O59677N82653R49102J402396J631414
9254A644905J299955J85049q29517p38758O2484K50177j99397q48862j360801
9245e34765j437870j176230r64887o90724O4666Q59815J161340J124907R99785
9236e93963N27984l5123l07064n68490o45023k3053L82269K40250M28140Q11451
9226B17378N09146o26931j771112k058195j443863l28032K98870L7494n10144
9217e675389r48712j006224n48230K52887Q92057P69321K57191Q6353j07828n45077
9207f573651o64483o64058m81222O6808Q04290J486764J372999P89280O02040
9198c261233O53032M38884J73863L24110O55338P95644N99480o9146k40747J92269
$$ plain form
9188 261494 721034 1000967 1073708 1204626 1506198 1718276 1589382 1200564 498637 -431147
9178 -431147 -917806 -498572 242919 456350 316541 680318 1108881 753887 203121 -123807
9168 -123807 -489659 -961173 -1576379 -2024349 -2075032 -1958762 -1689516 -1372430 -1201216 -1266847
9158 -1266847 -1464606 -1679725 -1825188 -1803942 -1872802 -2187769 -2334519 -1951076 -1380782 -1226464
9148 -1226464 -1498702 -1694910 -1709966 -1549406 -1382840 -1354350 -1471375 -1915386 -2613489 -3018676
9138 -3018676 -2918731 -2739184 -2797772 -2877364 -2644655 -2077753 -1085175 161601 761435 118304
9128 118304 -1210441 -1993030 -1710273 -944587 -367039 296885 1291877 2293464 2777165
9119 2777165 2538121 1921821 1323363 1195345 1852095 2792635 3263854 3189796 2721260 1706526
$$ packed form
9188B61494M59540K79933P2741J30918L01572K12078j28894l88818p01927r29784
9178d31147m86659M19234P41491K13431j39809L63777M28563l54994n50766l26928
9168a23807l65852m71514o15206m47970n0683J16270K69246L17086J71214o5631
9158a266847j97759k15119j45463K1246o8860l14967j46750L83443N70294J54318
9148a226464k72238j96208j5056J60560J66566K8490j17025m44011o98103m05187
9138c018676R9945J79547n8588p9592K32709N66902R92578J246776N99834o43131
9128A18304j328745p82589K82757P65686N77548O63924R94992J001587M83701
9119B777165k39044o16300n98458j28018O56750R40540M71219p4058m68536j014734
$$ plain form
9109 1706526 370161 -1069979 -2326002 -3168194 -3934110 -4677731 -5221833 -5229909 -4538559
9100 -4538559 -3543688 -2512048 -1487637 -561775 66211 -13480 -721937 -1394823 -1497420
9091 -1497420 -1072231 -583798 -331632 -134233 293818 1115168 2054002 2779027 3206231 3573004
9081 3573004 4067177 4518601 4755093 4537693 3669362 2295501 558348 -1520771 -3213533
9072 -3213533 -3734458 -3204132 -2297541 -1664326 -1211705 -462776 169421 92968 -367025 -712873
9062 -712873 -961492 -1445580 -1913557 -2012934 -1884494 -1624523 -1132248 -490553 -292856 -1105741
9052 -1105741 -2812967 -4395928 -5264692 -5501971 -5016415 -3885987 -2740870 -2336542 -2744221
9043 -2744221 -3491978 -4121153 -4709362 -5217815 -5198581 -4439020 -3358915 -2714786 -2462428 -1937220
$$ packed form
9109A706526j336365j440140j256023q42192p65916p43621n44102q076O91350
9100d538559R94871J031640J024411R25862O27986p9691p08457o72886j02597
9091a497420M25189M88433K52166J97399M28051Q21350R38834P25025M27204L66773
9081C573004M94173M51424K36492k17400q68331j373861j737153k079119j692762
9072c213533n20925N30326R06591O33215M52621P48929O32197p6453m59993l45848
9062g12873k48619m84088m67977r9377J28440K59971M92275O41695J97697q12885
9052a105741j707226j582961q68764k37279M85556J130428J145117M04328m07679
9043b744221p47757o29175n88209n08453J9234P59561J080105O44129K52358N25208
$$ plain form
9033 -1937220 -881684 403193 1276246 1389327 595880 -730858 -1969582 -2921409 -3290755
9024 -3290755 -2789551 -2021524 -2031771 -2859465 -3915271 -4731457 -4819045 -3943092 -2619333 -1598742
9014 -1598742 -1354061 -1628109 -1699709 -1648569 -1899175 -2070021 -1921790 -1858631 -2164487 -2624977
9004 -2624977 -2718700 -1974238 -905960 -146445 509158 1089138 1453224 1650460 1576107 934676
8994 934676 -106588 -923575 -1150651 -1144958 -1637773 -3063806 -4954668 -6264122 -6684757
8985 -6684757 -6620671 -6428793 -6294496 -5862738 -5011638 -3887979 -2736440 -1869027 -1318354
8976 -1318354 -647299 540669 1805797 2631954 2973608 3128650 3160059 2955647 2514238
8967 2514238 2123155 1388606 -327258 -2195483 -3368005 -4122579 -4970300 -5786165 -6067735
$$ packed form
9033a937220J055536J284877Q73053J13081p93447j326738j238724r51827l69346
9024c290755N01204P68027j0247q27694j055806q16186q7588Q75953J323759J020591
9014a598742K44681k74048p1600N1140k50606j70846J48231O3159l05856m60490
9004b624977r3723P44462J068278P59515O55603N79980L64086J97236p4353o41431
8994I34676j041264q16987k27076N693m92815j426033j890862j309454m20635
8985f684757O4086J91878J34297M31758Q51100J123659J151539Q67413N50673
8976a318354O71055J187968J265128Q26157L41654J55042L1409k04412m41409
8967B514238l91083p34549j715864j868225j172522p54574q47721q15865k81570
$$ plain form
8958 -6067735 -5811783 -5393724 -5120705 -5169762 -5058051 -4162740 -2522464 -937846 -184544
8949 -184544 4476 374260 1204874 2025462 1946201 769247 -766411 -1955511 -2703333
8940 -2703333 -3141266 -3338609 -3330588 -2983973 -2438378 -2223104 -2700683 -3574703 -4181952 -4016355
8930 -4016355 -3697447 -4060517 -4867826 -5525209 -5729721 -5475569 -4920002 -4753253 -5182720 -5360119
8920 -5360119 -5007690 -4515457 -4203705 -3894587 -3222333 -2138268 -862304 330834 1145731
8911 1145731 1513453 1652514 2030977 2884720 3545231 3525678 2773921 1749265 1155668 798253
8901 798253 -159579 -1733134 -3618573 -5383256 -6650925 -7516301 -7767285 -7510435 -7034171
8892 -7034171 -6491438 -5957329 -5199289 -4304009 -3839816 -4162670 -4808318 -5143622 -5134150 -5104738
$$ packed form
8958f067735K55952M18059K73019m9057J11711Q95311J640276J584618P53302
8949a84544J89020L69784Q30614Q20588p9261j176954j535658j189100p47822
8940b703333m37933j97343Q021L46615N45595K15274m77579q74020o07249J65597
8930d016355L18908l63070q07309o57383k04512K54152N55567J66749m29467j77399
8920e360119L52429M92233L11752L09118O72254J084065J275964J193138Q14897
8911A145731L67722J39061L78463Q53743O60511j9553p51757j024656n93597l57415
8901G98253r57832j573555j885439j764683j267669q65376k50984K56850M76264
8892g034171N42733N34109P58040Q95280M64193l22854o45648l35304R472K9412
$$ plain form
8882 -5104738 -4962195 -4527353 -4155828 -4141028 -4048318 -3199477 -1613847 -20341 623149 -20837
8872 -20837 -1368582 -2857360 -4226237 -5217853 -5496511 -5090456 -4394077 -3473453 -2535064
8863 -2535064 -2010567 -1938810 -1964970 -1524871 -307750 1459725 3191281 4064884 3761311
8854 3761311 3103131 3215873 4088289 4653515 4194626 3263773 2904720 3147763 3390609 3667108
8844 3667108 4142848 4254390 3884526 3455617 2630887 1255230 -225038 -1483463 -2677890
8835 -2677890 -3811406 -4154149 -3288105 -2009141 -1456997 -2079919 -3191600 -4071612 -4445910
8826 -4445910 -4093800 -3482348 -3092466 -2774835 -2492543 -2023182 -1362931 -614675 8111 254469
8816 254469 -44461 -835313 -1398939 -1594487 -1724187 -1716117 -1248281 -331240 456847 876622
$$ packed form
8882e104738J42543M34842L71525J4800R2710Q48841J585630J593506O43490o43986
8872b0837j347745j488778j368877r91616k78658M06055O96379R20624R38389
8863b535064N24497P1757k6160M40099J217121J767475J731556Q73603l03573
8854C761311o58180J12742Q72416N65226m58889r30853l59053K43043K42846K76499
8844C667108M75740J11542l69864m28909q24730j375657j480268j258425j194427
8835b677890j133516l42743Q66044J278964N52144o22922j111681q80012l74298
8826d445910L52110O11452L89882L17631K82292M69361O60251P48256O22786K46358
8816B54469k98930p90852n63626j95548j29700Q070M67836R17041P88087M19775
$$ plain form
8806 876622 851559 389151 -96466 -363372 -450677 -201311 144434 -324 -527859 -1029823
8796 -1029823 -1252328 -1011972 -89468 851587 607766 -711079 -2240297 -3436928 -3923044
8787 -3923044 -3968471 -4187022 -4583618 -4547704 -3837737 -2865292 -1819045 -903919 -654511 -1155059
8777 -1155059 -2068899 -3037912 -3646034 -3740908 -3625966 -3724663 -4207118 -4477362 -4147756 -4276022
8767 -4276022 -5819358 -8273204 -10641635 -12146762 -12266007 -11323356 -9768231 -7771134 -6126238
8758 -6126238 -5110591 -4506347 -4167219 -3961808 -4065581 -4617040 -5203069 -5649399 -6169906
8749 -6169906 -6959462 -7919476 -8911168 -9911893 -11006912 -11895674 -11849266 -10784951 -9221427
8740 -9221427 -7658246 -6661124 -6509127 -6858451 -7226572 -7074462 -6145393 -4829775 -3951640
$$ packed form
8806H76622k5063m62408m85617k66906q7305K49366L45745j44758n27535n01964
8796a029823k22505K40356R22504R41055k43821j318845j529218j196631m86116
8787c923044m5427k18551l96596L5914P09967R72445J046247R15126K49408n00548
8777a155059r13840r69013o08122r4874J14942r8697m82455k70244L29606j28266
8767d276022j543336k453846k368431j505127j19245R42651J555125J997097J644896
8758f126238J015647O04244L39128K05411j03773n51459n86029m46330n20507
8749f169906p89556r60014r91692j000725j095019q88762M6408J064315J563524
8740i221427J563181R97122J51997l49324l68121J52110R29069J315618Q78135
$$ plain form
8731 -3951640 -3795979 -4141677 -4781006 -5379303 -5680020 -5385678 -4621158 -4119014 -4083301 -4029998
8721 -4029998 -3851963 -3749105 -3421050 -2333524 -663484 738543 1454943 1622035 1449044
8712 1449044 1398921 1951650 3020332 3876547 3887913 3053546 1917334 1172235 771331 569907
8702 569907 521896 572769 725441 805923 560908 -58151 -1115967 -2619655 -4358493 -6055292
8692 -6055292 -6897188 -6395320 -4895415 -3124321 -1846240 -1235212 -1175296 -1935342 -3243427
8683 -3243427 -3677264 -2777288 -1471165 -296758 822639 1845491 2397581 1991489 594952
8674 594952 -726952 -1073362 -302550 1267900 2773605 3651001 4115458 4502335 4504139 3637882
8664 3637882 2082574 572477 -424103 -816354 -559087 8928 261686 159999 -188680
$$ packed form
8731c951640J55661l45698o39329n98297l00717K94342P64520N02144L5713N3303
8721d029998J78035J02858L28055J087526J670040J402027P16400J67092j72991
8712A449044n0123N52729J068682Q56215J1366q34367j136212p45099m00904k01424
8702E69907m8011N0873J52672Q0482k45015o19059j057816j503688j738838j696799
8692f055292q41896N01868J499905J771094J278081O11028N9916p60046j308085
8683c243427m33837Q99976J306123J174407J119397J022852N52090m06092j396537
8674E94952j321904l46410P70812J570450J505705Q77396M64457L86877J804q66257
8664C637882j555308j510097r96580l92251K57267N68015K52758j01687l48679
$$ plain form
8655 -188680 -507184 -159073 783625 1460516 1351969 555316 -610227 -1355505 -1631054 -2359951
8645 -2359951 -3484857 -3925729 -3409917 -2691383 -2200605 -2071509 -2575165 -3440117 -4112757
8636 -4112757 -4662283 -5122239 -5017163 -4173704 -3022126 -2320787 -1825897 -689147 644249
8627 644249 1107665 577106 -452590 -1702081 -2824740 -3696519 -4263739 -4327555 -3927421
8618 -3927421 -3520285 -3274954 -3067324 -2779321 -2374613 -2184023 -2443894 -2690360 -2206761 -1256326
8608 -1256326 -465103 176576 208618 -757560 -1894105 -2595837 -3212994 -4001545 -4558730 -4524299
8598 -4524299 -4163228 -3755504 -3202903 -2498355 -1930979 -1662025 -1869388 -2384595 -3112267 -4041332
8588 -4041332 -4774446 -5072598 -4677078 -3383673 -1786322 -635201 -64253 -286562 -1348638
$$ packed form
8655a88680l18504L48111R42698O76891j08547p96653j165543p45278k75549p28897
8645b359951j124906m40872N15812P18534M90778J29096n03656q64952o72640
8636d112757n49526m59956J05076Q43459J151578P01339M94890J136750J333396
8627F44249M63416n30559j029696j249491j122659q71779n67220o3816M00134
8618c927421M07136K45331K07630K88003M04708J90590k59871k46466M83599R50435
8608a256326P91223O41679L2042r66178j136545p01732o17157p88551n57185L4431
8598d524299L61071M07724N52601P04548N67376K68954k07363n15207p27672r29065
8588d041332p33114k98152L95520J293405J597351J151121N70948k22309j062076
$$ plain form
8579 -1348638 -2654177 -3534913 -3893035 -4053800 -4060881 -3743053 -3228227 -2734515 -2295915 -1686579
8569 -1686579 -894005 -190010 336794 532484 -95320 -1421327 -2472429 -2807584 -2436507
8560 -2436507 -1835849 -1568911 -1544861 -1603082 -1509223 -1334104 -1332600 -1705905 -2796749 -4183301
8550 -4183301 -4847085 -4150232 -2235785 -317945 567137 233950 -1017851 -2226624 -2659120
8541 -2659120 -2711862 -2700393 -2626616 -2627677 -2774026 -2754526 -2267998 -1755848 -1552380 -1456601 -1297919
8530 -1297919 -1075494 -1115263 -1841554 -2967017 -3378074 -2601619 -1419440 -899910 -1029434
8521 -1029434 -982295 -743221 -621854 -517716 -405136 -251886 18019 6662 -564005 -1340872
8511 -1340872 -1514624 -745718 477900 1357837 1282859 575436 128637 249577 390208 612058
$$ packed form
8579a348638j305539q80736l58122j60765p081L17828N14826M93712M38600O09336
8569a686579P92574P03995N26804J95690o27804j326007j051102l35155L71077
8560b436507O00658K66938K4050n8221R3859J75119J504l73305j090844j386552
8550d183301o63784O96853J914447J917840Q85082l33187j251801j208773m32496
8541b659120n2742J1469P3777j061j46349J9500M86528N12150K03468R5779J58682
8530a297919K22425l9769p26291j125463m11057P76455J182179N19530j29524
8521a029434M7139K39074J21367J04138J12580J53250K69905j1357n70667p76867
8511a340872j73752P68906J223618Q79937p4978p07423m46799J20940J40631K21850
$$ plain form
8501 612058 1359516 2299027 2866867 3090900 3107998 2799723 2130651 1172875 128164 -309523
8491 -309523 246242 1331127 2368537 3341905 4167313 4447370 4073801 3154044 1832393
8482 1832393 425509 -637051 -1228133 -1091046 -319399 70354 -549379 -1632870 -2449513
8473 -2449513 -2554982 -1681805 -77960 1661416 2746091 3094672 3360224 3681769 3692140
8464 3692140 3238171 3010827 3348752 3977700 4602308 5066130 4987901 4356700 3848125 3777229
8454 3777229 3917904 4056988 4110171 3737656 2992817 2359858 1879378 1180804 462818 157642
8444 157642 166421 182060 149680 230209 689138 1167543 1306188 1220227 811190 482350 583273
8433 583273 655504 492283 230762 -139071 -640794 -1379697 -2144180 -2555744 -2722802 -2888341
$$ packed form
8501F12058P47458R39511N67840K24033J7098l08275o69072r57776j044711m37687
8491c09523N55765J084885J037410R73368Q25408K80057l73569r19757j321651
8482A832393j406884j062560n91082J37087P71647L89753o19733j083491q16643
8473b449513j05469Q73177J603845J739376J084675L48581K65552L21545J0371
8464C692140m53969k27344L37925O28948O24608M63822p8229o31201n08575p0896
8454C777229J40675J39084N3183l72515p44839o32959m80480o98574p17986l05176
8444A57642Q779J5639l2380Q0529M58929M78405J38645q5961m09037l28840J00923
8433E83273P2231j63221k61521l69833n01723p38903p64483m11564j67058j65539
$$ plain form
8423 -2888341 -2851081 -2704201 -2654999 -2319888 -1174686 394277 1280484 1097545 377797 -172512
8413 -172512 -720092 -1808934 -3116839 -3665255 -3201847 -2177068 -1063400 -323520 -111979
8404 -111979 -559148 -1525107 -2453292 -3082981 -3462929 -3649676 -3611300 -2909199 -1318320 441738
8394 441738 1616449 2199068 2402947 1987187 855575 -405658 -1215730 -1190510 -628832
8385 -628832 -71837 467755 1069495 1569453 1812129 1674839 949775 -168961 -1083633 -1548232
8375 -1548232 -1573794 -1279864 -720402 -181318 -145434 -337750 -65293 657114 1262515 1297279
8365 1297279 940164 766810 662637 599407 1123889 1901891 2055091 1616519 1105960 822240
8355 822240 719886 603601 724404 1336644 2326985 3446356 3939570 3608957 3211996 3011370
$$ packed form
8423b888341L7260J46880M9202L35111J145202J568963Q86207j82939p19748n50309
8413a72512n47580j088842j307905n48416M63408J024779J113668P39880K11541
8404a11979m47169r65959r28185o29689l79948j86747L8376P02101J590879J760058
8394D41738J174711N82619K03879m15760j131612j261233q10072K5220N61678
8385f28832N56995N39592O01740M99958K42676j37290p25064j118736r14672m64599
8375a548232k5562K93930N59462N39084L5884j92316K72457P22407O05401L4764
8365A297279l57115j73354j04173o3230N24482P78002J53200m38572n10559k83720
8355H22240j02354j16285J20803O12240R90341J119371M93214l30613l96961k00626
$$ plain form
8345 3011370 2730244 2358861 2121893 1854938 1102206 -192171 -1448060 -2152186 -2563121
8336 -2563121 -3012011 -3340447 -3779558 -4715717 -5765860 -6658278 -7354035 -7170202 -5953230
8327 -5953230 -4617291 -4081508 -4405307 -4549646 -4035373 -3686244 -4334881 -5680676 -7100861
8318 -7100861 -8003247 -7974897 -7480618 -7155861 -6802543 -5725249 -3625377 -1175067 845472
8309 845472 2098226 2470560 2589777 3202288 4068959 4318181 3925979 3395140 3017745 2781411
8299 2781411 2243115 1155101 -228910 -1185239 -1215008 -924317 -832532 -846700 -857053 -830857
8289 -830857 -915474 -953052 -575477 219187 961045 1403721 1789863 2109936 2061440 1193107
8279 1193107 -517099 -2532644 -4136813 -4761388 -4148621 -2591682 -750742 865866 1711270
$$ packed form
8345C011370k81126l71383k36968k66955p52732j294377j255889p04126m10935
8336b563121m48890l28436m39111r36159j050143q92418o95757J83833J216972
8327e953230J335939N35783l23799j44339N14273L49129o48637j345795j420185
8318g100861r02386K8350M94279L24757L53318J077294K099872K450310K020539
8309H45472J252754L72334J19217O12511Q66671K49222l92202n30839l77395k36334
8299B781411n38296j088014j384011r56329k9769K90691R1785j4168j0353K6196
8289h30857q4617l7578L77575P94664P41858M42676L86142L20073m8496q68333
8279A193107j710206k015545j604169o24575O12767J556939J840940J616608Q45404
$$ plain form
8270 1711270 1491657 542340 -538613 -1381853 -1714222 -1693235 -1403833 -782414 -143461 -178515
8260 -178515 -1144877 -1868196 -1788786 -1344231 -656630 167039 1314428 2552409 3327306 3531069
8250 3531069 3196400 2623047 1992016 1363399 1144207 1477275 1972454 2042380 1807047 1576829
8240 1576829 1325179 1211903 1423034 1621644 1318908 525699 -169414 -305736 59662 582893
8230 582893 1110889 1658664 2149859 2488520 2481763 2392618 2339222 1821795 796255 -289526
8220 -289526 -1252827 -2116543 -2937142 -3303978 -2610581 -1256527 -68312 601460 779809
8211 779809 1115742 1890679 3072527 4507393 5497893 5630968 5317069 5132680 4904624
8202 4904624 4083392 2737332 1571257 1500661 2531957 3726184 4797972 5746866 6366813
$$ packed form
8270A711270k19613r49317j080953q43240l32369K0987K89402O21419O38953l5054
8260a78515r66362p23319P9410M44555O87601Q23669J147389J237981P74897K03763
8250C531069l34669n73353o31031o28617k19192L33068M95179O9926k35333k30218
8240A576829k51650j13276K11131J98610l02736p93209o95113j36322L65398N23231
8230E82893N27996N47775M91195L38661o757q9145n3396n17427j025540j085781
8220b89526r63301q63716q20599l66836O93397J354054J188215O69772J78349
8211G79809L35933P74937J181848J434866R90500J33075l13899j84389k28056
8202D904624q21232j346060j166075p0596J031296J194227J071788R48894O19947
$$ plain form
8193 6366813 6220057 4826534 2758712 1058056 -16048 -244738 527339 1847855 3461731
8184 3461731 4939065 5518838 5456056 5145313 4112819 2538906 1291930 426006 -258108
8175 -258108 -646809 -556175 -98677 38106 -159133 -345802 -459467 -280884 21572 70963
8165 70963 59170 -211288 -781781 -1064204 -1236665 -1779890 -2185218 -1654135 -472745 487454
8155 487454 1043936 1487500 1838729 2113420 2441357 2944956 3163403 2711856 2130164 1820291
8145 1820291 1850301 2167668 2713122 3364963 3976469 4323959 4222570 3836243 3313925 2844620
8135 2844620 2570738 2270560 2042423 2295928 2798274 2987898 3074343 3329180 3606704 4021141
8125 4021141 4396554 4340928 3891694 3114792 2437149 2163989 1837186 1090843 -26528 -1358199
$$ packed form
8193F366813j46756j393523k067822j700656j074104k28690P72077J320516J613876
8184C461731J477334N79773o2782l10743j032494j573913j246976q65924o84114
8175b58108l88701R0634M57498J36783j97239j86669j13665J78583L02456M9391
8165G0963j1793k70458n70493k82423j72461n43225m05328N31083J181390R60199
8155D87454N56482M43564L51229K74691L27937N03599K18447m51547n81692l09873
8145A820291L0010L17367N45454O51841O11506L47490j01389l86327n22318m69305
8135B844620k73882l00178k28137K53505N02346J89624Q6445K54837K77524M14437
8125D021141L75413n5626m49234p76902o77643k73160l26803p46343j117371j331671
$$ plain form
8115 -1358199 -2493389 -2711748 -2071400 -1462220 -1269818 -1188601 -1330840 -2059566 -3124841
8106 -3124841 -4337739 -5465577 -6052351 -5644318 -4098852 -1863461 624894 2764432 3988471
8097 3988471 4102512 3460015 2827079 2420072 1924012 1384339 1034655 1087613 1620521 2382311
8087 2382311 2955668 2964789 2598136 2187088 2001081 2018403 1960411 1685429 1145658 687250
8077 687250 656883 1336014 2523909 3633259 4419721 4999233 5172340 4911463 4592570 4610926
8067 4610926 5134447 5700254 5889776 5709216 5437577 4853370 3585100 2310216 1621581
8058 1621581 1167752 672454 441333 1143894 2675597 3957229 4252878 3676250 2530189
8049 2530189 1130804 215425 264597 896971 1606962 2148025 2094027 1231446 -144372 -1491631
$$ packed form
8115a358199j135190k18359O40348O09180J92402Q1217j42239p28726j065275
8106c124841j212898j127838n86774M08033J545466K235391K488355K139538J224039
8097C988471J14041o42497o32936m07007m96060n39673l49684N2958N32908P61790
8087B382311N73357R121l66653m11048j86007J7322n7992k74982n39771m58408
8077F87250l0367O79131J187895J109350P86462N79512J73107k60877l18893J8356
8067D610926N23521N65807J89522j80560k71639n84207j268270j274884o88635
8058A621581m53829m95298k31121P02561J531703J281632K95649n76628j146061
8049B530189j399385r15379M9172O32374P09991N41063n3998q62581j375818j347259
$$ plain form
8039 -1491631 -2289439 -2328249 -2008398 -1823837 -1775196 -1530293 -1063337 -611882 -35534 871568
8029 871568 2214017 3604053 4330288 4090677 3011311 1669359 809907 360305 51321
8020 51321 110222 562196 1265520 1932805 2324348 2330568 1858376 1103149 292257 -361482
8010 -361482 -526823 -46197 731576 1401985 1842963 1738631 942218 -124980 -860298 -1129641
8000 -1129641 -1378299 -1745954 -1957541 -1881716 -1387416 -693366 -244800 -144614 -264856 -220109
7990 -220109 137552 176581 -155506 -262714 69242 842271 1794986 2515884 3055235 3675661
7980 3675661 4093407 3678618 2434076 1092767 140385 -592966 -1367320 -2049716 -2355673
7971 -2355673 -2480556 -2918240 -3514865 -3474510 -2555118 -1207246 197834 1375901 1773723
$$ packed form
8039a491631p97808l8810L19851J84561M8641K44903M66956M51455N76348R07102
8029H71568J342449J390036P26235k39611j079366j341952q59452m49602l08984
8020E1321N8901M51974P03324O67285L91543O220m72192p55227q10892o53739
8010c61482j65341M80626P77773O70409M40978j04332p96413j067198p35318k69343
8000a129641k48658l67655k11587P5825M94300O94050M48566J00186j20242M4747
7990b20109L57661L9029l32087j07208L31956P73029R52715P20898N39351O20426
7980C675661M17746m14789j244542j341309r52382p33351p74354o82396l05957
7971b355673j24883m37684n96625M0355R19392J347872J405080J178067L97822
$$ plain form
7962 1773723 1243146 332301 -338237 -157710 1033775 2713381 4148872 4851872 4452198
7953 4452198 2820339 531582 -1697723 -3600364 -4850461 -5278912 -4835610 -3754125 -2809799
7944 -2809799 -2525531 -2485423 -2141682 -1256310 -12483 1416410 2761939 3241180 2711633
7935 2711633 2039824 1981011 2650138 3912650 5283110 6270989 6519815 5917723 4556173
7926 4556173 2992093 2033282 1922590 2192686 2082420 1264117 213402 -805972 -1712632
7917 -1712632 -2325582 -2592707 -2669321 -2657203 -2584222 -2653734 -2851932 -3037309 -2940184 -2257903
7907 -2257903 -925092 265828 491686 69070 -571415 -1323565 -2043603 -2841170 -3823533
7898 -3823533 -5072510 -6689830 -8355251 -9484970 -9687975 -8792613 -7036914 -5248603 -4354020
$$ packed form
7962A773723n30577r10845o70538J80527J191485J679606J435491P03000l99674
7953D452198j631859k288757k229305j902641j250097m28451M43302J081485R44326
7944b809799K84268M0108L43741Q85372J243827J428893J345529M79241n29547
7935B711633o71809n8813O69127J262512J370460R87879K48826o02092j361550
7926D556173j564080r58811j10692K70096j10266q18303j050715j019374r06660
7917a712632o12950k67125p6614J2118P2981o9512j98198j85377R7125O82281
7907b257903J332811J190920K25858m22616o40485p52150p20038p97567r82363
7898c823533j248977j617320j665421j129719k03005Q95362J755699J788311Q94583
$$ plain form
7889 -4354020 -4429617 -4827676 -4675481 -3831171 -2909885 -2134859 -1441422 -991870 -790198 -431692
7879 -431692 34819 431923 797535 1143721 1632831 2153345 2645597 2858457 2583345 1989844
7869 1989844 1121860 -73713 -949426 -930611 -561805 -743860 -1612628 -2519969 -2879555 -2851389
7859 -2851389 -2588578 -1820255 -762285 146749 796563 1028212 548893 -206234 -583679
7850 -583679 -209931 882754 2264716 3601010 4750874 5397701 5659680 5791335 5369470
7841 5369470 4044285 2234878 691578 -302340 -823449 -1080200 -1308728 -1679270 -2136514
7832 -2136514 -2467737 -2607568 -2488640 -2042248 -1235086 -79671 1186466 2210921 3220005
7823 3220005 4508224 5546508 5906264 5758327 5612404 5395261 4679683 3534691 2539363
$$ packed form
7889d354020p5597l98059J52195Q44310R21286P75026O93437M49552K01672L58506
7879d31692M66511L97104L65612L46186M89110N20514M92252K12860k75112n93501
7869A989844q67984j195573q75713J8815L68806j82055q68768r07341l59586K8166
7859b851389K62811P68323J057970R09034O49814K31649m79319p55127l77445
7850e83679L73748J092685J381962J336294J149864O46827K61979J31655m21865
7841E369470j325185j809407j543300r93918n21109k56751k28528l70542m57244
7832b136514l31223j39831J18928M46392Q07162J155415J266137J024455J009084
7823C220005J288219J038284L59756j47937j45923k17143p15578j144992r95328
$$ plain form
7814 2539363 2162308 2053417 1641229 1155442 1115778 1203515 598825 -819890 -2144600 -2673873
7804 -2673873 -2482782 -1827595 -704775 650339 1973666 2749802 2652715 2136507 1507486
7795 1507486 904353 87040 -1088869 -1982302 -2029916 -1298246 -20411 1111734 1211081
7786 1211081 718422 373255 160043 -269508 -709930 -435014 615404 1774544 2371651
7777 2371651 2218723 2119101 2951812 4137139 4512282 4116874 3448284 2817562 2442608 2090959
7767 2090959 1446420 552402 -790523 -2239341 -3116325 -3258805 -2514753 -1117219 164482
7758 164482 876153 1392370 2240747 3181594 3465955 2855338 2062138 1979284 2633513 3558400
7748 3558400 3989871 3569799 2784166 2167232 1639350 723090 -594430 -1809697 -2485469
$$ packed form
7814B539363l77055j08891m12188m85787l9664Q7737o04690j418715j324710n29273
7804b673873J91091O55187J122820J355114J323327P76136r7087n16208o29021
7795A507486o03133q17313j175909q93433m7614P31670J277835J132145R9347
7786A211081m92659l45167k13212m29551m40422K74916J050418J159140N97107
7777B371651j52928r9622Q32711J185327L75143l95408o68590o30722l74954l51649
7767B090959o44539q94018j342925j448818q76984j42480P44052J397534J281701
7758A64482P11671N16217Q48377R40847K84361o10617p93200q2854O54229R24887
7748C558400M31471m20072p85633o16934n27882r16260j317520j215267o75772
$$ plain form
7739 -2485469 -2358415 -1473227 -13631 1516980 2472979 2526854 1783548 638742 -408182
7730 -408182 -907810 -828328 -527087 -112306 514456 1127276 1457375 1676340 2025581 2697580
7720 2697580 3800440 4738779 4896253 4666371 4700744 5101130 5744182 6409972 6686584 6536085
7710 6536085 6318696 6147399 5768627 4902619 4002010 3527195 3287155 3166794 3064375 2882404
7700 2882404 2715031 2597978 2338327 1771438 1237996 908429 588984 529913 998704 1618401
7690 1618401 1635473 1307345 1572567 2573068 3649800 4487884 5041257 5307254 5208313 4891008
7680 4891008 4678572 4340856 3583948 2370861 861613 -972544 -2940602 -4454112 -5043435
7671 -5043435 -4373168 -2837823 -1440979 -904385 -1341980 -1966522 -1707102 -797484 -287963
$$ packed form
7739b485469J27054Q85188J459596J530611R55999N3875p43306j144806j046924
7730d08182m99628P9482L01241M14781O26762O12820L30099K18965L49241O71999
7720B697580J102860R38339J57474k29882L4373M00386O43052O65790K76612j50499
7710F536085k17389j71297l78772q66008r00609m74815k40040j20361j02419j81971
7700B882404j67373j17053k59651n66889n33442l29567l19445n9071M68791O19697
7690A618401J7072l28128K65222J000501J076732Q38084N53373K65997r8941l17305
7680D891008k12436l37716p56908j213087j509248j834157j968058j513510n89323
7671e043435O70267J535345J396844N36594m37595o24542K59420R09618N09521
$$ plain form
7662 -287963 -218235 -87043 105796 242422 169129 -369996 -854436 -106124 1719996 3529393
7652 3529393 4673311 4894823 4273862 3411276 2929954 2949553 3297279 3721172 3786621 3111344
7642 3111344 2291263 1731758 1083668 584292 630777 890338 1234430 1769947 2101841 2381716
7632 2381716 2961134 3471968 3411251 2751443 1901510 1252090 779812 424307 364503 467180
7622 467180 470141 445661 292697 -59848 -188645 -99970 -110771 -592524 -1451755 -1877122 -1408777
7611 -1408777 -264118 1081583 2015137 2314065 2353660 2813130 3587649 4036595 3806566
7602 3806566 2983232 2265161 2072565 1873373 1052723 -38840 -601983 -241375 663584
7593 663584 1423683 1445681 639311 -131140 -239905 38530 84739 100444 719695 1679663
$$ packed form
7662b87963O9728J31192J92839J36626p3293n39125m84440P48312J826120J809397
7652C529393J143918K21512o20961q62586m81322J9599L47726M23893O5449o75277
7642C111344q20081n59505o48090m99376M6485K59561L44092N35517L31894K79875
7632B381716N79418N10834o0717o59808q49933o49420m72278l55505n9804J02677
7622D67180K961k4480j52964l52545j28797Q8675j0801m81753q59231m25367M68345
7611a408777J144659J345701R33554K98928L9595M59470P74519M48946k30029
7602C806566q23334p18071j92596j99192q20650j091563n63143L60608R04959
7593F63584P60099K1998q06370p70451j08765K78435M6209J5705O19251R59968
$$ plain form
7583 1679663 2445095 3187792 4251311 5441527 6223027 6350637 5899135 5174112 4676421
7574 4676421 4538446 4677722 4902900 4869711 4222221 2833208 1553141 1160006 1473859
7565 1473859 2061535 2578833 2558750 1947285 1424873 1412097 1975548 2959213 4109722 5228261
7555 5228261 6127449 6720208 7150725 7561890 7657516 7561631 7789072 7981758 7723130 7473659
7545 7473659 7377432 7005401 6104547 4626597 2687184 777378 -634767 -1318502 -1535941
7536 -1535941 -1535665 -1053517 171857 2005988 3745720 4824890 5458252 5833774 5403330
7527 5403330 4095989 2500447 1403356 722033 -345149 -1686746 -2771230 -2930027 -1601729
7518 -1601729 616282 2741320 4041683 4066976 2952957 1368684 -3883 -1050995 -2073253
$$ packed form
7583A679663P65432P42697J063519J190216P81500J27610m51502p25023m97691
7574D676421j37975J39276K25178l3189o47490j389013j280067l93135L13853
7565A473859N87676N17298k0083o11465n22412j2776N63451R83665J150509J118539
7555E228261Q99188N92759M30517M11165R5626r5885K27441J92686k58628k49471
7545G473659r6227l72031r00854j477950j939413j909806j412145o83735k17439
7536a535941K76M82148J225374J834131J739732J079170O33362L75522m30444
7527E403330j307341j595542j097091o81323j067182j341597j084484j58797J328298
7518a601729K218011K125038J300363K5293j114019j584273j372567j047112j022258
$$ plain form
7509 -2073253 -2705156 -2631553 -2156907 -1420955 -613210 -206690 -258817 -380669 -440165 -398334
7499 -398334 -246436 -80291 36154 243261 668509 1301459 1875837 2050975 2067924 2250706
7489 2250706 2633106 3125120 3722253 4391733 5012329 5333132 5214773 4822912 4523442 4382812
7479 4382812 4183052 4074082 4183460 4505315 4834841 4512992 3655669 2855893 2258548 1658768
7469 1658768 901152 61394 -928670 -1685829 -1562591 -545819 963234 2510878 3746806
7460 3746806 4336740 4112269 3483959 2943092 2771871 2877068 3157389 3753410 4571126 5409551
7450 5409551 5960442 5766429 4720784 3104167 1515973 632858 306314 72224 -50569
7441 -50569 -313789 -960753 -1208334 -511992 439640 950193 1332284 1804162 2438662 3295744
$$ packed form
7509b073253o31903P3603M74646P35952Q07745M06520n2127j21852n9496M1831
7499c98334J51898J66145J16445K07107M25248O32950N74378J75138J6949J82782
7489B250706L82400M92014N97133O69480O20596L20803j18359l91861k99470j40630
7479D382812j99760j08970J09378L21855L29526l21849q57323p99776n97345n99780
7469A658768p57616q39758r90064p57159J23238J016772J509053J547644J235928
7460C746806N89934k24471o28310n40867j71221J05197K80321N96021Q17716Q38425
7450E409551N50891j94013j045645j616617j588194q83115l26544k34090j22793
7441e0569k63220o46964k47581O96342R51632N10553L82091M71878O34500Q57082
$$ plain form
7431 3295744 3941220 4069628 4000524 4011090 4108665 4078858 3443952 2236384 848740 34833
7421 34833 232254 969181 1826021 2844491 3758626 4355699 4799532 5152641 5359175 5365540
7411 5365540 5244952 5270676 5342999 5021990 3916312 2238459 895057 689185 1438231
7402 1438231 2544287 3282751 3159211 2476469 1842547 1102825 -302580 -1711150 -1609514
7393 -1609514 195647 2422229 3706389 4120134 4622630 5170941 5251804 5267905 5710303
7384 5710303 6221466 6414733 6177192 5539184 5191152 5545568 6181442 6220833 4978005 2890941
7374 2890941 808960 -609034 -1342417 -1733188 -2080860 -2690081 -3671823 -5335793 -7041902
7365 -7041902 -7392000 -6506876 -5029236 -3266770 -1591450 -503910 -75730 379424 1499225
$$ packed form
7431C295744O45476J28408o9104J0566R7575k9807o34906j207568j387644q13907
7421C4833J97421P36927Q56840J018470R14135N97073M43833L53109K06534O365
7411E365540j20588K5724P2323l21009j105678j677853j343402k05872P49046
7402A438231J106056P38464j23540o82742o33922p39722j405405j408570J01636
7393a609514J805161K226582J284160M13745N02496N48311Q0863J6101M42398
7384E710303N11163J93267k37541o38008l48032L54416O35874L9391j242828k087064
7374B890941k081981j417994p33383l90771l47672o09221r81742j663970j706109
7365g041902l50098Q85124J477640J762466J675320J087540M28180M55154J119801
$$ plain form
7356 1499225 3187425 4644252 5405950 5755296 5772342 5625444 5409549 5054384 4838548
7347 4838548 4506692 3482880 2413285 2246334 2608794 2642742 2393688 2621826 3562961
7338 3562961 4479780 4838382 4819596 4692528 4441298 3925821 3363450 2888428 2200660 1096582
7328 1096582 -160826 -839472 -579487 298325 1162540 1763819 2374923 3071721 3849412
7319 3849412 4691131 5001922 4492402 3791641 3213785 2897299 3140754 3852532 4790682 5543094
7309 5543094 5955517 6176846 6095224 5575084 5355128 6213964 7396844 7858468 7586148 7099735
7299 7099735 6869831 6606392 5941928 4833834 3362024 1860305 707209 56568 -39955
7290 -39955 566071 1384489 1639175 1470615 1483820 1469576 1298626 1336029 1598908 2005040
$$ packed form
7356A499225J688200J456827P61698L49346J7046j46898k15895l55165k15836
7347D838548l31856j023812j069595j66951L62460L3948k49054K28138R41135
7338C562961R16819L58602j8786j27068k51230n15477n62371m75022o87768j104078
7328A096582j257408o78646K59985Q77812Q64215O01279O11104O96798P77691
7319C849412Q41719L10791n09520p00761n77856l16486K43455P11778R38150P52412
7309E543094M12423K21329q1622n20140k19956Q58836J182880M61624k72320m86413
7299G099735k29904k63439o64464j108094j471810j501719j153096o50641r6523
7290c9955O06026Q18418K54686j68560J3205j4244j70950L7403K62879M06132
$$ plain form
7280 2005040 2567874 2967899 2722475 1629125 230596 -708933 -967538 -722058 -56652
7271 -56652 451195 305715 -11189 100113 601614 800683 454909 -56436 -575894 -767558
7261 -767558 -222361 768898 1727107 1980697 1506447 1308446 1872525 3122522 4477522
7252 4477522 5486644 6261582 6775526 6785495 6080098 5062101 4507822 4663491 5416705 6456268
7242 6456268 7104647 6910960 6015477 5019871 4117570 3166453 2226021 1165601 191278
$$ packed form
7280B005040N62834M00025k45424j093350j398529r39529k58605K45480O65406
7271e6652N07847j45480l16904J11302N01501J99069l45774n11345n19458j91664
7261g67558N45197R91259R58209K53590m74250j98001N64079J249997J355000
7252D477522J009122P74938N13944R969p05397j017997n54279J55669P53214J039563
7242F456268O48379j93687q95483r95606r02301r51117r40432j060420r74323
$$ [...]
##END NTUPLES=NMR SPECTRUM
##END=
