##TITLE=dept_SR163_k_TFA CH-,CH3- -up, CH2- -down
 DMSO-d6, 1000 sc
 17.02.2023
##JCAMPDX= 6.0         $$ Bruker NMR JCAMP-DX V2.0
##DATA TYPE= NMR SPECTRUM
##DATA CLASS= NTUPLES
##ORIGIN= UXNMR, Bruker Analytische Messtechnik GmbH
##OWNER= root
$$ XWIN-NMR		Version 3.5
$$ Fri Feb 17 16:40:11 2023 Russian Standard Time (UT+4h)  she@DPX200
##.OBSERVE FREQUENCY= 50.327992884445
##.OBSERVE NUCLEUS= ^13C
##.ACQUISITION MODE= SIMULTANEOUS
##.ACQUISITION SCHEME= undefined
##.AVERAGES= 1001
##.DIGITISER RES= 17
##SPECTROMETER/DATA SYSTEM= spect
##.PULSE SEQUENCE= dept135
##.SOLVENT NAME= DMSO
##.SHIFT REFERENCE= (INTERNAL, DMSO, 0, 214.665)
##AUDIT TRAIL= $$ (NUMBER, WHEN, WHO, WHERE, WHAT)
$$ ##TITLE= Audit trail, XWIN-NMR		Version 3.5
$$ ##JCAMPDX= 5.01
$$ ##ORIGIN= Bruker BioSpin GmbH
$$ ##OWNER= she
$$ F:/spectra/data/she/nmr/depta/1/pdata/1/auditp.txt
$$ ##AUDIT TRAIL=  $$ (NUMBER, WHEN, WHO, WHERE, WHAT)
(   1,<2023-02-17 16:38:40.76 +0400>,<she>,<DPX200>,
      <created by zg, POWCHK disabled, PULCHK disabled
       terminated by command 'halt'
       configuration hash MD5:
       00 E9 B6 7A A2 85 ED C7 34 08 36 98 17 FE 4E 26
       data hash MD5: 16K
       77 80 69 DD 2C 41 D4 BE A7 31 6B E1 B9 71 AE 64>)
(   2,<2023-02-17 16:38:45.81 +0400>,<she>,<DPX200>,
      <Start of raw data processing
       efp BC_mod = 2 LB = 3.5 FT_mod = 6 PKNL = 1 PHC0 = -3637.906 PHC1 = -1048.601 SI = 16K 
       data hash MD5: 16K
       99 54 F5 7D 13 63 C2 9B E6 36 9E 1D 76 3F C4 E2>)
(   3,<2023-02-17 16:39:20.48 +0400>,<she>,<DPX200>,
      <pk PHC0 = -44.5076 PHC1 = 9.800003 
       data hash MD5: 16K
       18 BF B4 AA 34 47 19 99 9F 2D AE 0B D9 CB B9 D7>)
$$ ##END=
$$ 
$$ hash MD5
$$ 6F 5A 6F 5D C9 CD CE AF FF A5 67 4C 32 68 5D 48
##$RELAX= 
##$RELAX= 
##$RELAX= 
##$RELAX= 
##$RELAX= 
##$RELAX= 
##$RELAX= 
##$RELAX= 
$$ Bruker specific parameters
$$ --------------------------
##$DU= <F:/spectra>
##$EXPNO= 1
##$NAME= <depta>
##$PROCNO= 1
##$TYPE= <nmr>
##$USER= <she>
##$AMP= (0..31)
100 100 100 100 100 100 100 100 100 100 100 100 100 100 100 100 100 100 
100 100 100 100 100 100 100 100 100 100 100 100 100 100 
##$AQSEQ= 0
##$AQ_mod= 1
##$AUNM= <au_zg>
##$AUTOPOS= <>
##$BF1= 50.322709
##$BF2= 200.13
##$BF3= 200.13
##$BF4= 200.13
##$BF5= 200.13
##$BF6= 200.13
##$BF7= 200.13
##$BF8= 200.13
##$BYTORDA= 1
##$CFDGTYP= 0
##$CFRGTYP= 5
##$CHEMSTR= <none>
##$CNST= (0..31)
1 1 145 1 1 1 1 1 1 1 1 1 1 1 1 1 1 1 1 1 1 1 1 1 1 1 1 1 1 1 1 1 
##$CPDPRG= <>
##$CPDPRG1= <waltz16>
##$CPDPRG2= <waltz16>
##$CPDPRG3= <>
##$CPDPRG4= <mlev>
##$CPDPRG5= <mlev>
##$CPDPRG6= <mlev>
##$CPDPRG7= <mlev>
##$CPDPRG8= <mlev>
##$CPDPRGB= <>
##$CPDPRGT= <>
##$D= (0..31)
0 2 0.003448276 0 0 0 0 0 0 0 0 0 2e-05 0 0 0 0 0 0 0 0 0 0 0 0 0 0 0 
0 0 0 0 
##$DATE= 1676636760
##$DBL= (0..7)
120 120 120 120 120 120 120 120 
##$DBP= (0..7)
150 150 150 150 150 150 150 150 
##$DBP07= 0
##$DBPNAM0= <>
##$DBPNAM1= <>
##$DBPNAM2= <>
##$DBPNAM3= <>
##$DBPNAM4= <>
##$DBPNAM5= <>
##$DBPNAM6= <>
$$ [...]
##$SUBNAM2= <"">
##$SUBNAM3= <"">
##$SUBNAM4= <"">
##$SUBNAM5= <"">
##$SUBNAM6= <"">
##$SUBNAM7= <"">
##$SUBNAM8= <"">
##$SUBNAM9= <"">
##$SW= 219.3118970423
##$SWIBOX= (0..15)
0 1 3 0 0 0 0 0 0 0 0 0 0 0 0 0 
##$SW_h= 11037.527593819
##$TD= 16384
##$TD0= 1
##$TE= 0
##$TE2= 300
##$TE3= 300
##$TEG= 300
##$TL= (0..7)
120 120 120 120 120 120 120 120 
##$TP= (0..7)
150 150 150 150 150 150 150 150 
##$TP07= 0
##$TPNAME0= <>
##$TPNAME1= <>
##$TPNAME2= <>
##$TPNAME3= <>
##$TPNAME4= <>
##$TPNAME5= <>
##$TPNAME6= <>
##$TPNAME7= <>
##$TPOAL= (0..7)
0.5 0.5 0.5 0.5 0.5 0.5 0.5 0.5 
##$TPOFFS= (0..7)
0 0 0 0 0 0 0 0 
##$TUNHIN= 0
##$TUNHOUT= 0
##$TUNXOUT= 0
##$USERA1= <user>
##$USERA2= <user>
##$USERA3= <user>
##$USERA4= <user>
##$USERA5= <user>
##$V9= 5
##$VALIST= <valist>
##$VCLIST= <CCCCCCCCCCCCCCC>
##$VD= 0
##$VDLIST= <DDDDDDDDDDDDDDD>
##$VPLIST= <PPPPPPPPPPPPPPP>
##$VTLIST= <TTTTTTTTTTTTTTT>
##$WBST= 1024
##$WBSW= 2
##$XGAIN= (0..3)
0 0 0 0 
##$XL= 0
##$YL= 0
##$YMAX_a= 970295
##$YMIN_a= -851542
##$ZGOPTNS= <>
##$ZL1= 120
##$ZL2= 120
##$ZL3= 120
##$ZL4= 120
##$ABSF1= 0
##$ABSF2= 0
##$ABSG= 0
##$ABSL= 0
##$ALPHA= 0
##$AQORDER= 0
##$ASSFAC= 0
##$ASSFACI= 0
##$ASSFACX= 0
##$ASSWID= 0
##$AUNMP= <proc_1d>
##$AZFE= 0.1
##$AZFW= 0.1
##$BCFW= 0
##$BC_mod= 2
##$BYTORDP= 0
##$COROFFS= 0
##$CY= -3
##$DATMOD= 1
##$DC= 0
##$DFILT= <>
##$DTYPP= 0
##$F1P= 0
##$F2P= 0
##$FCOR= 0.5
##$FTSIZE= 16384
##$FT_mod= 6
##$GAMMA= 0
##$GB= 0
##$INTBC= 1
##$INTSCL= 0
##$ISEN= 128
##$LB= 3.5
##$LEV0= 0
##$LPBIN= 0
##$MAXI= 10000
##$MC2= 0
##$MEAN= 0
##$ME_mod= 0
##$MI= 0.4000791
##$NCOEF= 0
##$NC_proc= -3
##$NLEV= 6
##$NOISF1= 120.0001
##$NOISF2= 80.00006
##$NSP= 0
##$NTH_PI= 0
##$NZP= 0
##$OFFSET= 214.6655
##$PC= 4
##$PHC0= -3682.414
##$PHC1= -1038.801
##$PH_mod= 1
##$PKNL= yes
##$PPARMOD= 0
##$PSCAL= 0
##$PSIGN= 0
##$REVERSE= no
##$SF= 50.3227091
##$SI= 16384
##$SIGF1= 140
##$SIGF2= 120
##$SINO= 80
##$SIOLD= 32768
##$SREGLST= <13C.CDCl3>
##$SSB= 0
##$STSI= 16384
##$STSR= 0
##$SW_p= 11037.527593819
##$SYMM= 0
##$S_DEV= 0
##$TDeff= 16384
##$TDoff= 0
##$TI= <>
##$TILT= no
##$TM1= 0
##$TM2= 0
##$TOPLEV= 0
##$USERP1= <user>
##$USERP2= <user>
##$USERP3= <user>
##$USERP4= <user>
##$USERP5= <user>
##$WDW= 1
##$XDIM= 16384
##$YMAX_p= 558408367
##$YMIN_p= -230069145
$$ End of Bruker specific parameters
$$ ---------------------------------
##NTUPLES= NMR SPECTRUM
##VAR_NAME=  FREQUENCY,     SPECTRUM/REAL,   SPECTRUM/IMAG
##SYMBOL=    X,             R,               I
##VAR_TYPE=  INDEPENDENT,   DEPENDENT,       DEPENDENT
##VAR_FORM=  AFFN,          ASDF,            ASDF
##VAR_DIM=   16384,         16384,           16384
##UNITS=     HZ,            ARBITRARY UNITS, ARBITRARY UNITS
##FACTOR=    0.67371834180669, 1,            1
##FIRST=     10802.5493505904, 0,            0
##LAST=      -234.978243228581, 0,           0
##MIN=       -234.978243228581, -230069145,  0
##MAX=       10802.5493505904, 558408367,    0
$$ Real data points
##PAGE= N=1
##DATA TABLE= (X++(R..R)), XYDATA
$$ [...]
14476 -4335291 -4597938 -4632982 -4164217 -3294908 -3419231 -4740562 -6428428 -8210763 -9687393
14467 -9687393 -9968636 -8673490 -6925484 -4852091 -1943182 -383442 -1750725 -3450059
14459 -3450059 -3542154 -3256756 -3932235 -5204175 -5500499 -4837957 -4369289 -3899943 -3243256
14450 -3243256 -2252337 390552 4485554 7756615 8699953 7924783 6934784 7650914 9853509
14441 9853509 11705056 12558870 12498918 11484472 9193297 7132632 6675978 7084873 7565322
14432 7565322 7518622 6534386 5215451 5098094 7197463 10514618 12704590 12699937 10558957
14423 10558957 6785339 2831849 -1026028 -5328378 -9175535 -11876401 -14059827 -16231657
14415 -16231657 -17279671 -16220123 -14363543 -13635147 -14540983 -16254363 -16671896 -14737168
14407 -14737168 -11948708 -9492081 -8585033 -9084623 -10664882 -12041029 -10739379 -6506175
14399 -6506175 -1321601 3427422 7304411 9551083 10602267 11288751 11941306 11860877 10869160
14390 10869160 9195279 6767082 4828841 4009217 3490075 3202978 3246660 3629216 3833627
14381 3833627 3453347 2523343 1388295 487051 -152789 -387004 -467277 -438701 -1030051 -2953248
14371 -2953248 -4522630 -4748297 -5179023 -6085141 -6500710 -6994888 -7891037 -8415909 -7550297
14362 -7550297 -5723047 -5051409 -5395317 -3431893 1340762 5246407 7030359 7669349 7916463
14353 7916463 8078728 7328386 5566390 3339287 773792 -1903962 -3803212 -5032409
14345 -5032409 -4890085 -2256540 725075 1427331 -547768 -3543486 -4615728 -2634116
14337 -2634116 1109202 4227949 4647767 2838448 389423 -889635 33318 993783 159881
14328 159881 -660660 556349 3151076 4908404 4824638 3144252 1433559 1199137 3121246
14319 3121246 6628478 9505650 10254170 9905572 10102771 10747286 11437805 11616501 9615791
14310 9615791 5779095 1965652 -2038367 -6229471 -8855058 -8865146 -6631661 -2803910
14302 -2803910 995623 2817163 3026325 3457798 4552896 5046836 4791880 5242211 7072164
14293 7072164 9257413 10277449 11058563 12974665 14078287 11982655 8171475 5379932
14285 5379932 3905181 3798192 5500869 8546448 11475739 12970863 13416144 13680099 13541911
14276 13541911 11750960 8444401 5778311 5257553 6242761 6474830 4639731 762033
14268 762033 -3898704 -8800892 -14897930 -21287799 -25075008 -24416031 -20476777 -15425258
14260 -15425258 -10226168 -5863932 -2967234 -2362789 -3971574 -5383049 -5821976 -7042471
14252 -7042471 -8838888 -8542166 -4877289 211828 3586104 4667552 4372241 3701151 2899725
14243 2899725 2584337 3946560 6703422 9361302 10617289 10000536 8379677 7231675
14235 7231675 7194142 7741967 8610419 10489816 12515413 12821183 11231178 8343642 5133160
14226 5133160 2941205 3251571 5881557 8756053 10570040 10999396 10585706 10224034 10388590
14217 10388590 11012619 11484679 11502969 11186161 9945401 7102874 3078137 -791847 -3771571
14208 -3771571 -6314758 -7972823 -7821174 -7355910 -8773572 -11466001 -13001925 -11482797
14200 -11482797 -7142213 -1816737 2871599 6155675 8104766 8721008 8469767 8427770 8634624
14191 8634624 7464013 5919538 6443724 8788150 11316569 13343476 13988738 13541398 12841930
14182 12841930 11941076 11309841 10666922 9601782 6357791 1076109 -3314188 -4769658
14174 -4769658 -3539329 -1803254 -279297 911267 2045553 4545983 7138749 8589559
14166 8589559 9681897 10946044 12581677 14410178 15713008 15851086 14720721 13077742
14158 13077742 12014326 11536391 11758111 14034660 17518882 19213710 18320395 16020157
14150 16020157 13243307 9598546 5137202 1497848 243868 1479648 3327531 3639224
14142 3639224 1625939 -792200 -2547622 -3345807 -3512769 -4497810 -5746753 -6083734 -6008710
14133 -6008710 -6144484 -5776100 -4169315 -1453035 2485401 7754238 12130291 13381115
14125 13381115 12558991 12604445 13146905 12208394 10339915 8378678 6078863 3393734 -903270
14116 -903270 -6651432 -11980832 -16504511 -19644383 -20363996 -18898886 -15559997 -10292830
14108 -10292830 -4466858 -880940 -491519 -1488986 -3018707 -5352212 -8260484 -10503392
14100 -10503392 -10834297 -9777611 -7663939 -4744158 -2849773 -2376199 -2091662 -1858061 -1611479
14091 -1611479 -1135463 -796279 26589 1256247 1626820 1883448 2874258 3984696 4379084
14082 4379084 3704520 1379688 -2203511 -5171992 -6424615 -5506343 -2759617 785958
14074 785958 4805187 7914086 8419513 5708144 333081 -4542809 -5272692 -2517444 600230
14065 600230 2061657 403734 -4087911 -8748414 -10390604 -8509830 -5441240 -3017593
14057 -3017593 -1242948 -417555 -1589292 -4234272 -6850109 -8507892 -8836592 -8322656 -6919700
14048 -6919700 -4390948 -1212825 2100344 4679332 5303474 3786765 1676558 602038
14040 602038 1316279 3910154 7051310 8861671 9530252 10310061 12180224 14684596 16770730
14031 16770730 18152716 18424903 18090861 18998315 21830690 24063196 22827260 19569485
14023 19569485 18156654 19154220 20050017 19036783 16176449 13708038 14153211 16607547
14015 16607547 19008820 20749620 21920529 22009665 21009575 19206494 16536738 13542902
14007 13542902 10926414 8625312 7018741 6451280 5959932 5508968 5783415 6230496 6865248
13998 6865248 8189758 9864424 10117752 7807467 3986714 -445477 -5233171 -8534894
13990 -8534894 -9661972 -8962310 -6829449 -4575048 -2856199 -1589371 -467573 60217
13982 60217 -945108 -1828669 -159223 3089259 5783856 6981207 6409351 3321038 -1431078
13973 -1431078 -4340065 -3881925 -2394769 -2044826 -3258260 -5710053 -7614697 -6268661
13965 -6268661 -2762735 -67212 2516429 6576577 9933063 10631607 8800048 5148494
13957 5148494 2046814 2035515 4419002 6904898 8511552 8634480 6754918 4145873 2227935
13948 2227935 938017 61138 -225080 -354879 -1249270 -2291250 -2323290 -887810 1624998
13939 1624998 4440135 6481240 6658525 5361581 3266120 1024462 -254485 -1056558
13931 -1056558 -2395856 -4336743 -7296406 -11552875 -15406280 -16442889 -14362897 -10760053
13923 -10760053 -6258092 -1039757 3623205 5843257 5057045 3020466 1735298 1409928
13915 1409928 931099 1397150 3759786 5715185 5857679 5138011 4238050 3278913 3158934
13906 3158934 4322813 6594279 10384275 14187766 16432083 16371869 14257158 11646405
13898 11646405 9079625 7783100 9316949 12300880 13778148 12765805 10373428 8177082
13890 8177082 5218621 -390494 -6743321 -10341269 -10095156 -7490532 -3958046 220640
13882 220640 4957415 8944464 11150074 11397574 9828475 7566876 6600688 7417066 9258481
13873 9258481 11293596 12408093 12783246 12326728 11604214 11329125 10475074 8156416 5911953
13864 5911953 5771467 7274732 9007839 9553064 9412599 9884208 11591348 14097348 15920792
13855 15920792 16590218 16490411 16204541 15886978 14435811 12543506 11819520 11137402 9903043
13846 9903043 8571526 7414813 6320274 5237314 4670231 4945005 5748207 6993329 8677174
13837 8677174 10642419 13056929 15444753 15977909 13891076 10553346 6893565 3578761
13829 3578761 2471695 3687778 5180296 5559706 5215106 4204050 3451843 4519946 6171967
13820 6171967 6972975 7691301 8280146 7737873 6016945 4544594 4406617 5821792 9059399
13811 9059399 13480930 17172556 18301333 16366061 12787814 8912831 5488738 3681625
13803 3681625 4452673 6526421 7396340 6651928 5754741 5844546 6458930 6820298 7124281
13794 7124281 7002811 5856020 4280217 2767079 936071 -1784644 -4402234 -5226322
13786 -5226322 -4493987 -3205884 -190852 4542506 7855383 7243256 3199185 -2750477
13778 -2750477 -8527463 -11964169 -12907768 -12130675 -10659992 -9623429 -8979048 -8939977 -9628188
13769 -9628188 -9993017 -9026983 -7084354 -3757942 767856 4698321 7410760 9270926
13761 9270926 10390444 11994830 14851854 17136076 17393854 16504021 16309811 16892637 17241224
13752 17241224 16740803 15599721 14494741 13097980 10766774 8036844 5804609 3221101
13744 3221101 275115 -1552991 -2552050 -4022286 -5231836 -5417768 -4661783 -2801040 -819733
13735 -819733 -290992 -95140 1187599 3527659 5576359 5417969 3133580 491165 -1025563
13726 -1025563 -2223753 -4533546 -8097008 -11570423 -13122416 -12428930 -11337570 -11168402
13718 -11168402 -11170250 -9688788 -7157768 -4342092 -1057576 1336707 1753833 1010500 360102
13709 360102 752444 2414680 4165574 4655056 3380417 21177 -3907760 -5958107 -6005809
13700 -6005809 -5573179 -4720633 -3130155 -1777496 -1306400 -1067448 -274517 919570 1923312
13691 1923312 2837278 3986606 5319412 6431073 6945359 7011767 7190659 7439840 6987642
13682 6987642 5081825 2748144 2006025 3257134 5173621 5738876 4677240 3473384
13674 3473384 2904969 3109078 4495256 6788992 8604657 9437866 10313634 11815951 12477571
13665 12477571 11207159 9244886 7460215 5821638 4821523 5004478 6212825 7274327
13657 7274327 6791911 4882133 1637140 -3821843 -10305922 -14066989 -13725382 -11381372
13649 -11381372 -9228627 -8286507 -8506057 -9237573 -10378720 -12072622 -12283230 -9217235 -4904824
13640 -4904824 -2175175 -655824 335442 306010 -875319 -2800315 -5470245 -8015170 -8720756
13631 -8720756 -8201778 -6975604 -5017406 -2646127 725232 5661821 10254276 12740920
13623 12740920 14463631 15420773 15057412 14093174 12511129 11245377 11698919 13562018 14443127
13614 14443127 12466849 9621836 8481598 8785957 10295298 12961688 15152004 15548956
13606 15548956 14297016 11351721 7718850 4565987 1338624 -1560391 -2675960 -3106583
13598 -3106583 -4835502 -7300151 -9618642 -11754282 -13432101 -14672510 -14854600 -12495053
13590 -12495053 -8351479 -5772285 -5614931 -5198148 -3211823 -988033 1084860 3440693
13582 3440693 5392840 5592372 3128225 -1285774 -5248115 -6649021 -4998804 -744825
13574 -744825 3874340 6900992 7879400 7318260 5752605 2480302 -1805479 -5475876 -8833711
13565 -8833711 -11441721 -11345096 -8311987 -3866688 916683 4588667 6211511 5431212 2333651
13556 2333651 -1527440 -4644828 -6864500 -7790641 -6845867 -5190628 -4085513 -3473387 -2839471
13547 -2839471 -1835774 111641 2748771 4627330 4819257 3565561 1732545 687029
13539 687029 279291 -836992 -2849089 -5508148 -8011653 -8807031 -7988076 -7229305 -7538597
13530 -7538597 -7879980 -8144832 -9085532 -9710060 -9628368 -9429722 -8493330 -6479391 -3697226
13521 -3697226 -714409 2380440 6367327 10395471 12939079 13589349 12501014 10296507
13513 10296507 7049771 2870744 -502191 -2190458 -3005146 -3473023 -3281377 -2286726 -2072088
13504 -2072088 -3996876 -7379184 -10995328 -13238130 -13086939 -11197821 -8046024 -4106149
13496 -4106149 -1751893 -2575368 -5263905 -8487354 -10913460 -10998350 -9088211 -6215660 -3779794
13487 -3779794 -2419047 -1405193 -692800 -548163 -197170 834839 2373600 3093009 1699128
13478 1699128 -756205 -2395687 -2239601 -756829 522016 629750 -471602 -2308763
13470 -2308763 -3698114 -4109889 -4050331 -3814655 -2655666 -296915 3079738 6751401 9283995
13461 9283995 10348858 10237134 9202676 8309128 8045676 6623822 3170924 -848357 -4316629
13452 -4316629 -7104713 -9249712 -10879029 -11504588 -11001358 -10099102 -9673345 -9874237 -9602727
13443 -9602727 -7714870 -4454967 -644344 2878819 4693040 5252368 5434854 4606391 1757639
13434 1757639 -2180650 -4128820 -3001610 -1152269 -1490808 -3179794 -3800233 -3904972 -4251048
13425 -4251048 -4943298 -6923385 -9876583 -12553369 -14880738 -17443665 -19450999 -19604376
13417 -19604376 -18743875 -18466935 -19047234 -19700480 -19230511 -17005401 -14304267 -13201160 -14344454
13408 -14344454 -16685856 -17833368 -16147498 -13917229 -14053759 -15632609 -16681559 -16910534
13400 -16910534 -16145605 -14090578 -11473462 -9775329 -10288053 -12781110 -16182601 -18849425
13392 -18849425 -19155622 -17031716 -13809280 -11150006 -9671846 -9814620 -11527188 -14113800
13384 -14113800 -15720649 -14184048 -11124556 -8262409 -4419769 883393 5556524 7775863
13376 7775863 8012528 7708337 6942015 5362265 3632041 2065515 -88036 -2607182 -4200399
13367 -4200399 -5664632 -8584441 -11872688 -13054511 -11871160 -10641119 -10748222 -10091589
13359 -10091589 -6162091 -1038319 2536302 4820229 6781226 8119893 7961263 6595232
13351 6595232 4101255 1220874 -1733529 -3764214 -3784006 -2057334 1158624 4689304
13343 4689304 8083284 12012275 15523343 17537183 17777715 16558550 15204620 13195767
13335 13195767 10146816 7069590 4667828 3936822 4655121 6028346 7352248 6805152
13327 6805152 3637664 -222865 -2383150 -1735594 899204 2989025 3327274 2198366
13319 2198366 1208990 859203 1039359 1866034 2194699 2129706 2733716 3439504 3198258 1293297
13309 1293297 -2200283 -6614673 -11330834 -14507121 -14484853 -12594814 -10306250 -7886567
13301 -7886567 -5877244 -5341079 -6267813 -6881598 -6549040 -5989594 -5950897 -5117057 -2083707
13292 -2083707 1960079 4838728 5587823 5397136 5201052 4341197 1784997 -2442567 -6089035
13283 -6089035 -8322708 -9270792 -8905360 -7162125 -3613103 802368 3899011 6437893
13275 6437893 10189653 13474581 14618429 14364390 13597788 11976760 9211715 6248694
13267 6248694 4508259 4300166 5236593 7574852 9726082 9573930 7619430 4952648 2503657
13258 2503657 363974 -1518754 -2310018 -2183127 -2383676 -3720068 -5265323 -6456048 -7395685
13249 -7395685 -7578052 -6860494 -6296374 -6591653 -6699866 -5811124 -4977997 -4262096 -2240689
13240 -2240689 729242 3272670 4910867 6186751 8385438 11887694 14368905 14590897
13232 14590897 14771581 16275010 17660146 18008046 17181279 15268936 12707495 10756630
13224 10756630 9873333 9123298 8489630 8317473 8881916 8788191 6948582 5386982 5755253
13215 5755253 6714691 5494544 1359091 -3487745 -5686655 -3789249 936541 6374325
13207 6374325 10580200 13567267 15531461 15212559 11848039 6884814 2543819 -630627
13199 -630627 -1315815 807206 4065406 7344725 9709762 10532339 10965358 11748020 12171541
13190 12171541 10546928 6345216 1942611 -845465 -3125666 -5860925 -7995438 -8430089
13182 -8430089 -7676061 -8179008 -10686096 -12363912 -11324819 -8969083 -6329777 -3565601
13174 -3565601 -802726 1706033 3368596 4321006 5566427 8371735 12073506 14865053
13166 14865053 15783269 14940122 13443537 12005852 10262576 7822063 3867983 -2009455
13158 -2009455 -6724006 -8490476 -9361954 -10495960 -12138288 -13729417 -14726644 -14866836 -14527307
13149 -14527307 -14400997 -13750477 -11977703 -10435341 -9948649 -9327768 -7972941 -5515345 -1803250
13140 -1803250 1821262 4179826 5324200 6530721 8535953 10069707 9978357 7894483
13132 7894483 4366179 1066044 -1075898 -1181428 2394768 7374555 10106736 10242972
13124 10242972 10639624 12831700 15491388 18098497 20698499 23112648 24250741 23772869
13116 23772869 22151880 20577354 19881782 19131995 18364936 18021935 16681296 13046139 8270863
13107 8270863 4321946 3008038 4192502 5416150 4616916 2881188 2714509 4495148
13099 4495148 6424968 7796420 8720302 9051054 9066839 8104411 5223142 1247844 -1023886
13090 -1023886 -262175 2267341 4724139 6250660 7222759 7857229 7161135 4772480 1610237
13081 1610237 -1237000 -2755743 -2025819 332743 1594955 1216224 2253892 5299941
13073 5299941 7898242 8858947 7735130 4362845 578281 -1118038 -684116 332387
13065 332387 407535 -1781454 -5389291 -8245046 -9217913 -8177168 -6753719 -6724454 -8593718
13056 -8593718 -10163454 -9338019 -6687607 -3154021 -188310 1432414 3001244 5717147
13048 5717147 8877597 10961616 11110814 9830246 8524498 8767982 10376353 12366326
13040 12366326 13786008 14460041 14630317 14216817 12933510 9781625 5573193 2561712
13032 2561712 264729 -2425820 -4723901 -5350507 -3083881 1530913 5955014 8518403
13024 8518403 9967071 10783213 10023247 7082335 2190861 -3583283 -8709296 -11985565
13016 -11985565 -13186029 -12601712 -11071723 -10626595 -12033422 -14992536 -18304675 -20328800
13008 -20328800 -20182100 -16881546 -11329569 -6716733 -4660083 -4583926 -5937285 -8941027
13000 -8941027 -11735658 -12484032 -11710743 -9156494 -4965574 -1291957 -131940 -1664195
12992 -1664195 -4706586 -6672535 -6533766 -5022328 -2029477 1022966 1051927 -3242862 -9665398
12983 -9665398 -14379376 -15657157 -14149821 -11595749 -9969407 -9405688 -8620838 -7444669
12975 -7444669 -6379042 -5443991 -4431878 -3091128 -1726612 -636118 1273477 4768731
12967 4768731 8398558 10480361 11048833 11158482 10860326 9639340 8281742 7691909 7013338
12958 7013338 4853089 1938344 138847 426527 2488878 5446784 7777779 7666077
12950 7666077 5026277 1839896 -1187797 -3777271 -5409045 -6702097 -7237858 -6424164
12942 -6424164 -4990417 -4031460 -3480051 -2688189 -736284 2115651 4599023 6163388 7025270
12933 7025270 7084501 5227139 1472538 -1433579 -1165337 1249099 3779319 5980692 7586257
12924 7586257 8506826 9103784 8498552 5535101 611387 -4388703 -6357710 -4218044 -500961
12915 -500961 2498185 4735900 6543837 6673606 4821906 2732447 1692599 1761280 2633678
12906 2633678 3896859 4405221 3121636 1183730 -367138 -1393600 -1874994 -2300736 -3308751
12897 -3308751 -5345626 -8101998 -10083286 -10071344 -8256481 -6265070 -5388017 -5319771 -4115052
12888 -4115052 -1929454 -1168382 -2568111 -3738588 -1836391 2722087 7063642 8967920
12880 8967920 8245326 6096431 3789387 1487532 -173362 -936021 -1597039 -2753830 -4000008
12871 -4000008 -5179078 -6717522 -7338713 -6271298 -4716451 -3564804 -3230635 -4029756 -5535539
12862 -5535539 -6575573 -6888721 -6207861 -4065289 -1478611 -582038 -2101180 -4424642 -5653152
12853 -5653152 -6027052 -5789873 -5210665 -4869696 -5130660 -5760675 -5513966 -4571191 -4342568
12844 -4342568 -5393931 -7250284 -8475681 -7747273 -5795509 -4396784 -3251638 -1226265
12836 -1226265 679368 2271157 4380107 6022505 5675334 4022340 2764725 2020267
12828 2020267 1022609 -199112 -1156451 -2207697 -3680405 -4085401 -2680684 -846368 -49742
12819 -49742 -306907 -1943665 -5127488 -7919244 -9177669 -9832357 -10155538 -10081012 -8891229
12810 -8891229 -6258458 -3901288 -3523229 -5086559 -7402874 -8228244 -6533558 -4074097
12802 -4074097 -2848816 -3817472 -5922769 -7592982 -8629514 -8533902 -6087771 -2520806 112577
12793 112577 819590 -373340 -2626009 -5432880 -8565755 -10720315 -11137092 -10705914 -9967451
12784 -9967451 -8539001 -5815219 -1887732 2276237 5868332 8385485 9071251 8000355
12776 8000355 6144094 3692008 1365574 -21746 -760815 -1580430 -2937148 -4099434
12768 -4099434 -4444637 -3736940 -1922960 -292770 -207473 -1008711 -1926984 -3402384 -4560838
12759 -4560838 -3205619 142405 2500930 2910234 2284026 1473540 1504466 2741991 4895336
12750 4895336 7549950 9529616 10176230 9071242 6305841 3779023 2738516 2427957
12742 2427957 1861017 1591820 2241942 2398451 94337 -4268865 -8406873 -10241482 -9472066
12733 -9472066 -7365946 -5660775 -5528514 -7777048 -11930352 -15162583 -15157455 -12094852 -7572382
12724 -7572382 -4308073 -3643322 -4200645 -5442475 -7442490 -9103667 -9488932 -8826584 -8072747
12715 -8072747 -7746567 -7751555 -7613205 -6611799 -4638967 -1789048 2306143 7111006 10227810
12706 10227810 9316970 5592839 2558777 1640007 1808630 1996900 2975767 6274595 10258992
12697 10258992 11848110 10994279 8688499 5693866 3315326 1715216 -564058 -4216259
12689 -4216259 -8038510 -10854146 -12414479 -12392839 -10532923 -7615342 -5169839 -4058281
12681 -4058281 -3434904 -2588706 -2659171 -4190197 -5639626 -5381474 -4782734 -5574249 -6577136
12672 -6577136 -6738414 -6557857 -6156254 -6055764 -6108185 -4486345 -1496012 582764 709139
12663 709139 -1091411 -3990740 -6387293 -6884103 -5830211 -4277372 -3529956 -4646598 -6909877
12654 -6909877 -8398448 -9153734 -10317155 -10812512 -9244945 -6432221 -4227884 -3237654 -2844167
12645 -2844167 -2132268 -242530 2342141 4867012 7071011 8298121 7645813 4864651
12637 4864651 1209255 -1250116 -1529795 -1280939 -2629783 -5117082 -6289373 -5538639 -3791247
12628 -3791247 -2018009 -64745 2155519 2786388 774209 -1970489 -3367873 -3419868 -2270967
12619 -2270967 156822 1987490 1987144 427251 -2603835 -6387097 -9531665 -10628038 -9571928
12610 -9571928 -7369269 -5086336 -3726830 -3932078 -4913317 -6496784 -8683358 -10090546
12602 -10090546 -9952953 -8363977 -5883119 -3964227 -3741927 -3191781 797956 7046129
12594 7046129 11603923 13161227 13022214 12154937 10650590 9467474 8644389 7147015 5493289
12585 5493289 4051245 1124978 -2996846 -5901763 -5653465 -1613754 2360219 2852810
12577 2852810 1662668 1308466 1836570 2218202 2876656 4277952 6012819 7498898 8232553
12568 8232553 8466344 9146869 10127350 9630982 6917503 4283829 3148071 1964098 278848
12559 278848 -447821 203177 1057601 2253261 5210195 10239086 15735003 17903279 15494907
12550 15494907 11231937 6958745 3336679 1583852 1167870 618132 -467386 -1573891
12542 -1573891 -1974332 -640926 2587835 6579784 10321937 12225143 12038978 10629601
12534 10629601 9944156 10976981 12361644 12555636 11456010 9212950 5691051 2005902
12526 2005902 241848 1012607 3382205 5665560 6112010 4467601 1849536 509171
12518 509171 321611 -735111 -2496400 -4099804 -5029326 -4276245 -1412326 3083789 8608048
12509 8608048 13809849 16764292 16331893 14612378 13854490 12772564 9679568 5009999
12501 5009999 869558 -1070163 -1328441 -1572435 -2935403 -5118743 -7742066 -9909207
12493 -9909207 -10644019 -11637774 -13557437 -14087199 -12596866 -9765758 -6520700 -4266130 -3387504
12484 -3387504 -2826469 -1717334 107508 1632482 1543991 493093 900409 4826698 10817007
12475 10817007 15695245 18228477 19164573 19349932 19342551 18260217 14661827 10455260 8359391
12466 8359391 8425410 8845197 8493647 7865887 6568583 3658622 -559850 -3956256 -5292602
12457 -5292602 -5793089 -6636536 -7467027 -7394679 -5830627 -3310863 -1457927 -230801 848806
12448 848806 858649 70333 -517508 -958765 -1257575 -1772889 -2754202 -3594066 -4149064 -4909188
12438 -4909188 -5700111 -5688121 -4476836 -3274818 -4063073 -6092516 -7307435 -8133189 -9363225
12429 -9363225 -9774103 -7860844 -5023120 -3607032 -3229242 -2210909 -1585289 -2426725 -4479616
12420 -4479616 -7584176 -10946309 -12895465 -12481123 -10837555 -9588252 -9667370 -10436215 -10329220
12411 -10329220 -8270437 -5084242 -2830025 -2604292 -3674051 -4842856 -5701720 -6877659
12403 -6877659 -8068783 -8739234 -8613261 -8079327 -7324000 -6639353 -6443650 -6509732 -6767986
12394 -6767986 -7060615 -6660326 -4851170 -2179937 -9928 715199 699345 954659 868490
12385 868490 439396 -32541 -1425554 -4311208 -8336898 -12701735 -15137425 -14121535 -12286043
12376 -12286043 -12353661 -13792347 -15519337 -16714432 -17088761 -16129506 -12446996 -6944844 -2269466
12367 -2269466 -198805 755542 2232116 3013374 2047841 910353 1388898 3420047 6568609
12358 6568609 8737933 8765644 7096742 4854239 3740282 3746987 3430875 1852394 -1013892
12349 -1013892 -4497424 -7366887 -8332306 -7175874 -5709319 -4485218 -2986432 -1720412
12341 -1720412 -674097 339192 1520562 3483430 5745820 6506969 5051924 2631148
12333 2631148 -637919 -4573187 -7454232 -8716116 -8457487 -6854463 -5524510 -5609364 -6009581
12324 -6009581 -5643325 -4076573 -1348227 1553618 3198477 3403301 2889457 1734616 -14888
12315 -14888 -1567435 -2088983 -1276299 -31860 44328 -838493 -1163257 -275879 535612 1663807
12305 1663807 4401726 7614042 9276919 9306642 8090926 5839103 3754418 2438608
12297 2438608 1684662 2315041 5274207 8980804 10796357 10210287 8532761 6706593 5242087
12288 5242087 4074088 3042279 2641064 3090249 3607804 3891071 3522700 3010787 3154209
12279 3154209 2760814 2178697 3165208 5558951 6905144 6176767 4462825 3118536 3321019
12270 3321019 5298104 8223753 10493491 10815579 8766114 5067834 865290 -2603894
12262 -2603894 -4023580 -3093665 -860107 1522365 3983550 5810529 5418839 3712302
12254 3712302 2245088 1472874 1261998 1779648 3538607 5517429 6887135 8251068 9160107
12245 9160107 7980496 5158794 1999733 -926432 -3415944 -5344594 -7073475 -9103723
12237 -9103723 -10293902 -9667345 -8192827 -5793689 -2118945 2394358 7685262 12851096
12229 12851096 16298432 17446553 17517915 16313873 12651420 8312263 5928398 5882543 6340932
12220 6340932 5983373 5073997 4478687 4871366 6404695 7838954 7417701 6391911 6320094
12211 6320094 6885688 8041658 9419107 10727366 11625582 10736563 7286696 1855614 -3136895
12202 -3136895 -4998112 -4666570 -4304305 -3944761 -3029069 -1637573 112352 2592924 5681728
12193 5681728 8343548 9658425 9799818 9300846 8118813 5060336 48361 -3923841
12185 -3923841 -4710063 -3783228 -3391073 -4164369 -5033307 -5467402 -6126305 -7237230 -8523270
12176 -8523270 -9493717 -9694223 -9429819 -8348062 -5756542 -2132883 596888 -75039 -3539353
12167 -3539353 -7434893 -10377045 -10942498 -8718941 -5210905 -2395801 -617552 405823
12159 405823 42309 -1088187 -2191317 -3136571 -3894846 -5024808 -6290983 -6990535 -6026774
12150 -6026774 -3384914 -898270 108631 318047 653310 377808 -1424774 -3617365 -4109429
12141 -4109429 -3122381 -2098726 -2069669 -2596943 -2138471 -774639 452841 1629669 2767567
12132 2767567 3110700 2814065 1754135 189945 -516937 181591 1065143 178341 -2495195
12123 -2495195 -5952564 -9022925 -10730333 -11437996 -11244397 -9255608 -5459989 -673205
12115 -673205 4169529 7479270 8743645 9017342 8530094 7624240 6623239 5187202 3120846
12106 3120846 1137776 197416 -872116 -1757580 -1274344 -659926 -1026168 -3075895 -6051520
12097 -6051520 -7676413 -7535178 -6361463 -4163330 -1218362 1915375 4669634 6140227
12089 6140227 6226208 6575551 8120953 9176048 7790738 5387968 4208349 4580307 4670484
12080 4670484 2422957 -904432 -3196893 -4249362 -4953091 -5837938 -6554011 -6127129 -4341759
12071 -4341759 -2702094 -3549209 -7295586 -12154912 -16150831 -17694344 -16438376 -14794142
12063 -14794142 -15404365 -17332463 -18660183 -19249855 -19631097 -19201175 -16081718 -10366708 -4771844
12054 -4771844 -769820 1861851 3149642 3520639 3346821 2665523 2177774 2234196 1504028
12045 1504028 -420878 -2486323 -3711084 -4633074 -6799151 -9378583 -10280772 -9461140 -7478616
12036 -7478616 -5296315 -4271858 -4813780 -5778181 -5805576 -3918860 -707103 2491112 5635018
12027 5635018 8543424 10239165 9689929 8249731 7750824 8248458 9199314 10681715 12611074
12018 12611074 14349205 15468554 16856317 18367643 18310820 16218996 12633417 9079102
12010 9079102 7009305 5893184 3881507 500756 -1430637 -770444 944383 2611632
12002 2611632 2516551 1100697 445790 1440709 3802873 6201900 6385864 3801462 169482
11993 169482 -3185748 -6053792 -8030748 -9452379 -11556370 -13577937 -14119999 -13128242 -11497078
11984 -11497078 -9867891 -7924290 -5514521 -3699502 -3023359 -3353881 -3975541 -4009424 -4222069
11975 -4222069 -5398571 -7058847 -8453221 -9102201 -8868747 -7826899 -6446125 -4675083
11967 -4675083 -2489805 -456865 918546 919214 -121537 -541063 -406041 -1151414 -2458469
11958 -2458469 -3418041 -4889006 -7481946 -11040018 -14391828 -16427841 -17508355 -18252573
11950 -18252573 -18192718 -17371660 -16879151 -16866449 -15654407 -13043231 -11395611 -12126358 -13456821
11941 -13456821 -12562468 -8982037 -4601357 -1589744 -1000545 -1856564 -2443378 -2719104 -2322361
11932 -2322361 -621299 1128697 1564130 946551 -152205 -1980592 -4184927 -4663833 -3110335
11923 -3110335 -1418871 321431 2583481 4349412 5180243 5045388 4475505 4706028 5184755
11914 5184755 4290825 1793818 -1711183 -5070439 -6872904 -6426329 -5012966 -4022136 -3073282
11905 -3073282 -787889 2915130 6728396 9496948 10000858 7882581 4936828 2939125
11897 2939125 1115514 -1151756 -2799924 -3222122 -2332450 -80675 3229091 6042388
11889 6042388 5974502 2336421 -2680163 -6482545 -7713507 -6838212 -5636432 -5579871 -6965817
11880 -6965817 -9023732 -11078426 -12859722 -14041712 -14001923 -12327349 -9864604 -7334314
11872 -7334314 -4779912 -2599907 -1348518 -734187 438173 1240056 151327 -2349953
11864 -2349953 -5433302 -7167296 -5831667 -2614238 -365727 -582809 -1568797 -988504 590491
11855 590491 926244 -802240 -2885579 -3554058 -3825656 -4592582 -5206935 -6144936 -7425968
11846 -7425968 -7310555 -4429924 381970 4493835 5100879 2294001 -833435 -1259332 -14227
11837 -14227 229916 -892005 -2351885 -2962825 -2920696 -2649862 -3093849 -4375265 -5083686
11828 -5083686 -5172295 -5447720 -6262319 -7679482 -8272669 -6948639 -4329161 -1281724 1127340
11819 1127340 3100593 4841744 5722423 5000712 2969718 1311428 166619 -2007116
11811 -2007116 -4191327 -4711643 -3833831 -2078033 -417084 241068 646403 2242619 4522449
11802 4522449 5629714 4803421 3704643 4494683 6715205 7146916 4539446 107751 -4003743
11793 -4003743 -6028902 -5630441 -4209060 -2730627 -1174467 -131035 328404 633278 216304
11784 216304 -1669024 -3667600 -4854012 -6543243 -9786372 -14210299 -17250080 -16319843
11776 -16319843 -12531395 -9095675 -7009730 -5175665 -2414951 1014385 3442137 3423775
11768 3423775 1668445 344822 -122086 -910983 -2089191 -3314555 -4596031 -6480804
11760 -6480804 -8385616 -8459508 -6455483 -3682303 -2147539 -2082383 -1746150 -629293 724428
11751 724428 852080 -820458 -3310041 -4906748 -3382821 1044106 5636419 8452478
11743 8452478 9750749 9771518 7896847 4704494 2022316 128451 -1764526 -3124919
11735 -3124919 -2093942 1784886 6602338 10234159 11653997 10056050 6542276 3688720
11727 3688720 2799859 2743689 1365030 -1826919 -5945723 -9396618 -10387791 -9015734 -7104015
11718 -7104015 -7019561 -9155229 -11202805 -12105237 -12296035 -11002981 -6870673 -1624248 1025061
11709 1025061 358063 -871782 -444228 1628693 3713050 4216953 3225072 978429 -2308944
11700 -2308944 -5503636 -8031770 -10310159 -12091424 -12619702 -11439169 -9234189 -7212235
11692 -7212235 -5580745 -3409969 -193037 2446934 3009743 2490756 2535916 2620372 1699302
11683 1699302 988346 1441942 1637592 1002410 1058188 2178393 2336748 -778177 -5742734
11674 -5742734 -8051368 -6302649 -2936480 -513136 1351374 3601867 5638852 7088573
11666 7088573 7113677 6032394 4424469 1864483 -195081 -380696 953897 3143205 5540043
11657 5540043 6551438 4316209 -603260 -5818184 -9248878 -9980001 -9159658 -8999714 -9366192
11648 -9366192 -8534412 -6377068 -4932636 -5512845 -8111921 -11747576 -15238906 -18108847
11640 -18108847 -19871354 -20327068 -19356768 -16943219 -13663841 -10804980 -8472256 -6334559
11632 -6334559 -4335026 -2611325 -2725956 -5139031 -8658454 -11837838 -13956539 -15062770
11624 -15062770 -15718769 -15861789 -14676584 -12296375 -9957745 -8801802 -8556610 -7627347 -5917223
11615 -5917223 -4402299 -2886713 -1601436 -1729606 -4513415 -9685510 -15087127 -18060268
11607 -18060268 -17468104 -14608908 -11539961 -9300364 -8690330 -9725328 -10763852 -10516748
11599 -10516748 -8926117 -7325659 -6336703 -4968299 -3285259 -1999809 -1894770 -4146492
11591 -4146492 -8162147 -11093549 -11712094 -10815669 -9789001 -9609110 -9529309 -8374049 -5877308
11582 -5877308 -2611011 -60934 743416 61124 -1849821 -5832922 -10571170 -14060398
11574 -14060398 -16070747 -16435310 -15086981 -13023280 -11289042 -10444244 -10062744 -9258463 -8116107
11565 -8116107 -7681944 -8262343 -8919735 -8604165 -7191461 -6250965 -7557977 -11832785 -17401187
11556 -17401187 -21725486 -24066602 -24787237 -24098965 -22386644 -20100541 -18482901 -18341969
11548 -18341969 -18932072 -18407033 -14946062 -8006105 668132 6785125 7594039 5309696
11540 5309696 4072302 5791799 8875958 10330851 9386318 6512043 1768190 -4028395
11532 -4028395 -9860570 -13932495 -15272481 -14681619 -13116271 -11465170 -10085063 -9513559
11524 -9513559 -9997367 -10516229 -10344405 -9276039 -6911393 -4127141 -3175156 -4206047 -6033828
11515 -6033828 -8023916 -10058705 -11528115 -11265563 -8238508 -4278487 -2274617 -2319015 -3227742
11506 -3227742 -3247809 -1658134 454758 1784110 1303271 -571071 -3126096 -6254727 -9036061
11497 -9036061 -10239702 -8845433 -5844335 -3044518 -899504 -255421 -2284444 -4958377
11489 -4958377 -6547279 -7506662 -8222717 -8398779 -7795854 -6792254 -5430549 -4515373 -3904034
11480 -3904034 -2014006 868593 3197166 3996368 3444285 1770796 -1423839 -4596433
11472 -4596433 -5958175 -5826848 -4399641 -1822834 -48358 -876204 -4210100 -7815099
11464 -7815099 -10205297 -11015707 -10125094 -9310158 -9828418 -11310846 -11793176 -10660063 -9475978
11455 -9475978 -8644197 -7278985 -5012271 -2665143 -1104136 -345183 31659 682899 1071270
11446 1071270 -7069 -1920923 -3754107 -5059202 -5805323 -6507065 -8086650 -9600045
11438 -9600045 -8790401 -6274491 -4214334 -3778478 -5049680 -6986212 -7979610 -7108121 -5293797
11429 -5293797 -4344613 -4113998 -4122032 -4219755 -3885637 -2732831 -1338270 -1091804 -2166967
11420 -2166967 -3151723 -3597765 -3874378 -3077275 188889 4701156 7233402 5466343 -460136
11411 -460136 -6895094 -10268308 -10776473 -10493224 -9738027 -6836277 -1456161 4489569 10061181
11402 10061181 14366541 15584451 13865402 10628693 7703932 6219971 5432400 4624712
11394 4624712 3673966 2702412 1822464 132014 -2463740 -4311444 -4982179 -5475622 -6197580
11385 -6197580 -7065882 -8032543 -9798303 -12307164 -13721462 -13352021 -12196129 -10754078 -9262158
11376 -9262158 -8112886 -8362923 -9835905 -10270415 -8772929 -6314404 -4711063 -4296273 -3756358
11367 -3756358 -2298093 -958485 -825506 -1006334 -293042 1422276 3735803 5042193 3778110
11358 3778110 1068304 -1818516 -4567033 -6494249 -8036033 -8732581 -8285530 -7579841 -6321377
11349 -6321377 -4569899 -2897312 -943602 1738081 3784179 4190998 4770524 7239629
11341 7239629 9960020 11362369 12233857 12093933 10371948 7624052 4505509 1793164
11333 1793164 -671003 -4111126 -8652287 -11600481 -11262350 -9301855 -8026455 -8365871
11325 -8365871 -9538351 -10129847 -9682375 -9322503 -9427369 -7705713 -2065579 6498983 14282492
11316 14282492 17306438 15517717 11693546 6820489 2159845 -6145 -238224 -411079
11308 -411079 -1554313 -3174214 -4915348 -7042370 -9153521 -9606011 -8067655 -6799623
11300 -6799623 -6652672 -6132276 -5368866 -5517976 -5993281 -5676191 -4667696 -3929466 -3009387
11291 -3009387 -1591639 -82515 876552 412647 -1764007 -4548630 -7227849 -10242593
11283 -10242593 -13844572 -16699088 -17477575 -16563297 -14493284 -12098262 -10210103 -9805143
11275 -9805143 -10572306 -10891190 -10927914 -11533335 -11728572 -10146205 -7820709 -6310951 -5469166
11266 -5469166 -4642793 -4374695 -5374236 -5897102 -5089157 -4395789 -3794529 -2492176 -1326143
11257 -1326143 -936474 -511898 1941163 6215238 8707466 7014204 2126683 -2810761
11249 -2810761 -6114211 -8158778 -10267890 -12619225 -13406405 -11608325 -9149726 -7928862
11241 -7928862 -7671917 -7714223 -7495253 -5489314 -1849043 1564604 4469456 7912445 11135339
11232 11135339 12993586 13627998 12999389 12223505 11773803 11155686 9598515 6382177 2165210
11223 2165210 -1550467 -4549868 -7371682 -9080190 -9061358 -8121876 -6766375 -5030980 -3664935
11214 -3664935 -2689777 -1184451 -113437 -750432 -2027307 -2695784 -2352029 -985429 -337482
11205 -337482 -1284512 -1966841 -663137 1372513 2287223 1428033 -1731117 -6153074 -10088667
11196 -10088667 -13592804 -16497303 -18178578 -18518890 -18602834 -19473377 -20715044 -21722330 -21915815
11187 -21915815 -19911652 -14755557 -7896202 -2129516 752829 1726883 2248038 2635127
11179 2635127 3233423 5331041 8866779 10743513 8894420 5037740 1189954 -2194798
11171 -2194798 -5824530 -9742606 -13385038 -15710644 -16606005 -17022010 -16129066 -13061210 -8716264
11162 -8716264 -4942925 -3196760 -3273504 -3865320 -3681286 -3277403 -3926109 -5200610 -5661545
11153 -5661545 -4403492 -2648895 -2034974 -2944703 -4795501 -5775008 -4871458 -2775240 147490
11144 147490 2773550 4089736 4312118 3690691 2657911 2006907 2874416 4474025 4891506
11135 4891506 3788979 1547087 -969692 -2433371 -2654634 -475007 4123923 7827426
11127 7827426 7797284 4854989 1494908 -1607342 -5287698 -10321453 -16442044 -21502103
11119 -21502103 -22977142 -21873066 -20771557 -19577416 -16821625 -13950031 -13670367 -15357460
11111 -15357460 -16370057 -15473974 -12848448 -10058395 -8801185 -9210649 -10273134 -10840007
11103 -10840007 -10651013 -10669704 -11569928 -13319711 -15298711 -16172431 -14947469 -12075566 -9423665
11094 -9423665 -7660477 -6118987 -4504999 -3175748 -3139523 -3686257 -3151762 -2025409 -898251
11085 -898251 729795 1855141 2183767 2387274 2780954 3798813 4114029 3267066 2544362
11076 2544362 1856049 -19247 -2637811 -4322630 -4663376 -3985916 -2855766 -1939925 -1968448
11067 -1968448 -3205459 -6230737 -10443231 -12975861 -12466055 -10524523 -8792631 -7609224
11059 -7609224 -6343702 -4324296 -1367231 1886954 3573755 2863981 1821878 2374648
11051 2374648 4732701 7865916 10202828 9539347 5625361 817829 -3314710 -6431846
11043 -6431846 -9148165 -11296762 -12419420 -13127486 -14159202 -14776487 -13037882 -8883961
11035 -8883961 -6045186 -6984333 -8972235 -9704054 -10868333 -13962527 -18182250 -22430863
11027 -22430863 -24624999 -22770369 -18288373 -13216426 -8515713 -5870873 -5134927 -4541819
11019 -4541819 -3686444 -3475083 -5456155 -9170949 -12113333 -13282977 -13141613 -11329821 -8724628
11010 -8724628 -7091715 -6578406 -6645437 -6945602 -7718463 -8584744 -8484497 -7143816 -4984471
11001 -4984471 -3608746 -4017913 -6245470 -8786573 -8489625 -5768331 -4224965 -5287114
10993 -5287114 -7862339 -11111321 -14259584 -16169095 -16216650 -14222053 -11078231 -8605737
10985 -8605737 -7778863 -7401571 -6480666 -5473127 -3817033 -692292 3481203 7097355 8156637
10976 8156637 6071984 1864484 -2198567 -4074230 -3550393 -2639417 -2964200 -4432292 -6281330
10967 -6281330 -7642612 -8161913 -8781962 -9049433 -7908117 -6888289 -7702640 -10029200 -12415444
10958 -12415444 -13959840 -14672998 -15395263 -15624860 -14483221 -12766493 -11817110 -11176643 -9393659
10949 -9393659 -6123249 -2910716 -1617105 -2029131 -2308908 -1312827 474859 1763089 2054920
10940 2054920 2089248 2397827 2556125 2734272 3609254 5218349 7078012 8436691 7809502
10931 7809502 4326724 -710117 -5442036 -8522032 -9204197 -7649284 -5196329 -2798373
10923 -2798373 -1638510 -2802852 -5273489 -7052570 -7247959 -5249526 -923210 3974963
10915 3974963 7010915 7469253 5856979 3450622 1743174 1688906 2824201 3616434 3965443
10906 3965443 3572587 1882001 -1309142 -4955250 -6692376 -6168155 -5013374 -4801859 -6390521
10897 -6390521 -9934909 -14083471 -16515320 -15417812 -11760375 -8758503 -7883183 -8620974
10889 -8620974 -10248746 -11889708 -12652534 -12021083 -9210817 -4697150 -1000039 393680
10881 393680 1084005 2770055 4631001 5831444 6320908 5439292 2549562 -779568 -2112010
10872 -2112010 -532992 2880748 6095995 7430154 7067639 5434373 2885333 651499
10864 651499 -455891 -352015 -136548 -1060714 -2939889 -4457012 -5606500 -6711576 -7108323
10855 -7108323 -5663826 -2137184 1322657 3326109 4969632 6098115 5655490 4127615
10847 4127615 2103208 26516 -1744284 -3510376 -4973546 -5539041 -5417305 -4732181 -4176500
10838 -4176500 -3654150 -2306281 -1849024 -3286728 -5299354 -6744322 -7168606 -7769745 -9552222
10829 -9552222 -11313119 -11590193 -10814302 -11314246 -12517817 -12229489 -9300957 -4359549 13353
10820 13353 1445874 496018 21484 1387162 2776757 2910069 2134821 1285366 633309
10811 633309 11326 -860491 -2334216 -3613195 -4646312 -5207305 -4198285 -1682023 1037924
10802 1037924 3148598 4408566 5525993 6933510 8248997 9858226 11912276 12988665
10794 12988665 12271072 10697174 9186181 6760212 3241071 1155219 2011692 4260095
10786 4260095 4724081 2405426 -633344 -2679201 -3951603 -4870030 -5714184 -6333364 -5760218
10777 -5760218 -3571157 -675192 1741067 3396434 3945312 3206209 2058055 2394927 3810431
10768 3810431 4729205 5249758 6045295 7224939 8390737 9264123 9379477 8934040 9010411
10759 9010411 9630029 9812204 7082344 1154665 -4161881 -6577362 -6470209 -5216291 -5235391
10750 -5235391 -6767840 -7893749 -7366699 -5867273 -4911407 -4801507 -4345451 -2340332 218757
10741 218757 1505685 1218694 209063 -1390139 -2970484 -4048668 -4871426 -4938241 -4348969
10732 -4348969 -4791330 -7086802 -9552643 -10226645 -9774709 -9565605 -10209996 -12111288 -14899618
10723 -14899618 -17416068 -18855716 -18780946 -16594507 -13194671 -9533742 -7032771 -6919207
10715 -6919207 -7663924 -7652106 -7366617 -7831739 -7717154 -6245705 -5086634 -5334057 -6069505
10706 -6069505 -7086663 -9040650 -11760993 -13373996 -11618321 -7323217 -4494365 -5567208
10698 -5567208 -8594941 -10444010 -10006044 -8950839 -9241880 -10375312 -11282778 -11232390 -10075523
10689 -10075523 -8066401 -5896651 -4612815 -3846657 -1569289 2011711 3593796 1871918
10681 1871918 -1848424 -5315240 -5880288 -2666315 2576177 7110102 9761274 12298264
10673 12298264 16208788 18675508 17391783 13767565 8844952 3348228 -1272238 -3219313
10665 -3219313 -3190785 -3443326 -4083169 -4196722 -4134662 -4935348 -6090629 -6581186 -6075867 -4597485
10655 -4597485 -3647778 -4245203 -4793870 -4105717 -2256682 102205 1273197 1560661 2491305
10646 2491305 4608284 7607832 9982367 10554656 8807496 4848965 -120345 -4293201
10638 -4293201 -6560292 -7442127 -6829254 -4686863 -2773705 -2676663 -3071177 -2062463 -201223
10629 -201223 379729 -848637 -2687719 -4273437 -4964675 -4316230 -2929944 -1439942 -598996
10620 -598996 391772 2823739 5290171 6881061 7317101 5861806 3236140 1350626 1161752
10611 1161752 2189380 3711752 5385979 6618754 6488128 3857058 -603849 -5283568
10603 -5283568 -9156334 -10993463 -9290243 -4384580 1176774 5300171 7906526 10124535
10595 10124535 12213608 13779922 14154882 12823640 9938870 5683907 957137 -3295869
10587 -3295869 -7022535 -8684464 -6581857 -2071340 1700231 3433923 2396352 -1836274
10579 -1836274 -7324482 -11510978 -13112452 -12600382 -10443277 -7450562 -4860504 -3127726
10571 -3127726 -2356979 -2218107 -2569749 -3752952 -5283771 -6655771 -7860826 -7524734 -5722567
10562 -5722567 -4399587 -3624475 -3022051 -1915887 -23174 1401143 2097507 2927232 3824303
10553 3824303 3291718 404296 -3851594 -8027133 -10334545 -10387152 -10040851 -10367591 -11831601
10544 -11831601 -14403069 -16638457 -16838649 -15510214 -14577460 -13898475 -12603894 -10546074
10536 -10546074 -8035371 -5505121 -3052125 -1270855 -760294 -618202 241416 196452 -2625834
10527 -2625834 -7396663 -13029817 -18855278 -23262851 -24922597 -23727488 -20997688 -17895079
10519 -17895079 -14831728 -12673759 -12312395 -12669128 -12957426 -13928441 -15112405 -14643627 -11768245
10510 -11768245 -8328853 -5570245 -3559151 -1726737 836941 4690594 8650600 10745023
10502 10745023 11164765 11120287 10403028 9121005 7375046 3431696 -2825197 -9048476 -11577756
10493 -11577756 -9101103 -4439495 -243428 3279265 6060686 7089570 6449712 5673759
10485 5673759 5724022 5008244 2646206 98231 -1165160 -1637266 -2459601 -3149961 -2441453
10476 -2441453 -454213 2774423 5295613 5282828 3956085 2316857 164173 -2712304
10468 -2712304 -4850384 -4630911 -3137934 -3163547 -5537871 -7545878 -6716794 -4332884 -1447687
10459 -1447687 1847740 4332434 4739163 3369384 2459298 2020459 607129 -898139 -1708539
10450 -1708539 -2497858 -3450401 -4039957 -4250367 -4686044 -6461268 -9936935 -14589614 -18779298
10441 -18779298 -21148016 -21860728 -21387862 -20516045 -18831915 -15130520 -11451466 -10509278 -11615603
10432 -11615603 -12223976 -10313946 -6842838 -3638471 -245442 3041796 4562075 3798851
10424 3798851 1182024 -2200511 -5405421 -8199786 -9968950 -10565867 -10944470 -12278645
10416 -12278645 -14296993 -16048609 -17746849 -20114777 -21820738 -22447202 -23598659 -24867159
10408 -24867159 -25509309 -25409449 -23054875 -18987673 -16410150 -15598070 -13551833 -8258937 -873931
10399 -873931 5704908 9209262 9268940 6714557 3420081 1332772 1125669 2135926 1857800
10390 1857800 227994 -944004 -1824502 -3245173 -5519870 -9494417 -14396720 -17046628
10382 -17046628 -15916129 -12941364 -11084901 -12037806 -15379183 -19020099 -20513889 -18636679
10374 -18636679 -14610542 -10984604 -8829961 -7472690 -6679271 -6212629 -5258469 -4270599 -4366834
10365 -4366834 -5164817 -6183791 -8509466 -12051749 -13923697 -11820579 -6054639 -362677
10357 -362677 2330261 2405633 821815 -505555 319792 3204738 5514587 5259670 3491280
10348 3491280 1123679 -1498723 -3017417 -2105246 332116 2347322 3192648 2060466
10340 2060466 -1630912 -5268474 -7173712 -8072550 -8435054 -7616972 -5125515 -2071610 -784910
10331 -784910 -3184922 -7865090 -11583585 -13057263 -13449856 -13410402 -12295369 -10533022 -8453903
10322 -8453903 -5611633 -2764831 -2287915 -4667746 -6880075 -6928560 -5570946 -3643614 -1532891
10313 -1532891 17722 868830 600741 -683409 -2732849 -5077355 -6592348 -7853399
10305 -7853399 -8704538 -7749338 -5583672 -3629902 -2725879 -2700825 -2234176 -1548006 -1739118
10296 -1739118 -3256106 -7208283 -12807848 -17871004 -21346777 -22257798 -21107355 -19715031
10288 -19715031 -18446772 -18350023 -19853823 -21038821 -21088008 -19410998 -15844005 -11713785 -9218443
10279 -9218443 -8362374 -7313654 -5828782 -5410981 -7107553 -10610481 -14517991 -17262729
10271 -17262729 -18686809 -19762509 -21127359 -21142186 -18540892 -14385286 -10930417 -10225458
10263 -10225458 -11320999 -12153218 -12284676 -11073010 -8110180 -4920438 -2657908 -1299643
10255 -1299643 -957163 -1362293 -2723665 -4919081 -7304688 -9881765 -11812982 -12034671 -12535895
10246 -12535895 -13445470 -12031110 -9242028 -8048685 -9345627 -12051570 -13898299 -12958794
10238 -12958794 -10547998 -9164437 -8971735 -9041449 -9074360 -9621683 -11425811 -13770725 -15326159
10229 -15326159 -15797086 -16769799 -19402151 -22387125 -23147721 -20007817 -14376631 -9184678
10221 -9184678 -5184646 -2142259 -946473 -1225455 -792949 930042 2210827 2225336 1336259
10212 1336259 -197316 -2274733 -4759269 -6250352 -5218238 -3445393 -3400734 -4467824
10204 -4467824 -4950139 -4782942 -6072153 -9853595 -13349105 -14693386 -14732704 -13755853 -10906808
10195 -10906808 -6064384 -1032316 2653674 3778065 2986788 2608785 3721479 5678330
10187 5678330 7127293 7126771 4981975 1365798 -2265260 -5535428 -8241246 -8921644 -6942187
10178 -6942187 -5006978 -6387129 -11280432 -16581575 -20414219 -22446260 -20828357 -15693162
10170 -15693162 -10124096 -6254654 -3769681 -1560640 368542 1563757 2553278 3735116
10162 3735116 5411927 7944615 9758754 8666194 5428363 2842321 1133438 -990418
10154 -990418 -2455807 -3126321 -3553859 -2659583 -127432 2929507 4522910 4821648 6794975
10145 6794975 10735396 14086454 16237778 17777032 18286058 17026430 14245366 10950447
10137 10950447 7534472 4553008 2417205 1066623 82488 -1751027 -4620385 -7600216
10129 -7600216 -9781527 -10889317 -10015965 -7247790 -4314122 -2090035 -1100839 -1470926 -2470294
10120 -2470294 -2884074 -2463581 -2064576 -2420804 -3557821 -4716678 -5990216 -7688920 -9948098
10111 -9948098 -11731717 -11714822 -11470902 -11715170 -10926091 -8345526 -4625917 -1653174 -586549
10102 -586549 -433969 -494586 -648733 -1152719 -1695290 -1061384 366781 945214 -81451
10093 -81451 -1445862 -1111555 834798 3023226 3570640 1822632 -939722 -3954815 -6203332
10084 -6203332 -7451465 -8223274 -7726110 -5937913 -3386963 -269402 2354052 2847231 937563
10075 937563 -2268764 -5341365 -6426896 -5357859 -3895042 -3078508 -2382886 -1193766 -515095
10066 -515095 -1848108 -5282921 -9800119 -13738025 -15266967 -14522524 -12370044 -9168961
10058 -9168961 -4823019 -363639 2385135 3395796 3674615 3226379 1712026 268732
10050 268732 -230817 677999 2424893 3611163 3294066 1264066 -1746721 -4553981 -6524137
10041 -6524137 -7497645 -7448178 -6024633 -3227873 -389018 1575029 3048829 4227131 5498791
10032 5498791 6643924 7089184 7986212 9496820 9969882 10617678 13646214 18545866 22601775
10023 22601775 23504266 22658059 22146377 22962970 25802319 31266582 39228285 48559177 57523373
10014 57523373 66107931 76361251 89688259 106702698 127932748 154621028 188188745
10007 188188745 229757243 281560689 346331838 424898454 506209302 558408367 546966596
10000 546966596 479021282 394597628 319477693 258900799 210743018 171839327 139742359
9993 139742359 113882051 93204156 77037338 64626002 54474035 46466222 40959077
9986 40959077 37173813 34861468 33522702 32651569 32438429 31947131 30440713 29449259 30666155
9977 30666155 33721073 37774456 41488325 43387842 45472353 50803834 59939219 70975714
9969 70975714 83032237 96939265 113482315 134252843 160228943 189597179 221286760
9962 221286760 256376040 293832320 325974116 342895200 345686621 344871084 349582409 362994600
9954 362994600 381923855 398035304 405343292 404466130 393452565 367730499 329890956
9947 329890956 289281817 253927741 226427210 204815522 186122699 168707908 152286717
9940 152286717 136668946 120798613 106457626 96319759 89318857 81916681 72618201
9933 72618201 63445731 56442128 50799634 43799108 35158053 26346675 18186359 10602700
9925 10602700 4246251 200280 -1106468 -926768 -1496923 -2601397 -2867120 -2264980 -2588852
9916 -2588852 -4317820 -5086835 -3155606 621007 3871298 5425997 5810077 5693564 5881466
9907 5881466 6374944 6469872 6445312 6499340 6832103 8045635 9167342 10176308 11723898
9898 11723898 13191225 14623049 15211468 13788987 11246836 9725560 9613241 8647388 5685560
9889 5685560 1454624 -1916083 -2269493 -543852 763929 -547365 -3484129 -5536580
9881 -5536580 -6176399 -5283026 -3120641 -462051 2531443 5540031 7838001 8476794 6057648
9872 6057648 1307905 -2872085 -4725659 -4631429 -3207189 -1107802 1297991 3679119 5535208
9863 5535208 6075970 5131405 3166771 435632 -1912946 -3280699 -4573296 -7114360 -10817722
9854 -10817722 -14607908 -17249853 -17486659 -15883486 -13774523 -11992682 -10648847 -9823987
9846 -9823987 -9319229 -9568388 -10220432 -10287516 -10518994 -11324851 -10974190 -8546601 -5082231
9837 -5082231 -2678001 -2589024 -4296679 -6985536 -9276051 -9494545 -8145828 -7191559 -8478112
9828 -8478112 -11899036 -14878861 -15664585 -14723520 -12795749 -10838842 -10058362 -10775308 -12614829
9819 -12614829 -15240726 -17022153 -16766660 -15910920 -15927909 -16472229 -16150595 -14163932 -11047996
9810 -11047996 -7429205 -3580227 -919388 -941153 -3442498 -6438396 -8951003 -10770023
9802 -10770023 -12335309 -13872152 -14460249 -13792803 -12790079 -11162872 -8384847 -5998178
9794 -5998178 -5405591 -7024692 -9794252 -11779667 -12546402 -12300956 -10813535 -7184905 -2685754
9785 -2685754 14999 -839282 -3837690 -5854843 -6432392 -7112017 -7859530 -8542634 -10175282
9776 -10175282 -11722690 -11713068 -10084420 -8177906 -6861526 -5300673 -2584555 472571 2427540
9767 2427540 3197714 3255531 3180200 2439922 902825 262491 -119536 -1756385 -3577472
9758 -3577472 -4085847 -2847377 -1361368 -2479619 -7663664 -14288435 -17750221 -16466278
9750 -16466278 -12348534 -8704829 -7631017 -8135602 -8984893 -10543764 -12568700 -12956768 -10427138
9741 -10427138 -6814404 -3442612 -697044 749794 1509077 1683391 473359 -1632602
9733 -1632602 -3188967 -4267946 -5958283 -7904157 -9463708 -10802814 -12250066 -13385452
9725 -13385452 -13379167 -11996130 -10185660 -9769449 -11648230 -14658936 -18179654 -21383230 -22957769
9716 -22957769 -22486002 -19797996 -15902893 -12748551 -11488846 -11310836 -11072500 -10116447 -8439063
9707 -8439063 -7066552 -7248676 -8524391 -9108554 -8831276 -7967769 -6523247 -4461111 -3028723
9698 -3028723 -3550368 -5565360 -7386269 -7827371 -7073558 -5881756 -5504865 -5808414 -5419115
9689 -5419115 -4116583 -2907408 -2779384 -4080569 -6522097 -9133571 -9541210 -7492202 -4957776
9680 -4957776 -2062392 706929 1881892 2449129 4861354 8936503 11916744 11053206 6334986
9671 6334986 251449 -4820751 -7643707 -8453594 -7631608 -5617562 -3602340 -2998142 -3068704
9662 -3068704 -2553391 -1735976 -2015123 -4645573 -7827658 -9049811 -7619843 -3929690 -680316
9653 -680316 107890 -18161 -121730 -579030 -711230 -191971 479499 1179030 906734 -2016716
9643 -2016716 -7117441 -11678744 -14544179 -16395987 -17102552 -17106325 -16441197 -14631703 -12018294
9634 -12018294 -9656171 -8649639 -8801944 -8014818 -4652251 142236 4182339 5631097
9626 5631097 4475818 2146836 328916 826872 2561654 2890700 1478780 -280344 -1325337
9617 -1325337 -2316908 -3919692 -6284498 -9247007 -12573550 -15716407 -17283730 -16995706 -16019267
9608 -16019267 -15299158 -14795963 -13479370 -11403404 -10061073 -9334082 -7812838 -5448352 -2668703
9599 -2668703 -351091 -11073 -1685107 -4081404 -6129058 -8111653 -11070086 -14792066
9591 -14792066 -17717247 -19788932 -21487718 -22389901 -22393348 -21650243 -20003008 -17740820 -15818993
9582 -15818993 -14819987 -14304572 -13951966 -14683973 -16783179 -19332927 -22170757 -24819834 -25862944
9573 -25862944 -25642559 -24582820 -22139045 -18182911 -13768291 -9615092 -6889281 -6428319
9565 -6428319 -7831025 -10555445 -12946898 -13366936 -11406469 -8144323 -4888134 -2583514
9557 -2583514 -931431 422213 1114029 1150768 482246 -428418 -835028 -22476 2835685
9548 2835685 6236242 7008758 5325365 3788754 4411799 7196003 9796077 10709318 10983975
9539 10983975 11556191 12247685 12828467 12504200 10981056 10286274 11467807 12704778 11731653
9530 11731653 9215138 6226090 3945830 3837089 5318446 6157504 4893654 1824436
9522 1824436 -2636865 -6810316 -7922697 -6156157 -4715078 -5486408 -7822351 -10079564
9514 -10079564 -11325833 -10976927 -9556801 -7999101 -6747410 -5713938 -5386474 -7691681
9506 -7691681 -12768229 -16950781 -18032978 -17293780 -16000988 -14046741 -10731795 -6878702
9498 -6878702 -4657286 -4338441 -4911769 -6174501 -7295778 -7632867 -7466717 -7111276 -7380525
9489 -7380525 -9451969 -12754117 -15512167 -17625457 -19934858 -22401645 -24598966 -26539739
9481 -26539739 -27836235 -28691376 -29602740 -29945794 -29866907 -29860723 -29371246 -27766927 -25138668
9472 -25138668 -20854081 -14605805 -8305165 -4448496 -3715797 -4979560 -6040161 -5676561
9464 -5676561 -4629022 -3854438 -3921036 -4759042 -6314192 -7984151 -9714761 -11350578 -12257001
9455 -12257001 -13165728 -14577386 -16067934 -16913832 -17079063 -17292774 -16988174 -15942293 -13918283
9446 -13918283 -10738086 -7636184 -6783740 -8103462 -9326936 -9564322 -9868401 -10740712 -11806753
9437 -11806753 -12004806 -11004610 -10913047 -11458007 -10971969 -10815323 -11007844 -9837982 -7231377
9428 -7231377 -4290691 -2802420 -3823357 -6365622 -8805637 -11491722 -14931082 -17830136
9420 -17830136 -19177485 -19167544 -17957906 -15782814 -13048793 -9932850 -6906614 -5156224 -3138400
9411 -3138400 114595 2191082 1855461 104148 -1991073 -3314806 -3345906 -2492249 -1278108
9402 -1278108 -303391 879746 2997053 5249144 6055031 5273336 3285002 502408 -2212181
9393 -2212181 -3926785 -4728042 -5150513 -5567438 -5780346 -5561779 -5058656 -4457642 -4636124
9384 -4636124 -4933193 -4686269 -4483132 -4401335 -4168894 -4466264 -5091145 -6277837 -8721765
9375 -8721765 -11686785 -13921277 -14151002 -12349376 -9407472 -6964894 -5708978 -5953160 -6586656
9366 -6586656 -6188790 -4912223 -3838095 -3905838 -5561962 -9186949 -13985297 -18739945 -22097460
9357 -22097460 -23021020 -21814089 -18981164 -15171017 -11403739 -7379968 -3276080 -923018
9349 -923018 -1674028 -3893696 -4520708 -2835225 -537177 651066 283949 -1062455 -3012179
9340 -3012179 -4426768 -4844774 -5327810 -5902952 -4970085 -2367186 -217985 541948 417028
9331 417028 -549718 -2273589 -4552055 -7640709 -10625516 -12049693 -12434068 -12827058 -12822631
9322 -12822631 -12464938 -10843241 -6806036 -3055595 -1941113 -3085614 -5181240 -7760602
9314 -7760602 -10392006 -12112055 -12195031 -10552527 -8120736 -5949605 -4785137 -4763325 -5880925
9305 -5880925 -7374125 -9384901 -12398276 -15309837 -16750399 -16142285 -13404332 -10221389
9297 -10221389 -9197678 -9719127 -9435472 -8034994 -6316469 -5405825 -4950097 -4568467 -4933379
9288 -4933379 -6213390 -8059080 -9311590 -9584600 -9673983 -10159816 -10694507 -10647643 -9767407
9279 -9767407 -8877883 -8455008 -7164753 -4546952 -1184339 1660951 1686328 -2377628 -8813265
9270 -8813265 -13751432 -14841494 -13420189 -11244502 -8818686 -7160139 -6705225 -6919329 -6464272
9261 -6464272 -4361820 -989107 1942262 4168459 6090143 6702922 5566124 3776302
9253 3776302 2176626 1188357 926905 780468 -379653 -2694213 -4040312 -3642699 -2681470
9244 -2681470 -2255362 -3281053 -5770882 -8541027 -10739008 -12307638 -13853441 -15873688
9236 -15873688 -18042494 -19125842 -17964499 -14532563 -10879163 -9106439 -9453636 -10257986
9228 -10257986 -10206676 -10537529 -11950490 -12861963 -11652484 -9130399 -5527264 -850440 3124179
9219 3124179 4863563 4925095 4244449 3546331 4122367 6150003 7870504 7822408 6569817
9210 6569817 6138692 7258777 7737421 6884664 6083748 6232053 7008707 6839773 5142142
9201 5142142 2457302 -990701 -5218058 -9090826 -10709184 -10041559 -8348743 -5941476
9193 -5941476 -2808775 -569409 -275131 -1444272 -2184317 -326044 4017165 8367930 11316171
9184 11316171 13152129 13756636 12461406 9800111 6614144 3202308 -347215 -3684195
9176 -3684195 -5830933 -6590220 -6554653 -6273405 -5439272 -3914292 -1994310 -225917 489441
9167 489441 1386490 2433592 1556947 -311779 -876513 -502358 -521455 -1283473 -3566235
9158 -3566235 -7162698 -9187487 -8092044 -5667011 -3655375 -4094762 -7093729 -9822120
9150 -9822120 -10724789 -11027998 -11936565 -13712071 -15526330 -16082390 -15571918 -14926840 -13829064
9141 -13829064 -12390090 -11942571 -11845740 -11060339 -10849486 -10886797 -9833575 -8952823 -8848589
9132 -8848589 -8497545 -7840976 -7662764 -8484780 -9621002 -10163808 -9831119 -9610913 -10742440
9123 -10742440 -11890911 -11337098 -9916487 -9021098 -7993101 -6865504 -6182802 -5182562 -3332197
9114 -3332197 -2177397 -2646969 -3357026 -2781115 -938427 437382 503247 70679 -59499
9105 -59499 525859 1083562 541 -1593003 -794600 2515627 5901558 7636999 8149556
9096 8149556 7984701 7587477 8561138 10286637 10322731 7768789 3129141 -1878452 -5509865
9087 -5509865 -7494572 -8830172 -10318319 -12438299 -15199626 -17283975 -18000541 -18016051 -16873766
9078 -16873766 -14317570 -11521550 -9864863 -10639964 -12988485 -14713563 -14645883 -13267965 -11793116
9069 -11793116 -10895960 -10140746 -9646855 -10868729 -13818123 -16867562 -17852654 -16143486 -13453777
9060 -13453777 -12282932 -13826878 -17010699 -19147895 -18470701 -15449507 -11176764 -7120875
9052 -7120875 -4348422 -3648650 -4988045 -6574947 -6512756 -4603222 -1964772 256560 2197114
9043 2197114 4247303 6319816 8204664 8733518 8092565 7873154 7458204 5648165 2247290
9034 2247290 -2507929 -7166501 -10423567 -11159896 -9963633 -8499304 -7598327 -7442323 -6908953
9025 -6908953 -6089741 -6421738 -8803913 -12066611 -13729526 -12612610 -9957265 -7285017 -4586041
9016 -4586041 -1882889 43702 34908 -1911790 -3937634 -5378727 -6147752 -7094650 -8439990
9007 -8439990 -7961254 -5431899 -3497229 -4029144 -6457735 -8349685 -8206855 -6826582 -5619854
8998 -5619854 -5314745 -5600739 -6414321 -6650575 -5971820 -5194269 -5097412 -5614236 -5756710 -5683662
8988 -5683662 -5576986 -6247871 -7530678 -9503242 -13517591 -17944202 -20391933 -20049018 -18107143
8979 -18107143 -16182426 -14902936 -14393407 -13511606 -11172015 -7549182 -4095605 -3029397
8971 -3029397 -4798161 -7729683 -10472203 -13388886 -16708412 -19207825 -19973648 -19774035 -19932498
8962 -19932498 -20525637 -19956841 -17861780 -16785061 -17291489 -17159990 -15439306 -13598468 -12893421
8953 -12893421 -13013874 -13448803 -13932681 -15151700 -18050760 -21987831 -24931997 -25685673 -24434782
8944 -24434782 -22103284 -18603807 -14487348 -11356836 -9623671 -9118549 -9998178 -11333789
8936 -11333789 -12411355 -13357256 -13466283 -11433903 -7990008 -5885924 -5438872 -5140361 -3706570
8927 -3706570 -1059215 905712 288448 -2468117 -5068415 -5211787 -3967768 -2600394 -1646093
8918 -1646093 -2368833 -3965608 -4581712 -3345672 -116106 4386434 8506997 10163175 9497533
8909 9497533 8237796 6773004 4030815 -160999 -4214593 -6031263 -5688259 -4753650 -4109455
8900 -4109455 -4456782 -5347042 -6661016 -8694002 -9646688 -7856346 -4111145 -746942 -293554
8891 -293554 -2391848 -5696508 -9010134 -10992154 -11456307 -11085413 -10980557 -11670818 -11980880
8882 -11980880 -11051741 -10357997 -11505460 -12720694 -11704122 -9082358 -6518401 -5786445 -7552218
8873 -7552218 -11001972 -15118334 -18367730 -19158313 -18700547 -19195391 -20143748 -19861308 -18383912
8864 -18383912 -16886461 -15558091 -14479087 -15019056 -16588546 -16925597 -15163623 -11131314
8856 -11131314 -5789153 -1112500 417445 -2421152 -6966439 -10346257 -13041003 -16122447
8848 -16122447 -19377293 -20735916 -19629613 -18135931 -17286654 -17421505 -18394143 -19740180 -21516017
8839 -21516017 -23080021 -23769530 -22329174 -18267287 -12729995 -7326453 -3241430 -924929
8831 -924929 493976 1665950 3357293 5344081 5401224 3343723 1288069 430899 -986234
8822 -986234 -5092036 -10669932 -14485433 -14696423 -12709301 -11766967 -13447719 -16194571 -17298222
8813 -17298222 -15537274 -11318336 -6408926 -2779079 -1314202 -2161160 -4695919 -7442428
8805 -7442428 -9641100 -11553979 -12432682 -10911492 -7427975 -3115193 1245393 3820240
8797 3820240 2180755 -3164442 -8832342 -12074263 -12491030 -12395508 -13835121 -15771597 -16954212
8788 -16954212 -17564799 -17509801 -15705620 -12886002 -10418670 -7577206 -4382160 -2992584 -3894262
8779 -3894262 -5222727 -6801110 -9736218 -12814171 -14148293 -13783582 -12873922 -12765739 -13014350
8770 -13014350 -11714047 -9637283 -8802998 -9331622 -9156029 -6563235 -2152370 2570254 6203429
8761 6203429 8390093 10223109 11835268 11156295 8150158 5092066 2483571 393819
8753 393819 -1484126 -3579932 -5296844 -5322682 -3719387 -3169745 -4514676 -6608382 -8222023
8744 -8222023 -8781169 -8276722 -6922483 -5764644 -5212162 -4431600 -3176820 -3144293 -5215014
8735 -5215014 -8282523 -11399639 -13977436 -15563113 -16279073 -15309285 -12051857 -7008780 -2518324
8726 -2518324 -956087 -1348571 -1849693 -2909524 -4816159 -7234992 -9425655 -11216628 -13723752
8717 -13723752 -15165551 -13143109 -9075600 -5271402 -1818228 2112312 5455117 6425966
8709 6425966 5800155 4751662 3468548 2356279 1383327 214491 -884071 -1899699 -2793598
8700 -2793598 -3481366 -3815933 -4530785 -6015654 -6761485 -5338117 -2745954 -1187619 -1245721
8691 -1245721 -2525231 -4194791 -4261731 -1715166 1914926 4925724 6358078 5485868 2881512
8682 2881512 -1036699 -5619248 -9955186 -15366381 -21925189 -27340793 -30190501 -29478494
8674 -29478494 -25616897 -20935476 -16598337 -13434312 -12063093 -11143280 -9154323 -6084911
8666 -6084911 -3288243 -1428137 751341 4056871 6569729 6585089 4776104 2340247 247451
8657 247451 -575128 -812899 -2463047 -5962567 -9472855 -10935522 -10587413 -9637658 -8508452
8648 -8508452 -7482739 -6719548 -6263867 -6453449 -6110925 -2929345 1837220 5563182 7249462
8639 7249462 7531250 7713236 6531394 2599660 -2164445 -5610890 -7481187 -8655905 -10186589
8630 -10186589 -12655447 -14960675 -15888082 -15353132 -13426339 -10490354 -8759879 -10320418
8622 -10320418 -14497556 -18761808 -20801713 -20624851 -19236103 -16162299 -11772874 -8451630
8614 -8451630 -8074826 -9815842 -11501235 -12927235 -14161433 -13970785 -12370933 -11115303 -10221188
8605 -10221188 -8381852 -5645715 -3200939 -1750400 -1396525 -1323064 -485048 1093270 3165573
8596 3165573 5115109 6379531 6598148 6178211 6826856 8479385 9821726 11376114 13515087
8587 13515087 15865208 17078097 15687878 12732764 9492501 6335281 4085789 3170411
8579 3170411 2969327 2038486 -16465 -1594155 -1538372 -816857 -1721101 -4731557 -8546648
8570 -8546648 -11549616 -13777132 -16650389 -19681304 -21720168 -23312081 -24783497 -24487180
8562 -24487180 -21595083 -17456743 -12955010 -8401821 -4738421 -2662978 -2132269 -2487262
8554 -2487262 -2510581 -2000369 -1161473 903577 3426723 3721841 615826 -3245235 -5602780
8545 -5602780 -6449106 -5169764 -2163256 1548513 4537671 5560209 5307639 5434824 5739163
8536 5739163 5005737 2739402 541794 -1684954 -5393133 -9073681 -11012539 -11238341 -10077412
8527 -10077412 -8023924 -4912899 -1390358 1551602 4458761 6498570 5930581 3021148
8519 3021148 -715006 -3890263 -5804709 -6523721 -6945994 -8088783 -9886342 -10724452 -9795491
8510 -9795491 -8694672 -7779269 -7170613 -8011191 -10415360 -12632128 -12952466 -11885373 -10537480
8501 -10537480 -8249399 -5547135 -3529118 -2055792 -2455487 -4937759 -7339184 -7701965
8493 -7701965 -6263854 -4998568 -4353155 -4590510 -5777912 -6224893 -5352634 -4554335 -3802387
8484 -3802387 -2819560 -2312291 -1496123 306025 2472573 4416322 6739926 9350578 10036809
8475 10036809 6988189 1206677 -4326949 -7830512 -9660349 -10374721 -10543648 -10498530 -9926832
8466 -9926832 -9818272 -10803744 -11782729 -11636944 -10615843 -10529588 -11572361 -12240983 -11797056
8457 -11797056 -10693602 -9508237 -7919195 -5862118 -2737902 2228457 7535187 11563312
8449 11563312 13904319 14171846 12406375 8501109 3061697 -2934423 -8692837 -12397960
8441 -12397960 -13626462 -14107990 -13959080 -12324912 -9281906 -6139459 -4318638 -4778710 -6856446
8432 -6856446 -8474463 -8498748 -7616293 -6354894 -4084167 -925064 1792505 3514786 4915890
8423 4915890 6147768 7061805 7920931 7797391 6098077 4142779 2842541 1243741 -1388634
8414 -1388634 -3061062 -2741093 -2314264 -3122633 -4915371 -5987074 -5376667 -4387356 -4586971
8405 -4586971 -6429105 -9563140 -13741242 -16992317 -17145216 -16007743 -15876277 -15041277 -12777569
8396 -12777569 -10475739 -8004175 -4723692 -1131150 2095039 3856836 2825574 -255197
8388 -255197 -3206768 -5006290 -4461987 -1061154 1828269 1759424 163894 -1531021 -2375443
8379 -2375443 -2218766 -1726625 -1039150 -198694 1493647 4751596 7698349 8465305 7917326
8370 7917326 7880876 8511476 8397925 7023015 4747360 1804783 -1236241 -4156138 -6693843
8361 -6693843 -7762001 -7079722 -5502888 -4374321 -4922325 -6575930 -8127472 -9203026 -9287661
8352 -9287661 -7925646 -5389175 -1608452 2689642 5035442 4306680 1937255 842918
8344 842918 613888 -1007895 -2961175 -3465369 -2631373 -1077598 631751 1981185 2829950
8335 2829950 3416715 3911841 4281621 3245324 -23579 -4087830 -7474323 -8840447 -7129808
8326 -7129808 -4143286 -3130099 -4958337 -8652620 -12660063 -15039327 -14914669 -13013478
8318 -13013478 -10934592 -10569524 -11965935 -14132388 -15843628 -16009490 -14575793 -12223950
8310 -12223950 -9255935 -5938061 -4342930 -5960720 -9103847 -10636518 -10122984 -8827538
8302 -8827538 -6649115 -4278136 -3528436 -4546585 -5412849 -5681043 -7551343 -11643834 -16476850
8293 -16476850 -19894842 -19898307 -17266317 -15762256 -16795038 -18273148 -18483002 -17452405 -16450700
8284 -16450700 -15869292 -15185035 -13915760 -12022362 -9840771 -7326741 -4316285 -2003255
8276 -2003255 -1656361 -2509134 -2776572 -1436860 543707 1741745 2541713 2857249 1457139
8267 1457139 -1093694 -2469081 -1822288 -192792 734544 -50228 -2606801 -6522467 -9606237
8258 -9606237 -9829969 -8034648 -5734454 -3886557 -3366759 -4604099 -7746455 -11204769 -12595876
8249 -12595876 -12951150 -14342926 -15622315 -14853097 -12021260 -9151260 -7821821 -8015378 -9268016
8240 -9268016 -10730533 -11064220 -9206372 -5316399 -1022183 2437473 4669524 5701057
8232 5701057 5465075 4552762 3865945 3352326 2529849 1569161 469566 -1127718 -2111809
8223 -2111809 -823780 2023174 4620226 6313347 6187957 3671621 3260 -3585157
8215 -3585157 -6271440 -6734298 -4528796 -766985 2631474 3985861 1916209 -2800050
8207 -2800050 -7289325 -9732248 -11054152 -13401208 -16196814 -16603686 -14327385 -11070786
8199 -11070786 -7404240 -3125081 629701 2174845 2211030 3205414 4724932 3850414 370000
8190 370000 -2900791 -3981882 -3788551 -3781855 -2876579 -915917 -6844 -358896 -699929 -509038
8180 -509038 512114 2618712 4407629 4459408 3441633 2439424 1998094 1667947 1094665
8171 1094665 596372 31882 -1045588 -2785861 -4911678 -6767341 -8117113 -10188425 -13014058
8162 -13014058 -15331670 -16297013 -15569866 -13954517 -12912768 -13591631 -15210397 -14778766 -11029947
8153 -11029947 -6233682 -3134222 -1025975 1837398 3983351 3592879 1610744 -701689
8145 -701689 -3055033 -5276498 -7599252 -9412519 -9544030 -7954339 -6633383 -6505155 -7009576
8136 -7009576 -7590690 -7789186 -7529476 -7100655 -6671296 -6496569 -6503747 -6305379 -6098663 -5608147
8126 -5608147 -4723491 -3750693 -2652495 -1920674 -2109017 -3236260 -5134353 -5963792 -5165448
8117 -5165448 -4372405 -4345540 -4136975 -3598367 -3406831 -3591768 -3603101 -4721926 -7675928 -9644010
8107 -9644010 -9476381 -9459312 -11207400 -14480778 -18491519 -22254580 -24951045 -26589806 -26877378
8098 -26877378 -25673067 -22529359 -17661126 -13231727 -10937445 -11400653 -13657187 -15555767
8090 -15555767 -15162365 -12827711 -10877388 -10301619 -10008002 -8517444 -4733064 398791 3821015
8081 3821015 4659607 4868688 5417028 5856547 4966300 1806048 -2229301 -4621399 -4970776
8072 -4970776 -3805423 -1104940 2011852 3728351 3790618 2969495 2117821 1547499 1264531
8063 1264531 1063306 1651580 2576265 1492487 -844226 -1072923 886462 2458970 2846504
8054 2846504 3974163 7000221 10583675 12397248 11539718 10054014 9277821 8414983 8587006
8045 8587006 10002476 9854336 7054481 2732320 -1581053 -5259545 -9375632 -13696641
8037 -13696641 -15711373 -14202510 -10437307 -7467169 -7313710 -9374540 -11186702 -10796098
8029 -10796098 -8528180 -5098719 -1214598 953263 1314747 1751936 2132889 2677561 4539199
8020 4539199 6141555 5685017 3408538 725996 -1620490 -3139336 -3342094 -2854410 -2678048
8011 -2678048 -3290339 -4075205 -3911356 -2387552 -1114944 -2106298 -3735776 -4285308 -4973936
8002 -4973936 -6871994 -8046260 -6145849 -1689784 3531808 7268776 7765253 5566104
7994 5566104 2798587 742234 -992374 -3044929 -5240137 -6367052 -5668248 -3079485
7986 -3079485 -170486 1382374 2144817 1791830 -37371 -1533820 -170067 2594130 4036655
7977 4036655 4248634 4629794 6287909 8492637 8836539 6023888 1248452 -3262992 -6323559
7968 -6323559 -7952620 -9093561 -10337999 -11397587 -11947233 -12390765 -12341227 -10684011 -7936118
7959 -7936118 -5657484 -3923485 -765614 3930302 8177985 10360230 11365940 12450200
7951 12450200 13095176 13634065 14464493 15153653 16376900 18534874 19652249 18338479 15480182
7942 15480182 12381657 9538285 7624950 6975629 6836540 7365565 8670179 10989689 13136097
7933 13136097 13583888 13455221 13249081 11684466 9459611 8985131 9865714 9865683 8229845 7020842
7923 7020842 8232415 10323795 11028461 10996335 10623202 9531555 7930918 5464928 3070816
7914 3070816 2300835 2515636 2162409 368933 -1942757 -2480247 -1199049 340179 2284455
7905 2284455 4614232 5415600 4413913 3301981 2584980 1798348 1425820 1753765 1713424
7896 1713424 723563 -1012336 -2422156 -2581919 -2288683 -3067121 -5197241 -7330174 -8312148
7887 -8312148 -7129982 -4062034 -1059610 545584 -464271 -4950767 -9774050 -11927606
7879 -11927606 -12749587 -13585097 -13063772 -10593242 -8641097 -9170265 -11472058 -13842761 -15688161
7870 -15688161 -17996387 -20364915 -20920842 -20482089 -21081446 -22798369 -24506008 -25584640 -25738107
7861 -25738107 -25030789 -23582683 -21468626 -19695308 -18099894 -16396356 -15612060 -15506244 -14754343
7852 -14754343 -11982444 -7465450 -3962046 -4222124 -7833747 -11579667 -12463398 -10708608
7844 -10708608 -8324967 -5491267 -2315655 -273442 244039 960399 3235771 5859024
7836 5859024 7341875 8605834 10433123 12410539 13404792 11886148 7786138 2700047
7828 2700047 -448365 -1321316 -1618749 -766099 1820206 4901379 7258341 8562975 8582406
7819 8582406 7996638 9129473 11779777 13548205 13878130 13389813 12713722 12696462 13004510
7810 13004510 13786118 15143280 15897425 15632368 13739414 9919694 5256854 1281672 -1181667
7801 -1181667 -1987171 -1086306 431501 1200481 705639 -540255 -1104105 -844714 -622815
7792 -622815 -224982 261308 -352770 -1868055 -2194048 226001 3578659 3758031 121412
7783 121412 -3677636 -5284372 -4867256 -4236287 -4750473 -6808500 -9441216 -9971021 -7728082
7774 -7728082 -4293834 -521615 3760973 7621257 9506045 9489200 8166312 6519524 4875733
7765 4875733 2570856 1210260 2786076 6399866 9598698 10147748 7397947 3046702
7757 3046702 -145609 -968055 -716351 -798491 -525736 1053851 2747623 3454049 2695251
7748 2695251 256161 -3166261 -6952474 -10479340 -12324591 -10656440 -6731814 -3453891
7740 -3453891 -2006625 -1538509 -848547 171296 -27892 -2888107 -6920268 -9516610 -9416040
7731 -9416040 -7673232 -6124040 -4856185 -2789399 -1014865 -840337 -1318627 -2009128 -2394708
7722 -2394708 -2553371 -3144849 -3467857 -2973744 -2152032 -1152606 178961 438757 -856533
7713 -856533 -2254962 -3074261 -2893437 -1926026 -1078295 -976851 -1444760 -1540973 -666907 260078
7703 260078 520478 192979 -1175596 -2906242 -3110185 -1263132 1574593 4816416 8749012
7694 8749012 12064425 12700510 10985297 9126039 8816429 9467740 8499319 4397101 -1055032
7685 -1055032 -5263245 -7530511 -7939363 -6281567 -3424670 -1235782 -1144994 -2551065 -3946908
7676 -3946908 -3896783 -2502846 -1443609 -1453872 -1794442 -1951268 -1005722 1352417 3758141
7667 3758141 4408141 2649794 -391299 -2633372 -2059275 1122605 4020991 3988161 1211600
7658 1211600 -2556345 -6371238 -10190802 -12305507 -11415851 -9101887 -7390147 -6827698 -6882372
7649 -6882372 -6576857 -4618170 -304001 4444559 7380747 8659222 8953473 9021726 8687869
7640 8687869 8131662 8404531 9356217 10654099 12052264 12480027 12273155 12112793 11248670
7631 11248670 9510992 8216474 8354060 9828839 11053375 10724142 9774329 9759428 10977095
7622 10977095 13095752 15109201 16079850 16227638 16218154 16527989 15785378 13600622 10819220
7613 10819220 8365249 6750261 6187674 7268067 8590490 7571163 4173581 471763
7605 471763 -2480211 -4711282 -6881742 -9945395 -13620241 -16342515 -16284224 -13147475 -8646367
7596 -8646367 -4525068 -1634970 305840 1561818 2901333 5074895 6906669 7653089
7588 7653089 7926774 7627209 7549616 7657357 6053553 2460596 -1928028 -5903789 -8063880
7579 -8063880 -7285917 -4469035 -1510048 702008 1652790 1814821 3198709 5894202 7845403
7570 7845403 6484882 1363856 -3915382 -6107955 -5906987 -4398128 -1561888 2705491
7562 2705491 6683523 8076831 6788153 4655398 3228002 2310476 1813369 1680289 894336
7553 894336 -1174078 -4239033 -7736233 -9844233 -9053669 -6932577 -4767926 -2665113 -1130765
7544 -1130765 -1314753 -2967310 -4491697 -6102516 -7960277 -8856821 -8330156 -7232776 -7879356
7535 -7879356 -11120860 -15473046 -19308409 -20902952 -19993530 -17091668 -12863178 -8501714
7527 -8501714 -4716136 -2587397 -2243202 -2156095 -1847557 -1635944 -1256190 461915 3330412
7518 3330412 5997304 7617279 6570739 2915491 -952802 -3656242 -4886020 -4370543
7510 -4370543 -2186871 500700 800246 -1847788 -5451295 -7882690 -7441251 -5771065 -3832448
7501 -3832448 -424742 4040091 7548678 9303876 9938332 9669641 8247721 6214421 4298562
7492 4298562 3106246 3161518 3728515 4095012 4406235 4571506 4607573 5121181 6324873 7561160
7482 7561160 8271367 9001482 9864487 10495302 10452790 8504256 4873937 1194837 -1205108
7473 -1205108 -1069413 1198869 3330912 4603655 5386528 5216526 3033291 -358380 -2530416
7464 -2530416 -2357194 -947810 658112 3063551 5116373 5820223 5696965 4510159 2355463
7455 2355463 305796 -482185 325646 2325206 4516088 5757053 6504551 8160186 10751316
7446 10751316 12690966 13205166 12447839 11238451 11500983 13821639 16517440 17912736 17626550
7437 17626550 16816653 16913896 17675662 18366526 18481692 17791333 17251037 18361346 20747466
7428 20747466 22035305 21070166 18632631 15197868 12209443 11445607 11564764 10363925 7356457
7419 7356457 4507364 3066033 2059734 1192331 651466 -203352 -1794119 -3668184 -5444712
7410 -5444712 -7240383 -8618674 -8209419 -5996355 -4164484 -3054212 -1195264 1141203
7402 1141203 2205206 497649 -2598553 -4644776 -4671305 -4072984 -4491081 -5627433 -6223375
7393 -6223375 -5069107 -3257030 -2959014 -4102245 -5003390 -4556955 -3929484 -3988927 -4638726
7384 -4638726 -5988797 -7032677 -6511128 -5121657 -4130217 -4388963 -5737876 -7036456 -7918228
7375 -7918228 -8680126 -8919398 -8755733 -8339338 -7247679 -5689662 -3923970 -1660679 230657
7366 230657 740998 322123 -888530 -2373822 -1663689 2128465 6515441 9768582 11212309
7357 11212309 10039418 6726952 3316989 1093531 140441 73112 -614325 -2776446 -5142243
7348 -5142243 -7364609 -8834928 -9047640 -8838825 -9401625 -10577854 -10541612 -9312842 -7493136
7339 -7493136 -4809734 -2137299 -873402 -1847611 -4437178 -7199958 -9099796 -10568874
7331 -10568874 -12090166 -13505850 -13994679 -13362082 -13394140 -15214245 -18191981 -21675561 -24453455
7322 -24453455 -24018841 -20462434 -16008439 -12484078 -9517837 -6618146 -4287243 -2059889
7314 -2059889 991846 4756954 8621756 12789609 16930828 18692322 16379305 12106739
7306 12106739 9357044 8907711 8910734 8189644 6079870 1635692 -4453316 -9782799 -12904935
7297 -12904935 -14137469 -13765316 -12301357 -10299494 -7128427 -3047367 616248 3417724
7289 3417724 5774595 7767483 9889899 12265139 13848491 13839367 12914132 11726924 10409186
7280 10409186 9483998 10467860 15003010 21290204 25232092 25637287 24063954 22392321 21365964
7271 21365964 19841061 16963124 14740271 14961506 16101818 16413869 17410762 20619930 23389571
7262 23389571 22699391 18896637 14237017 10560152 8560771 7579477 5893600 3121574
7254 3121574 434633 -1142603 -1939558 -2505628 -2380276 -1844935 -1995601 -3018549 -3954898
7245 -3954898 -3628423 -2086481 -1063866 -1054199 -1632191 -2548506 -3526781 -4978690 -6356924
7236 -6356924 -5752224 -2721830 499818 1742570 803182 -1626437 -3455202 -3325628 -1115934
7227 -1115934 2551473 6469535 9899525 12737360 14861067 15802600 16052010 16970713 20033832
7218 20033832 24105896 26900553 27953652 26641370 22912900 18432399 14541053 11471857
7210 11471857 8672987 6374966 5109447 3941865 2146150 860538 1710589 5127055
7202 5127055 10026105 13144275 13090221 10666369 6765954 2293829 -1615315 -4853258 -7574795
7193 -7574795 -8593872 -7704310 -6429584 -6073489 -6078576 -6058733 -6041703 -5230149 -3918852 -3932334
7183 -3932334 -5470074 -6146112 -3644946 469580 3459801 4449207 3265391 220247 -1997838
7174 -1997838 -1335273 439147 1520687 1459920 89542 -2227281 -3142379 -2334604 -2239433
7165 -2239433 -3186730 -3253503 -1370252 1658122 4127137 4712084 3910878 2267985 -295136
7156 -295136 -2440199 -2964744 -2069871 327866 3759907 6246492 6416271 5100181 4597366
7147 4597366 5251821 6235417 7957338 9490443 10261422 10725250 9227723 5023492 317018
7138 317018 -2662402 -3900927 -4038962 -2493808 417112 3743686 6667832 7754145 6831771
7129 6831771 4275276 1936599 1737586 2526072 2394050 24577 -4608022 -9298079 -11772795
7120 -11772795 -12065742 -10359972 -7273401 -4963180 -4650775 -5274757 -5576871 -5342282 -4322385
7111 -4322385 -2108357 315548 1170089 718545 339521 -251583 -1411358 -1022902 2287390
7102 2287390 5788007 6894058 5484453 2316625 -434073 -396618 814921 575353 -673608
7093 -673608 -1214774 -561919 -342207 -2121984 -4615053 -5680957 -5093541 -4094985 -3410038
7084 -3410038 -2699861 -766894 1719145 2684439 2291621 1554347 1366885 1874063 2140346
7075 2140346 1974294 1498187 447336 -924072 -2577632 -4358321 -4770344 -3072085 39205
7066 39205 3740614 7786946 11172649 12357228 11435519 10377256 10330629 10904694 12414728
7057 12414728 14034409 13802743 11526603 8117477 4897081 4279710 5940703 6309740 3775439
7048 3775439 -498562 -4221400 -6279862 -6883553 -6719711 -8004438 -11356670 -14995368 -17869849
7039 -17869849 -18352202 -16057645 -13118752 -11311263 -10574918 -10198911 -10281895 -10058124 -9150634
7030 -9150634 -8007681 -7548164 -8161508 -9173279 -9557113 -8868648 -7576537 -6423181 -5448969
7021 -5448969 -4830160 -4869854 -5930421 -7629343 -8799786 -8970262 -8145197 -6158233 -3256232
7012 -3256232 -154875 1933342 2701118 3087336 3577811 4064513 4912478 6200653 6440349
7003 6440349 4995261 2836489 1260483 -415010 -3775030 -7535197 -10597324 -13401727
6995 -13401727 -15588226 -15696347 -13549846 -10536388 -7410562 -3854781 -8078 2678420
6987 2678420 4079022 5283905 6862246 7411168 4705655 -1188462 -8368062 -15134408
6979 -15134408 -19872455 -21728105 -21423345 -18917842 -14526988 -11169115 -10019175 -9635055
6971 -9635055 -8601113 -5858206 -2552148 -656815 -593509 -2836238 -5562134 -6001939 -4460695
6962 -4460695 -1814540 774065 2210847 2884307 2948783 3294817 4781815 6928229 8464875
6953 8464875 7768595 4759271 1567200 119902 59369 169298 1040214 2919391 3845427
6944 3845427 3095587 1679486 -47497 -2554841 -5785055 -10229019 -16527799 -22983414
6936 -22983414 -27465410 -28882561 -27052569 -24278535 -23721467 -25046703 -24011011 -18316532
6928 -18316532 -11003352 -6340968 -3749095 -63188 4928822 8508785 8113917 4919183
6920 4919183 2273528 1527705 1376351 491859 -1176803 -3093477 -4410917 -5064249 -4465892
6911 -4465892 -2694589 -1496224 -757855 -35091 1203749 3377348 4760521 4135885 2815781
6902 2815781 2247527 1763269 -184805 -2961092 -4636320 -5765697 -7999990 -9919112 -9761983
6893 -9761983 -7651879 -3496896 2590752 8068310 10469874 10374198 9608502 10344762 12977896
6884 12977896 14814305 14698397 14054476 13016486 11093665 9045059 8651405 9525524 10186669
6875 10186669 10971937 12438058 13860900 13696209 11592713 8555055 4521718 -630535
6867 -630535 -4206456 -3934273 -398721 4146355 7988877 11037230 13772469 16825048 19369992
6858 19369992 20062420 18064107 13458225 8757480 6766555 8031261 10876715 13985158
6850 13985158 15906783 14727871 11451620 7453686 2342135 -2986668 -6999265 -8536210
6842 -8536210 -7962233 -6553427 -4395873 -243979 5716369 10962431 14091540 14206332 11759530
6833 11759530 8994083 6525436 3986708 1770104 938147 1471569 1806979 134650 -3481984
6824 -3481984 -6387688 -7217875 -7230693 -8200892 -9660361 -10424649 -9684753 -6863103 -3177547
6815 -3177547 110071 2148946 1763589 49509 -950901 -2319114 -5022289 -8397875
6807 -8397875 -10391654 -9268449 -6543994 -3556086 -399889 1579346 1409017 -575470
6799 -575470 -3278298 -5616799 -8159866 -11918231 -16398893 -19142755 -19131206 -17436275 -16219287
6790 -16219287 -16021887 -15359471 -12384991 -7678118 -3702327 -329546 3475887 6685515
6782 6685515 7551057 8071292 10504116 12928335 14102911 15256969 16776291 17421030 16543412
6773 16543412 15511554 15160757 15003605 14701040 13851717 12545511 10838915 9409073 9211439
6764 9211439 9994595 10954004 11166756 10263168 8149037 5186270 2486195 1857457 3104666
6755 3104666 3624586 2439976 1655658 2221931 2102027 -75466 -3124304 -5606375 -6211302
6746 -6211302 -5144836 -4204938 -3975460 -3823677 -3270756 -2912623 -3323789 -4195037 -3906782
6737 -3906782 -1663598 2069522 4977930 5389580 3248144 -1664609 -7751103 -10984877
6729 -10984877 -8868772 -4181695 -1791551 -3492084 -6626069 -7769098 -6203533 -3803739
6721 -3803739 -1670070 608633 4285768 9724523 15313141 19202588 21605068 22309368
6713 22309368 21034520 19320837 18937283 20299167 21977895 22847354 22356250 20558314 18726864
6704 18726864 17358654 15383450 11446859 6713541 3753909 2437444 1228900 -832348
6696 -832348 -4545314 -9315327 -12961753 -13346845 -9861992 -4389742 690595 4186787 5736820
6687 5736820 5766516 5124446 5312711 7447822 10083500 10980814 9307574 5645569 348094
6678 348094 -4751958 -6687304 -4486898 -1346770 -39114 -123238 -606850 -993327 -1737576
6669 -1737576 -3460897 -6091890 -8793125 -9584960 -7948373 -6703791 -8450861 -11375928
6661 -11375928 -13434496 -14596394 -14008695 -11046275 -6360786 -1785446 1263988 3686296
6653 3686296 6766189 10183829 11067920 7745724 2362569 -2910513 -6879760 -8958568
6645 -8958568 -9074169 -7509958 -5870776 -6299451 -8232604 -9799976 -10904391 -11282979 -10470154
6636 -10470154 -8462686 -5679406 -3196930 -2381786 -3920852 -6998824 -11059361 -15058542
6628 -15058542 -17204799 -17527104 -16799226 -14762743 -11166174 -6947545 -4006427 -3604010 -4981438
6619 -4981438 -5679569 -4683095 -3734045 -3860239 -4582562 -5966134 -7577869 -8977167 -9423199
6610 -9423199 -8411302 -5748280 -1780911 1771940 4224653 6358027 8092372 7901439
6602 7901439 5576577 3066375 1558456 1565394 2250921 2099733 510655 -1235299 -1216096
6593 -1216096 1353682 3979048 5367801 6861969 7875057 7029120 5385549 5295409 6695251
6584 6695251 7947546 9618695 12538027 15804693 19202029 22745490 25325617 26157421
6576 26157421 25341000 24016911 22364105 19080390 13675887 8077661 4883311 3724273
6568 3724273 2248207 -161596 -1131898 1083967 4563177 6232376 5555534 3559071 1449204
6559 1449204 -447698 -1962689 -2488026 -1478059 441431 3039514 6789094 10708043
6551 10708043 12868070 11938711 8949311 7281915 8739140 12561751 15931879 16518937
6543 16518937 15404582 15201788 15400396 15263189 15621232 16378451 17288043 19188752 22244896
6534 22244896 24880009 26702449 28551136 29771144 29226904 26670381 22754231 17874722
6526 17874722 13053147 9981938 8343976 7601323 7701461 7805582 7174427 5806869 4848586
6517 4848586 5977684 9586753 13735709 16294219 17397696 17554881 17113187 16467726 15654846
6508 15654846 14317273 11617425 7328619 3142296 477868 -388432 1163958 4381381
6500 4381381 7073825 7432599 5398100 2384330 -852696 -3977163 -5731767 -6418291 -7649978
6491 -7649978 -9183414 -10367390 -10700183 -10020770 -8651781 -6553575 -4575695 -2990034 -892029
6482 -892029 546901 -229850 -1931332 -2302114 48256 3634465 5290458 3444182 -1190436
6473 -1190436 -5011793 -6334783 -6739305 -7003805 -6302451 -3988111 -461943 3842946 7641030
6464 7641030 10492300 12972273 13785617 11799792 9168870 8057287 8536346 10631074 12323145
6455 12323145 10903104 7682343 4968089 2839545 1181121 922349 2265078 4133432
6447 4133432 6415961 9722695 13635541 15659810 14600615 12070678 9774721 8828370
6439 8828370 9157474 10061109 10571478 10385595 9269941 8221655 9665185 13635943 17249742
6430 17249742 18376275 17405852 15469001 13034284 9194900 3730341 -2038292 -7121401
6422 -7121401 -12114296 -16519852 -18728064 -17497774 -13458401 -8901304 -5488843 -3292418
6414 -3292418 -999526 1577041 2294244 540529 -2172285 -4965662 -6929764 -7177288 -5780931
6405 -5780931 -3936493 -3011838 -3366366 -3904084 -2838416 741923 5534949 8597562 9333314
6396 9333314 10134619 11885988 12848679 11842437 10077321 9826272 11535748 14293522 16378390
6387 16378390 16029820 13597907 10955714 9664439 10909354 14166946 17209960 18994189
6379 18994189 19684250 19014399 17636704 15491888 10373655 3214452 -2064333 -3979395
6371 -3979395 -4460489 -5397983 -7224778 -9374736 -11524159 -13648068 -14870117 -14707108 -12987017
6362 -12987017 -9335880 -5486533 -2600906 -707192 647867 1877646 2620096 3107040
6354 3107040 2590440 318473 -2617227 -5032424 -6325436 -7201074 -9119914 -11805327 -14401107
6345 -14401107 -15614613 -14592464 -11574459 -7088781 -2563055 379532 1543002 2064494
6337 2064494 3368283 5256066 6940662 9091727 11755424 14418377 17490443 19689363
6329 19689363 19520455 18293965 18024614 19509172 20326500 17229229 11853567 9044376 8645698
6320 8645698 7688654 5715086 3900558 3574337 4059380 4022840 3552384 3873753 6471735
6311 6471735 10120065 11883086 9843129 5794484 3977721 5803047 9283728 11740702
6303 11740702 11799272 9759665 6664366 5048772 7065932 10265699 11948791 12731217 13397812
6294 13397812 14131251 15179502 16262161 16511091 15274935 13344413 11836163 11236849 10149890
6285 10149890 7430029 4214538 1667707 311329 229205 774257 1158285 1154804 559660
6276 559660 -479181 -605386 172014 698452 1871431 4720137 6918865 6773724 5927441
6267 5927441 5670383 4861653 3034083 1235051 -833028 -1903537 -954462 374733 2158413
6258 2158413 4879360 7468611 9662843 11383098 12409205 12444198 10997183 8701042 7480273
6249 7480273 7575280 7977604 7826868 5741118 2977531 1410421 191046 -1753524 -4289834
6240 -4289834 -6673468 -6833679 -5254275 -4873307 -5040612 -4359324 -2792351 -268785 2658522
6231 2658522 4875247 5321261 3182265 -1039090 -5372006 -8599537 -10413721 -11519853
6223 -11519853 -12608175 -12963047 -12638403 -12116529 -12549026 -14678522 -16453707 -15880162 -13680759
6214 -13680759 -10837203 -7379101 -4304666 -2480471 -1643430 -1057138 -691009 -804287 -3176
6205 -3176 2365331 4221542 4251936 3415119 2184758 -622103 -3939829 -4601507 -2388277
6196 -2388277 486812 3053460 5387752 6593099 5627980 3746312 2987093 2440935 1120346
6187 1120346 362569 406311 -248693 -1925042 -3573880 -4924679 -5459774 -3338560 355953
6178 355953 2486143 3507118 4944058 6497423 8667982 12397159 15751753 16607926 15657700
6169 15657700 14149552 12404095 10654118 9399190 8145254 5804893 2680099 179325
6161 179325 -1517134 -2582995 -3038163 -2360227 -152802 1836844 2254502 1500866 1069047
6152 1069047 1562313 1967924 1923130 2412234 3483509 3268699 1469384 -554931 -1852842
6143 -1852842 -2666354 -3731858 -4981781 -5092028 -3609567 -2198392 -1408162 -1027338 -655599
6134 -655599 1137756 3338032 3299294 999896 -1505602 -3287848 -4932830 -5135389 -2720097
6125 -2720097 1191890 5359444 8526854 9326792 8035011 6912116 7266994 8104941 8034013
6116 8034013 6495626 4408289 3464494 3057828 1818803 1128638 2635657 6693486 11400112
6107 11400112 14207852 15217130 16856581 19111668 20851915 21637103 20769773 19464952
6099 19464952 19869742 21427186 21685877 20451282 18715537 17460137 17718223 19099526 19797365
6090 19797365 18887391 15882176 11529597 7402216 4284116 1931390 858505 833220 302931
6081 302931 -499065 658401 4817339 9513827 12487697 14036066 14504001 13658756 12726025
6072 12726025 11897520 10151355 8724389 8196586 7709667 6600746 5791677 7113968 9944369
6063 9944369 11668902 9936464 4534887 -2543575 -9483645 -15300135 -18772555 -19205996
6055 -19205996 -16885420 -14049278 -12143595 -9782769 -6055573 -2281564 778325 3713059
6047 3713059 6192865 7405946 6697924 3474307 -1565448 -5849275 -7483056 -7335344 -6837414
6038 -6837414 -6416942 -6298954 -5624998 -4167242 -2604769 -1407767 -108293 2448109 5850707
6029 5850707 8121033 8217583 7473997 8148291 10997878 14420597 17152817 19130894 20575397
6020 20575397 20943587 18309038 13084191 8199155 4806519 3364299 3912717 5620381
6012 5620381 7754211 9694292 11713048 13357989 13158298 10802832 8109703 6852374
6004 6852374 6792534 6998159 6851076 7168291 8512058 10023256 10889254 10704684 9395636
5995 9395636 7076456 4248413 1535024 -1377494 -4161576 -6367694 -8149550 -9036484
5987 -9036484 -8300651 -7277119 -7342550 -7921876 -8862210 -10169666 -12026637 -13771345 -14532961
5978 -14532961 -14755675 -13767044 -10850195 -7968171 -6217764 -5062062 -3031966 783380
5970 783380 4483502 7199949 9600507 11336278 11880612 11096146 9991486 9323581 8481623
5961 8481623 7006354 4851081 3053658 2344490 2074293 2095368 3046109 5305811 8380188
5952 8380188 10854840 11699557 11370688 11344692 12386931 13867652 15072855 15924934 16836807
5943 16836807 17952567 18483084 18019493 17474698 17172959 15722196 12412823 8421375 5361648
5934 5361648 3227762 1135260 -112927 714253 2550266 3585485 2860461 1071781 -267659
5925 -267659 -1107135 -1924443 -1515439 394429 1859659 1628558 670289 155119 -56725
5916 -56725 215642 539372 -280809 -2294821 -4906692 -7541185 -8960258 -8919157 -8367605
5907 -8367605 -7539604 -5814815 -2958532 693576 3160852 3041132 1762231 181939 -1788770
5898 -1788770 -4038222 -6479690 -6814721 -3708476 612067 4365781 7531704 10734627
5890 10734627 12288470 10594466 7164214 3748525 552606 -2360148 -3597111 -2987171
5882 -2987171 -2830057 -4160856 -5259735 -4732504 -2616703 -20690 2289227 4054086 5027061
5873 5027061 5388962 5321303 5593469 6787158 9056862 12380600 15894127 18866181 20139569
5864 20139569 19920618 19380568 18816289 17862759 15673424 12330343 9597748 8838978 9913485
5855 9913485 12287484 14383285 14633098 13282657 10070954 5740752 2336754 -641130
5847 -641130 -4015458 -6131989 -5132654 -2012962 1325393 4231652 6180375 7551487 8781623
5838 8781623 9032257 8391745 8109632 8538738 8276302 6414747 3820632 2031027 1987315
5829 1987315 3231656 4793761 6099864 7798207 9367745 9455143 7716181 4880146 2965808
5820 2965808 3120987 4452606 5166556 5131197 5193954 5441307 4241175 66896 -5413188
5811 -5413188 -9517300 -10996164 -9504971 -5563835 -1212157 2202539 4741911 7848373
5803 7848373 11939768 16528384 20573102 21790205 20222309 17545277 15712214 15128559
5795 15128559 15320191 14940032 12886407 11041318 11585468 13525462 14204588 12143194 8711816
5786 8711816 6306361 5971161 7727226 10010420 10674045 9782210 6952912 1391728 -4744362
5777 -4744362 -9102686 -10441267 -8733107 -4977169 -466134 2172586 778381 -2367459
5769 -2367459 -3321576 -1649839 1034060 3788182 5506397 5567613 4538016 1204584 -3780406
5760 -3780406 -7158492 -8210407 -9130289 -10334275 -11105451 -10933112 -9312437 -6599383 -4142749
5751 -4142749 -3239044 -3972105 -5622390 -6971684 -7080815 -5952180 -3211268 773223 3943221
5742 3943221 5287629 5355730 6071978 7970932 9834863 10377450 8948330 6653657 5499991
5733 5499991 5384818 5199200 4581863 3735298 3734366 4476051 4924098 4694880 4504567 5123399
5723 5123399 4855385 2297448 -390880 -1979865 -4066741 -6253488 -8083001 -10425199
5715 -10425199 -11590281 -10539359 -7825659 -4681106 -2903873 -1370839 2478209 8067601
5707 8067601 12466596 14018818 13691077 13309638 13051473 11526029 9582498 9867400 12080625
5698 12080625 14280179 15873220 16236990 14828134 12106078 9966250 9536571 9739576 10221286
5689 10221286 11359953 12523370 12721473 13126146 14791289 15886127 14852978 13265530
5681 13265530 12285359 12354798 13648804 15516342 17515806 19434607 20874428 21579797 21550563
5672 21550563 20981944 19682679 17737101 15605237 13409058 10868099 7600067 4081999
5664 4081999 1983122 2169913 3630132 5804723 8427698 10857038 12144548 9753354
5656 9753354 5553863 3853916 5100606 7326162 9021056 9397279 7465438 3015708
5648 3015708 -1466799 -3704691 -3664970 -1879630 -653333 -815010 -1166202 -1159389 -624745
5639 -624745 981825 3808339 6669199 9179941 12174190 14815889 15822010 16264836 17568006
5630 17568006 19168203 19864541 18870381 17857999 17954935 16081193 11544231 6419187 2995348
5621 2995348 2624881 4329769 5987520 6545548 6786374 7115172 6986831 5085577 1188357
5612 1188357 -2426661 -2748765 485570 4323677 6604817 8490341 10317182 10683828 8311949
5603 8311949 3865033 359861 857448 4649690 8610211 10502732 10935028 11230841 10510134
5594 10510134 8783800 7141780 5925045 4864162 3848216 3829634 5370198 7181918
5586 7181918 9274594 12701437 15727320 15816641 13564135 11241484 9855185 9188284 9552785
5577 9552785 11012952 11496543 9982922 8385051 8650728 10140174 11254079 11697087 11688163
5568 11688163 10641665 9255864 9300385 11352040 14331773 16900489 18612596 18533591 15855400
5559 15855400 11198563 6065769 2037914 -315436 -1949793 -1987314 907534 5357134
5551 5357134 9817182 13895066 17351587 19993114 21517331 21042422 18676062 16090262
5543 16090262 14204435 12792494 11989613 11106647 9495937 8405490 9011997 11385131 13916512
5534 13916512 14545779 13124306 10430612 6723637 1233870 -4906646 -8711117 -9217938
5526 -9217938 -7088079 -3774243 -784076 739312 498744 755839 3579912 7055225 8598418
5517 8598418 8467489 7844944 7318673 7140532 6291878 4674547 3197154 1788314 557123
5508 557123 -401703 -1440306 -2476354 -2527835 -1616530 -1275114 -1347958 -1450141 -2448762 -4145834
5498 -4145834 -5995197 -7503735 -8139295 -7227724 -4691514 -1992969 -963186 -1926221 -3577240
5489 -3577240 -4802004 -5579386 -6529558 -7910804 -9301858 -9070220 -5987097 -844124 3886132
5480 3886132 6805414 8987519 10652552 10260092 7092339 2243240 -1689079 -2450897 -1264593
5471 -1264593 -745063 -2180425 -5718031 -9338590 -11319297 -12622603 -13938354 -14302164 -13532669
5462 -13532669 -12695495 -11658123 -9490779 -5765356 -1859939 594749 1720636 2130882
5454 2130882 2398108 2447694 1714366 -330324 -3074715 -4356135 -2898207 259092 3175069
5445 3175069 3950937 1941018 -256821 -1047867 -1314224 -2043020 -3566126 -5490901 -7766116
$$ [...]
##END NTUPLES=NMR SPECTRUM
##END=
