##TITLE=dept_SR158H3 CH-,CH3- -up, CH2- -down
 D2O, 2600 sc
 21.04.2023
##JCAMPDX= 6.0         $$ Bruker NMR JCAMP-DX V2.0
##DATA TYPE= NMR SPECTRUM
##DATA CLASS= NTUPLES
##ORIGIN= UXNMR, Bruker Analytische Messtechnik GmbH
##OWNER= root
$$ XWIN-NMR		Version 3.5
$$ Fri Apr 21 16:16:16 2023 Russian Standard Time (UT+4h)  she@DPX200
##.OBSERVE FREQUENCY= 50.327992884445
##.OBSERVE NUCLEUS= ^13C
##.ACQUISITION MODE= SIMULTANEOUS
##.ACQUISITION SCHEME= undefined
##.AVERAGES= 2601
##.DIGITISER RES= 17
##SPECTROMETER/DATA SYSTEM= spect
##.PULSE SEQUENCE= dept135
##.SOLVENT NAME= CDCl3
##.SHIFT REFERENCE= (INTERNAL, CDCl3, 0, 214.665)
##AUDIT TRAIL= $$ (NUMBER, WHEN, WHO, WHERE, WHAT)
$$ ##TITLE= Audit trail, XWIN-NMR		Version 3.5
$$ ##JCAMPDX= 5.01
$$ ##ORIGIN= Bruker BioSpin GmbH
$$ ##OWNER= she
$$ F:/spectra/data/she/nmr/depta/1/pdata/1/auditp.txt
$$ ##AUDIT TRAIL=  $$ (NUMBER, WHEN, WHO, WHERE, WHAT)
(   1,<2023-04-21 16:15:31.10 +0400>,<she>,<DPX200>,
      <created by zg, POWCHK disabled, PULCHK disabled
       terminated by command 'halt'
       configuration hash MD5:
       00 E9 B6 7A A2 85 ED C7 34 08 36 98 17 FE 4E 26
       data hash MD5: 16K
       EA DD 61 57 6E 86 7C E0 6B 90 92 D9 3E 7A 76 8B>)
(   2,<2023-04-21 16:15:32.95 +0400>,<she>,<DPX200>,
      <Start of raw data processing
       efp BC_mod = 2 LB = 3.5 FT_mod = 6 PKNL = 1 PHC0 = -3641.36 PHC1 = -1085.8 SI = 16K 
       data hash MD5: 16K
       8B 38 64 9F 32 37 2F C7 35 84 05 E9 B2 A6 09 FF>)
$$ ##END=
$$ 
$$ hash MD5
$$ DD EC CE BC BB 5B D9 E5 A1 B4 D6 C4 9C BC 16 9B
##$RELAX= 
##$RELAX= 
##$RELAX= 
##$RELAX= 
##$RELAX= 
##$RELAX= 
##$RELAX= 
##$RELAX= 
$$ Bruker specific parameters
$$ --------------------------
##$DU= <F:/spectra>
##$EXPNO= 1
##$NAME= <depta>
##$PROCNO= 1
##$TYPE= <nmr>
##$USER= <she>
##$AMP= (0..31)
100 100 100 100 100 100 100 100 100 100 100 100 100 100 100 100 100 100 
100 100 100 100 100 100 100 100 100 100 100 100 100 100 
##$AQSEQ= 0
##$AQ_mod= 1
##$AUNM= <au_zg>
##$AUTOPOS= <>
##$BF1= 50.322709
##$BF2= 200.13
##$BF3= 200.13
##$BF4= 200.13
##$BF5= 200.13
##$BF6= 200.13
##$BF7= 200.13
##$BF8= 200.13
##$BYTORDA= 1
##$CFDGTYP= 0
##$CFRGTYP= 5
##$CHEMSTR= <none>
##$CNST= (0..31)
1 1 145 1 1 1 1 1 1 1 1 1 1 1 1 1 1 1 1 1 1 1 1 1 1 1 1 1 1 1 1 1 
##$CPDPRG= <>
##$CPDPRG1= <waltz16>
##$CPDPRG2= <waltz16>
##$CPDPRG3= <>
##$CPDPRG4= <mlev>
##$CPDPRG5= <mlev>
##$CPDPRG6= <mlev>
##$CPDPRG7= <mlev>
##$CPDPRG8= <mlev>
##$CPDPRGB= <>
##$CPDPRGT= <>
##$D= (0..31)
0 2 0.003448276 0 0 0 0 0 0 0 0 0 2e-05 0 0 0 0 0 0 0 0 0 0 0 0 0 0 0 
0 0 0 0 
##$DATE= 1682072168
##$DBL= (0..7)
120 120 120 120 120 120 120 120 
##$DBP= (0..7)
150 150 150 150 150 150 150 150 
##$DBP07= 0
##$DBPNAM0= <>
##$DBPNAM1= <>
##$DBPNAM2= <>
##$DBPNAM3= <>
##$DBPNAM4= <>
##$DBPNAM5= <>
##$DBPNAM6= <>
##$DBPNAM7= <>
##$DBPOAL= (0..7)
0.5 0.5 0.5 0.5 0.5 0.5 0.5 0.5 
##$DBPOFFS= (0..7)
0 0 0 0 0 0 0 0 
##$DE= 274.5357
##$DECBNUC= <off>
##$DECIM= 12
##$DECNUC= <off>
##$DECSTAT= 4
##$DIGMOD= 1
$$ [...]
##$SUBNAM1= <"">
##$SUBNAM2= <"">
##$SUBNAM3= <"">
##$SUBNAM4= <"">
##$SUBNAM5= <"">
##$SUBNAM6= <"">
##$SUBNAM7= <"">
##$SUBNAM8= <"">
##$SUBNAM9= <"">
##$SW= 219.3118970423
##$SWIBOX= (0..15)
0 1 3 0 0 0 0 0 0 0 0 0 0 0 0 0 
##$SW_h= 11037.527593819
##$TD= 16384
##$TD0= 1
##$TE= 0
##$TE2= 300
##$TE3= 300
##$TEG= 300
##$TL= (0..7)
120 120 120 120 120 120 120 120 
##$TP= (0..7)
150 150 150 150 150 150 150 150 
##$TP07= 0
##$TPNAME0= <>
##$TPNAME1= <>
##$TPNAME2= <>
##$TPNAME3= <>
##$TPNAME4= <>
##$TPNAME5= <>
##$TPNAME6= <>
##$TPNAME7= <>
##$TPOAL= (0..7)
0.5 0.5 0.5 0.5 0.5 0.5 0.5 0.5 
##$TPOFFS= (0..7)
0 0 0 0 0 0 0 0 
##$TUNHIN= 0
##$TUNHOUT= 0
##$TUNXOUT= 0
##$USERA1= <user>
##$USERA2= <user>
##$USERA3= <user>
##$USERA4= <user>
##$USERA5= <user>
##$V9= 5
##$VALIST= <valist>
##$VCLIST= <CCCCCCCCCCCCCCC>
##$VD= 0
##$VDLIST= <DDDDDDDDDDDDDDD>
##$VPLIST= <PPPPPPPPPPPPPPP>
##$VTLIST= <TTTTTTTTTTTTTTT>
##$WBST= 1024
##$WBSW= 2
##$XGAIN= (0..3)
0 0 0 0 
##$XL= 0
##$YL= 0
##$YMAX_a= 764072
##$YMIN_a= -880270
##$ZGOPTNS= <>
##$ZL1= 120
##$ZL2= 120
##$ZL3= 120
##$ZL4= 120
##$ABSF1= 0
##$ABSF2= 0
##$ABSG= 0
##$ABSL= 0
##$ALPHA= 0
##$AQORDER= 0
##$ASSFAC= 0
##$ASSFACI= 0
##$ASSFACX= 0
##$ASSWID= 0
##$AUNMP= <proc_1d>
##$AZFE= 0.1
##$AZFW= 0.1
##$BCFW= 0
##$BC_mod= 2
##$BYTORDP= 0
##$COROFFS= 0
##$CY= -3
##$DATMOD= 1
##$DC= 0
##$DFILT= <>
##$DTYPP= 0
##$F1P= 0
##$F2P= 0
##$FCOR= 0.5
##$FTSIZE= 16384
##$FT_mod= 6
##$GAMMA= 0
##$GB= 0
##$INTBC= 1
##$INTSCL= 0
##$ISEN= 128
##$LB= 3.5
##$LEV0= 0
##$LPBIN= 0
##$MAXI= 10000
##$MC2= 0
##$MEAN= 0
##$ME_mod= 0
##$MI= 0.4000791
##$NCOEF= 0
##$NC_proc= -3
##$NLEV= 6
##$NOISF1= 120.0001
##$NOISF2= 80.00006
##$NSP= 0
##$NTH_PI= 0
##$NZP= 0
##$OFFSET= 214.6655
##$PC= 4
##$PHC0= -3641.36
##$PHC1= -1085.8
##$PH_mod= 1
##$PKNL= yes
##$PPARMOD= 0
##$PSCAL= 0
##$PSIGN= 0
##$REVERSE= no
##$SF= 50.3227091
##$SI= 16384
##$SIGF1= 140
##$SIGF2= 120
##$SINO= 80
##$SIOLD= 32768
##$SREGLST= <13C.CDCl3>
##$SSB= 0
##$STSI= 16384
##$STSR= 0
##$SW_p= 11037.527593819
##$SYMM= 0
##$S_DEV= 0
##$TDeff= 16384
##$TDoff= 0
##$TI= <>
##$TILT= no
##$TM1= 0
##$TM2= 0
##$TOPLEV= 0
##$USERP1= <user>
##$USERP2= <user>
##$USERP3= <user>
##$USERP4= <user>
##$USERP5= <user>
##$WDW= 1
##$XDIM= 16384
##$YMAX_p= 276200153
##$YMIN_p= -147985679
$$ End of Bruker specific parameters
$$ ---------------------------------
##NTUPLES= NMR SPECTRUM
##VAR_NAME=  FREQUENCY,     SPECTRUM/REAL,   SPECTRUM/IMAG
##SYMBOL=    X,             R,               I
##VAR_TYPE=  INDEPENDENT,   DEPENDENT,       DEPENDENT
##VAR_FORM=  AFFN,          ASDF,            ASDF
##VAR_DIM=   16384,         16384,           16384
##UNITS=     HZ,            ARBITRARY UNITS, ARBITRARY UNITS
##FACTOR=    0.67371834180669, 1,            1
##FIRST=     10802.5493505904, 0,            0
##LAST=      -234.978243228581, 0,           0
##MIN=       -234.978243228581, -147985679,  0
##MAX=       10802.5493505904, 276200153,    0
$$ Real data points
##PAGE= N=1
##DATA TABLE= (X++(R..R)), XYDATA
$$ [...]
5387D890261M528454P97841m220458n506203m986178m141319l009579k180429
5379a3827610k154763l660472l561401P87691N115443M966254K801907J815426
5371g717525J736994K02370j458358j346890n44156p44558O4440J357243K508715
5362e941725L819517K807503J600729J833680J638118J739499L842684N805997
5354A7146002M128240N21606j894757k041162m66787J78844O4356J084626J607681
5345B0328649q13954l827937m594244l758121j460400J424426L121748K598123
5337A3018290m55506l333422k489721p1356Q54997J617044K507943J678713j150131
5328A2176851m389561n249194k668696p74552j299932j620405j321059j199781
$$ plain form
5387 4890261 9418715 10216556 5996098 489895 -4496283 -8637602 -11647181 -13827610
5379 -13827610 -15982373 -19642845 -23204246 -22416555 -17301112 -12334858 -9532951 -7717525
5371 -7717525 -5980531 -5778161 -7236519 -8583409 -9127565 -9872123 -9807683 -8450440 -5941725
5362 -5941725 -2122208 685295 2286024 4119704 5757822 7497321 11340005 17146002
5354 17146002 21274242 21795848 19901091 17859929 17393142 17571986 17636342 18720968 20328649
5345 20328649 19514695 15686758 11092514 7334393 5873993 7298419 10420167 13018290
5337 13018290 12562784 9229362 6739641 6668285 7523282 9140326 11648269 13326982 12176851
5328 12176851 7787290 2538096 -130600 -905152 -2205084 -3825489 -5146548 -6346329
5320f346329n49849p68539j444093o67835J475721K178278J057649J685314K164160
5311a215523j096171m096139k786373J530123N763200N802469L280183N66343
5303G748112j346449n82785Q94602J91512k879552m798686l816754j085634J518524
5294d157110K427495K215417J451849J122613K834822L996435J943427J17336
5286A1952284N16228J858365J892564m88442m479982o981752o033392l727108
5278e491235j824925j512825j012182N06326Q75319o98876j251748J36648J92801
5269a0080697j641783k422393k137470l248397m563931m281013j858495O01294
5261b9632885J116968K350529M085020N424233P375916P435917M956803K401218
$$ plain form
5320 -6346329 -6896178 -7664717 -9108810 -9776645 -8300924 -6122646 -5064997 -3379683 -1215523
5311 -1215523 -2311694 -6407833 -9194206 -7664083 -1900883 3901586 7181769 7748112
5303 7748112 6401663 5818878 6713480 6904992 4025440 -773246 -4590000 -5675634 -4157110
5294 -4157110 -1729615 485802 1937651 3060264 5895086 9891521 11834948 11952284
5286 11952284 12468512 14326877 16219441 15730999 11251017 4269265 -1764127 -5491235
5278 -5491235 -7316160 -8828985 -9841167 -9334841 -8459522 -9158398 -10410146 -10273498 -10080697
5269 -10080697 -11722480 -14144873 -16282343 -19530740 -24094671 -28375684 -30234179 -29632885
5261 -29632885 -28515917 -26165388 -22080368 -16656135 -9280219 -1844302 3112501 5513719
5253E513719O48100j826477k804026M50336L528678L418642J061108j137359l83000
5244H469721K646495M530027K558943p21886k526876k869390l421124m354813
5236D311097m039915k757737j571113k612579m618898l295147K4904O20440o86110
5227a4625058j180230q40944J239939K918982J959628J190753K062472J281809
5219e992649p98479J077369N476302O962743N684061L805050Q72082k932760n578972
5210H574747n336280m532289m750049m386153l022192k045101k275727j755820
5202a9528864J46204J525230J859527J286070J220618K173008K737593J838247
5194f742367k86161j734206j67857L179607M567773L742613K156409M53068j236856
$$ plain form
5253 5513719 6161819 4335342 1531316 1981652 5510330 8928972 9990080 8852721 8469721
5244 8469721 11116216 15646243 18205186 17483300 14956424 12087034 8665910 4311097
5236 4311097 271182 -2486555 -4057668 -6670247 -11289145 -14584292 -14559388 -13938948 -14625058
5227 -14625058 -15805288 -16646232 -15406293 -12487311 -10527683 -9336930 -7274458 -5992649
5219 -5992649 -6791128 -5713759 -237457 6725286 12409347 16214397 17086479 14153719 8574747
5210 8574747 3238467 -1293822 -6043871 -10430024 -13452216 -15497317 -17773044 -19528864
5202 -19528864 -19382660 -17857430 -15997903 -14711833 -13491215 -11318207 -8580614 -6742367
5194 -6742367 -7028528 -8762734 -8930591 -5750984 -1183211 2559402 4715811 5168879 3932023
5185C932023k514868k553318j036980M90118J610518K351856J050457j447098
5177A882708k608206j672807n64017J58598J789080K987912K455444O02823q39727
5168D191808k49105J081919J196302J413420J271009J67489n91869q66526k174058
5159E440389m304019n363803m143509k09548L968530N218251N156194N334544
5151A1097029M564902L127041J758327P08884J121139J202731j143228k406694
5143B0030131l81959J073357l61832j354705K71520J986812J991322K053603J916068
5134B7224317R70089p5315l12118k351559o151699n956995j637495o97639m164574
5125F847012o639168o714558n195570k817299K07889K477703L442049L291465
$$ plain form
5185 3932023 1417155 -1136163 -2173143 -1683025 -72507 2279349 3329806 1882708
5177 1882708 -725498 -2398305 -2962322 -2803724 -1014644 1973268 4428712 5031535 4191808
5168 4191808 3942703 5024622 6220924 7634344 8905353 9072842 8480973 7614447 5440389
5159 5440389 1136370 -4227433 -8370942 -8580490 -4611960 606291 5762485 11097029
5151 11097029 15661931 18788972 20547299 21256183 22377322 23580053 22436825 20030131
5143 20030131 19648172 20721529 20359697 19004992 19276512 21263324 23254646 25308249 27224317
5134 27224317 28194406 28119091 27806973 25455414 19303715 13346720 11709225 11011586 6847012
5125 6847012 207844 -6506714 -11702284 -14519583 -14311694 -11833991 -8391942 -5100477
5117e100477J343174j208179k274401r16653L25165p07934j391837r69381j549149
5108a2449672k699927k545877j446230j983094l108927j943825p6498M94006R47739
5099b4812305J173958Q43368K237098L975630L955854L980015M924886M715386
5091I93890K410753k5569j161000k022666k864259k845711j605237m60204L22969
5082g257034K560954N748945N534356J265331l241029n224543k565789J879719
5074a299090L021734J214475o53109k452496m075482k703841K85405J992548J723273
5065b946583J14323j464001k817804m351350n532909n425099l925596j105359
5057b7454378J311233J786954N43948j263083j424290M75020J964019J329982
$$ plain form
5117 -5100477 -3757303 -4965482 -7239883 -8156536 -7831371 -8539305 -9931142 -10900523 -12449672
5108 -12449672 -15149599 -17695476 -19141706 -21124800 -24233727 -26177552 -26254050 -25760044 -24812305
5099 -24812305 -23638347 -22794979 -20557881 -16582251 -12626397 -8646382 -3721496 993890
5091 993890 3404643 3379074 2218074 195408 -2668851 -5514562 -7119799 -7580003 -7257034
5082 -7257034 -4696080 1052865 6587221 7852552 4611523 -613020 -3178809 -1299090
5074 -1299090 1722644 2937119 2284010 -168486 -4243968 -6947809 -6662404 -4669856 -2946583
5065 -2946583 -2832260 -4296261 -7114065 -11465415 -16998324 -22423423 -26349019 -27454378
5057 -27454378 -26143145 -24356191 -23812243 -25075326 -26499616 -26024596 -24060577 -22730595
5049b2730595l07449j14205J113405K426990K611236R03138j103582r18216M1565
5040a8077713J43265J276685L404197M673573L651312o26863n785753q368343
5032a9709640p716515m870201j292999L5960j601978k941484j214037K991593
5024c6319301O186285P773133P251180M682755J635162j077578k803254k110948
5016a4782566M44480J982046J566624P53349N44777J181388K073561J662114Q17913
5007c756314P16765J070989J214718o91244k858244k810318r87394R46921M87831
4998f666290j322901j127491J868398M801654L794971j31719j616930m79881k37622
4989a117811J64406N83136p99914j68069K942471K946105N11295p96281o78277
$$ plain form
5049 -22730595 -23038044 -23152249 -22038844 -19611854 -17000618 -16097480 -17201062 -18119278 -18077713
5040 -18077713 -17934448 -16657763 -13253566 -8579993 -4928681 -5555544 -11341297 -19709640
5032 -19709640 -27426155 -32296356 -33589355 -33553395 -35155373 -38096857 -39310894 -36319301
5024 -36319301 -30133016 -22359883 -15108703 -10425948 -8790786 -9868364 -12671618 -14782566
5016 -14782566 -14338086 -12356040 -10789416 -10036067 -9491290 -8309902 -6236341 -4574227 -3756314
5007 -3756314 -3039549 -1968560 -753842 -1445086 -4303330 -7113648 -8101042 -7154121 -6666290
4998 -6666290 -7989191 -9116682 -7248284 -2446630 1348341 1216622 -400308 -880189 -1117811
4989 -1117811 -953405 -370269 -1170183 -1338252 1604219 4550324 5061619 4265338 3587061
4980C587061L74879K57318k117176n047852p089731o291986k825664k42387j723040
4971b1118578m513379m381673k663770k0442K789447L610795L573091M222807
4963a8501702N339342N340021L764995Q70303k982064m737861l773591r77931
4955a5658488J649894K048092J874322J004215j276470m132388n870212m631004
4947b4992039j407603K329249M543351M723598L337848O67980j120661R2894L462255
4938h363128N507783M056780J811793J804763J451493r13062m168572p383851
4930f196001q111578n467215r39056K555733K943108K405263J960687J80696j394104
4921a2062467r94442j720263l389683r42278L258041N437158O741221O994822
$$ plain form
4980 3587061 3961940 4219258 2102082 -2945770 -10035501 -16327487 -19153151 -19395538 -21118578
4971 -21118578 -25631957 -30013630 -32677400 -32697842 -29908395 -26297600 -22724509 -18501702
4963 -18501702 -13162360 -7822339 -4057344 -3187041 -6169105 -10906966 -14680557 -15658488
4955 -15658488 -14008594 -11960502 -10086180 -9081965 -10358435 -14490823 -20361035 -24992039
4947 -24992039 -26399642 -24070393 -19527042 -14803444 -11465596 -10797616 -11918277 -11825383 -8363128
4938 -8363128 -2855345 1201435 3013228 4817991 6269484 5356422 1187850 -6196001
4930 -6196001 -14307579 -19774794 -20713850 -18158117 -15215009 -12809746 -10849059 -10668363 -12062467
4921 -12062467 -13056909 -14777172 -18166855 -19109133 -15851092 -10413934 -3672713 3322109
4913C322109O087716L550036J514532N92306j825299l171776k208176j621251
4905F240197j958211j926456j558614r26936r43364j136866K77703J576297J791275
4896A435025J269481K19898l3048J33581J85829J906928M708110N338102K383316
4887A7547222j371879n416209p039596m785909k857136l296190m702126l538018
4879a5459841m91505J291677J007263Q61941K525747M612976N224348L586327
4871C158933J346909o62862r98407L24953n26817k676705k733282j855327j033354
4862e655959K075265M817661L131943m04319j579201j609653j354990J034366
4854D55113K865018K102199J43867j833916k181676j378100k202574k959203k987279
$$ plain form
4913 3322109 9409825 12959861 14474393 15066699 13241400 10069624 7861448 6240197
4905 6240197 4281986 2355530 796916 -130020 -1073384 -2210250 -1932547 -356250 1435025
4896 1435025 2704506 2924404 2891356 3024937 3210766 5117694 9825804 15163906 17547222
4887 17547222 16175343 10759134 3719538 -1066371 -3923507 -7219697 -11921823 -15459841
4879 -15459841 -15951346 -14659669 -13652406 -12790465 -10264718 -5651742 -427394 3158933
4871 3158933 4505842 3842980 2844573 3169526 2642709 -33996 -2767278 -4622605 -5655959
4862 -5655959 -3580694 1236967 4368910 3964591 2385390 775737 -579253 455113
4854 455113 3320131 5422330 5566197 3732281 1550605 172505 -2030069 -4989272 -7976551
4845g976551l535736k084388N72066J249708K686041M978142M183019o9953l870487
4836c868139l190269N80057L744875M109985K363188Q18757K417081M333527K333587
4827A3642649j731908m766400m558249j347695J141023J40162k895413m421987
4819d797818l007849q70174J428795L188349K877894O07774l580270p259556o003071
4810a7415926l07977L944744L761282R22828j237642j034457L58209L37957r08475
4801a1579457k956257m535069k478645K895166N801075L708022k7847l042108
4793a2215120m724388l883246j429636j07995n07628o10107Q39739K367925K459659
4784a7810797K149299K321983J419481p36640k085610m75688K187537K527482
$$ plain form
4845 -7976551 -11512287 -13596675 -13024609 -11774901 -9088860 -4110718 72301 2348 -3868139
4836 -3868139 -7058408 -6478351 -2733476 1376509 3739697 4558454 6975535 11309062 13642649
4827 13642649 11910741 7144341 2586092 1238397 2379420 2519582 -375831 -4797818
4819 -4797818 -7805667 -8675841 -7247046 -4058697 -1180803 -573029 -4153299 -11412855 -17415926
4810 -17415926 -17723903 -13779159 -10017877 -9095049 -10332691 -11367148 -11008939 -10670982 -11579457
4801 -11579457 -14535714 -19070783 -21549428 -18654262 -12853187 -9145165 -9173012 -12215120
4793 -12215120 -16939508 -20822754 -22252390 -22360385 -22868013 -23478120 -22638381 -20270456 -17810797
4784 -17810797 -15661498 -13339515 -11920034 -12656674 -14742284 -15217972 -13030435 -10502953
4776a0502953J576007K557701M049915L875436K717809Q47363J06254J66478m75477
4767D918533n60087l58906N98220K266297K759148R67986j739989k569734m31908
4758E849560L108162N299303N062988L353557J300435n57954j932402n96088K200338
4749B3087899Q38524k896623k925395j86494p70956l972600m663437k263221R09136
4740G156833J700036m71210k429033k668275k863055m011631n172528n299511
4732a4058374m969640o095786o110269l815553k063949m44134K148082M503667
4724c0905956N277586M226218J700424q04244l098890l582682l77122L569287
4716b3995379M082372P15989k628813k858812j404291K79704K498862M492011
$$ plain form
4776 -10502953 -8926946 -6369245 -2319330 1556106 4273915 5121278 5227532 5394010 4918533
4767 4918533 4358446 3999540 4597760 6864057 9623205 10591191 8851202 6281468 5849560
4758 5849560 8957722 14257025 19320013 22673570 23974005 23416051 21483649 20887561 23087899
4749 23087899 23926423 21029800 18104405 17917911 17146955 13174355 8510918 6247697 7156833
4740 7156833 8856869 8385659 5956626 3288351 425296 -3586335 -8758863 -14058374
4732 -14058374 -19028014 -25123800 -31234069 -35049622 -37113571 -37557705 -35409623 -30905956
4724 -30905956 -25628370 -21402152 -19701728 -20505972 -23604862 -27187544 -27564666 -23995379
4716 -23995379 -19913007 -19197018 -21825831 -24684643 -26088934 -25809230 -23310368 -18818357
4708a8818357O245601O542801L758447o05960l578596l711428k432042j670164
4700a4269698j631007k880423l790273k864266j718309Q41544M586782N746525
4692a5979125L621174O14911j20202P13727N29281l06055n08607o06878L41447
4683a1700327J775469J053704j83816k20887l65853j760347k613880k758411l495485
4674b0269833m178997l421892k61416M199711N631487K542718r27873j719966
4666a8406061r90687l87663l58564J203761K991486J549099j371660k682172k403986
4657b0856447j918078k32788K678817M619442O477152Q847390Q684117N112828
4649A3412433O66474l220444n118005n634281m895600k527276l52695J593412
$$ plain form
4708 -18818357 -12572756 -6029955 -2271508 -2877468 -6456064 -10167492 -12599534 -14269698
4700 -14269698 -15900705 -18781128 -22571401 -25435667 -27153976 -26312432 -21725650 -15979125
4692 -15979125 -12357951 -11743040 -11863242 -11149515 -10620234 -10926289 -11434896 -12041774 -11700327
4683 -11700327 -9924858 -8871154 -9054970 -9275857 -9641710 -11402057 -14015937 -16774348 -20269833
4674 -20269833 -24448830 -27870722 -28132138 -23932427 -18300940 -15758222 -16686095 -18406061
4666 -18406061 -19396748 -19784411 -20142975 -18939214 -15947728 -14398629 -15770289 -18452461 -20856447
4657 -20856447 -22774525 -23007313 -20328496 -15709054 -9231902 -384512 8299605 13412433
4649 13412433 14078907 10858463 5740458 106177 -4789423 -7316699 -7669394 -6075982
4641f075982L365704K796018M58217q54497r45931j614438j865664p18817j170203
4632f625593l595940m873699m571540n150058n355586k424948K203245N393170
4624b5000949O219602N717237M330698L442014K407978K66476q61486j802121
4616e280551m771781p083433n316497r21625L465557N374380L685176K301203
4608h547571L409116M406990L512943M15158k772681m899994m743292k195764
4600a1415095J036909K809366J553882p04085j961475k077766k843540l062478
4592a6664282n84904J942975L582657N362264N561458L471037P95916m19765M75865
4583C523221J875192J790522K34137j670548k157478n98653J332066K624721L727581
$$ plain form
4641 -6075982 -2710278 85740 543957 -310540 -1256471 -2870909 -4736573 -5455390 -6625593
4632 -6625593 -10221533 -15095232 -19666772 -24816830 -30172416 -32597364 -30394119 -25000949
4624 -25000949 -18781347 -13064110 -8733412 -5291398 -2883420 -2616944 -3478430 -5280551
4616 -5280551 -10052332 -17135765 -22452262 -23373887 -19908330 -14533950 -10848774 -8547571
4608 -8547571 -5138455 -731465 2781478 3196636 423955 -4476039 -9219331 -11415095
4600 -11415095 -10378186 -7568820 -6014938 -6719023 -8680498 -10758264 -13601804 -16664282
4592 -16664282 -17249186 -15306211 -11723554 -6361290 -799832 2671205 3467121 3047356 3523221
4583 3523221 5398413 7188935 7423072 5752524 3595046 2996393 4328459 6953180 10680761
4574A0680761N525199P489104R590265J0045988P877440M675940J294969j066191
4566E6113475o02350J317298J065732k568334o898522r182728q931572p516197
4558B2796802n430557k604112J495671N345535N690470K920579r98433l530856
4550B5685099l683474j822305L36285J425918Q20122j514350m415185n800002
4542A1032108m663770l706277l800134m081946m163797l365014j064230J475758
4534a2337302K563431J473515j620039k259584J678514N127485M082821J24008
4526a167151k920836m261145l714370k658054k863792k396567l85947K177252
4518a8190610M630584N907801N571651M423564L336984L711495N711780N946441
$$ plain form
4574 10680761 16205960 23695064 33285329 43331317 51208757 55884697 57179666 56113475
4566 56113475 55511125 56828423 57894155 55325821 48427299 39244571 30312999 22796802
4558 22796802 17366245 14762133 16257804 21603339 27293809 30214388 29215955 25685099
4550 25685099 22001625 20179320 20515605 21941523 22761645 21247295 16832110 11032108
4542 11032108 6368338 2662061 -1138073 -5220019 -9383816 -12748830 -13813060 -12337302
4534 -12337302 -9773871 -8300356 -9920395 -12179979 -10501465 -5373980 -1291159 -1167151
4526 -1167151 -4087987 -8349132 -12063502 -14721556 -17585348 -19981915 -20367862 -18190610
4518 -18190610 -13560026 -7652225 -2080574 2342990 5679974 9391469 15103249 21049690
4510B1049690L991545K636791K013279r65678m741264l898850j331195j315079
4502A7439239k172103j979557r92506Q8293p93408l501449l226946J003292L522139
4493I386994L062791J909834J99230j245827q96762J539826K468614J351852M41236
4484A8217788K25996k24356j882253m062694o073375l652182J844189M092822
4476H485935J736370j280397k474928j551444o33586L41856K404992L393180M193331
4467A4615309N945440P034076O936714O490761L973531J250316J465806K653168
4459E0365121J347662k307287m182062l468348m246807n422905m060441k195885
4451B5829048j139792p28817N76810L196858M805518O250816P629501O786618
$$ plain form
4510 21049690 25041235 27678026 29691305 28725627 23984363 20085513 18754318 17439239
4502 17439239 15267136 13287579 12295073 12383366 11589958 8088509 4861563 5864855 9386994
4493 9386994 12449785 14359619 14558849 13313022 12416260 13956086 16424700 17776552 18217788
4484 18217788 18443784 18219428 16337175 12274481 6201106 2548924 4393113 8485935
4476 8485935 10222305 8941908 6466980 4915536 4281950 4623806 7028798 10421978 14615309
4467 14615309 20560749 27594825 34531539 41022300 44995831 46246147 47711953 50365121
4459 50365121 51712783 49405496 45223434 41755086 37508279 32085374 28024933 25829048
4451 25829048 24689256 23960439 24537249 27734107 32539625 38790441 46419942 53206560
4443E3206560K744511j204822l646351o007797n442950p61080M579556P872095
4435E1339722Q287680N528661J514199j628580l298278l263472j590741k04725
4427E6684466J013887N3440m657282p198940p197967q204694q983650o967903
4419A4541357k742922K075049N433374L796999j434427n251642m332887j908888
4411A0176013k066164l188302k457055j70190J768852K362316K934599M050217
4403A3410286M739914M696899L605385O86717j305372j884465l423460m845195
4395A5680709n258560n372976n003914k362088J726667M131300M357723M976576
4387A2875437N941361M763222K742226J201843r17198k990759l263175k316144
$$ plain form
4443 53206560 55951071 54746249 51099898 45092101 39649151 38888071 43467627 51339722
4435 51339722 59627402 65156063 66670262 65041682 61743404 58479932 56889191 56684466
4427 56684466 57698353 57751793 53094511 45895571 38697604 30492910 21509260 14541357
4419 14541357 11798435 13873484 19306858 23103857 21669430 16417788 12084901 10176013
4411 10176013 8109849 4921547 2464492 2294302 4063154 6425470 9360069 13410286
4403 13410286 18150200 22847099 26452484 27139201 25833829 23949364 20525904 15680709
4395 15680709 10422149 5049173 45259 -2316829 -590162 3541138 7898861 12875437
4387 12875437 18816798 23580020 26322246 27524089 26606891 23616132 20352957 18036813
4379A8036813j801374j787718O67663L592946J967632l51174j377148k623660
4371A6323980l342675l452660l233855k081241J76855P33097j347000k584022
4363A192479l123194l066383j779730K21844J344446J364509K261548L888226
4355B303745L915437J203377p00610J68578J022735Q55912l64709n55664J337521
4346I186322K015947o71317l767232m284348l329721j016444J357878J112209
4338F03294o75229j931396k452142q63351J320704J497991J647022L285948M729931
4329G162772O116321P772335P232362N993708O511077Q151767R940511R573427
4321F8454280M292432k955970o803755p700829p681214o793993m570894j539756
$$ plain form
4379 18036813 16235439 14447721 15115384 18708330 20675962 20324788 18947640 16323980
4371 16323980 12981305 9528645 6294790 4213549 4390404 5123501 3776501 1192479
4363 1192479 -1930715 -4997098 -6776828 -6554984 -5210538 -3846029 -1584481 2303745
4355 2303745 6219182 7422559 6721949 6890527 7913262 8769174 8404465 7848801 9186322
4346 9186322 11202269 10530952 6763720 2479372 -850349 -1866793 -508915 603294
4338 603294 -71935 -2003331 -4455473 -5318824 -3998120 -2500129 -853107 2432841 7162772
4329 7162772 13279093 21051428 28283790 34277498 40788575 48940342 58880853 68454280
4321 68454280 72746712 69790742 62986987 55286158 47604944 40810951 36240057 34700301
4313C4700301R13724M00628o69574J664403N344384P186581P431488M843273k774043
4304E9041165j0704452j1782253q123161o044285m632822l271310l481267l433792
4296G567823j634169P68289K998237N344668M932152m62597n009144m400376k670531
4287G434352j789826j79403K436048L059968K092537K320064L477514M917419
4279B3768673M600893L339125J744404n04028j347331k38910O96734j4557k277108
4270B9767895o020111q636145p299639m126152j111403K411961M960897M498595
4262A4445898J023796l892012n981852m233860j033533J673822K419273J506644
4254E928176l11400j600679j895873k654330k444322r81439j13456j72948j499947
$$ plain form
4313 34700301 35614025 36014653 35345079 37009482 42353866 49540447 56971935 61815208 59041165
4304 59041165 48336713 36554460 28431299 22387014 17754192 14482882 11001615 7567823
4296 7567823 5933654 6701943 9700180 15044848 19977000 19514403 14505259 10104883 7434352
4287 7434352 5644526 5465123 7901171 10961139 13053676 15373740 18851254 23768673
4279 23768673 28369566 31708691 33453095 32949067 31601736 31362826 32059560 32045003 29767895
4270 29767895 23747784 15111639 7812000 3685848 2574445 4986406 9947303 14445898
4262 14445898 15469694 11577682 5595830 1361970 328437 2002259 4421532 5928176
4254 5928176 5616776 4016097 2120224 -534106 -2978428 -3959867 -4073323 -4246271 -5746218
4245e746218k929139k975454k266576k389114l853942l800008k077791k073680
4237b8111922k911612j774101J442643L772955N565844P559665O066600J582835
4229f807093J44285P51905r6240m62059j757627m914320o544241m833978J8621
4220b4500747N718495R073243R621668Q004638M179680Q22970O6856O13995q5008
4211A3515790l105061m792591m115812l959684l801424k615050k06490K953187
4203f127135M222209K294603m58074k582389k887224p57240J032407J622534J916989
4194a723320J929395K426199L247588K911535K807654J755244j838008m821991
4186F694296n723691l708441k795371m017606k010305J940273L215400K163952
$$ plain form
4245 -5746218 -8675357 -11650811 -13917387 -16306501 -20160443 -23960451 -26038242 -28111922
4237 -28111922 -31023534 -32797635 -31354992 -27582037 -22016193 -14456528 -8389928 -6807093
4229 -6807093 -6662808 -5910903 -6007143 -6469202 -8226829 -13141149 -19685390 -24519368 -24500747
4220 -24500747 -18782252 -9709009 -87341 7917297 12096977 12919947 12986803 13600798 13515790
4211 13515790 10410729 5618138 1502326 -2457358 -6258782 -8873832 -9080322 -6127135
4203 -6127135 -1904926 389677 -68397 -2650786 -5538010 -6295250 -5262843 -3640309 -1723320
4194 -1723320 206075 2632274 5879862 8791397 11599051 13354295 11516287 6694296
4186 6694296 970605 -2737836 -5533207 -9550813 -11561118 -9620845 -6405445 -4241493
4178d241493J068849o0549j327013j997654j021565Q09207K467763K783458J897353
4169C78356J851511J536813O64647N02474l7206q92271q93913J218371M376561
4160H705343M005078P9825k392833k420317l032704n580475p700059o718354k987200
4151a8041696k7107k94134l018719l280320M79400L394095N038924O448352N778824
4142c522381K912440p61485l874665m233260l160897k122202o57759J25545m72605
4133a5767269r16628R82402L783605L578340P34249o75624M53731K033714J757700
4124d035780J136703K290308K942145K412599L693220N215853K899694j001989
4116A5552753l410189m164655k315835Q05218K338060K542310J855904m86328
$$ plain form
4178 -4241493 -3172644 -3233193 -4560206 -6557860 -7579425 -6770218 -4302455 -1518997 378356
4169 378356 2229867 3766680 4431327 4933801 4896595 4004324 3110411 4328782 8705343
4160 8705343 12710421 12790246 10397413 7977096 4944392 -636083 -8336142 -15054496 -18041696
4151 -18041696 -18068803 -18362937 -21381656 -24661976 -24182576 -20788481 -15749557 -9301205 -3522381
4142 -3522381 -609941 -1371426 -5246091 -9479351 -12640248 -14762450 -15420209 -15294664 -15767269
4133 -15767269 -16683897 -15701495 -11917890 -8339550 -7605301 -8280925 -7827194 -5793480 -4035780
4124 -4035780 -2899077 -608769 2333376 4745975 8439195 13655048 16554742 15552753
4116 15552753 12142564 7977909 5662074 6467292 8805352 11347662 13203566 12717238
4108A2717238j948978k738393l883768k365940L1363q83045k744152k936221k924099
4099g675995l096862k001812q38198j432263j792214n7590J521440J680337J676908
4090a2016249K250137K917803J212866k337217m362312l108085l19673J282743
4082a4479987J250218J055516P96113J594063L823308N164323M674617L715526
4074G593697L050943J644809q06j284487j989651K39755M270709N805512K348053
4065B1678534l921372q258746o845222j054564L627113L418898o99586n132543
4057B812512n612715k980821j368569q72902j076478k980592o100474p733682
4049b5913721o357770j812778L115940M725678M211407N046620O349975P007663
$$ plain form
4108 12717238 10768260 8029867 4146099 1780159 1811522 928477 -1815675 -4751896 -7675995
4099 -7675995 -10772857 -12774669 -13612867 -15045130 -16837344 -16894934 -15373494 -13693157 -12016249
4090 -12016249 -9766112 -6848309 -5635443 -7972660 -12334972 -15443057 -15762730 -14479987
4082 -14479987 -13229769 -12174253 -11378140 -9784077 -5960769 -796446 3878171 7593697
4074 7593697 10644640 12289449 12288643 11004156 9014505 9254260 13524969 19330481 21678534
4065 21678534 17757162 9498416 2653194 1598630 5225743 8644641 7945055 2812512
4057 2812512 -2800203 -5781024 -7149593 -8022495 -9098973 -12079565 -18180039 -25913721
4049 -25913721 -32271491 -34084269 -30968329 -26242651 -22031244 -16984624 -10634649 -3626986
4041c626986O626417M628395K365136Q60276j133947m434937o707600n978883
4033g402129l132456Q79043L091844J340060j727323k170208n82206J003146K125829
4024f574400K669690K792436J997003M56878k59314K98134l65554j627098j903312
4015b515537k833060m575332m442727k679889p14826J398071K456769J856445
4007a2050086J614278L224960M166023K484832K04323j17632J160026K496920
3999C183644K239195O82794p92582k636363k979898n37745R72960k89782k711013
3990b868790m467200n515481m613570j783148N8001o9798j346136k576566k641705
3981b5824393j275077J193193K779927K531885K615345L865214K847483k021965
$$ plain form
4041 -3626986 2999431 7627826 9992962 10853238 9719291 5284354 -1423246 -7402129
4033 -7402129 -10534585 -9655542 -6563698 -5223638 -6950961 -9121169 -9703375 -8700229 -6574400
4024 -6574400 -3904710 -1112274 884729 1341607 1082293 1380427 1014873 -612225 -2515537
4015 -2515537 -5348597 -9923929 -14366656 -17046545 -17761371 -16363300 -13906531 -12050086
4007 -12050086 -10435808 -7210848 -3044825 -559993 -355670 -473302 686724 3183644
3999 3183644 5422839 6105633 5313051 2676688 -303210 -840955 132005 -157777 -2868790
3990 -2868790 -7335990 -12851471 -17465041 -19248189 -19190188 -19259986 -20606122 -23182688 -25824393
3981 -25824393 -27099470 -25906277 -23126350 -20594465 -17979120 -14113906 -11266423 -13288388
3973a3288388p113352p781858m014802J139195N679302O955453O047596M956842
3965g420012L592293K497932R47053r95906k261146m042908m109031j405129J370710
3956a1826144L957626N348269M326919J038137k934117n743628n836717l230553
3948a4900208N85081K958028J470419j620423k344899o56471J569814J856616
3940a1082043Q55640J487420K516288J266223j401497k135225j06202L077675
3932e521721M783320M810424M616621J715355l112122n517718n685295m734165
3924h645301k542989l17107O48666J389449J866545R50173J130139K963659M323076
3915A766310M072310J358564j454189k735968m645177o673009o209861l512685
$$ plain form
3973 -13288388 -20401740 -28183598 -32198400 -31059205 -25379903 -18424450 -12376854 -7420012
3965 -7420012 -3827719 -1329787 -382734 -1378640 -3639786 -7682694 -11791725 -13196854 -11826144
3956 -11826144 -7868518 -2520249 1806670 2844807 -89310 -5832938 -11669655 -14900208
3948 -14900208 -14315127 -11357099 -9886680 -11507103 -13852002 -14508473 -12938659 -11082043
3940 -11082043 -10226403 -8738983 -6222695 -4956472 -6357969 -8493194 -8599396 -5521721
3932 -5521721 -738401 4072023 8688644 10403999 7291877 1774159 -3911136 -8645301
3924 -8645301 -11188290 -11505397 -10856731 -9467282 -7600737 -6650564 -5520425 -2556766 1766310
3915 1766310 5838620 7197184 5742995 3007027 -1638150 -8311159 -14521020 -18033705
3907a8033705j182567j271501j813636k72564K710204O608927R713234R621891
3899F080283P651084M901774K457464J646776Q47846j498163k675941j192179
3891A8218944Q448n48516j836043l379801m192724j707889K238092L187274J634581
3882A3622366o34316l118266n143051o575357p087949n282631k524634j91843
3874a6935681K511421M426053M009913J098270j186126K78923K691992K368794
3866g36441M39458j114001k072900j961571k74358K207208K952356J331262m61176
3857C09837N05385K552406J676957j693264m522724m648257j765333J779293K600903
3848c204797O37251j457912k911059l738599m061861k871086K7777R95824m64572
$$ plain form
3907 -18033705 -19216272 -20487773 -22301409 -22573973 -19863769 -13254842 -3541608 6080283
3899 6080283 13731367 18633141 21090605 22737381 23585227 22087064 19411123 18218944
3891 18218944 18227392 17678876 15842833 12463032 8270308 6562419 8800511 11987785 13622366
3882 13622366 12988050 9869784 4726733 -1848624 -8936573 -14219204 -16743838 -16935681
3874 -16935681 -14424260 -9998207 -5988294 -4890024 -6076150 -5797227 -3105235 -736441
3866 -736441 -296983 -1410984 -3483884 -5445455 -5719813 -3512605 -560249 771013 309837
3857 309837 815222 3367628 5044585 3351321 -1171403 -5819660 -7584993 -5805700 -3204797
3848 -3204797 -2567546 -4025458 -6936517 -10675116 -14736977 -17608063 -17580286 -16584462 -17049034
3839a7049034p2817K959234N262418L727527J61828j425391k281861l260918k828692
3830a4807706p47465R44588O3932k49458J375068L356419M202568L219028J883775
3821g59251J035538l83128j310891K46109K980240L718275J187509j280479l17113
3812E116809J904112J965352j055748n321873p463350n953191j563373J005819
3804a1365443J13348o19676L78904J644596K237372K057729K211982K279655K103543
3795A042010J660226J076649K30661j860447m517710n718112n208610l010823
3787a6306156R65879K245217N59211j140239k207205k199182n96110K683079K853606
3778a3141900P21644j26014r78834j587046m90317J183773K138111K503000K694972
$$ plain form
3839 -17049034 -17121851 -14162617 -8900199 -5172672 -5010844 -6436235 -8718096 -11979014 -14807706
3830 -14807706 -15555171 -14610583 -14546651 -14796109 -13421041 -10064622 -5862054 -2643026 -759251
3821 -759251 276287 -106841 -1417732 -1171623 1808617 5526892 6714401 5433922 5116809
3812 5116809 7020921 8986273 7930525 2608652 -4854698 -10807889 -12371262 -11365443
3804 -11365443 -11252095 -11871771 -11492867 -9848271 -7610899 -5553170 -3341188 -1061533 1042010
3795 1042010 2702236 3778885 4009546 2149099 -2368611 -8086723 -13295333 -16306156
3787 -16306156 -15340277 -13095060 -12535849 -13676088 -15883293 -18082475 -18678585 -15995506 -13141900
3778 -13141900 -12420256 -12546270 -13525104 -15112150 -15602467 -14418694 -12280583 -9777583 -7082611
3769g082611K447088K378917K840638K535746J802263R01268k55217j146170k659808
3760A762114k779104l39903J088433J652112K267191K118321J306111O51217J536306
3751I262798K987405K690781N23297o27754k363427o099652p955883n704493k816116
3742a0103044k896480k938934j222051k86668m4116J613521M248237O503813O240061
3733A114339L600712K173465K450228K299343J052476j961018n694308o623181
3725a587944l499938r5484j19604j889635k879350k168751j565262j295470Q36153
3716a4265285K198580Q22463j760679l320977l666254j189077L937571O482431
3708a0761227N876365M549461L631098K520970J58513j856569k139258k301817
$$ plain form
3769 -7082611 -4635523 -2256606 584032 3119778 4922041 5823309 5568092 4421922 1762114
3760 1762114 -1016990 -1356893 -268460 1383652 3650843 5769164 7075275 7726492 9262798
3751 9262798 12250203 14940984 15464281 14836527 12473100 6373448 -1582435 -7286928 -10103044
3742 -10103044 -12999524 -15938458 -17160509 -17447177 -17491293 -15877772 -11629535 -5125722 1114339
3733 1114339 4715051 6888516 9338744 11638087 12690563 10729545 5035237 -1587944
3725 -1587944 -5087882 -5183366 -5302970 -7192605 -10071955 -12240706 -13805968 -15101438 -14265285
3716 -14265285 -12066705 -11244242 -13004921 -16325898 -19992152 -21181229 -17243658 -10761227
3708 -10761227 -4884862 -335401 3295697 5816667 5975180 4118611 1979353 -322464
3700c22464l242017l205100j674391j1951P23912J009300J595481J784250K191223
3691a151757K183583O53015O82109P55324j870352m392560k534541J846241L838979
3682A0041L501871K634598M32107o25961M22387J598089L246424L887242K493704
3673A7600502k10022k676122l834184l273260k372017k930913l127140r76548
3665a799704J129790J010091o81110j291153j869383l422310l569235k476401
3657a2969415l50531J099249K088640L487058L308770K405894K289726J416972
3649B776363l65073n8505J242274P45160j396912l198232k895698j510624p99193
3640e460440L93582R53245q8391q86443m09217q70371l063581l375959n98809
$$ plain form
3700 -322464 -3564481 -6769581 -8443972 -8455923 -7732011 -6722711 -5127230 -3342980 -1151757
3691 -1151757 1031826 1684841 2366950 3122274 1251922 -3140638 -5675179 -3828938 10041
3682 10041 3511912 6146510 6578617 5952656 6375043 7973132 11219556 15106798 17600502
3673 17600502 17390480 14714358 10880174 7606914 5234897 2303984 -823156 -1799704
3665 -1799704 -669914 340177 -340933 -1632086 -3501469 -6923779 -10493014 -12969415
3657 -12969415 -13319946 -12220697 -10132057 -6644999 -3336229 -930335 1359391 2776363
3649 2776363 2411290 2352785 3595059 4340219 2943307 -254925 -3150623 -4661247 -5460440
3640 -5460440 -5066858 -4113613 -4202004 -5088447 -5497664 -6368035 -9431616 -12807575 -13406384
3631a3406384J995154K859559L273355L006889K349632J996768J266006R524j394130
3622A956373k553186k927155j318138P42985J357261K839798O727394R160061
3614A5985393P518458M585853J067684q66234n23747n47973k195426l838489m833642
3605A6351877o153581o423767n222590l448093j177100M43187J717084J622279
3597b290704L61244n73757m42378j57430l85833N26905J365086Q72571J819416
3588A095120L030957L278855L714598K659092k93679l506364n914316p938676
3580c874413p153430m439682j139037K725795N197294N666914M025141J688502
3572B697084p95556k317965j805653j083456j19840J088294R06087R45073J960044
$$ plain form
3631 -13406384 -11411230 -8551671 -5278316 -2271427 78205 2074973 3340979 3350503 1956373
3622 1956373 -596813 -3523968 -4842106 -4099121 -2741860 97938 6825332 15985393
3614 15985393 23503851 28089704 29157388 28291154 27767407 27219434 25024008 21185519 16351877
3605 16351877 10198296 3774529 -1448061 -4896154 -6073254 -5630067 -3912983 -2290704
3597 -2290704 -1929460 -2503217 -2945595 -3103025 -3488858 -2961953 -1596867 -724296 1095120
3588 1095120 4126077 7404932 11119530 13778622 13484943 9978579 4064263 -3874413
3580 -3874413 -11027843 -15467525 -16606562 -13880767 -8683473 -3016559 1008582 2697084
3572 2697084 1901528 -416437 -2222090 -3305546 -3425386 -2337092 -1431005 -485932 1474112
3563A474112L799901N509007N737956L638127j119417m084132l287994j744712
3555I922848j197900k049368l620663l790035p12886M694229O856984M909983
3547A5013192K783781K42125l318990l513874o64141J51101k030201k412366j170846
3538E079781k382309m327387n494147n998358m650356j000552K476797K665239
3530a3631292O55430n21656P74878K147798K384222K683242L141373L539187K204226
3521C377408l94433j536978m33795O53911O76572r5596j489457l389152l905366
3512f536886l410488l704371k980884k08004J143176j52950j267614r47443j05972
3503a8171436R20500L060242L526720K855502K406489M99809l709013o713107
$$ plain form
3563 1474112 5274013 10783020 16520976 20159103 19039686 14955554 11667560 9922848
3555 9922848 8724948 6675580 3054917 -735118 -1448004 3246225 10103209 15013192
3547 15013192 17796973 18039098 14720108 11206234 10542093 10693194 8662993 6250627 5079781
3538 5079781 2697472 -1629915 -7124062 -13122420 -17772776 -18773328 -16296531 -13631292
3530 -13631292 -12975862 -13497518 -12722640 -10574842 -8190620 -5507378 -2366005 1173182 3377408
3521 3377408 2982975 1445997 1012202 1666113 2342685 2247089 757632 -2631520 -6536886
3512 -6536886 -9947374 -13651745 -16632629 -16840633 -15697457 -15850407 -17118021 -18065464 -18171436
3503 -18171436 -17250936 -14190694 -10663974 -7808472 -5401983 -4902174 -8611187 -15324294
3495a5324294m152960K289929O923907O911510M406847J604l702515m212043l290433
3486a0148448j045820K540687M374559L617138L398975M316400L205017M47811
3478A0706319q67867j844343n388493r990512j1713171j0154072o826953k199309
3470c8278401J360011K582104M337648O659985P190673O190887N495494M809058
3462C47459K021412j674144l294945k216740j16080J403349J364266m98484k143238
3453d807145j319720R12021K315891K077746O25708j757127k984816k262519j593234
3444h793195j166294k69436p8769r02860j066590J959291O549363P567859L766150
3435G565519o22845n85491K175706M032642M499358L306476N36876q27829j416015
$$ plain form
3495 -15324294 -19477254 -17187325 -10263418 -3351908 1054939 1056543 -2645972 -6858015 -10148448
3486 -10148448 -11194268 -8653581 -4279022 -661884 2737091 7053491 10258508 10706319
3478 10706319 9838452 7994109 2605616 -7384896 -19098067 -29252139 -36079092 -38278401
3470 -38278401 -36918390 -34336286 -29998638 -23338653 -16147980 -9957093 -4461599 347459
3462 347459 2368871 694727 -2600218 -4816958 -4933038 -3529689 -2165423 -2663907 -4807145
3453 -4807145 -6126865 -5214844 -2898953 -821207 -195499 -1952626 -4937442 -7199961 -8793195
3444 -8793195 -9959489 -10228925 -10307694 -11210554 -12277144 -10317853 -3768490 3799369 7565519
3435 7565519 6942674 6357183 8532889 12565531 17064889 20371365 20908241 20080412 18664397
3426A8664397l199356m404369m788179m241502k728445k70514K076344M27711
3418A536087m890698q720746p334139m454465m319815l159601o4018K492941L955202
3409b4959252N380161N873821M101448K770954K850284K567242J774339K797191
3401C156188M751207M408910K668239N95766j314671k168481j846246n23469m4687
3392I682756j585774l979682o401617n957951k594523M2947P78569L68771j104113
3383a0750617k869903l554430k471533K33002J455665J421217J195641K561903
3375a2779055L695580K066655r82771l166767k671796J369498O467679Q383969
3367B382992P426928N677164K918735O23285l66004j787260k664757l412104m847807
$$ plain form
3426 18664397 15465041 11060672 6272493 2030991 -697454 -967968 1108376 1536087
3418 1536087 -3354611 -12075357 -19409496 -23863961 -28183776 -31343377 -31407395 -28914454 -24959252
3409 -24959252 -19579091 -13705270 -9603822 -6832868 -3982584 -1415342 358997 3156188
3401 3156188 7907395 12316305 14984544 15580310 14265639 12097158 10250912 9727443 9682756
3392 9682756 8096982 4117300 -2284317 -8242268 -10836791 -10793844 -10015275 -9646504 -10750617
3383 -10750617 -13620520 -17174950 -19646483 -19413481 -17957816 -16536599 -15340958 -12779055
3375 -12779055 -9083475 -7016820 -7999591 -11166358 -13838154 -12468656 -6000977 2382992
3367 2382992 9809920 15487084 18405819 19029104 18663100 16875840 14211083 10798979 5951172
3358E951172n093250k454288m59933j966471l219914j832770k49343N56628M0184
3349h727985l15557l74868j113542P92295M550658O274626N498388L949984J964535
3340A2498534O4030j360099k657137j392415K311213M515266K393235k399709
3332A3972918n784518n342373k701077k096870l230269m304858m563949l412900
3324a7463896j208952N79079K214861N064198O596979M860402K679247J203904
3316D525822n83385j440851k1233K421803L511932J788705k350056n987576o127668
3307d262507k694748J245207L238299L011458K867340L075736L360035J634238
3299A1475058l245548p246110o177759j985277J244033L158748M076263L070559
$$ plain form
3358 5951172 857922 -1596366 -2056299 -4022770 -7242684 -9075454 -9324797 -8768169 -8727985
3349 -8727985 -9043542 -9418410 -10531952 -9739657 -5188999 1085627 6584015 10533999 12498534
3340 12498534 12562564 11202465 8545328 7152913 9464126 13979392 16372627 13972918
3332 13972918 8188400 2846027 144950 -1951920 -5182189 -9487047 -14050996 -17463896
3324 -17463896 -18672848 -18093769 -15878908 -10814710 -4217731 642671 3321918 4525822
3316 4525822 3942437 2501586 2480353 4902156 8414088 10202793 7852737 1865161 -4262507
3307 -4262507 -6957255 -5712048 -2473749 537709 3405049 6480785 9840820 11475058
3299 11475058 8229510 983400 -5194359 -7179636 -5935603 -2776855 1299408 4369967
3291D369967P69015p46154n69474K84048L50909j214041l650993m538132l907681
3282h852536l361747j409536K488703M791608M216425K898690K111580R42078
3274C825265r17751l256907n552693n402959j950120J380484K496709L333621
3266f044351L412903L027182K259501Q56738P92476J197415Q21296J40873p71233
3257E692800k428214m999201o444242m687448j540409J304015K698821L398295
3249g005583L635747M453204O005423N873529M306630L578409K560127l50881
3241B3056605l077193m375690m387146k488940N77022L743675M200078Q08204
3233A8056615k317479l290796l458654l416439k523139L7109L135597L667359
$$ plain form
3291 4369967 5138982 4392828 3823354 4107402 4458311 3244270 -406723 -4944855 -8852536
3282 -8852536 -12214283 -13623819 -11135116 -6343508 -2127083 771607 2883187 3825265
3274 3825265 2907514 -349393 -5902086 -11305045 -13255165 -11874681 -9377972 -6044351
3266 -6044351 -2631448 395734 2655235 3511973 4304449 5501864 6323160 6464033 5692800
3257 5692800 3264586 -1734615 -8178857 -12866305 -14406714 -13102699 -10403878 -7005583
3249 -7005583 -3369836 1083368 7088791 12962320 17268950 20847359 23407486 23056605
3241 23056605 19979412 15603722 11216576 8727636 9304658 13048333 17248411 18056615
3233 18056615 15739136 12448340 8989686 5573247 3050108 3087217 6222814 9890173
3225I890173J060035l198064o268697m972242j949111j630961j286187J471929
3217f883125L741621j5975n551547l775133L026651O061116J568493n520785p611739
3208a4960423l589237R35852K517112K691246L173118L216720K710627k07125
3200c512110l816266k927515J560465M344349M022124L083369K055494P17659
3192E527569j253656m033232o086295o465498l682178j5654J888905L090746L455831
3183g573462K892131K107091K986229L802774K753314J663850O70362j235184
3175H067105k773999k245385R5517J662994K225077L253727L709436L471787K702017
3166B0168276J774210J323339J832828l15278n797694j0245291r116205k478403
$$ plain form
3225 9890173 10950208 7752144 1483447 -3488795 -5437906 -7068867 -8355054 -6883125
3217 -6883125 -3141504 -3157479 -8709026 -12484159 -9457508 -3396392 -1827899 -7348684 -14960423
3208 -14960423 -18549660 -17613808 -15096696 -12405450 -9232332 -6015612 -3304985 -3512110
3200 -3512110 -7328376 -10255891 -8695426 -4351077 -328953 2754416 4809910 5527569
3192 5527569 4273913 240681 -5845614 -12311112 -15993290 -16008944 -14120039 -11029293 -7573462
3183 -7573462 -4681331 -2574240 411989 4214763 6968077 8631927 9302289 8067105
3175 8067105 5293106 3047721 3143238 4806232 7031309 10285036 13994472 17466259 20168276
3166 20168276 21942486 23265825 25098653 24783375 18985681 8740390 -375815 -2854218
3158b854218K402720p08588p634374j0812193p925021k646523R69216L012103
3150b6196878N069727O686741O302625L375123Q6577r93198J8551J849110K881422
3141i20200J568702j817197l147542j184804K334506L405036O21634j522463j272315
3132a934643j706459l186495k037322J194472K805432L046792L391664L447411
3124E020852K302899j465481o252494q274171o067981k984792j839874j974345
3116b1535387k181203p81251K109307M720442N394571K659578j011377k850723
3108a3476043l808958m350819l713587k290117j306846O31J705893K563942L404297
3099b1271607L990701L237303K375057K063317K976541L148690J311790p07090
$$ plain form
3158 -2854218 -451498 -1160086 -8794460 -19606653 -27531674 -30178197 -29208981 -26196878
3150 -26196878 -21127151 -14440410 -8137785 -4762662 -4676085 -5669283 -5650732 -3801622 -920200
3141 -920200 648502 -1168695 -4316237 -5501041 -3166535 238501 860135 -662328 -1934643
3132 -1934643 -3641102 -6827597 -8864919 -7670447 -4865015 -1818223 1573441 5020852
3124 5020852 7323751 5858270 -394224 -8668395 -14736376 -17721168 -19561042 -21535387
3116 -21535387 -23716590 -24497841 -22388534 -17668092 -12273521 -9613943 -10625320 -13476043
3108 -13476043 -17285001 -21635820 -25349407 -27639524 -28946370 -28945739 -27239846 -24675904 -21271607
3099 -21271607 -17280906 -14043603 -11668546 -9605229 -6628688 -3479998 -2168208 -2875298
3091b875298j143775J12099J410600J497131J08271j713999l019399k428273J780637
3082f272006L975209J645928l16361P21507J624739Q99354J238661L318086M309145
3073A1144262K095589j504026l778921l799507k687314k961256k200194J50088
3065c541279K103733L091374L105361J239497j91653P54453J034569k94882k453663
3056D847510m389199l174638L45387J427597R25153J171046J78127j849065k060985
3047b579067j006663j16473j057469j420581J703028M433554L668710K749974
3039F375013M097471L609153O67844j958007l527260k590564j147605j189055
3031D336990o38441J374063K283156K530747R99453j313095j288872k05065J804333
$$ plain form
3091 -2875298 -4019073 -3906974 -2496374 -999243 -890972 -2604971 -5624370 -8052643 -6272006
3082 -6272006 -2296797 -650869 -967230 -245723 1379016 2278370 3517031 6835117 11144262
3073 11144262 13239851 11735825 7956904 4157397 1470083 -1491173 -3691367 -3541279
3065 -3541279 -1437546 1653828 4759189 5998686 5807033 6561486 7596055 7301173 4847510
3056 4847510 458311 -2716327 -2370940 -943343 -18190 1152856 1330983 -518082 -2579067
3047 -2579067 -3585730 -3702203 -4759672 -6180253 -4477225 -43671 3625039 6375013
3039 6375013 10472484 14081637 14749481 12791474 9264214 6673650 5526045 4336990
3031 4336990 3698549 5072612 7355768 9886515 10885968 9572873 8284001 8078936 9883269
3022I883269L591662K994093K025824J917918k69318l993590n422826n292355
3014E434677m971839k599473J706501M954174L899027l6399k253822j402165M58092
3005E188773J241779R14457L8557j828045l301192k491281p29730J179596J138527
2996A351441j661787k455569O94930K561976K522632K769913J267159j73463R60949
2987G838181O60810j891499m127403l794338j750143J27396O85381j56019j158078
2978c565712n98042Q64406k7812j890203j921894J135427N879520R918419J3087555
2969B2881664J2854152P445038P71264k808122l841306p055464j1103422j1868731
2961G275073p723931K54338M332422J577637k255446l757557j621019J815316
$$ plain form
3022 9883269 13474931 16469024 18494848 20412766 20143448 16149858 10727032 5434677
3014 5434677 462838 -2136635 -430134 4524040 8423067 8386668 6132846 4730681 5188773
3005 5188773 6430552 7345009 7383566 5555521 2254329 -236952 -966682 212914 1351441
2996 1351441 -310346 -2765915 -2070985 490991 3013623 5783536 7050695 6877232 7838181
2987 7838181 8498991 6607492 2480089 -1314249 -3064392 -2936996 -2251615 -2407634 -3565712
2978 -3565712 -4163754 -3299348 -3327160 -5217363 -7139257 -6003830 -124310 9794109 22881664
2969 22881664 35735816 43180854 43952118 41143996 37302690 30247226 19143804 7275073
2961 7275073 -448858 -194520 4137902 5715539 3460093 -297464 -1918483 -103167
2953a03167K608853J233528O52778J706045J927680k8712j079980m52034l26964
2944F138027O59598J502918J73314q51769L41731J764562J509123m30224j887277
2935H920003j494753j70637Q59997J485164L034525O014858Q374905P499228P143290
2926D1666580J1476523J6151450J7721786J6153485J3579424J1514212J0598285
2919A38861745J3569785J8475781K2351846K5824302K3995943J2486372k349427
2912B53216347j2249071j2907398o966319k198534n294931j4976020k5098450
2905A73525624k9716579k7032116k0349420j4552281j2054189j0659932q914346
2898E0246761m942698n64248J92370p60417k157129l863916k966346K197334P428758
$$ plain form
2953 -103167 2505686 3739214 4391992 6098037 8025717 7997005 6917025 6464991 6138027
2944 6138027 6797625 8300543 8473857 7622088 7963819 9728381 11237504 10807280 8920003
2935 8920003 7425250 7254613 8114610 9599774 12634299 18649157 27024062 34523290 41666580
2926 41666580 53143103 69294553 87016339 103169824 116749248 128263460 138861745
2919 138861745 152431530 170907311 193259157 219083459 243079402 255565774 253216347
2912 253216347 240967276 228059878 221093559 218895025 213600094 198624074 173525624
2905 173525624 143809045 116776929 96427509 81875228 69821039 59161107 50246761
2898 50246761 45304063 44739815 44932185 44171768 42014639 38150723 35184377 37381711 44810469
2889D4810469J0774787J3725359J3343121J0951928J0005605Q240366K983491
2882A14835126p246945j9079008k6016862k8587031k6146677k0323457j5272091
2875b7836945j0887528r010053r774913r286916p085763m300590M27976O887209
2867g0867523J1384040J0301156M559414l139167j1276049j6742781j5426172
2860i1207082p589601M244273J4854570J9572497J7515123J2193976R172607P972147
2852a3271490N262244K719706J313605j372824m088988l605259j701089L16881
2844a4427214L631305P737945J0979907J2142656J1416868R430779Q447922J0464665
2836E9824833J3098160J5004720J8670364K2484015K3378242J9644104J0668568
$$ plain form
2889 44810469 55585256 69310615 82653736 93605664 103611269 111851635 114835126
2882 114835126 107588181 88509173 62492311 33905280 7758603 -12564854 -27836945
2875 -27836945 -38724473 -47734526 -57509439 -66796355 -73882118 -78182708 -77754732 -70867523
2867 -70867523 -59483483 -49182327 -44622913 -47762080 -59038129 -75780910 -91207082
2860 -91207082 -98796683 -94552410 -79697840 -60125343 -42610220 -30416244 -21243637 -13271490
2852 -13271490 -8009246 -5289540 -3975935 -5348759 -9437747 -13043006 -14744095 -14427214
2844 -14427214 -10795909 -3057964 7921943 20064599 31481467 40912246 49360168 59824833
2836 59824833 72922993 87927713 106598077 129082092 152460334 172104438 182773006
2829A82773006j947848j5813701k7826478l4171470l2500440k6028095j8338951
2822B6146023j1261407p531413o425955n710755l943482p92608J229143Q20488
2814g469966p49511j218598r86626m43867J849861M717300N929211M685775J029172
2805G342751k675809m728328o031594n516254k720986O60014K547078L286523
2797g836605K084904j650747m048859l458580k371639p88619J532561K242532
2789a4295052K757168L018849K357304J888592O45704j591282l393628m534023
2781a3146368m748435m449389m872683m626416l110945n57998J776292L031523
2773c0704419M624542N638052M993396L928918K915613J191413p49988j880610
$$ plain form
2829 182773006 180825158 165011457 137184979 103013509 70513069 44484974 26146023
2822 26146023 14884616 7353203 927248 -4783507 -8726989 -9519597 -8290454 -7469966
2814 -7469966 -8219477 -9438075 -10424701 -10868568 -9018707 -4301407 1627804 6313579 7342751
2805 7342751 4666942 -61386 -6092980 -11609234 -14330220 -13670206 -11123128 -7836605
2797 -7836605 -5751701 -7402448 -11451307 -14909887 -17281526 -18070145 -16537584 -14295052
2789 -14295052 -11537884 -8519035 -6161731 -4273139 -3627435 -5218717 -8612345 -13146368
2781 -13146368 -17894803 -22344192 -27216875 -31843291 -34954236 -35512234 -33735942 -30704419
2773 -30704419 -26079877 -20441825 -15448429 -11519511 -8603898 -7412485 -8162473 -10043083
2765a0043083k390793k234723j059447n01974k422685l881420k217167J297470
2757b3453822M244156M308236K432704o49958l595508l601254j942203j505664
2749b3763313j728753k197491l687317n412657o141157q752808j2988602j2864896
2741g7536994p656199j639588K728075L313592Q87091m04440M14330Q78776k601109
2732h1616466p022456o275741j441142K378220K597577j35161m430417p267688
2724a03213274p329256p095319p958181q577328n680505l68878M654437Q758557
2716a26809747J1936471J4443782J5952124J5419970J3348631J1189733Q228687
2709c6290349N799857O714189Q506309O743641L449921J852146N30706j780733
$$ plain form
2765 -10043083 -12433876 -14668599 -15728046 -16230020 -18652705 -22534125 -24751292 -23453822
2757 -23453822 -19209666 -14901430 -12468726 -13118684 -16714192 -20315446 -22257649 -23763313
2749 -23763313 -25492066 -27689557 -31376874 -36789531 -42930688 -51683496 -64672098 -77536994
2741 -77536994 -85193193 -86832781 -84104706 -80791114 -79904023 -80308463 -79894133 -79015357 -81616466
2732 -81616466 -88638922 -94914663 -96355805 -93977585 -91380008 -91515169 -95945586 -103213274
2724 -103213274 -110542530 -117637849 -125596030 -134173358 -139853863 -140222741 -135568304 -126809747
2716 -126809747 -114873276 -100429494 -84477370 -69057400 -55708769 -44519036 -36290349
2709 -36290349 -30490492 -23776303 -15269994 -8526353 -5076432 -3224286 -2693580 -4474313
2701d474313m495452o612052o278861k708132O89974K401324K813235J317530
2693a7346747O3334J484553M230363O156963O086377L715082J218794j183632
2685D425087l072085l449314m172890n475398n337153m096772k960565k071916
2677b6211006l565138m461317j889290P95491L29307j599377k075689r98424j628422
2668d1303865l582481k964808k38660J450818J205392n60018j941922Q4669L719341
2659d4131534M918416L202832O42185Q08968L415649N370700N649591M319900
2651a5803293K378311R76499J067275J572085J104910O09098O03892N67366J43409
2642f780448m91456J24600J139511K99564r02594J381477M892015M997198K010909
$$ plain form
2701 -4474313 -8969765 -15581817 -21860678 -24568810 -23878836 -21477512 -18664277 -17346747
2693 -17346747 -17283413 -15798860 -11568497 -5411534 674843 4389925 5608719 4425087
2685 4425087 1353002 -2096312 -6269202 -11744600 -17081753 -21178525 -24139090 -26211006
2677 -26211006 -29776144 -34237461 -36126751 -35331260 -35001953 -36601330 -38677019 -39675443 -41303865
2668 -41303865 -44886346 -47851154 -48089814 -46638996 -45433604 -45993622 -47935544 -47850875 -44131534
2659 -44131534 -39213118 -36010286 -35368101 -34559133 -31143484 -25772784 -20123193 -15803293
2651 -15803293 -13424982 -12448483 -11381208 -9809123 -8704213 -8095115 -7491223 -6923857 -6780448
2642 -6780448 -7271904 -7147304 -6007793 -5708229 -6610823 -5229346 -337331 4659867 6670776
2633F670776k722l85951j859506m438965o092420m492166r03860J252859K364903
2624g887052K106669J510850L274909M808324L386945N50320o48366l72239m06551
2615F323809O24317K297416J865771L54001n17965j468649k448750k758262k278874
2606A992814j104874L47015N65168j882967n704368p422374o578795m021471p56477
2597b4566329K454539N040360N187424K990781J149264K698163M928132L305962
2589C188296j47457k729168m767576n310953m359769l480509k747784j527674
2581b1882594j129031j779846k196342j091295K011941N320305N303866K112456
2573a3330540j343738j911243J975420P182784R880651Q006757L380968m86695
$$ plain form
2633 6670776 6668054 6282103 4422597 -16368 -6108788 -10600954 -11504814 -10251955 -7887052
2624 -7887052 -5780383 -4269533 -994624 3813700 7200645 7750965 7102599 6730360 6323809
2615 6323809 6948126 9245542 11111313 11465314 10947349 9478700 7029950 4271688 1992814
2606 1992814 887940 1234955 1800123 -82844 -5787212 -13209586 -19788381 -23809852 -24566329
2597 -24566329 -22111790 -17071430 -11884006 -8893225 -7743961 -5045798 -117666 3188296
2589 3188296 3040839 311671 -4455905 -9766858 -14126627 -17607136 -20354920 -21882594
2581 -21882594 -23011625 -24791471 -26987813 -28079108 -26067167 -20746862 -15442996 -13330540
2573 -13330540 -14674278 -16585521 -14610101 -7427317 2453334 10460091 13841059 13354364
2565A3354364l312071n695927m748348j832799j99023j835969n262372o213124
2557a5745269l532851l74964O73247O24652Q3195j305577j918973K01438K498769
2548a8796333L250363L196300J626689j025817k872622l485530l517268k173734
2540b3797952J41586J304523L37451j598595k393215k858384l343961k694742
2532c4903289q53948P79778K062413K686418L010568M863226P066571Q094571
2524g193692O752405K689974j804717n128251n365661j489253J102365k12j306600
2515a1743642j113592J78491J741583L467491M008918K642817o47478j866108
2507c331520q8385R85357J477959N26333k693304m710259l729891k304994j988980
$$ plain form
2565 13354364 10042293 4346366 -401982 -2234781 -2433804 -4269773 -9532145 -15745269
2557 -15745269 -19278120 -19653084 -18979837 -18355185 -18271990 -19577567 -21496540 -21295102 -18796333
2548 -18796333 -15545970 -12349670 -10722981 -11748798 -14621420 -18106950 -21624218 -23797952
2540 -23797952 -23656366 -22351843 -22014392 -23612987 -26006202 -28864586 -32208547 -34903289
2532 -34903289 -35757237 -34977459 -32915046 -30228628 -27218060 -22354834 -15288263 -7193692
2524 -7193692 -441287 2248687 443970 -4684281 -10049942 -11539195 -10436830 -10437042 -11743642
2515 -11743642 -12857234 -12678743 -10937160 -7469669 -3460751 -817934 -1465412 -3331520
2507 -3331520 -3419905 -2434548 -956589 -430256 -3123560 -7833819 -11563710 -13868704 -15857684
2498a5857684j603753j279483r05763J529534K950069P29453j859814k809495
2490a9106936k643405p29665K87892l95299p5920K002640M263222M213041K075544
2481a0108886J263912L053386M620149L714441J337634m90076k009460j555395
2473a74295Q73484Q36269j885107m623029m687524j205944J707135K501898R84040
2464e673073l578548p191836o424984l073115l02001J028662L087331L857873
2456a8269691P73339j088118j843772k085562N56886J898367J063119L48330N99992
2447a8047110J402466M97110J015407L357060M323130L471183P87192j136190
2439d329752j198495j320139j349141N7958J653526K330636K947310K690396J23301
$$ plain form
2498 -15857684 -17461437 -18740920 -19646683 -18117149 -15167080 -14437627 -16297441 -19106936
2490 -19106936 -21750341 -22480006 -22192114 -22587413 -22663333 -20660693 -16397471 -12184430 -10108886
2481 -10108886 -8844974 -5791588 -1171439 2543002 3880636 3390560 1381100 -174295
2473 -174295 699189 1535458 -349649 -4972678 -9660202 -10866146 -9159011 -6657113 -5673073
2464 -5673073 -9251621 -16443457 -22868441 -25941556 -26243557 -25214895 -22127564 -18269691
2456 -18269691 -17496352 -18584470 -20428242 -22513804 -21956918 -20058551 -18995432 -18647102 -18047110
2447 -18047110 -16644644 -16147534 -15132127 -11775067 -7451937 -3980754 -3193562 -4329752
2439 -4329752 -5528247 -6848386 -8197527 -8139569 -6486043 -4155407 -1208097 1482299 1605600
2430A605600j724255j430851o16550J97701J093783K641610M422884N776288M730058
2421A6696268J926258j554640n033955o793448n417769j863064J514223L808066
2413C281939K438183j462425m221057l693312j719425p64583K13590J415298J264488
2404c247304p0127p46849n39728j556880k632626m98446K449299K704074R42523
2395c196064j730202n289084r821382j2757635j1541747j1587473j5794375j9543507
2387i1261469k1148825k1299791j4275594J406321J3333097J6677762J7770587
2380i8797912J7383036J2498689M690311l838772j1080513j4619333j5340527
2373a09105021j2405301k736284J0270809J9674812K1734307J8407351J3172399
$$ plain form
2430 1605600 -118655 -1549506 -2166056 -1968355 -874572 1767038 6189922 11966210 16696268
2421 16696268 18622526 17067886 12033931 5240483 -177286 -2040350 -526127 3281939
2413 3281939 5720122 4257697 36640 -3656672 -5376097 -6140680 -5927090 -4511792 -3247304
2404 -3247304 -3317431 -4064280 -4604008 -6160888 -8793514 -9291960 -6842661 -4138587 -3196064
2395 -3196064 -4926266 -10215350 -20036732 -32794367 -44336114 -55923587 -71717962 -91261469
2387 -91261469 -112410294 -133710085 -147985679 -146579358 -133246261 -116568499 -98797912
2380 -98797912 -81414876 -68916187 -64225876 -68064648 -79145161 -93764494 -109105021
2373 -109105021 -121510322 -124246606 -113975797 -94300985 -72566678 -54159327 -40986928
2366d0986928Q615043N859598M603545M869133M219555R54283j870976j714068
2358a5450815N3590p94415m207728m541873m07356K918123J042229k050165j255647
2349b4694057K357552N848085O340587L524767J61170r00731J81236K70706q30353
2340g741038n93944O69211K38295j468901l341337m543856l859415j597168J063231
2331b1174922L399504O700007Q041217N678474J869590j134100j622750j95196
2323A561824P10706Q53443J377138J462500J90211k465107n417656n986782n142206
2314a2855929n448079m844397k216552J95369J603545K815203M568798N490028
2306a0692014M854284L351399K328310K465690K829984K058107J647646Q98792
$$ plain form
2366 -40986928 -32371885 -26512287 -21908742 -17039609 -12820054 -11865771 -13736747 -15450815
2358 -15450815 -15397225 -16191640 -20399368 -24941241 -25348597 -22430474 -21388245 -23438410 -24694057
2349 -24694057 -22336505 -16488420 -10147833 -6623066 -6461896 -7362627 -7181391 -6910685 -7741038
2340 -7741038 -8334982 -7665771 -7427476 -8896377 -12237714 -16781570 -20640985 -22238153 -21174922
2331 -21174922 -17775418 -11075411 -3034194 2644280 4513870 3379770 1757020 1561824
2323 1561824 2272530 3125973 4503111 5965611 6155822 3690715 -1726941 -7713723 -12855929
2314 -12855929 -18304008 -23148405 -25364957 -25169588 -23566043 -20750840 -16182042 -10692014
2306 -10692014 -5837730 -2486331 -158021 2307669 5137653 7195760 8843406 9742198
2298I742198k263922l505486q67339J831342J379696j689679m805195m185972
2290d364357j849470j278626j9139K252272K456801J158085N35655J582350J979867
2281B453438O33922n48893l83050j220651k123300l97295M31725k232437m099660
2272g486201l565230k247205p90012L63019l05915o66230J805183N556130P283876
2263e2585M884032J400884q92576k530404k783239k746580m003103n233533m053702
2254a6010806n98431J343982P05492J49222L15318k52090j209290j505134p07916
2245a7769653J347193K747741L263565L677543K987499J861853K674066L677854
2237D467661K216142j084582l436573l237113k741558l787779m547385l820373
$$ plain form
2298 9742198 7478276 3972790 3105451 4936793 6316489 4626810 -178385 -4364357
2290 -4364357 -6213827 -7492453 -7511592 -5259320 -2802519 -1644434 -1108779 473571 2453438
2281 2453438 3087360 2538467 2155417 934766 -1188534 -1585829 -1154104 -3386541 -7486201
2272 -7486201 -11051431 -13298636 -14088648 -13725629 -14031544 -14697774 -12892591 -7336461 -52585
2263 -52585 4831447 6232331 5339755 2809351 26112 -2720468 -6723571 -11957104 -16010806
2254 -16010806 -16609237 -15265255 -14559763 -14410541 -14095223 -14347313 -15556603 -17061737 -17769653
2245 -17769653 -16422460 -13674719 -10411154 -6733611 -3746112 -1884259 789807 4467661
2237 4467661 6683803 5599221 2162648 -1074465 -3816023 -7603802 -12151187 -15971560
2229a5971560k571128j146623o36592k350939n280347q474391j1389767j3672138
2221f1493485j2495530p239443k159947j601851n942225j0523324j3812664j4433500
2213a29701969q887983K996512J2661917J4787019J3446945R834453L336502j981890
2205h3508494j069792N594908J0833790J1899816J0855302P205374K892560J682625
2197c3613911L973117O330367M930857K407155K733858L983608K542059j646867
2189h359757n153154n692929m762448l983103k225693J380848M560362O400734
2181a7835140O328081N190666M345409L027917J44874l240551m559369l111367
2173i709480j461117j411798k352864j857635J587547M835513N547455M951453
$$ plain form
2229 -15971560 -18542688 -19689311 -20325903 -22676842 -27957189 -36431580 -47821347 -61493485
2221 -61493485 -73989015 -81228458 -83388405 -84990256 -90932481 -101455805 -115268469 -129701969
2213 -129701969 -138589952 -135593440 -122931523 -108144504 -94697559 -84863106 -81526604 -83508494
2205 -83508494 -84578286 -78983378 -68149588 -56249772 -45394470 -38189096 -35296536 -33613911
2197 -33613911 -29640794 -23310427 -18379570 -15972415 -13238557 -9254949 -6712890 -8359757
2189 -8359757 -13512911 -19205840 -23968288 -27951391 -30177084 -28796236 -24235874 -17835140
2181 -17835140 -11507059 -6316393 -1970984 1056933 1201807 -2038744 -6598113 -9709480
2173 -9709480 -11170597 -12582395 -14935259 -16792894 -15205347 -10369834 -4822379 129074
2165A29074L915144J705514j828309n238771o851326m517093J73442L223159L731461
2156e557705L377885K876774L48448k542514k819837j439470j898550l553086
2148a1208055k718575J57688J876122J503161J403276K167766K373840J403816
2140c040961q44572k943620j938537J819413M197513M142232L392093K072009
2132F855570J102876N81090p37434l233138n497100n049498k581967Q0878K993846
2123e484877N512650M482414J08976j844896M81289L304177L284509J428361l64425
2114A0908178k400015n220018q102378q983283n692494j674238K80316J472444
2106a9411488K788661L158405J863829J268593N66399j566865l893785l718731
$$ plain form
2165 129074 4044218 5749732 3921423 -1317348 -8168674 -12685767 -12512325 -9289166 -5557705
2156 -5557705 -2179820 696954 1045402 -1497112 -4316949 -5756419 -7654969 -11208055
2148 -11208055 -13926630 -13768942 -11892820 -10389659 -8986383 -6818617 -4444777 -3040961
2140 -3040961 -3885533 -6829153 -8767690 -6948277 -2750764 1391468 4783561 6855570
2132 6855570 7958446 8539536 7802102 4568964 -928136 -5977634 -8559601 -8478723 -5484877
2123 -5484877 27773 4510187 4619163 2774267 3255556 6559733 9844242 11272603 10908178
2114 10908178 8508163 3288145 -4814233 -13797516 -19490010 -21164248 -20883932 -19411488
2106 -19411488 -16622827 -13464422 -11600593 -10332000 -9765601 -11332466 -15226251 -18944982
2098a8944982j718955J57539K016107K374025P80963j457794k062788M20765L671749
2089a4763371M722011L367137K570373K893609K129238k58049k497733k372758
2081d209543l73552L50788j055186k159982k782053l342077l402324j323090Q39298
2072a7457721R23138J146276J580818K972578N522036P279549Q068824N863505
2064A5899003J128661k353604l430676m168444n712180m668206l57395M524192
2056H61351P382478O480859L701859K102607l8142l581735n424590n665002n209523
2047F10162m413784l725725j864951R66624J866904q2326j444866P39056L554844
2038c794062L942171K679048K126267L078546L956467K827221K75330q28902j166901
$$ plain form
2098 -18944982 -20663937 -20506398 -18490291 -16116266 -15335303 -16793097 -18855885 -18435120 -14763371
2089 -14763371 -10041360 -6674223 -4103850 -1210241 918997 660948 -1836785 -4209543
2081 -4209543 -4583095 -4232307 -5287493 -7447475 -10229528 -13571605 -16973929 -18297019 -17457721
2072 -17457721 -16534583 -15388307 -13807489 -10834911 -5312875 1966674 10035498 15899003
2064 15899003 17027664 14674060 11243384 7074940 1362760 -3305446 -3662841 861351
2056 861351 8243829 14724688 18426547 20529154 20491012 16909277 11484687 5819685 610162
2047 610162 -3803622 -7529347 -9394298 -8427674 -6560770 -6643096 -8087962 -7348906 -3794062
2038 -3794062 148109 2827157 4953424 8031970 11988437 14815658 15090988 14262086 13095185
2029A3095185q93235o55435j295450k383487l699305l927921l283329k223079
2021e266056l55322Q95427J528014J563602J585128K444102K734465K836417M847003
2012A2812780M869589J129981l397882o194979p629644o642355k926205Q5365
2004g893350o7159j686911j127385q7556j094919l662478m205026j452326R44962
1995b0332148J700125J852801K052432K736070M228997N788887O548055N295774
1987I870993K951018J259302M60027M10368j16342k061864n137446p300980o431366
1978f096290j878899L185720M162229J699273n44886M36964L028349K105366j469859
1969D627967l103467k010494k520629n994344p119149m517234j999474k166K304432
$$ plain form
2029 13095185 12201950 11546515 10251065 7867578 4168273 240352 -3042977 -5266056
2021 -5266056 -5621378 -4725951 -3197937 -1634335 -49207 2394895 5129360 7965777 12812780
2012 12812780 17682369 18812350 15414468 9219489 1589845 -5052510 -7978715 -7893350
2004 -7893350 -7960509 -9647420 -10774805 -10862361 -11957280 -15619758 -19824784 -21277110 -20332148
1995 -20332148 -18632023 -16779222 -14726790 -11990720 -7761723 -1972836 4575219 9870993
1987 9870993 12822011 14081313 14541340 14951708 14835366 12773502 7636056 335076 -6096290
1978 -6096290 -7975189 -4789469 -627240 1072033 527147 964111 3992460 6097826 4627967
1969 4627967 1524500 -485994 -3006623 -9000967 -16120116 -20637350 -22636824 -22638990 -20334558
1960b0334558M322757N670236N365126L071345K60628k007065k540609r86452
1952g178592J171254P14878j633505k363743m22482J304902Q90489J16794p90930
1943h190935j793177j835687O50794M970200O723137M072320o7378j336421P66053
1934C958906M030919N960810M825380J433224r86259l053759n411557o467641
1926D290023o461628m796761k319462j016324k25756J000308J568121M36558k452842
1917i977763m627423m373970k918434l95194K338390L516273M694625N400314
1909f343182N193789L450025J65777k086165j175539O22146m8352k053933l126187
1900e401621k958786l743059n940757p233506o440208m182557k132787k637944
$$ plain form
1960 -20334558 -16011801 -10341565 -4976439 -1905094 -1644466 -3651531 -6192140 -7178592
1952 -7178592 -6007338 -5292460 -6925965 -9289708 -9712190 -8407288 -7516799 -7400005 -8190935
1943 -8190935 -9984112 -11819799 -11169005 -6198805 524332 4596652 4529274 3192853 3958906
1934 3958906 7989825 13950635 18776015 20209239 19222980 16169221 10757664 4290023
1926 4290023 -2171605 -6968366 -9287828 -10304152 -10529908 -9529600 -7961479 -7524921 -9977763
1917 -9977763 -14605186 -18979156 -21897590 -22292784 -19954394 -16438121 -11743496 -6343182
1909 -6343182 -1149393 2300632 2466409 380244 -795295 -173149 -221501 -2275434 -5401621
1900 -5401621 -8360407 -12103466 -18044223 -25277729 -31717937 -35900494 -38033281 -40671225
1892d0671225j996666J748555M281402M052515K683988J799782K303820L957939
1884b1839890N360804M410592J474415r99286j276732j730303l524831m142242
1876b2267473l015602r60159J633760K881792J406985L95898J443715K810217
1868a5670867L444262M253788M484762L085243J649419J495059J753992J82175
1860D677833j765054k982849k901089q16281K275279M391583N004185L330007
1852A1213614J35331k576024l787059l249501j157998K06455n21212j322714m21543
1843a480651K144745N172919N149983J045159l384573m525747k633906n04611
1835I83318p74p73945j245522n62724J380750K990660L041539J223508k18458
$$ plain form
1892 -40671225 -42667891 -40919336 -36637934 -32585419 -29901431 -28101649 -25797829 -21839890
1884 -21839890 -16479086 -12068494 -10594079 -11593365 -12870097 -14600400 -18125231 -22267473
1876 -22267473 -25283075 -26243234 -24609474 -21727682 -20320697 -19924799 -18481084 -15670867
1868 -15670867 -12226605 -7972817 -3488055 -402812 1246607 2741666 4495658 4677833
1860 4677833 2912779 -70070 -2971159 -3787440 -1512161 2879422 7883607 11213614
1852 11213614 11348945 8772921 4985862 1736361 578363 784818 263606 -1059108 -1480651
1843 -1480651 664094 5837013 10986996 12032155 8647582 4121835 1487929 983318
1835 983318 982544 208599 -1036923 -1599647 -218897 2771763 5813302 7036810 6818352
1826F818352o25350j617386k965151k997704k919262m086985l597796j832971
1818a3824253j802754j234720R74629M118582O182834O175217N766081M782432
1810A1138048L038058J627508Q6037k135804m390052m217977k213439o29632J321918
1801C624665L747977N248398N324570M603798L572668L183822L269416K825805
1793C5401119J613824J251961J354304O40999P11117K355787L358149L239787
1785D9927047K562486K320044M307087P933309J0667007J0435655R708275J0713260
1777A08574170J2632346J4688072J8285746K2329539K2001839J6004483Q334464
1770B22850659K464941K119003O701199Q409428M86089j1260984j6335904j4372065
$$ plain form
1826 6818352 6193002 4575616 1610465 -1387239 -4306501 -8393486 -11991282 -13824253
1818 -13824253 -15627007 -16861727 -15887098 -11768516 -5585682 589535 6355616 11138048
1810 11138048 14176106 15803614 15889651 13753847 9363795 5145818 2932379 2302747 3624665
1801 3624665 7372642 12621040 17945610 22549408 26122076 29305898 32575314 35401119
1793 35401119 37014943 38266904 39621208 40262207 40973324 43329111 46687260 49927047
1785 49927047 52489533 54809577 59116664 67049973 77716980 88152635 97860910 108574170
1777 108574170 121206516 135894588 154180334 176509873 198511712 214516195 222850659
1770 222850659 225315600 227434603 234135802 242545230 243031319 231770335 215434431 201062366
1762B01062366r290618j568742O795925J0010032P354756L464201l57665j895150
1754B15575105Q08527J078973q925803k4973204l5208376l4060849k5082766j6222799
1746G2988808j0266655o726111o319618o486237n723269n731100n184725k251969
1738B4299124J861248K783429M26550k026271m244515n650407l096895J41698
1730A4493961j163859l353952l234784j726514N62002K260896J036788j001468
1722G873070q09076J449585L421756L845661J807412j692616l069193j511315
1714A1315284p9623r41168R462L850514M537477Q33247k799173l132925m10438
1705A3182657J994887K437588K134590K727469L937782L396271J397871r82566
$$ plain form
1762 201062366 191771748 190203006 196998931 207008963 214363719 217827920 217470255 215575105
1754 215575105 216383632 217462605 208536802 183563598 148355222 114294373 89211607 72988808
1746 72988808 62722153 55996042 49676424 43190187 37466918 31735818 26551093 24299124
1738 24299124 26160372 28943801 29370351 27344080 23099565 17449158 14352263 14493961
1730 14493961 13330102 9976150 6741366 5014852 5576854 7837750 8874538 7873070
1722 7873070 7063994 8513579 11935335 15780996 17588408 15895792 12826599 11315284
1714 11315284 11235661 10294493 10303955 14154469 18691946 19525193 16726020 13593095 13182657
1705 13182657 15177544 17615132 19749722 22477191 26414973 29811244 31209115 30226549
1697C0226549k958904k439986j428865k240936k747799k364810k707387l131308
1689A0206554j581774P22405K61525m226559p025763m485168j54151K510598L173782
1680e98551K991562L123336L112509K497746K132324N10514k163196l675579k694330
1671E236335q83226j290755l370402l892580j679223M49639Q05974J660277K712645
1662b51316J687001j558134l722674m129186m195957l310721j469456m62256p82996
1653a8195695j808774l105243m625564o079795n863321k848370R66588M289566
1645c7270608O969239O875465M196796R34720j476401j520258N64066L884741
1637a6842240O376850O669243M496918J331932q69266j224848q77326k000355
$$ plain form
1697 30226549 27267645 24827659 23398794 21157858 18410059 16045249 13337862 10206554
1689 10206554 8624780 9347185 9608710 5382151 -1643612 -6128780 -6282931 -3772333 -598551
1680 -598551 2393011 5516347 8628856 11126602 13258926 13769440 11606244 7930665 5236335
1671 5236335 4353109 3062354 -308048 -4200628 -5879851 -5430212 -4624238 -2963961 -251316
1662 -251316 1435685 -122449 -3845123 -7974309 -12170266 -15480987 -16950443 -17412699 -18195695
1653 -18195695 -20004469 -23109712 -27735276 -33815071 -39678392 -42526762 -41560174 -37270608
1645 -37270608 -30301369 -23425904 -19229108 -18294388 -19770789 -21291047 -20726981 -16842240
1637 -16842240 -10465390 -3796147 700771 2032703 1163437 -61411 -938737 -2939092
1629b939092l809653k856645N24736J821865J174753j25032j165854r05530k70234
1620h550686o83737l328920n905504o577953m322317Q57742M671022O809134Q028959
1611i002260P614081N682355J092330k139854j782407m07194Q43957Q80653k17268
1602B564393j106904p85239N77808K270388R81726k929089m156546k488192j464728
1593f536383k059964k930208r63365K745821N454078N835213L085441L34046L29867
1584E294546K351061M151678M953917N376144N262917M972681K943921j262975
1576C4043890m810785m514858j458034l50359j807056j331085J570945L672528
1568B5015186O146388J0997830J3922104J1784450O283066J976172K537844O140978
$$ plain form
1629 -2939092 -6748745 -9605390 -9080654 -7258789 -6084036 -6209068 -7374922 -8280452 -8550686
1620 -8550686 -9234423 -12563343 -18468847 -25046800 -29369117 -28511375 -23840353 -17031219 -9002260
1611 -9002260 -1388179 4294176 5386506 3246652 1464245 1057051 1901008 2781661 2564393
1602 2564393 1457489 672250 1250058 3520446 4502172 1573083 -2583463 -5071655 -6536383
1593 -6536383 -8596347 -11526555 -12489920 -9744099 -4290021 1545192 4630633 4964679 5294546
1584 5294546 7645607 11797285 16751202 22127346 27390263 32362944 35306865 34043890
1576 34043890 29233105 24718247 23260213 22909854 21102798 19771713 21342658 25015186
1568 25015186 31161574 42159404 56081508 67865958 74149024 76125196 78663040 84804018
1560H4804018P992859N895401J464912j157677j200520l929802q540891j0157332
1552G5170968o712113l65370L022439j351534j0390789j5104151j3218660j0142983
1544B0907807n814444P1154M504387L726692j378092n360110m524174j353588
1536A0779632k99561J07074J232167J055067j312507n128943r331261j0637521
1528a3535853o704037o05135K743027L619940K096478n02673j455219j916387
1520a6259859l450763m443410l126955n22304Q14863J758386L974340M975462
1512a6280240M188481L958556N401284O508649L826512j501925n574889n526004
1504d999576j855959K363078L040620M32379k44551L089453N084658L157885J963339
$$ plain form
1560 84804018 92796877 98692278 100157190 98999513 97798993 93869191 85328300 75170968
1552 75170968 68458855 68093485 71115924 69764390 59373601 44269450 31050790 20907807
1544 20907807 15093363 15164517 19668904 23395596 22017504 16657394 12133220 10779632
1536 10779632 10480071 10587145 11819312 12874379 11561872 6432929 -2898332 -13535853
1528 -13535853 -20239890 -20845025 -18101998 -14482058 -12385580 -12888253 -14343472 -16259859
1520 -16259859 -19710622 -24154032 -27280987 -27803291 -26988428 -25230042 -21255702 -16280240
1512 -16280240 -12091759 -8133203 -2731919 3776730 7603242 6101317 526428 -4999576
1504 -4999576 -6855535 -4492457 -1451837 -1019458 -1264009 1825444 6910102 10067987 12031326
1495A2031326J581130P56322r01163k146013k152427j894451j558836k70323J095774
1486F541339J608537Q38394k02823N19887K431652L036050L84574k965429m634421
1477G557760l832460k957707l022513j302445R80353R62175R74245K288403L094379
1468D742190L066127P76078k701227m673255l672253Q5683K654208R65089k083205
1459h40565l012451m127508o028469m965304l27115L131876K595215J41732m64031
1450a3896620J673208L094775L182588L989380O262233P487912O161789O121153
1442B4076418O702174O615134Q801198J4193850J9136337K0315840J4765675M827801
1434A19434427J738178P099315J1429308Q155620Q89820k172807j407391l445402
$$ plain form
1495 12031326 13612456 14368778 13467615 11321602 9169175 7274724 5715888 5445565 6541339
1486 6541339 8149876 8988270 8785447 9305334 11736986 14773036 15157610 12192181 7557760
1477 7557760 3725300 767593 -2254920 -3557365 -2577012 -1614837 -640592 1647811 4742190
1468 4742190 7808317 8584395 5883168 1209913 -2462340 -2376657 277551 1242640 -840565
1459 -840565 -3853016 -7980524 -14008993 -18974297 -19301412 -16169536 -13574321 -13432589 -13896620
1450 -13896620 -12223412 -9128637 -5946049 -1956669 4305564 11793476 17955265 24076418
1442 24076418 30778592 37393726 46194924 60388774 79525111 99840951 114606626 119434427
1434 119434427 121172605 128271920 139701228 147856848 148746668 146573861 145166470 141721068
1426A41721068p295092n966328k585213l659072r671333j7105429j9842442j5285388
1418F0310771q954732n205159l507870m200150n751134n911509n292479m039971
1410A7447767j092214K452888M073242J257615l889460o855746p103418m845805
1402A444869l039351l245115j694224j68728q14060k378272m545783n163086k476842
1393b2080592M81812J346841k62924l063346l038456N95579K578100J848100J461413
1384b0133473J471903Q77046j010286l145282l652750k023181J472892L058319
1376b3084812J390872r34694j370933K50468J165662R85592j294518k407988L98395
1367b4901956K062050N35414L37249J460447J595419P88243k598654o083658o300363
$$ plain form
1426 141721068 134425976 128459648 125874435 122215363 112544030 95438601 75596159 60310771
1418 60310771 51356039 46150880 42643010 38442860 32691726 26780217 21487738 17447767
1410 17447767 16355553 18808441 22881683 24139298 20249838 13394092 6290674 1444869
1402 1444869 -1594482 -4839597 -6533821 -6702549 -7516609 -9894881 -14440664 -19603750 -22080592
1393 -22080592 -21598780 -20251939 -20514863 -23578209 -26616665 -26021086 -23442986 -21594886 -20133473
1384 -20133473 -18661570 -17784524 -18794810 -21940092 -25592842 -27616023 -26143131 -23084812
1376 -23084812 -21693940 -22628634 -23999567 -23749099 -22583437 -21597845 -22892363 -25300351 -24901956
1367 -24901956 -22839906 -22304492 -21967243 -20506796 -18911377 -18123134 -20721788 -26805446 -33105809
1358c3105809l128274J430162M537391N106977M830692M189828K273060O0653
1350a3805320k403763k892639q61040N36232j81437k361613m061121m203508j833233
1341c2067442J287849K735280L730396M863912L951695L58279l368102m883836
1333b3391969l866807j036139J303836K082564K879065M528852O075799P361253
1325d063546Q946121P301263K311617j918499m111452n596883n363289k643551
1317e138219k036551l976032n264111k998208J513218N059960N084709J874757
1309e880477j11636N71275J734102J645393J004579M67611m58686j180971P91448
1300a417362L323876L141571J373823p97891j842714k335542j656732k36136L18076
$$ plain form
1358 -33105809 -36234083 -34803921 -30266530 -25159553 -20328861 -16139033 -13865973 -13805320
1350 -13805320 -16209083 -19101722 -19962762 -19426530 -19607967 -21969580 -26030701 -30234209 -32067442
1341 -32067442 -30779593 -28044313 -24313917 -19450005 -15498310 -15140031 -18508133 -23391969
1333 -23391969 -27258776 -28294915 -26991079 -24908515 -22029450 -17500598 -11424799 -4063546
1325 -4063546 4882575 12183838 14495455 12576956 8465504 2868621 -2494668 -5138219
1317 -5138219 -7174770 -11150802 -16414913 -19413121 -17899903 -12839943 -7755234 -5880477
1309 -5880477 -5992113 -5420838 -3686736 -2041343 -1036764 -569153 -1027839 -2208810 -1417362
1300 -1417362 1906514 5048085 6421908 5624017 3781303 1445761 -210971 -447107 -129031
1291a29031j81835j074618q12672m40683k134009l545660j970579J585530M473427
1282d230130N710100N197760L267933Q04475j358285k302277j712372j114230
1274D262974k930577n494181o415579n963263n072610l198149j835207p31309
1266b7377901O74074L375900N988326N854431M169235L170490L650887M443249
1258C948691M051481L455609K529045k677847r214203r581479n557532j622223
1250a4668458J261734J719251L29262L22899k92714j168049m63490j256425k736140
1241a6952130k687076n97947K931411N539946N153483K129495k491115n899177
1233a2873110o541746m174503p93948m66793k269009k430766O58227M074962N484777
$$ plain form
1291 -129031 -310866 -1385484 -2198156 -2638839 -4772848 -8318508 -10289087 -8703557 -4230130
1282 -4230130 1479970 6677730 9945663 10750138 9391853 7089576 5377204 4262974
1274 4262974 1332397 -4161784 -10577363 -16540626 -21613236 -24811385 -26646592 -27377901
1266 -27377901 -26703827 -23327927 -17339601 -11485170 -7315935 -4145445 -494558 3948691
1258 3948691 8000172 11455781 13984826 11306979 2092776 -7488703 -13046235 -14668458
1250 -14668458 -13406724 -11687473 -11358211 -11035312 -11328026 -12496075 -12959565 -14215990 -16952130
1241 -16952130 -19639206 -20237153 -17305742 -11765796 -6612313 -4482818 -6973933 -12873110
1233 -12873110 -19414856 -23589359 -24383307 -24850100 -27119109 -29549875 -28891648 -24816686 -19331909
1224a9331909N768738N239491M692991M380752L201139K773520L967425M292676
1216A4984823L113213K460186K732674L032404J530168r78852j959728j168091
1208B3746797j264017k157552j848752L2896K592604L603471J888892j34400O08616
1199B7068555L468319N668713N841180M648562L385720J871996k36878r08557
1191E0807610O84613L621502P353317R022134P583258O880486J0603152J8145612
1183A14701684K7769997L7620536M3204984L7145609J5757343j2040946l7162537
1176B26996670n0244010m7873255l8263947k7836259j9452604j2754093n930861
1169B4641641K45379M077194N367059N146778L269391J987867J246210J250388
$$ plain form
1224 -19331909 -13563171 -8323680 -3630689 750063 3951202 6724722 10692147 14984823
1216 14984823 18098036 20558222 23290896 26323300 27853468 26874616 24914888 23746797
1208 23746797 22482780 20325228 18476476 18509372 21101976 24705447 26594339 26459939 27068555
1199 27068555 30536874 36205587 42046767 46695329 50081049 51953045 51716167 50807610
1191 50807610 51492223 55113725 62467042 71489176 79072434 85952920 96556072 114701684
1183 114701684 142471681 180092217 223297201 260442810 276200153 264159207 226996670
1176 226996670 176752660 128879405 90615458 62779199 43326595 30572502 24641641
1169 24641641 24887020 28964214 34331273 39478051 42747442 44735309 45981519 47231907
1161D7231907L860066O466213R287654J5648927K5716082L5147158L7181513K4666447
1153B05205967r81936k7903132m3918825m4186160l4140873k4456025j8648529
1146A0970487j3301470r343328p544557n973833l317870m01196J105163J081003
1138b6725601J745987J835037N14896J300642L366984K595847j035324k927765
1130a9329297m91936L863760P732959R585189Q247877L569096l431344o495970
1122C250334l654318N07934J351036m57101J78556L158556M008119R67056k038828
1113G271344l253439m201984l993133j696600J153290J799901q30359k918536
1105f669516p25291J675893L47552k867422m184187k210490J117111K502492L39682
$$ plain form
1161 47231907 51091973 57558186 66845840 82494767 108210849 143358007 180539520 205205967
1153 205205967 204224031 176320899 132402074 88215914 54075041 29619016 10970487
1146 10970487 -2330983 -11674311 -19218868 -25192701 -28510571 -28911767 -27806604 -26725601
1138 -26725601 -24979614 -23144577 -22629681 -21329039 -17962055 -15366208 -16401532 -19329297
1130 -19329297 -19821233 -15957473 -8224514 1360675 9608552 13177648 9746304 3250334
1122 3250334 -403984 103950 1454986 997885 1176441 4334997 8343116 9310172 7271344
1113 7271344 4017905 -184079 -4177212 -5873812 -4720522 -2920621 -3750980 -6669516
1105 -6669516 -7394807 -5718914 -5371362 -8238784 -12422971 -14633461 -13516350 -11013858 -10674176
1096a0674176k011714k455213k700294k338680n72718K407740M808273O184586
1088g352196N784409K599539k334205p418320r283761p701922l904695K34411
1080b9376740K286875J688541J051038K289507L230722K278900M40658K21582
1072a5888917L232007N686519N255637M027695J973776m33756n21740J813712
1064E144933K978063n29893n582031p800570o228309k697123k39973O32347L82734
1055a3939822M52256O66684K094380N669933O990774L427196j33599o80005j11427
1046D436370J152748K267825k2378l745312m187060j634422m23822j731713k172913
1037f060677n30393L403452P871833P076055K823140K22535o88575j733085l591436
$$ plain form
1096 -10674176 -12685890 -15141103 -17841397 -20180077 -20752795 -18345055 -13536782 -7352196
1088 -7352196 -1567787 1031752 -1302453 -8720773 -18004534 -25706456 -29611151 -29376740
1080 -29376740 -27089865 -25401324 -24350286 -22060779 -18830057 -16551157 -16110499 -15888917
1072 -15888917 -12656910 -6970391 -1714754 2312941 4286717 3852961 3331221 5144933
1064 5144933 8122996 7593103 2011072 -5789498 -12017807 -14714930 -14954903 -14322556 -13939822
1055 -13939822 -13487566 -12820882 -10726502 -5056569 1934205 5361401 5227802 4547797 4436370
1046 4436370 5589118 7856943 7834565 4089253 -97807 -1732229 -2156051 -3887764 -6060677
1037 -6060677 -6591070 -3187618 4684215 11760270 14583410 14805945 14117370 12384285 8792849
1028H792849l881403k723896k351330l251348k829976j199917m41870O41882J595850
1019e649159J603658N49915p04462j124457q56359L3031k327j501753k968624
1010a0620537q54970L749964N115779L809376K257115o4966k901836m839304n641417
1001i990796n628150l213989J441334O266694Q460282N916334J578788r96619
993C833878k595455l745068l135859n0064K983096L530136K491382O74153o08404
984C377795j440227k036431n11389J761139K231308J007983N91225O22940m199
975E600144l77558j315531k208089k288263k296184n36716K196232K572498Q49870
966B196403n9936J71878K49417O17794N70022q85346j135050j201570l354475
$$ plain form
1028 8792849 4911446 2187550 -163780 -3415128 -6245104 -7445021 -7886891 -7245009 -5649159
1019 -5649159 -4045501 -3495586 -4200048 -5324505 -6180864 -6147833 -6150160 -7651913 -10620537
1010 -10620537 -11475507 -7725543 -2609764 1199612 3456727 3391761 489925 -4349379 -9990796
1001 -9990796 -15618946 -18832935 -17391601 -11124907 -2664625 3251709 4830497 3833878
993 3833878 1238423 -2506645 -5642504 -5692568 -2709472 820664 3312046 3986199 3377795
984 3377795 1937568 -98863 -610252 1150887 3382195 4390178 4981403 5604343 5600144
975 5600144 5222586 3907055 1698966 -589297 -2885481 -3422197 -1225965 1346533 2196403
966 2196403 2136467 2308345 2557762 3175556 3745578 2860232 1725182 523612 -2830863
957b830863l950227l030328k145406p86431J695509K496334J350997J323772R78839
948d897804k91839j399506k576809k627689k453293j708103R40741N220935P775966
939b017401N296387O15464k996535m198495k031601M89945P64960O23819J659950
930a793507J127318m14971m42573j039641l155517m728577n015823l805321j099206
921b0367818K445873N257799M271457J179202J09412J841886M716584N801762
913E256157M285521K558557N82667j892680m194501l587107j599855j947786k858375
904c397402j911547O54442L778898M855897K786352j034916l281879k656575k074919
895b281649j505357O0151n07936k160498j878070K02865M67804m78698r24169
$$ plain form
957 -2830863 -6781090 -9811418 -11956824 -12743255 -11047746 -8551412 -7200415 -5876643 -4897804
948 -4897804 -5189643 -6589149 -9165958 -11793647 -14246940 -15955043 -15014302 -9793367 -2017401
939 -2017401 3278986 3894450 897915 -3300580 -5332181 -4842236 -4077276 -3453457 -1793507
930 -1793507 -666189 -1081160 -1523733 -2563374 -5718891 -10447468 -15463291 -19268612 -20367818
921 -20367818 -17921945 -12664146 -8392689 -7213487 -7104075 -5262189 -545605 5256157
913 5256157 9541678 12100235 12682902 10790222 6595721 3008614 1408759 -539027 -3397402
904 -3397402 -5308949 -4654507 -875609 3980288 6766640 5731724 2449845 -206730 -2281649
895 -2281649 -3787006 -3726855 -4234791 -6395289 -8273359 -8070494 -7602690 -8081388 -9005557
886i005557r23474N31562J119182P31604J204676J741217K363899L909793M481663
877F154565K791492R3086j554022j282140j466665j528935j236444j363078o03352
868D507j072042l282936m177881k120644O93300K853223L362711K324399K96657
859a118706l037893m367688k78470M132098N168287M920482K464464m318845j0664520
850g100791r552038k466607J937733O94550k305076k034107J308995K639845J22766
841a6754730l384390k426136K163619L585921K464480K081927J337531M11140
833a0520638Q07564L375426N880856M862559K053111m55649j994495k156783j645554
824B06397L10502K094856J555781N76523l64738j523396j919133M77959L977339
$$ plain form
886 -9005557 -9929031 -9397469 -8278287 -7546683 -6342007 -4600790 -2236891 1672902 6154565
877 6154565 8946057 9039143 7485121 6202981 4736316 3207381 1970937 607859 4507
868 4507 -1067535 -4350471 -8528352 -10648996 -9955696 -7102473 -3739762 -1415363 -1118706
859 -1118706 -4156599 -8524287 -8802757 -4670659 497628 5418110 7882574 3563729 -7100791
850 -7100791 -16652829 -19119436 -17181703 -16487153 -18792229 -20826336 -19517341 -16877496 -16754730
841 -16754730 -20139120 -22565256 -20401637 -16815716 -14351236 -12269309 -10931778 -10520638
833 -10520638 -9713074 -6337648 -456792 4405767 6458878 6003229 4008734 1851951 206397
824 206397 516899 2611755 4167536 4744059 4379321 2855925 936792 1414751 5392090
815E392090N949112N913648K955223p53774k721320k615784k756304l443300l409176
806D510415k558210j619679j749095k992237k667866L00189K034674J999586K750006
797G783L372680J122527k123899k847082k710815l460543n007759n266695l212878
788b0126681J95119M046645O165125M782646Q17339j140725n80442j618098m405845
779a1864917n341201k782358J307606L934815K837505o33735l211970l615562
771a9369817j826689K049653M210873J574061k174695m128621l631942j340867
763b4638044p79301j714644j138123M09694q3232q00929j74088K225389M610541
754b2082737L132579Q42964l47891k199709l111213j380220J542817M374351O585768
$$ plain form
815 5392090 11341202 17254850 20210073 19456299 16734979 14119195 11362891 7919591 4510415
806 4510415 1952205 332526 -1416569 -4408806 -7076672 -6776483 -4741809 -2742223 7783
797 7783 3380463 4502990 2379091 -467991 -3178806 -6639349 -11647108 -16913803 -20126681
788 -20126681 -19931562 -15884917 -9719792 -4937146 -4119807 -5260532 -5840974 -7459072 -11864917
779 -11864917 -17206118 -19988476 -18680870 -14746055 -11908550 -12542285 -15754255 -19369817
771 -19369817 -21196506 -19146853 -14935980 -13361919 -15536614 -19665235 -23297177 -24638044
763 -24638044 -25417345 -27131989 -28270112 -27860418 -27943650 -28744579 -28918667 -26693278 -22082737
754 -22082737 -18950158 -18107194 -18455085 -20654794 -23766007 -25146227 -23603410 -19229059 -12643291
745a2643291O345182K455841k958478m909074k067773p30790k001880k636184
737a9146447k169589Q72930N232347O773780L928081o97788k778065j450529R25686
728h509594K101516K360177K499565R32208j245676j536357j181146k061304l721182
719a0361793l330756o90489J480501K659849J750950M00156o07060j779945j355296
710a1833883Q90292L181945M590750N442473M711390L59869j740784P13777J363534
701G679363j255244k978364j440286J492144K829157J975845J463276J203244
693A0969135J696317J243106R06677J927760J622443j16902j004583j68555M08060
684A7483458K42588K61477J476723K376899N4790l968372o710225o680588m470123
$$ plain form
745 -12643291 -6298109 -3842268 -6800746 -11709820 -13777593 -14508383 -16510263 -19146447
737 -19146447 -21316036 -20443106 -15210759 -8436979 -4508898 -5206686 -7984751 -9435280 -8509594
728 -8509594 -6408078 -4047901 -1548336 -616128 -1861804 -3398161 -4579307 -6640611 -10361793
719 -10361793 -13692549 -14383038 -12902537 -10242688 -8491738 -8091582 -8698642 -10478587 -11833883
710 -11833883 -10943591 -7761646 -3170896 2271577 6982967 7342836 5602052 6315829 7679363
701 7679363 6424119 3445755 2005469 3497613 6326770 8302615 9765891 10969135
693 10969135 12665452 13908558 14815235 16742995 18365438 18248536 17243953 17075398 17483458
684 17483458 17726046 17987523 19464246 21841145 21895935 17927563 11217338 4536750 66627
675F6627l277733l638441k558118n07707J146559J915947J254174J954735N036539
666A392582N823328L475966K56392j796980j939026j502775j018166l40249j330794
657C020278l663155m116742k381305j26842K184089K339478l28142k434889j493631
648g000861J334438K966695K968316K266843O23878m74783L2007J23716o40086
639B200163k34503J782086K872381J881535q35833m477008n839632k587032K545490
630b692353N347918L853725J598652J520468K053812K660250J891113j046414
622A5187171l340714m699140m519731k493421n7856J652224K546553K599540J530833
613H405459L01828n40683n68388p71218j305657M97195L186262L797100K878036
$$ plain form
675 66627 -3211106 -6849547 -9407665 -9915372 -8768813 -6852866 -5598692 -3643957 1392582
666 1392582 7215910 10691876 10948268 9151288 7212262 5709487 4691321 4351072 3020278
657 3020278 -642877 -4759619 -7140924 -7267766 -5083677 -2744199 -3072341 -5507230 -7000861
648 -7000861 -5666423 -2699728 268588 2535431 3159309 2684526 2716533 2840249 2200163
639 2200163 1965660 3747746 6620127 8501662 7665829 3188821 -2650811 -5237843 -2692353
630 -2692353 2655565 6509290 8107942 9628410 11682222 14342472 16233585 15187171
622 15187171 11846457 7147317 2627586 134165 76309 1728533 4275086 6874626 8405459
613 8405459 8707287 8166604 7598216 6826998 5521341 6018536 9204798 13001898 15879934
604A5879934n98885n900124p390282l900479k93164N40059P843j322769l166469
595f144336l034803m15712J159833K157048M323076O306953N303296l41282n337889
586C976184n250760k792861k257807l912622m956966m637414k561175P27636K130977
577a9534808K295584L584200M458650L061991j027259m942095n163713j410886
569a8678336L617828O202060O573080M708082L70497l768340l965036j843127
561f783292l12318N95855j0508j635836l316338l969471j714492J249057K785614
552a3111729K317671p86641l564722j242780L641178M648929K316971L96086k17724
543e602761R85834L141138K227667l88958k57548J698891J876433J012735J608141
$$ plain form
604 15879934 15281049 9380925 1990643 -1909836 -2203000 -1662941 -1655098 -2977867 -6144336
595 -6144336 -9179139 -9594851 -8435018 -6277970 -1954894 4352059 9655355 9314073 3976184
586 3976184 -1274576 -4067437 -6325244 -10237866 -15194832 -19832246 -22393421 -21665785 -19534808
577 -19534808 -17239224 -13655024 -9196374 -6134383 -7161642 -12103737 -17267450 -18678336
569 -18678336 -15060508 -8858448 -2285368 2422714 2793211 -975129 -4940165 -6783292
561 -6783292 -7095610 -6499755 -6510263 -8146099 -11462437 -15431908 -17146400 -15897343 -13111729
552 -13111729 -10794058 -11580699 -15145421 -16388201 -12747023 -8098094 -5781123 -5385037 -5602761
543 -5602761 -4616927 -1475789 751878 362920 105372 1804263 3680696 4693431 6301572
534F301572J726956j73104k067040k135625k304939l738601m803936m483222k677457
525a4355396K98076J708325P75269k08551p3859J058856K956362L627530Q14803
516c398585k266472l427594k675852O43333M691122M930732K245705J114744K525242
507D382375L650770J286584k987075m998163l444605r69652m44537j899449k903609
498h327361o21840K423011K574487K780180L350814Q03361k621401k502999J875481
489b66267N261201K942332j677889m290085n107833l425018J73809J304386j129185
480f214549m714588o262845n693887m956853l825850k762712k744163k522726
472c9698173q76411K235664M468468M286984L756301K932708J192170O13125J039382
$$ plain form
534 6301572 8028528 7855424 5788384 3652759 1347820 -2390781 -7194717 -11677939 -14355396
525 -14355396 -14057320 -12348995 -11573726 -11782277 -11856136 -10797280 -7840918 -4213388 -3398585
516 -3398585 -5665057 -9092651 -11768503 -11125170 -6434048 -1503316 742389 1857133 4382375
507 4382375 8033145 9319729 6332654 1334491 -2110114 -3079766 -3524303 -5423752 -8327361
498 -8327361 -8949201 -6526190 -3951703 -1171523 2179291 2982652 361251 -2141748 -266267
489 -266267 4994934 7937266 6259377 1969292 -3138541 -6563559 -6389750 -5085364 -6214549
480 -6214549 -10929137 -17191982 -22885869 -27842722 -31668572 -34431284 -37175447 -39698173
472 -39698173 -40574584 -38338920 -33870452 -29583468 -25827167 -22894459 -21702289 -21089164 -20049782
463b0049782O54924J053572P64200J473227L437795K968104K584791M107251N083490
454B077572L263277J290915J763682K468543P55479k078536l002626j566743L98990
445E370553J246838J287228J165119N23592J41055j372597m482377o099429n815271
436h035289n139668k944952m64318N79399J442112J330494L21060M20940R43439
$$ plain form
463 -20049782 -19394858 -18341286 -17577086 -16103859 -12666064 -9697960 -7113169 -3005918 2077572
454 2077572 5340849 6631764 8395446 10863989 11619468 9540932 6538306 4971563 5370553
445 5370553 6617391 7904619 9069738 9593330 9734385 8361788 3879411 -2220018 -8035289
436 -8035289 -13174957 -16119909 -16584227 -16004828 -14562716 -13232222 -12911162 -12490222 -11546783
$$ [...]
##END NTUPLES=NMR SPECTRUM
##END=
