##TITLE=dept_SR-167-R2K-AK CH-,CH3- -up, CH2- -down
 D2O, 2000 sc
 2.08.2023
##JCAMPDX= 6.0         $$ Bruker NMR JCAMP-DX V2.0
##DATA TYPE= NMR SPECTRUM
##DATA CLASS= NTUPLES
##ORIGIN= UXNMR, Bruker Analytische Messtechnik GmbH
##OWNER= root
$$ XWIN-NMR		Version 3.5
$$ Wed Aug  2 16:24:34 2023 Russian Standard Time (UT+4h)  she@DPX200
##.OBSERVE FREQUENCY= 50.327992884445
##.OBSERVE NUCLEUS= ^13C
##.ACQUISITION MODE= SIMULTANEOUS
##.ACQUISITION SCHEME= undefined
##.AVERAGES= 2501
##.DIGITISER RES= 17
##SPECTROMETER/DATA SYSTEM= spect
##.PULSE SEQUENCE= dept135
##.SOLVENT NAME= CDCl3
##.SHIFT REFERENCE= (INTERNAL, CDCl3, 0, 214.665)
##AUDIT TRAIL= $$ (NUMBER, WHEN, WHO, WHERE, WHAT)
$$ ##TITLE= Audit trail, XWIN-NMR		Version 3.5
$$ ##JCAMPDX= 5.01
$$ ##ORIGIN= Bruker BioSpin GmbH
$$ ##OWNER= she
$$ F:/spectra/data/she/nmr/depta/1/pdata/1/auditp.txt
$$ ##AUDIT TRAIL=  $$ (NUMBER, WHEN, WHO, WHERE, WHAT)
(   1,<2023-08-02 16:22:59.04 +0400>,<she>,<DPX200>,
      <created by zg, POWCHK disabled, PULCHK disabled
       terminated by command 'halt'
       configuration hash MD5:
       00 E9 B6 7A A2 85 ED C7 34 08 36 98 17 FE 4E 26
       data hash MD5: 16K
       2B 70 C1 63 89 EE 59 4A 55 12 F5 9F 4D 36 08 0F>)
(   2,<2023-08-02 16:23:04.95 +0400>,<she>,<DPX200>,
      <Start of raw data processing
       efp BC_mod = 2 LB = 3.5 FT_mod = 6 PKNL = 1 PHC0 = -3746.148 PHC1 = -1051.8 SI = 16K 
       data hash MD5: 16K
       71 59 DE EB 35 6F 70 9F 22 3D F6 BA 10 1B A9 FC>)
(   3,<2023-08-02 16:23:50.53 +0400>,<she>,<DPX200>,
      <pk PHC0 = 21.20935 PHC1 = -14.2 
       data hash MD5: 16K
       F8 D3 E3 7F C1 EF 45 7F 23 6E F8 91 0A C1 FF CF>)
$$ ##END=
$$ 
$$ hash MD5
$$ 01 8E CC 05 5B 30 B5 C6 BB AF 70 DA 3E 30 28 FA
##$RELAX= 
##$RELAX= 
##$RELAX= 
##$RELAX= 
##$RELAX= 
##$RELAX= 
##$RELAX= 
##$RELAX= 
$$ Bruker specific parameters
$$ --------------------------
##$DU= <F:/spectra>
##$EXPNO= 1
##$NAME= <depta>
##$PROCNO= 1
##$TYPE= <nmr>
##$USER= <she>
##$AMP= (0..31)
100 100 100 100 100 100 100 100 100 100 100 100 100 100 100 100 100 100 
100 100 100 100 100 100 100 100 100 100 100 100 100 100 
##$AQSEQ= 0
##$AQ_mod= 1
##$AUNM= <au_zg>
##$AUTOPOS= <>
##$BF1= 50.322709
##$BF2= 200.13
##$BF3= 200.13
##$BF4= 200.13
##$BF5= 200.13
##$BF6= 200.13
##$BF7= 200.13
##$BF8= 200.13
##$BYTORDA= 1
##$CFDGTYP= 0
##$CFRGTYP= 5
##$CHEMSTR= <none>
##$CNST= (0..31)
1 1 145 1 1 1 1 1 1 1 1 1 1 1 1 1 1 1 1 1 1 1 1 1 1 1 1 1 1 1 1 1 
##$CPDPRG= <>
##$CPDPRG1= <waltz16>
##$CPDPRG2= <waltz16>
##$CPDPRG3= <>
##$CPDPRG4= <mlev>
##$CPDPRG5= <mlev>
##$CPDPRG6= <mlev>
##$CPDPRG7= <mlev>
##$CPDPRG8= <mlev>
##$CPDPRGB= <>
##$CPDPRGT= <>
##$D= (0..31)
0 2 0.003448276 0 0 0 0 0 0 0 0 0 2e-05 0 0 0 0 0 0 0 0 0 0 0 0 0 0 0 
0 0 0 0 
##$DATE= 1690972070
##$DBL= (0..7)
120 120 120 120 120 120 120 120 
##$DBP= (0..7)
150 150 150 150 150 150 150 150 
##$DBP07= 0
##$DBPNAM0= <>
##$DBPNAM1= <>
##$DBPNAM2= <>
##$DBPNAM3= <>
##$DBPNAM4= <>
##$DBPNAM5= <>
##$DBPNAM6= <>
##$DBPNAM7= <>
$$ [...]
##$SUBNAM1= <"">
##$SUBNAM2= <"">
##$SUBNAM3= <"">
##$SUBNAM4= <"">
##$SUBNAM5= <"">
##$SUBNAM6= <"">
##$SUBNAM7= <"">
##$SUBNAM8= <"">
##$SUBNAM9= <"">
##$SW= 219.3118970423
##$SWIBOX= (0..15)
0 1 3 0 0 0 0 0 0 0 0 0 0 0 0 0 
##$SW_h= 11037.527593819
##$TD= 16384
##$TD0= 1
##$TE= 0
##$TE2= 300
##$TE3= 300
##$TEG= 300
##$TL= (0..7)
120 120 120 120 120 120 120 120 
##$TP= (0..7)
150 150 150 150 150 150 150 150 
##$TP07= 0
##$TPNAME0= <>
##$TPNAME1= <>
##$TPNAME2= <>
##$TPNAME3= <>
##$TPNAME4= <>
##$TPNAME5= <>
##$TPNAME6= <>
##$TPNAME7= <>
##$TPOAL= (0..7)
0.5 0.5 0.5 0.5 0.5 0.5 0.5 0.5 
##$TPOFFS= (0..7)
0 0 0 0 0 0 0 0 
##$TUNHIN= 0
##$TUNHOUT= 0
##$TUNXOUT= 0
##$USERA1= <user>
##$USERA2= <user>
##$USERA3= <user>
##$USERA4= <user>
##$USERA5= <user>
##$V9= 5
##$VALIST= <valist>
##$VCLIST= <CCCCCCCCCCCCCCC>
##$VD= 0
##$VDLIST= <DDDDDDDDDDDDDDD>
##$VPLIST= <PPPPPPPPPPPPPPP>
##$VTLIST= <TTTTTTTTTTTTTTT>
##$WBST= 1024
##$WBSW= 2
##$XGAIN= (0..3)
0 0 0 0 
##$XL= 0
##$YL= 0
##$YMAX_a= 1926153
##$YMIN_a= -1603685
##$ZGOPTNS= <>
##$ZL1= 120
##$ZL2= 120
##$ZL3= 120
##$ZL4= 120
##$ABSF1= 0
##$ABSF2= 0
##$ABSG= 0
##$ABSL= 0
##$ALPHA= 0
##$AQORDER= 0
##$ASSFAC= 0
##$ASSFACI= 0
##$ASSFACX= 0
##$ASSWID= 0
##$AUNMP= <proc_1d>
##$AZFE= 0.1
##$AZFW= 0.1
##$BCFW= 0
##$BC_mod= 2
##$BYTORDP= 0
##$COROFFS= 0
##$CY= -3
##$DATMOD= 1
##$DC= 0
##$DFILT= <>
##$DTYPP= 0
##$F1P= 0
##$F2P= 0
##$FCOR= 0.5
##$FTSIZE= 16384
##$FT_mod= 6
##$GAMMA= 0
##$GB= 0
##$INTBC= 1
##$INTSCL= 0
##$ISEN= 128
##$LB= 3.5
##$LEV0= 0
##$LPBIN= 0
##$MAXI= 10000
##$MC2= 0
##$MEAN= 0
##$ME_mod= 0
##$MI= 0.4000791
##$NCOEF= 0
##$NC_proc= -1
##$NLEV= 6
##$NOISF1= 120.0001
##$NOISF2= 80.00006
##$NSP= 0
##$NTH_PI= 0
##$NZP= 0
##$OFFSET= 214.6655
##$PC= 4
##$PHC0= -3724.938
##$PHC1= -1066
##$PH_mod= 1
##$PKNL= yes
##$PPARMOD= 0
##$PSCAL= 0
##$PSIGN= 0
##$REVERSE= no
##$SF= 50.3227091
##$SI= 16384
##$SIGF1= 140
##$SIGF2= 120
##$SINO= 80
##$SIOLD= 32768
##$SREGLST= <13C.CDCl3>
##$SSB= 0
##$STSI= 16384
##$STSR= 0
##$SW_p= 11037.527593819
##$SYMM= 0
##$S_DEV= 0
##$TDeff= 16384
##$TDoff= 0
##$TI= <>
##$TILT= no
##$TM1= 0
##$TM2= 0
##$TOPLEV= 0
##$USERP1= <user>
##$USERP2= <user>
##$USERP3= <user>
##$USERP4= <user>
##$USERP5= <user>
##$WDW= 1
##$XDIM= 16384
##$YMAX_p= 290953680
##$YMIN_p= -87322717
$$ End of Bruker specific parameters
$$ ---------------------------------
##NTUPLES= NMR SPECTRUM
##VAR_NAME=  FREQUENCY,     SPECTRUM/REAL,   SPECTRUM/IMAG
##SYMBOL=    X,             R,               I
##VAR_TYPE=  INDEPENDENT,   DEPENDENT,       DEPENDENT
##VAR_FORM=  AFFN,          ASDF,            ASDF
##VAR_DIM=   16384,         16384,           16384
##UNITS=     HZ,            ARBITRARY UNITS, ARBITRARY UNITS
##FACTOR=    0.67371834180669, 1,            1
##FIRST=     10802.5493505904, 0,            0
##LAST=      -234.978243228581, 0,           0
##MIN=       -234.978243228581, -87322717,   0
##MAX=       10802.5493505904, 290953680,    0
$$ Real data points
##PAGE= N=1
##DATA TABLE= (X++(R..R)), XYDATA
$$ [...]
14723 7247172 5019021 2526618 1248217 1559066 2744279 3695426 3532785 2762872 2995105
14714 2995105 3929963 4066484 3114077 1426626 -377667 -1784600 -2857182 -3912897 -5051300
14705 -5051300 -5808746 -5489296 -4183715 -2925231 -2316230 -1480729 -208350 44555 -730484
14696 -730484 -1715789 -2746736 -3189534 -2424290 -245687 2584510 4857921 6397286 7590147
14687 7590147 7914829 6454902 3590422 1272314 363459 -385106 -1212138 -1411454 -434260
14678 -434260 1543544 3802936 5782239 6977166 7638098 7782878 7326050 6351737 5317701
14669 5317701 4687735 3800586 2204296 1213738 1276829 1115304 91634 -1500032 -3573066
14660 -3573066 -6491863 -9780876 -12043233 -12324069 -10798938 -8218371 -5123271 -2334766
14652 -2334766 -613312 217947 311347 -108354 -205687 349441 1109478 1256026 -87335
14643 -87335 -2434237 -4249108 -4530741 -3498923 -2405268 -1891043 -2144287 -3010925 -4250367
14634 -4250367 -5456350 -5571066 -4543710 -3406087 -2046994 -735063 -501028 -822287 -1306888
14625 -1306888 -2030028 -2241262 -1449105 -197162 1079474 2579221 3758753 3701332 2513908
14616 2513908 635602 -1412712 -2794761 -3197665 -3197726 -3369448 -3425102 -2381686 143015
14607 143015 3404529 5885868 6603741 5491223 3343060 1275559 -149423 -677820 -726829
14598 -726829 -1045245 -1464155 -1329738 -865388 -546786 -168364 277143 639156 284098 -1714922
14588 -1714922 -4472146 -6382994 -7498548 -8195667 -7539344 -5310394 -2976273 -1710495
14580 -1710495 -1400232 -2111908 -3408061 -4229079 -3659601 -1753164 199691 933473 1125917
14571 1125917 2263760 4184360 6129267 7540534 8016329 7774859 7421564 7338583 7127383
14562 7127383 6546546 6291522 6829995 8173235 10238351 12123332 12750189 11635716 9174130
14553 9174130 7174234 6465110 6498703 6743363 6643886 6076751 5651845 5520002 4938433 3383365
14543 3383365 1733161 801359 1024960 1985045 2656990 2752005 2377165 1927448 1763240
14534 1763240 1857803 2744184 3957282 4207304 3195204 1500648 -64963 -907066 -1105022
14525 -1105022 -1594353 -2646047 -3233128 -2382039 -575057 1730660 4545204 6468548 6533244
14516 6533244 5442000 3039523 -881089 -4498039 -5811444 -4825322 -3001966 -1524058
14508 -1524058 -518183 279759 530610 -433394 -2057001 -3190330 -3711749 -3338997 -1981740
14499 -1981740 -886638 -716720 -1093577 -1064540 276350 2456889 4322273 5991602 7306955
14490 7306955 7263068 5919107 4242369 2823964 1702368 1031888 1236591 2352643 3643605
14481 3643605 4556140 4674091 4096699 3159264 2385271 2820831 4764635 6975556 8057748
14472 8057748 7440303 5161808 2200246 -144440 -1014526 -1193354 -2028623 -3770453 -6307475
14463 -6307475 -8747131 -9581534 -8921657 -7834485 -6722845 -5650186 -4809270 -4144640 -3414130
14454 -3414130 -2336049 -764435 654597 1546052 1988590 2083654 1958873 1212905 -374242
14445 -374242 -2013491 -3388183 -4363206 -4726779 -4840575 -4746121 -4274162 -3340404 -2701397
14436 -2701397 -2586523 -2104801 -1632708 -2061440 -2964602 -3192441 -2255965 -339587 1220843
14427 1220843 1345365 17501 -2061670 -3654808 -4427695 -4194923 -3337298 -3052987 -3400531
14418 -3400531 -3058152 -1577278 -17100 419344 -229679 -1064197 -1422657 -1473502 -1332717
14409 -1332717 -862476 37404 1079444 1744025 1960477 1977411 1879171 1495720 1037555 816807
14399 816807 337900 -1068943 -3140328 -5352435 -6922855 -6704152 -5050850 -2922281 -262504
14390 -262504 2225220 3455875 3662337 3892365 5052295 6386306 7073345 7409156 7007806
14381 7007806 5803185 4508458 3562217 2953253 2294664 1399550 741116 1047978 2245292
14372 2245292 3655988 4477545 4108314 2940938 2243581 2729835 3528376 3688693 3518478
14363 3518478 3489820 4102267 5558914 6773448 7039970 6296287 4244693 1177050 -1945029
14354 -1945029 -3903134 -4516527 -4297084 -3549144 -2761293 -1928899 -699454 564878 1474377
14345 1474377 1929365 1894308 1529942 465312 -1570876 -4047413 -6039897 -6660640 -5897197
14336 -5897197 -4880110 -3929616 -2791701 -1537696 100195 2352850 4936517 7733716
14328 7733716 10060182 11079747 11090070 10952503 10905156 10285954 8421667 5689159 3177026
14319 3177026 942593 -1657584 -3854262 -4900482 -5451940 -5877633 -5880216 -5493225 -5171216
14310 -5171216 -4619435 -3593892 -3034254 -3094887 -3581921 -4270929 -4959992 -5533042 -5067293
14301 -5067293 -2671839 580574 2882380 3963001 4679817 5137934 4754880 3902794 3117541
14292 3117541 2070722 706054 -284159 -800857 -1166417 -1176794 -62988 2328946 4935680
14283 4935680 6779247 8129905 9170165 9490873 9315753 9270517 9284892 8688574 7299270
14274 7299270 5417598 3053231 486396 -1506088 -2336695 -2130238 -1455148 -1066162 -913497
14265 -913497 -625858 -378925 -401722 -937946 -1908696 -2852834 -3116446 -2859174 -3220363 -4000393
14255 -4000393 -4109141 -3150441 -1716794 -648706 27331 65183 -1402376 -4066256 -5899873
14246 -5899873 -4963641 -1761557 1525004 3658941 4960861 5608554 5672634 5517140 4974785
14237 4974785 4181059 3474642 2653425 2117165 2534189 3467499 4291683 4582073 4388297
14228 4388297 3919221 3466869 2864932 1684233 406744 -397776 -474381 -94670 547768
14219 547768 1510743 3144878 5071159 6397796 6996836 7117345 6910827 6561308 6251336
14210 6251336 5913188 5230540 3968239 2387663 1087097 752205 885923 458441 -908260
14201 -908260 -2418417 -2898291 -2165392 -1338251 -1159251 -907965 -183521 304154 135255
14192 135255 -104795 200653 763707 822561 -34241 -1510515 -3302481 -5160410 -6105163
14183 -6105163 -5641899 -5036801 -5538970 -6707381 -7068614 -5887183 -3052262 783787 3701069
14174 3701069 4295269 3382319 2246026 1087487 -73575 -824466 -1080622 -1348634 -1560853
14165 -1560853 -1309893 -533952 7316 -243215 -1229116 -2387984 -3211063 -3940041 -4806773
14156 -4806773 -5040279 -4086467 -3091889 -2747675 -2347795 -1948754 -1836844 -1703154 -1259957
14147 -1259957 -206677 1258493 2664957 3024398 1699148 -739939 -3045686 -3940488
14139 -3940488 -4131502 -5021672 -6156600 -6308811 -5499254 -4275450 -2875854 -1716537 -1315785
14130 -1315785 -1663358 -2660402 -4077464 -5384165 -6148845 -6004544 -4832745 -2673933 104967
14121 104967 2517972 3670952 3507704 3270746 3894721 4703801 4980069 4997074 5156894
14112 5156894 5908520 7211575 8366160 9084551 9391846 9623288 9935317 10165530 10290349
14103 10290349 10623296 10957094 10437865 9086978 7796570 6896519 6138673 5279249 4278843
14094 4278843 3597215 2979452 2200761 2105527 2857135 4086022 5303376 5965946 5946308
14085 5946308 5743283 5679045 5310593 4363148 3477591 3046417 2885537 2729985 2467390 2329384
14075 2329384 2685321 3631681 4773797 5305010 4539129 3024640 2051130 1554891 789527
14066 789527 -263700 -1226693 -1602503 -1298901 -928407 -1383364 -2325356 -2183973 -797592
14057 -797592 427812 1313981 2601932 4202936 5160025 5290585 5227950 4972679 3986780
14048 3986780 2848733 2947209 3824582 3925397 3230388 2839787 2814313 2220546 1020396
14039 1020396 -39204 -495663 -647915 -1233666 -1711021 -1214040 -265498 195290 249000
14030 249000 666143 1358333 1991351 2308239 2184326 2537407 3900001 5469665 6158745
14021 6158745 6069239 6001540 5996145 5630724 4902509 4184744 3101343 1262285 -599504 -1631623
14011 -1631623 -1928870 -1931797 -1723563 -1374692 -1259976 -1409360 -1184006 -856737 -1378891 -2572742
14001 -2572742 -3687503 -4357094 -4395210 -3874234 -3170227 -2801004 -3099374 -3800887 -3743638 -2544080
13991 -2544080 -878238 877253 2799163 4556878 5744523 6696641 7246329 7190232 6971419
13982 6971419 6701066 6246262 5686243 4694226 3181001 1909494 1457879 1878303 3295548
13973 3295548 5447834 6958023 6924636 5457521 3008311 332542 -1381303 -1532165 -508979
13964 -508979 885260 1803403 2060298 1723002 879965 -184408 -1242672 -2127650 -2585108
13955 -2585108 -2759906 -3522038 -5038561 -6102277 -5946449 -5260532 -4299053 -2644979 -1360858
13946 -1360858 -1473009 -2002279 -2259502 -2706250 -3400842 -3888327 -4063839 -4043876 -3708621 -2708198
13936 -2708198 -989479 389295 670033 98109 -773669 -1278235 -1153385 -312823 1087753
13927 1087753 2265639 2491663 1766775 672178 98492 760530 2136435 3384406 4197206
13918 4197206 4282326 3587603 2456649 1531607 1045091 771513 356441 -422800 -1488801
13909 -1488801 -2451294 -2604782 -1414632 685813 2647217 3920115 4619518 5060586 4735211
13900 4735211 3089638 260264 -2584716 -3855121 -3640906 -3350122 -3314488 -2978833 -2455995
13891 -2455995 -2254899 -2039870 -1937960 -2145109 -2051737 -1541946 -1055580 -1001900 -636025 1191665
13881 1191665 3729624 5390654 5601507 4254346 2182367 1159217 2020436 3627343
13873 3627343 4230322 3526033 2389637 1762180 1620620 1169776 -94853 -2109861 -3406704
13864 -3406704 -3010553 -1853176 -1340907 -1752909 -2291589 -2622431 -2681484 -2694628 -2843215 -2805254
13854 -2805254 -2392861 -1313415 606450 2275947 2411935 1258097 -20509 -888692 -1715025
13845 -1715025 -2394334 -2360958 -1609856 -1051866 -1458273 -2175979 -2664420 -2941413 -3007434 -2986328
13835 -2986328 -2799834 -2740841 -3050135 -3238901 -2677905 -1522692 -299859 387337 -30327
13826 -30327 -1370223 -2984074 -4391752 -5126112 -4839870 -3978649 -3197881 -2917655 -2888753
13817 -2888753 -2429946 -1720804 -1177384 -587085 -126656 96224 -5769 -1091409 -3542618
13808 -3542618 -6316552 -7761583 -7381966 -5956916 -4448945 -3161256 -1991108 -1140698
13800 -1140698 -684696 -354876 -98259 182323 1006332 2517016 3903731 4550402 4597604
13791 4597604 4480993 4909152 6369754 7975835 8448773 7759774 6638519 5430662 4200917
13782 4200917 3165457 2503559 2049029 1100454 -1094308 -4240592 -7039619 -8104909 -6992986
13773 -6992986 -4830810 -3340680 -2655313 -2004266 -1221920 -755795 -802336 -1471749 -2547589
13764 -2547589 -3079080 -2766884 -2610887 -3058967 -3469113 -3475724 -2824576 -1352255 342338
13755 342338 1579305 2348917 2602711 2398239 2586427 3415459 3736199 2698045 602653
13746 602653 -2248120 -5028151 -6169047 -5487356 -4378778 -3723434 -3367345 -3448264 -4340898
13737 -4340898 -5226958 -5176327 -5098150 -6204202 -8334479 -10044800 -10352454 -9758656 -8830515
13728 -8830515 -7527724 -6102312 -4955723 -4425648 -4649826 -5236084 -5874806 -6502558 -7014612
13719 -7014612 -7149567 -7001318 -6504425 -5739738 -4997479 -4324653 -3907890 -3670004 -3325952
13710 -3325952 -2522227 -1092689 117060 632419 1245153 2059049 2578574 3084918 3705824
13701 3705824 3750462 2828996 1783951 967847 52845 -862200 -1412648 -1285718 -201604
13692 -201604 1778028 3902855 5662849 6636969 5947155 3201159 -576770 -3208305 -3474667
13683 -3474667 -2473484 -1616851 -1019602 -354034 82088 143132 237153 531268 663672 471907
13673 471907 106352 -313726 -949186 -1765064 -2448039 -2811046 -2469642 -972902 799192
13664 799192 1407039 860236 189039 -32043 183318 533526 520394 -26602 -520985 -586247
13654 -586247 -469562 -221272 566318 1736222 2318667 2053877 1537521 1421603 2069163
13645 2069163 3073337 3649599 3367750 2600410 2140631 2760584 4820888 7300436 8760980
13636 8760980 8757543 7440041 5207792 2775744 579381 -1022688 -1415870 -890778 -206332
13627 -206332 296875 695854 1363663 1911532 1727025 1057910 292444 -544726 -1026648 -438933
13617 -438933 838228 2264944 3571481 4089571 3325016 1264987 -1166625 -2423530 -1968046
13608 -1968046 -384593 1222419 2173141 2583799 2636774 2317803 1918547 2416228 3870182
13599 3870182 5344315 6403810 7125229 7776185 8301934 8550126 8218928 7092005 5688184
13590 5688184 4715264 4382448 4720812 5061425 4500191 3509988 2681209 1637993 569389
13581 569389 -265307 -793103 -938036 -1134925 -1565940 -1899322 -1896498 -1569910 -1264592 -1320874
13571 -1320874 -1376405 -1541048 -1806799 -1780842 -1634567 -1499630 -1012674 -223171 223779 187360
13561 187360 320327 1063321 1945767 2317091 2374931 2221543 1607268 626039 112851 180468
13551 180468 152703 276278 887004 1887780 3024901 3770765 3714910 2946270 1676086
13542 1676086 344446 -417696 -507246 -380910 -611537 -1260305 -2125811 -2928500 -3469130
13533 -3469130 -3442610 -2918174 -2334571 -1979857 -1926481 -2017411 -1657501 -486799 1182964 2563450
13523 2563450 3214854 3295254 3186863 3000852 2803296 2951714 3223073 2775150 1132033
13514 1132033 -827110 -1788316 -1208189 380577 1976361 2731681 3073605 4267053 5929664
13505 5929664 6526094 5546701 3796670 2331355 1641686 1432031 1415372 1739703 2504795
13496 2504795 3140889 2668301 1661917 1259194 1427176 1334908 1036187 1160855 1698433
13487 1698433 2352547 2509730 1702900 468324 -346763 -177567 794816 1887369 2584226
13478 2584226 2552787 1857558 1158263 851379 934805 1238325 750802 -877686 -3120433
13469 -3120433 -4986946 -5361505 -4271230 -2431954 -793898 267148 771993 400762 -676755
13460 -676755 -2494224 -4840064 -6932657 -8020846 -7380174 -5185502 -2866860 -1499121
13452 -1499121 -1204558 -1437621 -1623917 -1694673 -2139453 -3180956 -4220991 -4575280 -4215223
13443 -4215223 -3437138 -2248817 -878621 221586 962950 1632902 2015077 1589292 1221293
13434 1221293 1614069 2336440 3117017 4027145 5379551 6674828 7224855 6793758 5764564
13425 5764564 4298300 2864338 2485408 3056447 3166774 2521825 2412634 2887419 2801785
13416 2801785 2244416 1883399 1880265 2166134 2483010 2562534 2181995 1465412 1233400 1697846
13406 1697846 2176701 1857725 839498 210536 390495 1017138 1472847 1689137 2306061
13397 2306061 3664680 5434898 6843482 6879283 5368701 3400947 1720572 139011
13389 139011 -1181060 -1343362 -380468 660767 873994 533664 239608 329237 1215097
13380 1215097 2578187 3806044 4832799 5729347 6080952 5421816 4060286 3050283 2912993
13371 2912993 3102212 2588665 1146567 -204554 -410791 564270 2089059 3496564 4356835
13362 4356835 4382478 3881991 4080838 5540434 7199417 8234778 8281788 6985566 5193818
13353 5193818 4273673 4238091 4050936 3141584 1969490 1271101 1136388 1212895 896376 -26190
13343 -26190 -664463 -469185 -47710 6075 193298 1219709 2764860 3910865 3970746 3193306
13333 3193306 2682122 2984128 3264140 2795198 2416917 2626701 2708506 2074503 1089947 314890
13323 314890 -109675 -311604 -529664 -1015209 -1917130 -3128852 -4259008 -4661931 -4277692
13314 -4277692 -3186166 -1399808 210078 844520 718163 743916 1686552 3324125 4398183
13305 4398183 3673793 1181959 -1367798 -2020934 -927697 -34344 -80018 -546685 -1023998
13296 -1023998 -1036578 -865183 -1182621 -1541603 -1116995 24339 1382346 2238594 1864747
13287 1864747 791215 138617 291570 834615 1014015 832092 735678 690638 562166 50221
13277 50221 -970025 -1830592 -1993452 -1846813 -1957244 -1808677 -1155288 -460591 213776 1109100
13267 1109100 2388052 3763876 4747310 4699381 3666177 2417445 1482707 1062983 972316
13258 972316 899263 318975 -690720 -1698315 -2791124 -4073590 -5068781 -5361776 -5278442
13249 -5278442 -5214947 -5180105 -5048049 -4894676 -4773105 -4733151 -4791341 -4578566 -4257600 -4092693
13239 -4092693 -3741823 -2844505 -1680136 -515387 391719 556959 265936 55577 -264123
13230 -264123 -970347 -2180272 -3469511 -4146730 -4234990 -4589813 -5259937 -5265241 -4238935 -2602342
13220 -2602342 -1229860 -900875 -1746958 -2736937 -2737555 -2172337 -1548223 -729658 210429 1080650
13210 1080650 1651565 1572408 1285726 1512457 1950094 2445046 2960532 3210639 2844468 1831875
13200 1831875 1030473 1324968 2313239 3280969 3927636 3682231 2658054 2051653 1966368
13191 1966368 1719386 1488429 1761510 2040574 1652301 825548 114860 -557291 -1256760
13182 -1256760 -1354455 -752294 -108338 -212628 -868559 -1199216 -1153855 -1039208 -659296 480185
13172 480185 2254682 3631551 3640939 2601396 1367279 295748 -295616 263022 1408966
13163 1408966 2247440 2981584 3607788 4316432 5143950 5736771 5748610 4981186 3743423
13154 3743423 2807476 2673091 3037791 3326954 3493983 3744121 4209086 4763791 5247061
13145 5247061 5522228 5654087 5953709 5822723 4658532 2921233 1517166 642388 478255
13136 478255 1017245 1699388 2205268 2521338 2672864 2888018 3122397 3060877 2706379 2017278
13126 2017278 1111459 745753 1225491 1783029 1805741 1521056 1734855 2468701 2708687 1990012
13116 1990012 535848 -1233358 -2839048 -3402931 -2511332 -964593 388668 795513 -242772
13107 -242772 -2201648 -3879898 -4588469 -4773508 -4843515 -4799198 -4800440 -4860512 -4887209 -4947390
13097 -4947390 -5004572 -5034125 -5112217 -4940141 -4352936 -3660468 -3158371 -2939304 -3010487 -3001925
13087 -3001925 -2886747 -3272012 -4271901 -5336012 -5560454 -4630705 -3365499 -2269208 -1305048
13078 -1305048 -342357 720326 1838477 3051538 4096639 4467442 4300517 4290770 4442774
13069 4442774 4176254 3239805 1879525 806195 610340 1250112 2076985 2628743 3087227
13060 3087227 3432924 3224568 2472509 1505969 856444 644535 499160 346711 431020 958641
13050 958641 1417856 1098757 531504 458771 885206 1491851 2174341 2465977 2005146 1277808
13040 1277808 1007953 1318268 1547917 1240121 642452 31728 -771404 -2150561 -4132370
13031 -4132370 -6060502 -7010058 -6773585 -5462663 -3475109 -1821113 -1632477 -2928528 -4677263
13022 -4677263 -6003801 -6153199 -5043609 -3713896 -2964156 -2611008 -2068758 -994246 130859
13013 130859 886926 1305528 1530666 1993954 2683940 2894512 2737059 2396037 1855717 1223964
13003 1223964 463391 -147692 -30811 901500 2005245 3148129 4602811 6022422 6615590
12994 6615590 6235458 5626872 5337517 5357108 5348681 5120712 4584932 3887167 3584082 3462359
12984 3462359 2770686 1646474 683125 40187 -329133 -811710 -1804484 -3184315 -4450208
12975 -4450208 -4626053 -3526009 -2188959 -1337543 -637964 149391 789598 926237 701622
12966 701622 523976 861435 1600596 1709682 789921 62869 473416 1484898 2478972
12957 2478972 3260806 3701939 3818312 3773894 3735854 4179452 4786324 4933992 4927104 5126344
12947 5126344 5403258 5398739 5106698 4367767 3058218 1858405 1230234 1027244 734208
12938 734208 78929 -268559 122525 650083 821578 778592 863793 1327100 1949214 2730302
12928 2730302 4008529 5444695 6221416 6217641 5963337 5954842 6097172 5943210 5497905 4869616
12918 4869616 3972859 2691057 878284 -1135649 -2579918 -3105471 -3187234 -3533211 -4091957
12909 -4091957 -4733204 -5283984 -5588235 -5563804 -5236048 -4512433 -3169525 -1459079 -191669
12900 -191669 3480 -901793 -2481679 -4175225 -5736780 -7201511 -8518563 -8957805 -7894432
12891 -7894432 -5734626 -3712365 -2923956 -3275025 -3925833 -4203974 -4109436 -4152576 -4671877
12882 -4671877 -5179355 -4968027 -4162864 -3299336 -2520925 -1846502 -1035156 315072 1983975
12873 1983975 3247438 3420259 3025517 2810615 2834086 2792932 2415314 1670781 766691 304533
12863 304533 603982 1436353 2439502 3408989 4418530 5372087 5984495 6129085 5674774
12854 5674774 4645491 2965235 715905 -1371765 -3208126 -4734857 -5694320 -5925855
12846 -5925855 -5602915 -5436956 -5787585 -6417577 -6547282 -5482822 -3438850 -1609231 -1000499
12837 -1000499 -1614654 -2475739 -3141712 -3440753 -3118895 -2806963 -3019762 -3113486 -1871112
12828 -1871112 279736 1721071 2149459 2229396 2016790 1388695 700751 -86298 -977706
12819 -977706 -995696 434978 2174289 2744561 2104769 849311 -587587 -1763178 -2641266
12810 -2641266 -3426801 -4073612 -3892638 -2516566 -45577 2883311 5179975 6001289 4959660
12801 4959660 2472822 -556289 -3376006 -5473614 -7215818 -8851244 -9484910 -8755467
12793 -8755467 -7282502 -5416735 -3544677 -2183936 -1322297 -676993 59953 826794 1356683
12784 1356683 1689605 2065198 2877685 3494182 2552829 733030 -221172 -56987 284808
12775 284808 142327 -247366 -468832 -403064 -363143 -587112 -617832 -740809 -1440699 -2115657
12765 -2115657 -2155753 -1915507 -1961768 -2697638 -3703002 -4162128 -3885148 -3087769 -1885447
12756 -1885447 -573265 144450 230960 447990 568212 497928 744009 1226713 2056413 3293811
12746 3293811 4474719 5167944 5242468 4831356 4192767 3198844 2121583 1254116 477444
12737 477444 89863 209610 155806 -927311 -2942107 -4396703 -4314881 -3416079 -2456138
12728 -2456138 -1157547 200856 1055472 1581230 1917409 1910240 2001123 2307825 2130525 1285124
12718 1285124 410023 273384 1083085 1696368 736571 -968944 -1983246 -2525573 -3163664
12709 -3163664 -3534098 -2819037 -1828250 -1758687 -2022108 -1788207 -1198223 -319834 479124 408784
12699 408784 -765130 -2534130 -4174283 -4975554 -4262494 -2512091 -1170532 -938398 -1048442
12690 -1048442 -1017412 -1272612 -1970954 -2006839 -942654 706957 2655788 4315988 5239699
12681 5239699 5641028 6195580 7351066 8544790 8731324 8027381 7331319 6475208 5366445
12672 5366445 4148040 2786458 1678568 1146954 928599 612118 640304 1476399 2457923
12663 2457923 2797662 2588797 2232842 1950247 1544788 611309 -362010 -420308 105923 398487
12653 398487 216870 -395330 -1539243 -2792662 -2950018 -1833795 -53070 1383425 1571837
12644 1571837 1188143 991321 818711 1041184 2003318 3043395 3905683 4801198 5315517
12635 5315517 4663148 2698924 452205 -1026282 -1510932 -1289871 -501009 971303 2857338
12626 2857338 4511003 5386342 5676478 6024665 6323053 6323590 6239918 6527544 6784994 6502024
12616 6502024 6317927 6397899 6125795 5128084 3788701 2983047 2923097 3041028 2902785 2471419
12606 2471419 2252097 2029790 1213613 -198731 -2082171 -3613194 -4160836 -4147847 -4470302
12597 -4470302 -5762235 -7832875 -9739492 -10533550 -9880101 -8338703 -7126032 -7117871 -7729363
12588 -7729363 -7517272 -6026018 -3700829 -1092064 740381 797749 -199611 -886495 -1094404
12579 -1094404 -1839766 -3214929 -4306511 -4606066 -4117897 -3192363 -2368500 -1960265 -2156059
12570 -2156059 -3013257 -4543203 -6390109 -7396176 -7513140 -6969226 -6129719 -5588231 -5240281
12561 -5240281 -4650036 -3851850 -2785946 -1499450 -604139 -123203 -120927 -717963 -1812387
12552 -1812387 -3140320 -4293764 -4967786 -4990900 -4391932 -3610153 -3415912 -4177741 -5636792
12543 -5636792 -7517041 -9023087 -9463280 -9015005 -8570876 -8621982 -8504507 -8048690 -7616839
12534 -7616839 -6970627 -5905411 -4619664 -3470079 -2845825 -2467235 -1992766 -1650743 -1366091
12525 -1366091 -947100 -962073 -1559042 -1737291 -901561 33183 -121242 -604701 190632 2289616
12515 2289616 4470235 5955945 6721220 6366035 4734010 2698142 1155186 78339
12507 78339 -900766 -1760237 -2242074 -2427478 -2405402 -1924126 -808373 880310 2329592
12498 2329592 2390680 1273931 282535 64939 227315 -297638 -1991503 -3951564 -5547547
12489 -5547547 -6753475 -7667175 -8553121 -9234678 -8945612 -7353066 -5326461 -3607072 -2976135
12480 -2976135 -4117646 -6812803 -9941550 -12177410 -12827603 -12279267 -11533016 -10817357 -9939365
12471 -9939365 -8956429 -7749001 -6342330 -5145022 -4510300 -4039354 -2991057 -1411460 -463515
12462 -463515 -625489 -598489 775525 3456839 6029689 7251971 7351881 7023515 6878327
12453 6878327 6947521 6325484 4641936 2214191 -249412 -1659910 -1938448 -2201401 -3272350
12444 -3272350 -4601780 -5923906 -7303741 -7705991 -6650552 -4659619 -1988982 493068
12436 493068 1351598 498501 -544384 -133748 1650462 3096182 3423973 3340843 3076012
12427 3076012 2146307 492232 -1462428 -3135147 -4007505 -4430301 -4777328 -4981218 -5256326
12418 -5256326 -5595918 -6018486 -6531154 -6571432 -6033541 -5443264 -4758535 -3985425 -3315357 -2609245
12408 -2609245 -1575147 -171709 921881 965351 45401 -1053030 -1689109 -1742473 -2179771
12399 -2179771 -3742541 -5541282 -6564316 -6633787 -6039200 -4955490 -3568092 -2141055 -873708
12390 -873708 -78908 394899 545683 178757 -280408 -602527 -498111 246932 995145 1230460
12380 1230460 1425430 1712919 1769835 2238056 3886772 5995897 6892701 5838880 3656706
12371 3656706 1282302 -806362 -2772287 -4560700 -5815263 -6763772 -7633033 -8380755 -8761251
12362 -8761251 -8616821 -7841077 -6778879 -5142059 -2729906 -277424 1589726 2522602 2632275
12353 2632275 2606528 3378080 4827528 5522679 4922517 3672682 2250531 1576205 2231958
12344 2231958 3278527 3699972 3328740 2538723 1842388 1834371 2805213 3894168 4249378
12335 4249378 3791371 2670037 1595386 903040 838847 1430093 1958140 1911788 1406066
12326 1406066 926092 21291 -2637770 -6454545 -9062409 -9297125 -7736165 -5399953 -2959269
12317 -2959269 -907754 280610 721589 932279 561091 -189421 -435209 -42890 1145269
12308 1145269 2853334 4351914 4952602 4815438 4683751 4773043 4657939 3583436 1699815
12299 1699815 38536 -618138 -676952 -705211 -951188 -1744955 -2472376 -2059468 -386669
12290 -386669 1481123 2549904 2920669 3089721 3328942 3515763 3526980 3637083 3416392
12281 3416392 2118647 601680 -359471 -1176204 -1812198 -2223682 -2262188 -1626295 -426526
12272 -426526 1294990 3028177 4013884 4149268 3565859 2573227 2111331 2605619 3802543
12263 3802543 5345601 6835587 8112146 8902406 9417229 10068004 10770050 10823825 9667354
12254 9667354 8296425 8060516 9134219 10041958 9514107 8261351 7712878 8090098 8096010
12245 8096010 6799261 4603799 2117233 143291 -605847 41359 1887983 3954870
12237 3954870 4826396 4445246 3912961 4206396 5655864 7365484 7782714 6403985 3951161
12228 3951161 1532964 -156556 -1128387 -1498171 -908317 91683 -18529 -1308934 -2314411
12219 -2314411 -2067347 -888830 610618 1720143 2026219 1655248 1173110 934777 997427
12210 997427 917190 212522 -546426 -489056 217160 1058674 1881793 2120993 1121767 -706592
12200 -706592 -2601873 -3895698 -4946973 -6264263 -7045038 -6659491 -5163467 -3097252 -1198998
12191 -1198998 72085 528576 527322 858600 1342869 1574321 1663924 1406615 509392 -905455
12181 -905455 -2521024 -3625766 -3564341 -2598776 -1962383 -2668545 -3999195 -4513019 -4184080
12172 -4184080 -3766665 -3232282 -2680660 -2655650 -2819870 -2460053 -1898646 -1632135 -1061086 197114
12162 197114 1758730 2565111 1685685 -563898 -3139845 -4429303 -4255377 -4271529 -5060180
12153 -5060180 -5648123 -5273792 -4219253 -2912796 -2294668 -3122308 -4801648 -5179815 -2999798
12144 -2999798 548667 3821080 5931384 6628150 5970090 4490209 3187309 2738196 2993336
12135 2993336 3204691 2778802 2121222 1670261 1218141 946959 1098054 1629928 1947093
12126 1947093 867486 -974520 -2480728 -3757181 -4682827 -4705312 -4040112 -3650156 -3545036
12117 -3545036 -2764230 -956515 780868 1277759 796948 600973 593230 -239755 -1447313
12108 -1447313 -2101166 -1779263 -633522 504622 922567 328418 -743475 -1280139 -1186867
12099 -1186867 -987047 -433736 666204 1691635 2673066 3470936 2907387 862955 -1366977
12090 -1366977 -2511211 -2129246 -1309598 -1262112 -2401297 -4486144 -6617381 -7835454 -8472026
12081 -8472026 -9365698 -10557182 -11368561 -11385353 -10898045 -9454873 -7060265 -5056339 -4117637
12072 -4117637 -3864002 -3834844 -4324582 -4820121 -4732197 -4275055 -3093504 -1305963 -196362
12063 -196362 -183596 -519832 -778004 -1197143 -2151113 -3064162 -3182154 -2681608 -1691653 -528040
12053 -528040 391219 1331147 2135582 2105344 947596 -899199 -2360990 -2463948 -1242139
12044 -1242139 293811 1044102 1308104 2103669 3335989 4197389 4739004 5319106 5574225
12035 5574225 4863431 2955116 634847 -1065877 -1593204 -832037 1082979 3609889 5518174
12026 5518174 5685466 4325475 2386203 909423 497322 741794 1438660 2850983 4451681
12017 4451681 5097213 5011889 5397797 6121930 6119107 4774145 2525242 847450 484700
12008 484700 802290 541644 -717676 -2793658 -5292124 -7239918 -8082307 -7913295 -7150717
11999 -7150717 -6285201 -5808699 -5871214 -6194048 -6227263 -5619349 -4588395 -3417543 -2534018
11990 -2534018 -2315590 -2725207 -3565899 -4249080 -3780843 -2272776 -1125720 -987702 -990975
11981 -990975 -402810 1172533 3254980 4702745 5271935 5705687 6573136 7438940 7839920
11972 7839920 7797520 7332343 6571070 5363799 3545103 1323564 -265366 -96537 1483214
11963 1483214 3762086 5924809 7350019 8620021 10019026 10260924 9038789 6916056
11955 6916056 4208307 1813770 404697 -655209 -2053033 -3770730 -4975231 -4606325
11947 -4606325 -3203248 -2266016 -2280878 -2308334 -1852174 -1277814 -983721 -761056 113757 1097905
11937 1097905 1468351 1761833 2272555 2721236 2918165 3042884 2994137 2924973 3355661 4219484
11927 4219484 4768974 4712466 4518789 4073851 3593918 3579689 3831851 3930225 3686115 3316926
11917 3316926 2919427 2716749 2720184 2448694 1578017 277985 -1355447 -3014302 -4053055
11908 -4053055 -4545425 -5528883 -6795640 -7352721 -7239367 -6370984 -4763849 -2900041 -994313
11899 -994313 736023 1504805 1467064 1437747 1236465 687517 -80149 -1533669 -3251452
11890 -3251452 -4093047 -4547055 -5408428 -6373033 -7322703 -8313364 -8912838 -9040504 -8778294
11881 -8778294 -7865097 -6548291 -5038677 -3377093 -2480060 -2703625 -3651112 -5010760 -6183370
11872 -6183370 -6701482 -6132563 -4956992 -4733488 -5399899 -5678832 -5372921 -5060830 -5171738
11863 -5171738 -5878849 -6711728 -6705967 -5136157 -2793909 -992881 107396 1212159 3129682
11854 3129682 5631219 7480559 7737028 7145625 6568635 6224222 5824478 5543570 5806005
11845 5806005 6517283 7771632 9022752 9425488 9050611 7991391 6064727 3824800 2434807
11836 2434807 2217548 2198002 1253455 -365544 -1565797 -1843405 -1423958 -924783 -401513
11827 -401513 233079 536268 603697 656016 250198 -1036186 -2951909 -4835331 -6318693
11818 -6318693 -7300094 -7292948 -6625486 -6218963 -6359632 -6684434 -6377429 -5297520 -3488130
11809 -3488130 -946945 1525539 2946559 3016567 1891698 -334771 -3190867 -5743379
11801 -5743379 -7196116 -7362514 -6959408 -6487420 -5565928 -4753172 -5338649 -7075509 -8583335
11792 -8583335 -9096457 -8797970 -7570549 -5470636 -3819656 -3437971 -4275857 -6293697 -8926731
11783 -8926731 -11299324 -12725734 -13535758 -13752126 -13176767 -11897497 -9871780 -7956038 -6974912
11774 -6974912 -6488585 -6046088 -5177653 -3132608 -870432 14125 -420431 -1069208 -1254673
11765 -1254673 -338273 1437477 2918191 3590681 3517912 2607518 924385 -949163 -2050452
11756 -2050452 -2163438 -1935693 -1491106 -901833 -188042 534360 588429 -232688 -1552676
11747 -1552676 -2832860 -3923344 -5538577 -7851297 -10085893 -11688302 -12255497 -11691252
11739 -11691252 -11264337 -11639903 -11961837 -12284436 -12951637 -13486382 -13827473 -14514091 -14792131
11730 -14792131 -13953289 -12771856 -12193061 -12611333 -13496915 -13399447 -12050889 -10541579 -9736477
11721 -9736477 -9515556 -8900385 -7995806 -7361089 -7119349 -7184942 -7223251 -7025819 -6655498 -5847048
11711 -5847048 -4423343 -2245271 126408 1085929 -164167 -2753284 -5198610 -6161318
11703 -6161318 -5812910 -5273130 -4785759 -4418143 -4108720 -3295801 -2817148 -3975877 -6170560
11694 -6170560 -7375965 -7125581 -6692559 -6742006 -7083870 -6883618 -6025052 -5449671 -4965383
11685 -4965383 -4060673 -2715334 -962718 730618 1940976 2238826 1991284 1968611 1937000
11676 1937000 1331485 295678 -495660 -1024904 -1103653 -416857 191458 443838 1034407
11667 1034407 1694925 1533535 332139 -1439883 -2964679 -3468892 -3242487 -3101547 -3281801
11658 -3281801 -3942563 -4470919 -3865876 -2204114 -641707 347357 1127120 1935018 2893980
11649 2893980 4122914 5670768 7265624 8460323 8492795 7296416 5807827 4611131
11641 4611131 3900915 3447506 3184668 3551916 3917908 2799514 16636 -2983256 -4555775
11632 -4555775 -4120332 -2085336 335272 1340202 117017 -2264494 -4439988 -5761708
11624 -5761708 -6045251 -5812151 -5736381 -6094490 -6910330 -7651365 -8022134 -7918875 -7324802 -6763722
11614 -6763722 -6645214 -6185504 -4609819 -2860052 -2275961 -3136552 -4918530 -6874912 -8361833
11605 -8361833 -8846774 -8482616 -7750464 -6376756 -4264981 -2219897 -1384622 -2050675 -3565624
11596 -3565624 -5659848 -8346827 -10851821 -12468525 -13182134 -13602970 -14148560 -14357326 -13630067
11587 -13630067 -11603788 -8753374 -6085699 -4026852 -2130628 123376 2415045 3943507
11579 3943507 4394170 3898025 2752525 1407003 87513 -932758 -977876 -311260 30341
11570 30341 -194069 -793328 -1343316 -1559835 -1740343 -1823987 -1581593 -1093862 -758894 -1133614
11560 -1133614 -2215877 -3255878 -3831424 -3843278 -3072093 -1459582 337073 1755690 2586237
11551 2586237 2572973 1918083 1366922 1478054 2123731 3461195 5566146 7799242 9354084
11542 9354084 9688257 8800532 7333650 5933840 4418967 2581657 1636641 1907132 2256016
11533 2256016 2002067 1921213 3331051 5709611 7198225 7117067 6238986 5723076 5937402
11524 5937402 6150834 5689700 4618600 3593279 2641043 1114935 -724385 -1763582 -1533983
11515 -1533983 -664962 -306887 -1197950 -2819108 -4443083 -5997246 -7201473 -7356482 -6217221
11506 -6217221 -4182308 -2067764 -1054494 -1571858 -2261486 -2088633 -1214962 -118710 474702
11497 474702 433274 397287 692085 795043 594114 1456007 4013849 6934532 9007310
11488 9007310 10068037 10017000 9369839 8550173 6971729 4769932 2706077 1468863 777310
11479 777310 -83787 -980428 -1562868 -1744243 -1608599 -1171487 -179688 1081538 2081864
11470 2081864 2483549 2523922 2522852 2092505 854803 -1571556 -4575317 -6660842 -7695226
11461 -7695226 -8458583 -9203152 -9124378 -7879137 -6305532 -4399656 -2036737 -502698 74902
11452 74902 557226 987592 1327554 1865028 2465570 2379879 1388844 -200712 -1866036 -3051370
11442 -3051370 -3711236 -3654152 -2650042 -1126721 478665 1888398 3034805 3821926 4313936
11433 4313936 4951857 5418554 5136670 4330992 3412478 2460936 1441013 806651 730070
11424 730070 963338 1942806 3408883 4088116 3918181 3816240 3791189 3184013 1687959
11415 1687959 -360092 -2427132 -3992146 -4431438 -3989999 -3256194 -2312398 -1598417 -1783042
11406 -1783042 -2368429 -2872057 -3670204 -4452668 -5301010 -6763773 -8269769 -8632085 -7412483
11397 -7412483 -5413381 -3573618 -2698521 -2737405 -3183605 -3760201 -4111730 -4476917 -5272455
11388 -5272455 -6264768 -6980865 -7422211 -7797458 -7405456 -5932161 -4308744 -3469515 -3771073
11379 -3771073 -4964413 -6096615 -6148092 -4618221 -2023203 246152 1433433 2027216 2568232
11370 2568232 2582498 1693029 130677 -1928249 -3633700 -3780417 -2814027 -2058397 -2248947
11361 -2248947 -2938030 -3415290 -3527252 -3525249 -3463429 -3134783 -2379478 -1370726 -633508 -192045
11351 -192045 -71071 -486409 -1058278 -1394415 -1713675 -1963821 -1845422 -1774588 -2114229 -2473301
11341 -2473301 -2647958 -3061553 -3812816 -4315248 -4315891 -4311376 -4525098 -4321242 -3970137 -4003580
11331 -4003580 -3801458 -3213584 -2627303 -2068011 -1735189 -2036278 -3073620 -4774774 -6717785
11322 -6717785 -8335033 -9050284 -8468781 -6640855 -4035620 -1413588 228277 659088 712547
11313 712547 1129831 1999093 3527314 5478783 6764212 7237158 6765961 5395095 3112098
11304 3112098 144077 -2700741 -5225249 -7093652 -7311424 -6058090 -4744183 -3768423
11296 -3768423 -2638748 -1597984 -1380131 -1704327 -1816441 -1781682 -1396167 41740 2067845
11287 2067845 3463737 3966024 4361097 5431463 6566623 6676106 5795295 4251989 2499606
11278 2499606 1251032 689957 877863 1332581 953038 -94532 -1184808 -1964920 -2214663
11269 -2214663 -2194286 -2386137 -3123315 -4205929 -4658689 -4257355 -3687766 -3437409 -3478005 -3361663
11259 -3361663 -2515395 -1086988 471346 1524112 1751014 1794889 2177154 2877731 3265023
11250 3265023 2914163 2276582 1938322 1831798 1768753 1522380 471303 -1538685 -3349697
11241 -3349697 -3996477 -4088003 -4428475 -4453404 -3685551 -3181255 -3402626 -3593076 -3581957 -3691565
11231 -3691565 -3942613 -4267596 -4450675 -4206813 -3839629 -3527011 -3431710 -4456530 -6086514
11222 -6086514 -6392900 -5323485 -4497125 -4445245 -4920187 -5471501 -5571297 -4957928 -4002485 -3343370
11212 -3343370 -2942028 -2362314 -1568749 -1053566 -1336351 -2349671 -3598594 -4505487 -4817268
11203 -4817268 -4905996 -4697239 -4184800 -3695042 -3210470 -2700338 -1878068 -793787 -298790
11194 -298790 -499199 -992176 -1583539 -2227664 -2820407 -3230733 -3118097 -2337960 -1368053 -806715
11184 -806715 -614295 -475155 59869 1249258 2892140 3833693 3084198 1568316 283714
11175 283714 -766945 -1350960 -1020468 207370 1814725 2955415 3912139 5098035 6419261
11166 6419261 7592321 8403193 8938912 9718056 10637814 10998800 10559405 9454726 8223325
11157 8223325 7350942 6787599 6085884 5210130 4400524 3610332 2820680 1721208 16210
11148 16210 -1735101 -2796313 -3551202 -4621776 -5491807 -5714087 -5162689 -3973323 -2754575
11139 -2754575 -2194205 -2287171 -2568804 -3313927 -4448912 -4575024 -3264101 -1919725 -1105702
11130 -1105702 -288996 236850 -84893 -956929 -1443476 -1030848 335296 1681579 1951218
11121 1951218 1914309 2541884 3220285 3287506 2533427 1012369 -811768 -2209187 -2382527
11112 -2382527 -1434065 -349981 184589 353460 763842 1654125 2479718 2337588 1290938
11103 1290938 -3903 -1233827 -2117456 -2071016 -773345 833915 1981184 2602464 2584742
11094 2584742 1989298 1749003 2646419 3751416 3534157 2414193 2083609 3057269 4285959
11085 4285959 4598237 3693722 2111300 603832 -269466 -680555 -808247 -133536 1545856
11076 1545856 3137133 3353574 2090846 54388 -1233316 -848505 800851 2495272
11068 2495272 3221567 2777627 1503761 100997 -1082094 -1613444 -1014746 146350 1193683
11059 1193683 1905900 2108374 1963114 1710727 1337698 882972 520472 18717 -886329
11050 -886329 -2235187 -3737311 -4428283 -3884790 -3150471 -3166578 -3791139 -4542737 -5066820
11041 -5066820 -5087257 -4702051 -4696808 -5094115 -5331452 -5672958 -6380616 -6715482 -6277704 -5833177
11031 -5833177 -5263745 -4215495 -3281929 -2622484 -2293581 -2585873 -3442627 -3915598 -2973581
11022 -2973581 -908186 968193 1722365 1398111 517928 -21365 97399 -12797 -906122
11013 -906122 -2143814 -3315681 -3795830 -2929972 -1226739 256948 1264293 1575327 895234
11004 895234 9979 -650102 -1538744 -2061511 -1746799 -1296592 -961207 -417088 478375 1132142
10994 1132142 1170589 726166 61136 -319308 54014 783906 942144 247267 -493347 -1089385
10984 -1089385 -2066765 -3133301 -4038770 -4652732 -4781052 -4538904 -4555663 -4943693 -5131135
10975 -5131135 -5087846 -5040097 -5048935 -5235580 -5481761 -5667924 -5845921 -5684332 -4402448 -1509889
10965 -1509889 2264639 5036689 6149888 6266622 5851728 5786429 6422929 6846584 6243658
10956 6243658 4997687 4116302 4224685 4710985 4906601 4621450 3392035 1313307 -684340
10947 -684340 -1448579 -591179 682134 1145222 850841 303119 -152241 -338137 -555598
10938 -555598 -1159989 -1802365 -2089758 -1866349 -1272506 -698420 -877662 -1471663 -1512817 -1206649
10928 -1206649 -950523 -559234 241142 1366358 2447498 3639308 5169227 6267910 6645554
10919 6645554 6130526 4768441 3720398 3570458 3954425 4134861 3819431 3217555 2502751
10910 2502751 1819967 1391684 1270944 1490720 2559720 3959465 4245589 2882877 651489
10901 651489 -1130052 -1639392 -1623419 -2243265 -3130616 -3821024 -4159195 -4004800 -3720410 -3746624
10891 -3746624 -4247718 -5031198 -5133326 -4314627 -3602645 -3970568 -5360587 -7095218 -8354361
10882 -8354361 -8584378 -7846911 -6730083 -5692564 -4853246 -4286933 -3917812 -3768114 -4518628
10873 -4518628 -6137596 -7456335 -7740905 -7453524 -7284531 -7170294 -7211524 -7664781 -8627801
10864 -8627801 -9764203 -9637984 -7983118 -6187762 -4713541 -3371795 -2723765 -2532366 -1370130
10855 -1370130 790157 2691136 3035940 1562505 -301965 -973153 -419776 639007 1650264
10846 1650264 2979031 4206845 4115297 3115096 2196428 1375087 825174 745923 867479
10837 867479 1167856 1766273 2268008 2358603 2515198 2926562 3354691 3329978 2399258 773846
10827 773846 -803188 -1772699 -2357551 -2845295 -3415718 -4119095 -4676943 -4772614 -4409256 -3868250
10817 -3868250 -3713493 -3978866 -4646223 -6248526 -8409283 -9996655 -10590927 -10777021 -10902925
10808 -10902925 -10507793 -9190200 -7636910 -6695720 -6092783 -5715093 -6030846 -6847533 -7228936
10799 -7228936 -6575408 -5717358 -5196130 -4402287 -3207027 -2524872 -3141089 -4661754 -6780639
10790 -6780639 -9228445 -11441944 -13187134 -14272894 -14582143 -13708905 -11711154 -9713203
10782 -9713203 -8247982 -7273815 -6630915 -6533802 -7179443 -8208992 -9746476 -11454955 -12018348
10773 -12018348 -10854634 -8615667 -6353425 -4825190 -4299596 -4436720 -4182130 -2814248
10765 -2814248 -571350 1150330 1137428 24145 -779943 -870300 -776733 -1023086 -1409443
10756 -1409443 -1257851 -1396741 -2887639 -5003156 -6464228 -6730154 -6161413 -5209057 -4342722
10747 -4342722 -3791121 -3787500 -4252289 -4632504 -4693915 -4846930 -5419142 -6086732 -6809161 -7927852
10737 -7927852 -9363409 -10436396 -10843696 -10352661 -8886861 -6988660 -5014385 -3648111
10729 -3648111 -3144862 -3184520 -3227246 -2735722 -1741184 -534599 433790 629612 22860 -1018020
10719 -1018020 -2563387 -4273393 -5336307 -5404273 -4712723 -3747406 -2730096 -1846640 -1340560
10710 -1340560 -1099630 -598904 237169 819443 757866 478792 485946 334845 -519619 -1900674
10700 -1900674 -3331791 -4681578 -5704922 -5963671 -5426088 -4360931 -3631117 -3650060 -3684606
10691 -3684606 -3623876 -4202012 -5334534 -6417813 -7409889 -8195156 -8723746 -8720364 -7672688
10682 -7672688 -5946896 -5198358 -5541442 -5836818 -6063931 -6133385 -5488033 -3968731 -2166797
10673 -2166797 -538497 905584 2024687 2781146 2444157 912050 -671689 -1410096 -1351956
10664 -1351956 -1369040 -1899080 -2718208 -3613940 -4636689 -5696926 -6871327 -8557118 -10348665
10655 -10348665 -11098576 -10438346 -9159850 -7858119 -6706638 -5692327 -4018689 -1434576
10647 -1434576 1363397 3325250 3727282 2638394 688854 -1120005 -1988372 -2029901 -2042224
10638 -2042224 -2966484 -4745854 -6562975 -8019509 -9376565 -10749900 -12083888 -13054212
10630 -13054212 -13445170 -13386523 -12649658 -10744727 -7745676 -4842347 -3166844 -2569653 -2438200
10621 -2438200 -2482749 -2474640 -2020208 -1028222 -122804 152888 -306728 -1726162 -3609826 -4896003
10611 -4896003 -4815179 -3815368 -3051215 -2819391 -2906416 -2909178 -2642358 -2026674 -1108298 -1024607
10601 -1024607 -2453286 -4488789 -5907560 -5924952 -4543867 -2931441 -1718339 -224406
10593 -224406 1371162 2548676 3513875 4541441 5360011 5541859 4758306 2440521 -1112047
10584 -1112047 -4206097 -5174553 -4323558 -3502294 -3526566 -3615211 -2901788 -1622447 -924378
10575 -924378 -1700843 -3500013 -5184924 -6346122 -6989506 -6656553 -5370231 -3937944 -3136570
10566 -3136570 -3214645 -4121771 -5776564 -7821896 -9843805 -11250658 -11096427 -9357738 -7299150
10557 -7299150 -6034231 -5692821 -5838344 -5684070 -4621986 -3254669 -2148091 -1302739 -771671
10548 -771671 -423579 -520486 -1059721 -1449212 -1622458 -1953160 -2010637 -1595247 -953787 -440001
10538 -440001 -322595 -393909 -379278 -750590 -2441138 -5223743 -8305436 -11036759 -12223869
10529 -12223869 -11476578 -10136667 -9216095 -9148590 -10254265 -12022784 -13226602 -13340902 -12848267
10520 -12848267 -11986081 -10284665 -7571956 -4819271 -2806359 -1732234 -1532755 -1942138
10512 -1942138 -2741496 -3692376 -4584757 -5012342 -4412748 -3064312 -2023661 -2110649 -3511505
10503 -3511505 -5708520 -7729468 -8839978 -8988119 -8735098 -8522168 -7782250 -6169939 -4713677
10494 -4713677 -4487541 -5156468 -5570161 -4685349 -2747130 -1591060 -2141278 -3175851 -3418981
10485 -3418981 -3072347 -2891285 -3274827 -4289440 -5769172 -6683727 -6380618 -5458980 -4887913
10476 -4887913 -5181300 -5719832 -6158755 -6490833 -6509355 -6953305 -8622284 -10626326 -11626439
10467 -11626439 -11876649 -12078800 -11928560 -11089389 -9657269 -7756120 -5914382 -4866368 -4551844
10458 -4551844 -4426950 -4737326 -5605063 -6034145 -5368084 -4398430 -3634522 -3279392 -3952062
10449 -3952062 -5549815 -7073558 -7301466 -6370258 -5217831 -4428851 -4215891 -4442686 -4952810
10440 -4952810 -5917570 -7588530 -9464538 -10702968 -11397425 -11838034 -12090169 -11857050 -11052398
10431 -11052398 -10251375 -9382272 -8313604 -7489043 -6794871 -6080979 -5501786 -5052763 -4610722
10422 -4610722 -4235449 -4302707 -4941059 -5836028 -6404530 -6521206 -6444926 -6013759 -5638150 -5605588
10412 -5605588 -5174462 -4290845 -3837474 -4827634 -7129288 -9078055 -9741742 -9546352 -8798586
10403 -8798586 -8009054 -7339571 -6873398 -6997403 -7649778 -8269897 -8440581 -8113969 -7273222
10394 -7273222 -6017629 -4740908 -4146945 -4398899 -5301666 -7196248 -9768545 -11882736 -13076171
10385 -13076171 -13305958 -12397410 -10489626 -7908522 -5430117 -4486944 -5382441 -7278582 -8910768
10376 -8910768 -9342380 -8858820 -8111808 -7504871 -7482052 -7692178 -7581474 -7473603 -7225645 -6652817
10366 -6652817 -6068179 -5555874 -5088164 -4355807 -3689240 -3962372 -5258310 -6845672 -7925166
10357 -7925166 -7788877 -6379728 -4380920 -2697958 -1506543 -714811 -644873 -1635220 -3283091
10348 -3283091 -4835798 -6097260 -6940255 -7403875 -7755636 -8496253 -9915257 -11200025 -10768840
10339 -10768840 -8679316 -6611366 -5059626 -3371429 -1255555 901423 2307177 2179976
10331 2179976 915174 -669480 -2432609 -4260301 -6094077 -7184279 -6738790 -5954327
10323 -5954327 -5776419 -5451552 -4721153 -4179107 -3687741 -2694089 -1799755 -2113297 -3329853
10314 -3329853 -3918384 -3293181 -2112945 -1124525 -513446 -363590 -671662 -1230744 -2187679
10305 -2187679 -3841646 -6108403 -8388063 -9987533 -10708664 -10496704 -9405709 -7734977
10297 -7734977 -5813378 -3693554 -1474376 1264460 3994955 5351819 5731290 5391036
10289 5391036 4385649 3038352 1679717 735127 86619 -761296 -1946300 -2892899 -3147632
10280 -3147632 -2934465 -3305809 -4887857 -6939420 -8389654 -8758983 -8313436 -7005126 -4535251
10271 -4535251 -1718671 -106782 -902338 -3897151 -7094074 -8931134 -9433659 -8648288 -7027878
10262 -7027878 -5560491 -4708636 -3814306 -2540458 -1392708 -817016 -891610 -1125992 -1118552
10253 -1118552 -1236913 -1905871 -2703360 -2943416 -2898986 -2660546 -1777849 -444397 388908
10244 388908 398264 199703 691477 2145723 3301977 3079781 1852723 499959 -1052145
10235 -1052145 -2869903 -4532054 -6011221 -7194827 -7341041 -6557545 -5814513 -5198110 -4841298
10226 -4841298 -5008966 -5400102 -5629051 -5053456 -3461662 -1658240 -362016 171408 -205803
10217 -205803 -1858816 -4404214 -6900515 -8929951 -10312674 -10506711 -9460896 -7538908
10209 -7538908 -4742707 -1757338 -147181 -604009 -3024156 -5960412 -7482725 -7565728 -6770094
10200 -6770094 -5517020 -4637692 -4681564 -4587865 -3394923 -1744393 -579908 82906 303058
10191 303058 -399973 -2166821 -4124584 -4854548 -4240570 -3863068 -4601336 -5757946 -6301885
10182 -6301885 -5865060 -4987969 -4465030 -4504322 -4974911 -5775499 -6345767 -6406930 -6091032 -5347219
10172 -5347219 -3922983 -2017101 72500 2389153 4998969 7706463 9579537 9978640
10164 9978640 9390429 8273027 6955224 5654287 4257966 2891415 1792895 833881
10156 833881 -244499 -2039622 -4605548 -7121225 -9373038 -10427736 -9778076 -8110163
10148 -8110163 -6381478 -5006387 -4016304 -3308872 -2493191 -1432642 -477517 -11674 -208905
10139 -208905 -857393 -1432137 -1202806 51116 1659472 2620512 2396905 1765928 1746142
10130 1746142 2016316 1945982 1589027 989246 -226235 -1931838 -3684560 -5517815 -7644101
10121 -7644101 -9676973 -10746894 -10747811 -10086813 -8957337 -7874138 -6799183 -5055752 -3691183
10112 -3691183 -4040365 -5304715 -6425267 -7426404 -8749479 -10309130 -11178915 -10599213 -8950843
10103 -8950843 -7039071 -5370413 -4528424 -5301312 -7396706 -9153271 -9688635 -8944666 -7177550
10094 -7177550 -5279978 -3458874 -1173256 923781 1799614 2032205 1917002 1064398 142574
10085 142574 -385650 -299367 -36150 -451889 -1668538 -2546080 -2137983 -1402221 -1346937 -1837535
10075 -1837535 -1992949 -1295121 -329779 -89188 -602671 -1385594 -2298943 -3037051 -3406986
10066 -3406986 -3748152 -3981124 -4125266 -5118688 -7335078 -9608278 -10510817 -9816274 -8029960
10057 -8029960 -5921409 -4455550 -3789951 -3233324 -2687588 -2670021 -2700308 -2065312 -1253597
10048 -1253597 -1138178 -2017951 -3292891 -4541003 -5462955 -5561102 -4769125 -3273119 -1879809
10039 -1879809 -1211780 -480271 1216911 3230097 4332399 4426838 4225565 4887097 7531678
10030 7531678 12182117 17300378 21219032 24946140 31391412 41901554 56352116 74960230
10022 74960230 100028974 134614852 179618241 230946183 274979675 290953680 271396111
10015 271396111 230936137 187230127 148327440 116005678 90792219 71853359 57637363
10008 57637363 47215662 39931768 35087646 31550548 28692948 26600476 24895852 22654563
10000 22654563 19970328 18244781 18012183 18112623 17620192 16996858 17216684 18061176 19002561
9991 19002561 19853069 20278200 20452916 21079186 21748492 21412905 20300812 19997226 21877650
9982 21877650 25896565 31415555 38840493 48914351 61767000 78413346 100833294 131251848
9974 131251848 171478294 219033305 261621913 280814210 270236317 239420963 202365188
9967 202365188 169114287 142034462 119962575 101485731 85892381 73137857 63089515
9960 63089515 55739551 50237170 45191643 40097249 35167227 31323812 28627901 26249706
9952 26249706 24038295 22208609 20209381 17696867 15067028 12770685 11134990 10475009
9944 10475009 10560071 11002961 11470917 11561528 11195064 10993168 11416698 11993427 12451688 12355005
9934 12355005 10947517 8225341 5506149 4246691 4430961 4943018 5201940 5483947 5900718
9925 5900718 5612783 4032173 2672573 2963830 4445957 6077615 6876318 6625637 6322591
9916 6322591 6768652 6948165 5722041 3472152 993823 -1044543 -2216238 -2653193 -3140684
9907 -3140684 -4161538 -5452983 -6723815 -7578024 -7522050 -6954106 -6179489 -4735210 -2698880
9898 -2698880 -1232777 -868484 -696854 -145205 583120 1584098 2949123 4480564 5612914
9889 5612914 5641424 3947177 1378806 -879156 -1802374 -1241831 -817814 -1749248 -4079961
9880 -4079961 -7118094 -9223029 -9313505 -7824661 -5923598 -4333737 -2898814 -1075326 1187015
9871 1187015 2627198 2238441 544403 -1444532 -2493380 -2173246 -1588588 -1023162 386590
9862 386590 3215611 6415016 8161771 7732204 5922731 3837055 2502405 1880436 1508398
9853 1508398 1750359 2722430 3846401 4154806 3604128 3407113 3952266 4845697 5510641
9844 5510641 4660098 2123474 -282344 -889600 94659 1030937 977790 295277 -437560
9835 -437560 -944796 -1213460 -1252003 -682488 464467 1215470 686389 -596535 -2047009
9826 -2047009 -2767495 -1483800 953587 2997207 4261806 4722751 4888746 6225663 9753257
9817 9753257 15543179 23109968 31634151 41128113 52457766 66513357 83356205 100750774
9809 100750774 113063204 115359473 108988211 98166490 85336812 72381664 60529626
9802 60529626 50141380 41488530 34351137 28271618 23476681 19995988 17449166 15235440
9794 15235440 13397512 12430725 11914838 11140824 9969061 8064738 5308042 2654641 678313
9785 678313 -635856 -1866829 -3844488 -6201100 -8083769 -9173535 -9232754 -8371152 -7063255
9776 -7063255 -5228359 -3353246 -2728399 -3177807 -3409479 -2846883 -1824871 -993797 -285046
9767 -285046 817777 2189821 3951208 5764632 6504696 6131688 5473197 5328650 5494433
9758 5494433 5101535 4405648 3911718 3567149 3138466 2813538 2750391 2605603 2357764 2145060
9748 2145060 1713184 1189770 554160 -580673 -1545256 -2014695 -2551991 -3686282 -5732207
9739 -5732207 -7393086 -7510707 -6591962 -5707672 -5365027 -4588587 -2983679 -1571141 -1134883
9730 -1134883 -1486552 -1897859 -2375978 -2887646 -2915355 -1956775 -132288 1997177 4012093
9721 4012093 4948825 3608126 888746 -1631811 -3971619 -6216859 -7955277 -8366205 -7226850
9712 -7226850 -6078077 -6126654 -7239621 -8521547 -9557120 -10286309 -11050297 -12403953 -14111296
9703 -14111296 -15795745 -17275080 -18370792 -18661698 -17842487 -16129887 -13541286 -9959067
9695 -9959067 -6248463 -3494462 -2346018 -3231745 -5605661 -7657154 -8389893 -8348564 -7701234
9686 -7701234 -6409340 -5130031 -4878144 -5547238 -6297275 -7014332 -8075044 -8843866 -8317265
9677 -8317265 -7506543 -7690807 -8235326 -7471057 -5455686 -4088169 -4341997 -5040653 -4396720
9668 -4396720 -2525970 -674385 483098 278771 -934337 -2339628 -3535600 -4129744 -3811239
9659 -3811239 -2628561 -1801481 -2368826 -3449811 -4359338 -4480847 -3596150 -3247192 -3926865
9650 -3926865 -4956235 -6062793 -6734976 -6588622 -6078306 -6230986 -7119957 -7661505 -7853644
9641 -7853644 -8444314 -9437187 -10091212 -9746755 -8927350 -8478853 -8605615 -9398954 -10161602 -9763374
9631 -9763374 -8335412 -6150773 -3327534 -732634 130048 -1054638 -3345509 -5489562
9623 -5489562 -6662123 -6628513 -5319611 -3086277 -748017 1059454 1589877 839548 177164
9614 177164 250637 753513 753979 300157 314279 814973 1175891 1695301 2945627 4362695
9604 4362695 4539526 3075341 1549224 1237056 1746723 2307972 2443345 2106001 1681474
9595 1681474 1811071 2417751 2223450 859458 -417393 -1273508 -1565026 -724846 779143
9586 779143 2304469 4179263 6827424 9294309 9957423 8527069 6307210 3894377 1859803
9577 1859803 1352662 2527799 4278506 5202618 4604913 3610200 3277738 3244588 3271383 3402134
9567 3402134 3595046 3766812 3990121 4575068 5467832 5883838 5083832 3897478 3626727
9558 3626727 3984145 3923235 3637022 2960161 1531930 111662 -339452 254408 552621
9549 552621 -123947 -1220727 -2037513 -2419839 -2758133 -2648682 -1270925 368189 1063407
9540 1063407 940729 166720 -1123971 -2562027 -3820537 -4549052 -4572220 -3779381 -2092058
9531 -2092058 -772965 -905325 -1427663 -1501498 -1091949 104703 1991826 3818069 4973149
9522 4973149 5581985 6040934 6629260 7541026 8588517 9380406 9142586 8111193 7268638
9513 7268638 7488276 8287849 8700097 8414635 7431666 5648480 2874679 -624916 -4182885
9504 -4182885 -6570246 -7191811 -6571644 -5587658 -4826693 -4079593 -3201883 -2624656 -2122145
9495 -2122145 -1230894 -243678 820449 2241994 3978122 5879787 7043003 6608190 4896376
9486 4896376 2801563 737494 -925651 -1116930 -383184 -498208 -1862113 -3496162 -4782820
9477 -4782820 -5214095 -4884799 -4703336 -4687933 -4426540 -4313776 -4737758 -5560101 -5421436 -3288962
9467 -3288962 -661538 979537 1856399 2044571 928190 -549843 -765209 -150486 693570
9458 693570 1946987 3298995 4397139 5231654 5236802 4294192 3587453 3179963 2603623 2099273
9448 2099273 1922973 2125387 3265865 4606709 4558802 3022725 1485059 887857 1013375
9439 1013375 1470206 2477342 3496499 3411167 2510954 1800329 1056841 -502004 -2394636
9430 -2394636 -3337480 -2392613 -177007 1492247 1751862 1305048 1172990 1345009 1308681
9421 1308681 896443 642706 1352698 2460403 2064090 -273222 -2975764 -4814241 -5816284
9412 -5816284 -6401595 -6424633 -5750006 -5366794 -5398865 -5019509 -4821176 -5382063 -5741929 -5086324
9402 -5086324 -3770529 -2075981 272018 2961278 4920541 5457356 4673972 2549160 -1091177
9393 -1091177 -4866606 -7500029 -9075811 -9518802 -9155670 -8558497 -7509490 -5700505 -3257479
9384 -3257479 -935216 821137 1898882 1968230 1023946 -684140 -2326883 -3359290 -3771112
9375 -3771112 -3522818 -2498414 -1328142 -1182484 -1410249 -263058 2258163 4555776 5619800
9366 5619800 5606235 5177771 4688317 3635640 1192659 -2216760 -4943561 -5930849 -5644523
9357 -5644523 -4992124 -4249361 -4104641 -4673520 -5218619 -5975123 -7051127 -7546619 -6745565
9348 -6745565 -4723659 -2351812 -1161165 -1524866 -2838214 -4124711 -4428455 -4259718 -4018253
9339 -4018253 -3286697 -2594027 -2482300 -3136727 -4991745 -7786247 -9972899 -10377599 -9164636
9330 -9164636 -7353227 -5715676 -5171649 -6068571 -7046366 -6777581 -5378088 -4130793 -4024229
9321 -4024229 -5367044 -7393059 -9050467 -10320578 -11150504 -11121625 -10778300 -11123980 -11295765
9312 -11295765 -10480725 -10276330 -11740954 -14258861 -16499683 -17151217 -15710543 -12576254 -8992657
9303 -8992657 -6137728 -4366476 -3946747 -4847594 -6003740 -6632776 -7009414 -7729399 -8545000
9294 -8545000 -8511138 -7597493 -6505662 -5416556 -4587519 -4435626 -5145627 -5930021 -5665520
9285 -5665520 -4673590 -4274456 -4283711 -3709890 -2520983 -1517758 -1743401 -3492027 -5660521
9276 -5660521 -6871171 -6836059 -6245154 -6386864 -7176508 -7003092 -4959541 -1787919 1741477
9267 1741477 4710625 5863224 4425211 1712144 -83646 18660 982758 1078667 -350444
9258 -350444 -2336134 -3859257 -5582939 -7783514 -8825791 -7627152 -5113488 -2724611
9250 -2724611 -1756013 -2677544 -4390896 -5855199 -7108210 -8357181 -9761674 -10946506 -11300446
9241 -11300446 -10479282 -9526260 -8825373 -7183505 -4325868 -1818240 -959570 -1338511 -2099331
9232 -2099331 -2751433 -3222828 -3850543 -4792000 -6183534 -8077114 -9677944 -10286260 -9920428
9223 -9920428 -9334976 -9405197 -10232775 -10759338 -10125147 -8089017 -5308583 -3263399 -2475001
9214 -2475001 -2185368 -2038662 -2482371 -3347220 -3889457 -3286641 -2298840 -2162973 -3647498
9205 -3647498 -6366961 -8738148 -9881080 -9799878 -8826539 -7514297 -5999193 -4490778 -3446804
9196 -3446804 -2745054 -2077186 -1687027 -1558264 -1084624 -623008 -1364657 -3223495 -4771378
9187 -4771378 -5583799 -5623126 -4351983 -2755890 -2221897 -2523858 -2740275 -2818805 -3024568 -3917953
9177 -3917953 -5571707 -7202713 -8913646 -10602213 -11036370 -9794745 -8224716 -7161666
9169 -7161666 -6247402 -5195208 -3494238 -974855 1328604 2370626 1706364 -426404 -2945195
9160 -2945195 -4474313 -4750012 -4784645 -5141691 -5436145 -5946809 -6375448 -6177200 -5635434 -5111565
9150 -5111565 -4877973 -5358610 -6271484 -6979839 -7655656 -8228997 -8696093 -9320498 -9990374 -10329172
9140 -10329172 -10035516 -9318903 -8831128 -9000753 -9611622 -10431141 -11291794 -11996967 -12274028
9131 -12274028 -11890323 -11085216 -10001537 -8436696 -6741617 -5646135 -4870667 -3405601 -1239221
9122 -1239221 662105 1813976 2403550 3332557 5139939 6417269 5554235 3099481 1289497
9113 1289497 589722 -71182 -1041603 -2291710 -3848976 -5341619 -6596210 -7019593 -6234535
9104 -6234535 -5256685 -4836057 -4358918 -3510371 -2667298 -1856039 -1475556 -2068941 -3559348
9095 -3559348 -5259014 -6264131 -6213295 -5219887 -3704007 -2456040 -1956817 -1421440 -210297
9086 -210297 1030748 2088309 3335229 4718175 5910732 7344108 8526447 8157361 6404327
9077 6404327 4322817 2547777 1203435 -134598 -1612103 -2770793 -3131631 -2395405 -936374
9068 -936374 -13106 -572285 -2096412 -3568026 -4319345 -5187715 -7075373 -8702484 -8657462
9059 -8657462 -7356454 -5917307 -5215967 -4873963 -4207184 -3317390 -1949643 -413124 423979
9050 423979 215347 -509711 -1259486 -1706349 -1362405 -853812 -1503422 -2890220 -2984671 -1915373
9040 -1915373 -1243489 -1108046 -718294 -192108 -432238 -1292691 -1869656 -1679803 -1383879 -1337901
9030 -1337901 -793204 1000489 3559402 5792725 7165659 7719030 7176705 5511573 3473090
9021 3473090 1787939 1106955 1064292 404036 -734644 -1139858 -650027 -131396 533394
9012 533394 1693158 2737834 3435047 4606830 5802444 5671706 4237048 2124076 -326532
9003 -326532 -2884633 -5395915 -6953808 -7074865 -6313954 -5304046 -5510775 -7112524 -7937700
8994 -7937700 -6711579 -4003474 -1061206 1182924 2650856 3413700 3291492 2428489 887096
8985 887096 -993557 -2365630 -3152184 -4029614 -5046773 -4886442 -3546692 -2399445 -1721070
8976 -1721070 -1393461 -1605300 -2274380 -3368491 -4463648 -4581504 -3331121 -1672346 -539148
8967 -539148 420385 1876326 3754450 5731475 7179098 8296579 9128932 9369061 9258543
8958 9258543 8907420 8879002 9365371 9527401 8138115 5613141 3495014 2481095 1794140
8949 1794140 446526 -1591226 -3934286 -5711571 -5754440 -4347746 -2881691 -2151034 -2009748
8940 -2009748 -2356734 -3484667 -4750428 -5059680 -4116811 -2533349 -1346448 -1107590 -1368319
8931 -1368319 -1479011 -1066334 -308818 76067 -403823 -1490127 -2151249 -1712977 -631027
8922 -631027 -215805 -475202 -723267 -1411678 -2852624 -4805834 -6977054 -8726190 -9644489
8913 -9644489 -9925801 -9626560 -8097911 -5014700 -1150512 2426703 5050844 6812730 8382034
8904 8382034 9974779 11159476 11691324 11023974 8855529 5577355 2279514 -109857 -1407243
8895 -1407243 -1419055 114449 2667580 4471230 4323541 2936912 1408432 432119 17440
8886 17440 222631 820254 1243122 1962284 2981486 3546171 3275236 2727169 2375906 2254366
8876 2254366 2561376 3105166 3510940 3210810 2195411 1271955 931799 803601 -48005
8867 -48005 -2060217 -4225780 -5416715 -5249000 -4341515 -3218925 -2521652 -2968556 -4482485
8858 -4482485 -5536824 -4920732 -3495074 -2191542 -806116 766272 1570964 905867 -25560
8849 -25560 -201643 -139579 -611741 -1399418 -1874054 -2853910 -4662699 -6559097 -8005315 -8631596
8839 -8631596 -8572768 -8215934 -7503979 -6487082 -4960157 -3695000 -3374641 -3190799 -2439712
8830 -2439712 -1725460 -2359745 -4469927 -6707343 -7846454 -8090205 -8158445 -8338554 -8754022
8821 -8754022 -9177025 -8593366 -7076131 -5951208 -5855917 -6583534 -7773747 -9148150 -9891324
8812 -9891324 -9258672 -7576452 -5844351 -5219066 -5927548 -6875361 -7276564 -6831803 -6105953
8803 -6105953 -5968212 -6423910 -6870547 -7037398 -7720686 -9145139 -10429361 -10499192 -9352383
8794 -9352383 -8403060 -8014905 -7783861 -7294732 -6515984 -6259503 -6653620 -6978807 -6533828 -5052847
8784 -5052847 -3310811 -2478067 -2558571 -2643022 -2914339 -3725992 -4295313 -4428354 -4468300 -4527851
8774 -4527851 -4519668 -3816181 -2494724 -1144130 371287 1405810 1314491 823937 203677
8765 203677 -133459 -19986 -816541 -2507579 -3453940 -3082439 -2123832 -1072554 -87792
8756 -87792 435139 115084 -302943 30773 585503 300831 -1037847 -2529534 -3925553
8747 -3925553 -5291295 -5568373 -4157912 -2412934 -1403468 -905295 -698028 -357061 -265833
8738 -265833 -1317784 -3258014 -5337135 -7049466 -8203664 -9049783 -9927223 -10686971 -11420268
8729 -11420268 -12279758 -12717152 -12635015 -11958295 -10708026 -9169864 -7507759 -6789279 -7464661
8720 -7464661 -8166890 -6948836 -4107459 -2146505 -2032935 -3082134 -4396740 -5221744 -5338160
8711 -5338160 -4523827 -3230989 -2990337 -4514852 -6492775 -7301323 -6745276 -5671246 -4730221
8702 -4730221 -3982551 -3337877 -2931580 -2465528 -1421758 -144754 1003668 1455055 391188
8693 391188 -1566127 -3359230 -4493297 -4488120 -3494023 -2085292 -168304 1876204 2979941
8684 2979941 2694777 1422422 413922 513103 1441792 2363856 2622832 1852031 400465
8675 400465 -1596444 -3598922 -3919295 -2758810 -1815124 -1122631 -71694 1064518 1853305
8666 1853305 2484822 3214899 4155161 5544151 7253703 8792121 9190400 7704238 5326170
8657 5326170 3840159 3259311 3107394 3712674 4550598 4495865 3061094 409128 -2522066
8648 -2522066 -4295935 -5117606 -5977139 -6545247 -6786497 -7022266 -7219291 -7204159 -6481896 -5263124
8638 -5263124 -4903012 -5406699 -5368090 -4126270 -2092360 -392900 629202 1748180 3090629
8629 3090629 4378667 5310306 5718792 5678309 5436075 5277116 5661647 7043898 8603972
8620 8603972 9172404 8862834 8477616 8453825 8567705 7562292 4445033 -159385 -4627493
8611 -4627493 -7830699 -9162694 -8491662 -6641283 -4872221 -3729697 -3064279 -2259657 -1226444
8602 -1226444 -518629 -590347 -1556275 -2711888 -3139583 -3011432 -2788102 -1956140 -616732
8593 -616732 809868 2542656 3983663 3986926 2481694 586646 -503341 -186248 1070199
8584 1070199 2576163 3939484 4581356 3952722 2525150 1164502 -427165 -2244215 -3872002
8575 -3872002 -5054171 -5510649 -5167524 -4946235 -5478803 -5946618 -5494577 -5018448 -5630989
8566 -5630989 -6909645 -7892736 -8421207 -8650973 -8117022 -6813358 -5071992 -3156545 -1624117
8557 -1624117 -1279491 -1550619 -1073949 373074 2098290 3267402 3814187 4224083 4403479
8548 4403479 4154783 3428923 2154128 177640 -2163291 -4367076 -6144115 -7104165 -6904058
8539 -6904058 -6126983 -5839032 -5941583 -5794198 -5414949 -5421466 -5707651 -5537939 -4401474 -2367782
8529 -2367782 -372757 539960 342978 -438539 -1908653 -4223262 -6159739 -6215740 -4479116
8520 -4479116 -2085903 -821404 -1546224 -3045305 -3955380 -4345666 -4478905 -4286751 -4220599
8511 -4220599 -4064120 -4023393 -4603407 -5253532 -5757103 -6621757 -8119700 -9936089 -11693730
8502 -11693730 -12990658 -13754150 -14515263 -15361513 -15505386 -14676981 -13785157 -13379769 -13099674
8493 -13099674 -12359980 -10908051 -8900473 -6863197 -5171071 -3948081 -3485824 -3433403 -3128876
8484 -3128876 -2532211 -2459218 -2598058 -2035112 -1530795 -1617359 -1641418 -1283863 -407896 666925
8474 666925 1239572 1776659 2840257 3616062 3560755 2995472 2177063 1042017 -982160
8465 -982160 -3529071 -4900913 -4970195 -4694153 -4087590 -2661265 -927992 -108161 -604634
8456 -604634 -2387421 -4600771 -5971443 -6851534 -8366225 -10548143 -12533565 -13435279 -13258125
8447 -13258125 -12161165 -9560819 -5411833 -1167868 2064775 4211044 5440528 5234671
8439 5234671 3349829 958167 -439080 -218704 970898 1829830 1382302 -243740 -1735928
8430 -1735928 -2415584 -2686261 -3216593 -4040181 -4346961 -3192478 -970555 1511492 3773352
8421 3773352 4973158 4385854 2645393 829337 -406837 -469958 223390 1006576 1812385
8412 1812385 2072901 1182410 -54422 -887237 -1136031 -843458 -478218 -501105 -742723 -668790
8402 -668790 -18548 261345 -406426 -1373151 -1736015 -759847 704683 971702 -552978
8393 -552978 -2912464 -4339468 -3872231 -2558588 -1679313 -1542771 -1673054 -772555 1002543
8384 1002543 2177672 2410790 2315740 2110773 1884609 1884436 1986309 1759609 1278659 1405523
8374 1405523 2286422 2979978 2922461 2624897 2595585 2765015 2509883 1562736 214488 -1323280
8364 -1323280 -2758881 -3878587 -4532713 -4577865 -4122627 -3124065 -1907204 -1588329 -1777535
8355 -1777535 -1366074 -389363 630721 1119245 960511 448405 -263916 -891912 -1372485
8346 -1372485 -1844599 -1984519 -1300246 88367 1230091 863896 -1113069 -3819106 -6166295
8337 -6166295 -7452142 -7839927 -8123779 -9273459 -11202017 -12573198 -12385130 -10901606 -9191328
8328 -9191328 -8367684 -8383188 -8248497 -7308493 -5613622 -3972354 -2957174 -2482405 -2405331
8319 -2405331 -2319493 -2026846 -1558212 -972693 -495138 136689 1263220 2531265 3452934
8310 3452934 3629676 3393420 3278399 3088517 2665644 1970685 1200975 44566 -1614178
8301 -1614178 -2285892 -786195 2251509 5122260 6168913 5141702 3172018 1353159
8293 1353159 -12253 -53215 1748472 3800252 4536987 4206260 3691137 3151316 1892041
8284 1892041 -663820 -3753118 -6119504 -7371603 -7008027 -4766916 -2125754 -666458
8276 -666458 -615322 -1456606 -2803902 -3817770 -3793975 -3033085 -2016209 -838685 1199393
8267 1199393 4310363 7402893 9034312 8592645 6211208 2115717 -2453996 -5472913
8259 -5472913 -5854616 -3441612 826572 4947635 7667822 8568295 7771458 5941480 4158818
8250 4158818 2790048 1269653 -159397 -900549 -777421 44774 1080508 1990563 2732496
8241 2732496 2975304 2733218 2929967 4419408 6941839 9565561 11595279 12052932 10665668
8232 10665668 8751908 7015319 5219601 3539835 2960465 3787051 5132906 5661548 4483234
8223 4483234 1862575 -992529 -2596593 -2855626 -2530816 -1705417 -305965 931689 1164699
8214 1164699 766306 760650 940160 571164 182566 186757 298978 -128006 -872309 -1207865
8204 -1207865 -1336390 -1763008 -2213221 -1819594 -642291 542634 715455 -611373 -3171848
8195 -3171848 -6321766 -9498707 -12081439 -13394584 -12744833 -10306538 -7765279 -6596943
8187 -6596943 -6610406 -6816019 -6556368 -6384922 -7264714 -9229718 -11290579 -12445937 -12551553
8178 -12551553 -12015803 -11151230 -10400268 -10093203 -10253516 -10572178 -10396689 -9600822 -8324158
8169 -8324158 -6977421 -6260585 -6153742 -6487008 -7086014 -7568681 -7583105 -6640013 -4381053
8160 -4381053 -1321925 1721314 4153885 5076761 4072560 1959254 239617 -415054 -509476
8151 -509476 -956813 -2233887 -3724928 -4617767 -4925819 -5052400 -4832684 -4188014 -3503712
8142 -3503712 -3452500 -4239505 -5077858 -5114470 -4476213 -3608684 -2828913 -2789682 -3550690 -4479040
8132 -4479040 -5636196 -7072184 -8097936 -8609424 -8992644 -9401282 -9477175 -8780759 -7653560
8123 -7653560 -6424903 -5134430 -4016850 -3221160 -2675321 -1927474 -469449 1364797 2711416
8114 2711416 3641493 4292329 4007728 2494990 764869 -59559 -241782 -1072118 -3134139
8105 -3134139 -5806099 -7772327 -8223647 -7297760 -5676508 -4499676 -3784362 -2927096 -2620316
8096 -2620316 -3345801 -4676343 -5664425 -5482583 -4730529 -4435039 -4813783 -5452416 -5781460
8087 -5781460 -5444732 -4351838 -2981844 -1949283 -1225360 -559917 -312106 -561760 -778529
8078 -778529 -813210 -292873 1195554 2767821 3454232 2798268 968215 -1109520 -2799510
8069 -2799510 -4125084 -4931970 -4377162 -2169660 281186 1429611 1290554 558664 -383277
8060 -383277 -949345 -551051 472592 1393510 1828954 1373377 275896 -148987 718669
8051 718669 2668087 4967568 6504086 6245670 4072241 783318 -2833769 -6268400 -8476183
8042 -8476183 -8373563 -6182443 -3278799 -840348 476286 768718 758720 1037078 1558184
8033 1558184 1892059 2396102 3441126 4894601 6190186 7007253 7057195 6063575 4416182
8024 4416182 2796609 1941715 1891772 2135916 2383670 2679051 3078261 3868898 4852006 5411499
8014 5411499 5031387 3693750 2215771 1072057 598487 1180016 2557787 3941718 4027418
8005 4027418 2833799 2340591 3325550 4637117 4989024 4311339 3715645 3361306 2359986
7996 2359986 705959 -1329297 -3042939 -3656358 -2691992 -663215 1274028 2674250 3147775
7987 3147775 2956802 2547516 1459177 396938 473783 1296113 1815412 1733359 1131768 -212348
7977 -212348 -2043982 -3122156 -2951278 -2253309 -1785691 -1380224 -1001702 -671859 -189055
7968 -189055 197070 638082 1766625 3021186 3881246 4789571 5413001 5305421 4569969
7959 4569969 3883294 3659373 3529066 3217396 2666134 1317612 -557596 -1869807 -2440407
7950 -2440407 -2886204 -2896557 -1790191 255375 2666816 4560325 5244665 4479738 2920267
7941 2920267 2092442 2528191 3609441 4105525 3467301 2183403 636848 -882022 -2060870
7932 -2060870 -2835407 -2640895 -1616533 -860759 -812547 -1074166 -1572264 -2117573 -2245837 -2120536
7922 -2120536 -2558607 -3496358 -3829961 -3621646 -4190673 -5022495 -4677136 -3904899 -3769436 -3961425
7912 -3961425 -3971207 -3782208 -3411515 -2652969 -1579534 -628985 -503555 -1142019 -1801087 -2217711
7902 -2217711 -2446429 -2788151 -3180889 -3278849 -3135866 -2254233 -181057 2355328 3724351
7893 3724351 3614200 3323199 3114187 1919401 -382454 -2646903 -4213286 -4673829 -4092712
7884 -4092712 -3686041 -4454343 -5839523 -7336450 -8683710 -8908460 -7803675 -6494838 -5786096
7875 -5786096 -5442146 -5240213 -5310743 -5834453 -6992306 -8419169 -8975804 -7414099 -4346788
7866 -4346788 -1752951 -472976 -86166 -338510 -1706502 -4216546 -6730840 -7630786 -6359967
7857 -6359967 -4189538 -2473005 -1393540 -542118 484477 1902927 3135431 3280395 2011240
7848 2011240 -150557 -2288400 -3885252 -4726339 -4402778 -3024667 -2158919 -3083515 -5519482
7839 -5519482 -8307832 -10504661 -11717051 -11784679 -10667217 -8641575 -6507313 -4882891 -4094164
7830 -4094164 -3923067 -3815207 -3203942 -2429437 -2269496 -2683427 -3271768 -4035354 -4987846 -5551425
7820 -5551425 -4919545 -3150939 -1541520 -809371 -444419 -150664 -99305 -556205 -1690825
7811 -1690825 -3097531 -3921413 -4049908 -3658932 -2697479 -1635692 -874261 -256090 519686
7802 519686 1124188 1047226 776730 656644 278690 154656 576230 662110 -211610 -1584769
7792 -1584769 -2788875 -3824807 -4113204 -3077020 -1538493 -156871 1615115 3596709
7784 3596709 4292334 3045084 657762 -1610266 -3409241 -5202771 -7359127 -9386397
7776 -9386397 -10181105 -9372171 -7897643 -7245796 -8030110 -9202806 -9724713 -9673923 -8844413
7767 -8844413 -6947166 -4635643 -3032325 -2757356 -3730249 -4803078 -4644316 -3365541 -1742477
7758 -1742477 83883 1638323 1954648 908884 -1080282 -2632273 -2711154 -1664607 -97083
7749 -97083 1221177 1833157 1777106 1430180 602273 -1469866 -4307295 -5961681 -5939440 -5595505
7739 -5595505 -5722908 -6144009 -6475498 -6638416 -6483754 -6080104 -5764486 -5354229 -4467073 -3013631
7729 -3013631 -1767318 -1194724 -934960 -470403 263675 974505 1303640 793796 118507
7720 118507 449946 1523452 2435998 2942288 2715311 1187264 -1124233 -3133412 -4348279
7711 -4348279 -4601884 -4620748 -5415966 -7018992 -8430166 -8494313 -7539623 -6425104 -5644954
7702 -5644954 -5857575 -6393855 -5991247 -4724788 -2981133 -1675366 -1274187 -1179141 -1341785
7693 -1341785 -2081428 -3094944 -3563454 -3348635 -2544487 -854278 1319802 2761967 3083636
7684 3083636 2672360 1792810 245451 -1566210 -3093897 -4702577 -5973924 -6105470 -5678819
7675 -5678819 -5233806 -4457591 -3419421 -2758871 -2837356 -3107224 -3178293 -3055555 -2796692 -2559096
7665 -2559096 -2195041 -1339705 -379540 -227367 -719923 -972405 -369588 805067 1725300
7656 1725300 2282276 2459342 2180972 1666819 706952 -920833 -2688785 -3749980 -3672129
7647 -3672129 -3138307 -3530125 -4715832 -5745702 -6667634 -7411693 -7350640 -6443971 -5464887
7638 -5464887 -4827596 -4303614 -3712863 -3014674 -2095964 -1799214 -3138628 -5211148 -6311108
7629 -6311108 -6019571 -4627650 -2624202 -1032207 -467252 -540373 -651676 -818348 -1265595
7620 -1265595 -2247613 -3611605 -4815026 -4761362 -2865770 -678866 511345 875350 849595
7611 849595 999170 806550 -304829 -1776350 -2721383 -2951727 -2885449 -2476996 -1802001 -2184745
7601 -2184745 -3749511 -4907463 -4580606 -3045727 -1131873 73046 20838 -459110 -212341
7592 -212341 636416 1139940 963392 37004 -1680088 -3673474 -5017566 -5452575 -5208762
7583 -5208762 -4457025 -2945768 -1182018 -71989 378372 537741 1123201 2604785 3940630
7574 3940630 4268528 3482674 1944606 -201148 -3327087 -6078978 -7086883 -7751624 -9493838
7565 -9493838 -11474111 -12384621 -11890608 -10133588 -7581297 -4943758 -2786854 -1188737 -156235
7556 -156235 -132622 -1149592 -3017836 -5205894 -6928212 -8145723 -8682356 -8383489 -7640221
7547 -7640221 -6549464 -5593818 -5586190 -6751218 -8089940 -8442856 -7399203 -5178848 -2473283
7538 -2473283 -29768 1564607 2233331 3029466 4702808 6233365 6630735 5873214 4267645
7529 4267645 2780578 1943235 1281802 562970 23675 -87951 -267546 -559042 -692582
7520 -692582 -730783 -699181 -750105 -1150998 -2193348 -3780660 -5007280 -4689415 -2636265 -775357
7510 -775357 -735737 -1657939 -2495323 -2848172 -2800157 -2485573 -1817790 -1556549 -1890487 -2321262
7500 -2321262 -2282907 -1626139 -751223 74365 677530 766317 469181 283762 -56001 -1070991
7490 -1070991 -1934726 -1830737 -1598782 -2775241 -4834817 -5787312 -5314218 -4282644 -3194821
7481 -3194821 -2108838 -1232263 -857368 -1063631 -1578704 -1830978 -1396071 -800317 -716270 -778789
7471 -778789 -378961 291537 1411747 3348227 5517997 7094647 7431477 6479549 4900739
7462 4900739 3686956 3474213 4100281 4617252 4515997 4421605 5141571 6912812 9229443
7453 9229443 11460601 13068017 13462085 12805597 11436885 9179325 6234166 3095248 305982
7444 305982 -1668768 -2988086 -4119907 -5036620 -5423822 -5302784 -4741839 -3647426 -1894150
7435 -1894150 159341 1982509 3748298 5315729 6111447 6188651 5874834 5643042 6060953
7426 6060953 7159453 8092315 8352426 8486987 9079984 9616892 9217793 7797045 5807904
7417 5807904 3427244 741930 -1808534 -3548873 -3913221 -3403052 -3103572 -3126201 -2747611
7408 -2747611 -1491826 598050 2725964 3774215 3546820 2613837 1449171 1138640 2273990
7399 2273990 4142841 5239734 4711548 3303728 2948884 3504054 3390662 2511577 1731962
7390 1731962 1949050 2708628 3017913 2927627 3082659 3951477 5685708 7775858 9293124
7381 9293124 9550393 7949371 4833640 1641259 -555534 -2245536 -4298352 -6453104
7373 -6453104 -7694663 -8006124 -8181488 -8040426 -7212953 -5879446 -4717317 -4088267 -3436341
7364 -3436341 -2479944 -2246867 -2970889 -3462700 -2700914 -303572 2254386 3057191 2110093
7355 2110093 1056394 1212051 2204783 3248633 4002986 4314621 4241289 3434732 1792428
7346 1792428 -3645 -1558489 -2637278 -3212867 -3535359 -3310118 -2633483 -2427810 -2801123
7337 -2801123 -3208697 -3754584 -4336690 -4081457 -3292299 -2631575 -2322745 -2365111 -2411998 -2409410
7327 -2409410 -2295459 -2226155 -2658543 -2965211 -2541567 -1875207 -1298365 -1003040 -1044634 -909775
7317 -909775 95912 1749353 3009088 2983758 1771128 353909 -708714 -1442772 -1753530
7308 -1753530 -1488567 -800273 -331416 -759618 -1635803 -2032229 -2267906 -2246798 -1278416 283042
7298 283042 1915541 2961781 2258757 183131 -1329802 -1973398 -2918353 -4216334 -5194179
7289 -5194179 -5817783 -6479524 -7427014 -8406913 -9188851 -9866698 -10170498 -9631953 -8431945
7280 -8431945 -7120521 -5469518 -3540653 -1547750 552030 2104791 3056910 4011945 5170926
7271 5170926 6431037 7380085 7713284 7554429 6816043 5687913 4311450 2548046 1182157
7262 1182157 1369225 2569171 3520269 3467372 2408720 1191699 562790 483209 658278
7253 658278 1142510 1784309 1610169 407042 -821393 -1578704 -2086324 -2405915 -2097178
7244 -2097178 -994216 525604 2258489 3622899 3652006 2584679 1191791 -324202 -1788284
7235 -1788284 -3026476 -3457447 -2970362 -2205638 -1433551 -738257 5722 376846 -391747
7226 -391747 -1850809 -2906120 -2824015 -2330143 -2465769 -3241820 -4288442 -4985304 -5217373
7217 -5217373 -5186317 -5053221 -5139112 -5033076 -4585739 -4262040 -4598258 -6216569 -8806754 -11341440
7207 -11341440 -12840838 -12241119 -9577928 -6409323 -4012618 -2292665 -1047005 -552576
7199 -552576 -1362924 -2932397 -3676152 -3168170 -1535085 197978 569676 -333732 -1396601
7190 -1396601 -2205714 -2976666 -3365416 -2749953 -1451666 186181 1873860 2519519 1694483
7181 1694483 186557 -1653886 -3188734 -3879647 -3648190 -2718091 -1353964 472460 2122005
7172 2122005 2860389 2849836 2980615 3488380 3969386 4233084 3984878 2945369 1668885
7163 1668885 653680 -100650 -465229 -431227 20899 614868 1020669 1202607 1029135 420046
7153 420046 -321993 -635094 -371178 354102 1041777 1273946 1317185 1226034 1152637 963744
7143 963744 256626 -710405 -1510534 -2098046 -2604592 -2875799 -2757848 -2587150 -2054386 -663007
7133 -663007 1249732 3375540 5467980 6551986 6079618 4655615 2839053 1055878 -100736
7124 -100736 -94850 1010540 2060814 2187225 1435118 515036 294670 1176428 2843630 4287705
7114 4287705 4773672 4311520 3311907 2472654 2119127 1453258 417680 162841 1260529
7105 1260529 2786371 3637249 3419006 2299185 915741 352907 819070 1362783 1604454
7096 1604454 2155954 3150562 4031437 4883634 5646233 5433182 4430166 2986014 1115120
7087 1115120 -238198 -489477 111564 867444 1237203 1263964 1568958 2665459 4168062
7078 4168062 5875777 7312207 7196960 5851309 4654612 3603668 2535203 1989485 2084841
7069 2084841 2420717 2737329 3127697 3624155 3797118 3236646 2779036 2845723 2886367 2616598
7059 2616598 2498501 2753865 2952453 2725451 1800331 124672 -1848542 -3154790 -2950408
7050 -2950408 -1657927 -877885 -1116355 -1469021 -1189424 -541780 -407709 -899702 -1596837
7041 -1596837 -1965474 -1703088 -1116590 -351520 -29173 -570602 -1459192 -2001164 -2155513 -2090929
7031 -2090929 -1430097 -798208 -919850 -1136625 -1304162 -1963578 -2751644 -2897757 -2715323 -2375852
7021 -2375852 -991356 1196221 2834581 3109120 2513683 1643378 753539 214329 -278799
7012 -278799 -843163 -942941 -328581 382277 795477 1420140 2435475 2477425 1357091 413799
7002 413799 189730 515635 1173562 1584582 1733113 2556257 4057042 5148717 5255222
6993 5255222 4973952 5267906 6193978 7264559 7856201 6819866 4100743 805868 -1434018
6984 -1434018 -1721172 -1219610 -1274555 -2043594 -3082213 -3728927 -3850761 -3805553 -3742812 -3394776
6974 -3394776 -2151914 -155987 1303752 1507182 844977 -7490 -1073654 -2629128 -4211212
6965 -4211212 -5288550 -5543621 -5299317 -5166320 -4937448 -4499130 -4399794 -4565021 -4539196 -4585729
6955 -4585729 -5215596 -6090854 -6402185 -6152246 -5713183 -5175491 -4266630 -3119909 -1929532
6946 -1929532 -617203 418231 917609 1040263 1148231 836574 -216941 -1442369 -2464099
6937 -2464099 -3374652 -4027052 -3868645 -3347968 -3266862 -2976856 -1218476 1968411 5029254
6928 5029254 6611578 6093714 4105868 1697661 -636992 -2434791 -3645702 -3756623 -2753535
6919 -2753535 -1520612 -628631 -432162 -192844 619191 1223696 1287437 1109966 1259333 1746032
6909 1746032 1923436 1127447 -461601 -1996300 -3267713 -4398197 -4955847 -4601319 -3467225
6900 -3467225 -2160535 -1118553 -509264 -318748 -466345 -876112 -1075860 -842493 -235875
6891 -235875 -193336 -864071 -861062 -135868 538419 915215 1475920 2103091 2160239 1612991
6881 1612991 404036 -756052 -1215906 -1432411 -1624116 -1881257 -2331020 -2406789 -1668477
6872 -1668477 -1131325 -1494344 -2008865 -2065821 -1688016 -980745 15840 786681 847157 166681
6862 166681 -1309425 -3362296 -5228072 -6447160 -6600228 -5361596 -3897835 -3368321 -3520023
6853 -3520023 -3959453 -4236343 -4322909 -4268141 -3370132 -1449470 365483 763219 -202626 -1512284
6843 -1512284 -2497779 -3124575 -4022609 -5526061 -7504627 -9557787 -10502628 -9845671 -8802398
6834 -8802398 -7486913 -5392187 -3064058 -1641976 -988565 -80929 956012 1344100 746817
6825 746817 -293673 -1091121 -1494574 -1821210 -1956858 -1320958 475378 2956272 5550171
6816 5550171 7660268 7823871 5660530 2545014 -439509 -2999395 -5590034 -7953981
6808 -7953981 -8335230 -6265294 -3034685 209252 2663030 3484941 3097820 2736490 2777231
6799 2777231 2817385 2447214 2124738 2120030 1415712 -394247 -2317360 -3423960 -3388376 -2321361
6789 -2321361 -1059285 -493432 -276057 389861 918807 1095906 1836351 3010655 3779973
6780 3779973 4043965 4012317 3113216 1267470 -713985 -1542779 -562043 976357 1446787
6771 1446787 599936 -891707 -2526285 -3765573 -3808513 -2827119 -1910395 -1323323 -484042
6762 -484042 893927 2590183 4013943 5086494 6018171 6913679 7671888 7954520 7649006
6753 7649006 7542646 7817491 8054089 8122030 8012039 7561786 6482793 5330776 4580506
6744 4580506 3855420 3314318 3122402 2936619 2847776 2899008 2958966 3235990 3738392 4232033
6734 4232033 4398984 3911229 2844676 1536908 382142 -676021 -1645860 -2407703 -2963842
6725 -2963842 -3608976 -4181096 -3883500 -2534654 -495186 2067781 4665360 6373113 6766718
6716 6766718 6213329 5250320 3695147 2196429 1509721 1290279 1312658 1665093 2077139
6707 2077139 1868166 950106 -355927 -2006272 -3495631 -4110755 -4428438 -4951206 -5560461
6698 -5560461 -6624669 -7780402 -7580624 -5694843 -3738863 -2474459 -1025977 808592
6690 808592 2350941 3142108 3319601 3288958 3825315 5381113 7596084 9687053 10943612
6681 10943612 10549999 8432218 5846378 3920075 2796168 1833659 308431 -624160 83426
6672 83426 1222222 1248949 193008 -682270 -687227 -328013 208943 1676569 3615700 4996863
6662 4996863 5858035 6456550 6919872 7095515 6865094 6443101 6048775 5769741 5473665 5430146
6652 5430146 5868109 6167764 5703294 4721261 3423803 1801667 587925 -79078 -818073
6643 -818073 -1386376 -1208406 -952517 -1712191 -3493745 -5232859 -6015110 -5966748 -5759891 -5672999
6633 -5672999 -5872225 -5895302 -5481905 -5472751 -6000843 -6594858 -7151409 -6832352 -5469994 -4232381
6623 -4232381 -4038471 -4844178 -5979761 -7244097 -8299224 -8203260 -6685600 -4654729 -3259147
6614 -3259147 -2466337 -1631959 -1134851 -904266 -312784 505295 1204511 1471944 834073 88250
6604 88250 336133 1102912 1420058 1462312 1619689 1710353 1376524 771437 484350 763548
6594 763548 1051861 979360 341267 -833280 -2142208 -3511624 -4629083 -4846657 -4102761
6585 -4102761 -2537843 -1213240 -1585527 -3577173 -6145582 -8578219 -10182241 -10443954 -9172417
6576 -9172417 -7407574 -6474822 -5741909 -3878021 -1217085 1326971 3210523 3855704 3729117
6567 3729117 3396302 3153331 3644229 4950784 5685282 4934811 2780291 252317 -983394
6558 -983394 -534363 442480 619208 -395902 -1408050 -1533941 -1755897 -2518163 -2815578
6549 -2815578 -1755137 379548 2623943 4370147 5240107 4890963 3414802 1747011 1247619
6540 1247619 1637293 1833388 2258093 3342256 4482833 4762714 3977016 2699933 1569730
6531 1569730 866471 578572 949718 1925058 3826620 6939169 10002868 11337749 10770281
6522 10770281 9801018 8252482 5481986 2501909 141887 -1605624 -2796143 -3319686
6514 -3319686 -3264206 -3344431 -3756090 -3850629 -3040096 -1223771 730076 2003349 2672207 2808213
6504 2808213 1489141 -1454848 -4368284 -5922611 -5799902 -3957159 -964651 1966539
6496 1966539 3311065 2884936 1625104 806501 1301554 2587360 3635978 4373453 5163788
6487 5163788 5559804 4809588 3563257 2878552 1807082 4828 -978522 302686 3142989
6478 3142989 5659121 7263793 8592062 10093529 11379109 11936145 11304643 9380356 6641547
6469 6641547 4082779 2724911 2270858 2194565 2698303 3615476 4142097 4012347 3678593
6460 3678593 3021160 2185076 1938699 1889054 1188382 371073 521432 1355587 2208658 2869989
6450 2869989 3075768 2447395 965671 -507567 -1267669 -644159 1433083 3365905 3731014
6441 3731014 2888136 1704013 638344 -222071 -713387 -684737 -200385 343125 328499 -124326
6431 -124326 -1174517 -2551472 -2701517 -1257028 125858 645660 848324 1114582 1543347
6422 1543347 1995325 2407405 2496340 1473660 -759805 -3088943 -4088632 -3389509 -1814524
6413 -1814524 -517304 112365 516303 1434568 3011339 4550622 5339360 5190041 4736216
6404 4736216 4103269 3004663 1432431 -336079 -1591085 -1752776 -1029475 311390 2258855
6395 2258855 3884142 4358800 3496747 2056129 876522 205737 117421 -106353 102603
6386 102603 1280104 2080158 1310563 -444081 -1813872 -1819668 -232866 2496631 5071777
6377 5071777 6532308 6603801 5959203 5071098 4281282 4174960 4642653 4769650 3778426 1543537
6367 1543537 -1514914 -4843673 -7480765 -7829988 -6097850 -3719234 -1170817 1225525
6359 1225525 2713038 3136015 2739326 2482548 3022602 3235596 2186521 735468 -270594
6350 -270594 -1174329 -2534705 -3198536 -1986028 277829 2691363 4770901 6341534 7315575
6341 7315575 7484791 7383885 6998876 5699636 4380675 3764768 3020541 2063805 1056340
6332 1056340 -243610 -1164474 -1257415 -574494 855422 1982267 1705630 478132 -527072
6323 -527072 -1200718 -1713630 -1991348 -1988754 -2047456 -2839097 -3854464 -4228706 -4248802 -4458650
6313 -4458650 -4479583 -3764560 -2285099 -997521 -638460 -554852 339372 2059846 3745866
6304 3745866 5039038 5926084 6722064 7877507 8928974 9580494 10296071 11237582 11767273
6295 11767273 11273036 10259348 9457967 8463724 6636161 4173300 1761845 79908 -337216
6286 -337216 662047 2240026 3587321 4366073 4374282 3590692 2472222 1451233 302126
6277 302126 -1145162 -2289549 -2836726 -2948936 -3385772 -4074795 -4511839 -4782753 -4782141 -4142811
6267 -4142811 -2753802 -1267021 -247324 561136 1255283 1946698 2863891 3706541 4096994
6258 4096994 4019159 3601122 2862577 1904425 1309496 1532563 2375615 3023670 3419319 4322114
6248 4322114 5730718 7001374 7546823 7038740 5319722 2733063 437009 -667746 -558094
6239 -558094 -331334 -483244 -354611 229694 1239910 2579896 3912997 4935699 5050381
6230 5050381 3997040 2280314 594524 -787891 -1641016 -1372458 -624673 -514105 -1235195
6221 -1235195 -2587300 -3739715 -3471507 -1951165 -888061 -1534202 -2905742 -3901295 -4303704
6212 -4303704 -4312629 -4257087 -4188534 -3967712 -3647612 -3396708 -3196320 -2826563 -2602642 -2810755
6202 -2810755 -3472525 -4097543 -4030130 -3257562 -2536053 -2789947 -3422253 -3144686 -2100381 -1171347
6192 -1171347 -368178 956760 2808345 4920262 7220609 8783941 9026097 8054469 6130954
6183 6130954 4276720 3044391 2197373 1466981 1301975 1155494 -350099 -3222037 -5679476
6174 -5679476 -6414173 -6034248 -5503528 -4761455 -3341629 -2170948 -1813554 -1466070 -778014
6165 -778014 97237 991231 1209532 182625 -1078903 -1192935 -550927 -80948 341967
6156 341967 903562 1764367 3418442 5077042 5697810 5633790 5221532 4661189 4931800 6802918
6146 6802918 9422371 11582742 12697987 12385110 11269398 10085689 8754076 7562232
6138 7562232 6829864 6586765 6409589 5840315 5223939 4533145 3386057 2288110 1609210
6129 1609210 1482734 1744837 1878229 1870340 2201408 2860170 2931303 2415897 2382249 3083151
6119 3083151 3930712 4667685 5051231 4946008 4470807 3903904 3188410 2506821 2065641 1587942
6109 1587942 1152880 992138 1248938 1811906 1919683 1274581 439410 -88354 -142458 517676
6099 517676 1985376 3417972 3837450 3571382 3235310 3337321 3999253 4610138 4326440
6090 4326440 2855050 1203672 474601 1098510 3067284 5695801 8082374 9607986 9527614
6081 9527614 8156294 6225276 4274398 3057056 2441820 1912205 1179558 113459 -1443071
6072 -1443071 -3276443 -4389405 -3719617 -1648812 258452 606272 -919508 -3244154 -5450630
6063 -5450630 -7243279 -7826656 -7160688 -6479018 -6330850 -6410120 -6805239 -7706434 -8853122
6054 -8853122 -9591880 -9594107 -9152699 -8394147 -7352474 -6422369 -5519840 -4566318 -3662965 -2333616
6044 -2333616 -979501 -355671 -466365 -743962 -531091 82605 588076 424182 -333724
6035 -333724 -1579698 -2883201 -3305086 -2831742 -2747792 -3483112 -4103111 -4121645 -3544817 -2579519
6025 -2579519 -2051392 -2896361 -4280078 -4988192 -5428973 -5805757 -5770906 -5447881 -5067563 -4850559
6015 -4850559 -4473041 -3615324 -2133439 -215641 930268 983368 632885 479076 654515
6006 654515 987754 1227436 1241372 1202065 1320762 1497331 1004248 -680743 -2667470 -3755148
5996 -3755148 -3756603 -3161768 -2380044 -1672014 -1161746 -803232 -626651 -586052 -868336 -1546513
5986 -1546513 -2565065 -3961595 -5223317 -5922459 -6547544 -7129517 -7299587 -6990816 -6704128
5977 -6704128 -6886081 -7484603 -8215713 -8805255 -9251787 -8994508 -6911680 -3864966 -2048463
5968 -2048463 -2323521 -3802919 -5001114 -4867206 -3430700 -1953489 -1592698 -1555541 -956810
5959 -956810 -19095 768912 1292312 2053618 3243778 3949339 3345074 1997295 673476
5950 673476 29885 194069 1130732 3042227 5413209 6915074 6562083 4864530 3452554
5941 3452554 2761642 2360786 2255545 2758453 3693456 4414112 4644613 4692690 4706237 4698671
5931 4698671 4953637 5203513 5496135 5617469 5125575 4180857 3501093 3429417 3597756 3326012
5921 3326012 2245500 1048824 474019 324310 343859 733729 1706803 3247533 4927847
5912 4927847 6129668 6497805 6441555 6427796 6624610 6922171 7061500 6872093 6300854 5518677
5902 5518677 5124779 5283694 5037939 4924898 5914709 7385970 8773398 9624670 10097274
5893 10097274 10658271 11405560 12459274 13462475 13913366 13095647 11151967 9079186 6959182
5884 6959182 4885434 3506770 2844844 2585081 2346478 1933932 1883946 2354194 2552490
5875 2552490 2632295 2991719 2948724 2055813 731515 -100494 -140937 -266263 -1302318 -3142261
5865 -3142261 -4413658 -3876931 -1778141 807515 2685110 3155386 2656351 2487835 2264852
5856 2264852 1497815 809148 383047 -570998 -2111649 -3056686 -3007393 -2181855 -1380477 -1129152
5846 -1129152 -748358 -277664 -263166 -717973 -1416268 -2196286 -2675016 -2525532 -2300647 -2445158
5836 -2445158 -2595051 -2923698 -3430690 -2980030 -678481 2800682 5952080 8053310 9217754
5827 9217754 9529216 9145677 8654126 8387928 8499472 9032480 9715247 10277559 10943784 12101888
5817 12101888 12993566 12405142 10558102 8247176 6222624 4898423 4514136 5126897 6134836
5808 6134836 7214353 7953685 7738824 6744023 5571450 4383448 3873214 4477257 5249362
5799 5249362 5856323 6756246 7595809 8288300 8929858 8871030 7333342 4473740 1647931
5790 1647931 53721 -3291 490308 112010 -1248072 -2280515 -1930107 -553150 97718
5781 97718 -463798 -1125627 -1260480 -827318 -131991 977166 2544173 3571508 3341105
5772 3341105 2972227 3255626 3521883 3342821 3281041 3597841 3712016 3612585 3851963 3878421
5762 3878421 3165248 2774733 3891721 5780460 6778179 6833305 6451225 5643963 4204970
5753 4204970 2623326 1662069 659325 -814852 -1445831 -683869 584598 1491186 1750757
5744 1750757 1886410 2409842 3083814 3199439 2766496 1751245 -255418 -2811357 -5248428
5735 -5248428 -6354137 -5176641 -2752422 -654312 703385 905726 -232890 -1439641
5727 -1439641 -1639491 -1304443 -1294283 -1618427 -2164183 -3216506 -4075953 -4291451 -4106757 -3463534
5717 -3463534 -2905323 -2440621 -1306071 249397 1332584 1439927 1254035 1776326 2517415
5708 2517415 2497245 1860339 924135 -796357 -3067347 -5005751 -6329053 -6600752 -5905591
5699 -5905591 -4797510 -3709230 -2554368 -1184541 -86114 358119 453713 485587 -77104
5690 -77104 -1298406 -2688019 -3769217 -4468804 -5087081 -5848742 -6125565 -5172515 -2700563
5681 -2700563 578640 4075979 7225204 7761125 5670050 3587614 2708656 2750035 2852380
5672 2852380 2404842 1300415 20949 -838939 -1064922 -663963 318853 1326301 2264755
5663 2264755 3527757 4624140 4946848 4333762 3127125 2572914 3107236 3438590 2557512
5654 2557512 1118356 7774 -861376 -1558551 -2318150 -3565213 -5019020 -5702026 -5443268
5645 -5443268 -4794800 -4153109 -3751184 -3872514 -4411529 -4888413 -5027139 -4965856 -4669076 -3900325
5635 -3900325 -2456566 -401297 1435796 2076025 1777991 1539342 2376809 3678064 3821697
5626 3821697 2988956 2454176 2678952 2879633 1964056 220935 -1241810 -2155548 -3402785
5617 -3402785 -4442060 -3687473 -1716195 -195577 679567 968090 428708 -443821 -900696
5608 -900696 -517438 143986 902125 2329213 4356043 6086424 6969082 7196748 6775599
5599 6775599 5366667 3209617 1146551 -523410 -1584724 -1456460 -561139 229041 825781
5590 825781 1632911 2591037 3019041 2495185 1582736 1154557 1517014 2169863 2391542 2517329
5580 2517329 2447301 1741677 816927 -66847 -1134470 -1843280 -1321191 105711 1181316
5571 1181316 1239679 1154612 1753391 2710729 3104462 2717433 2300670 2895803 4351012 5689598
5561 5689598 6283505 5948449 5135621 4104589 3214298 3291994 4541272 6139450 6750899
5552 6750899 5884003 4692384 4338585 4337084 4141691 3897683 3833572 3521997 2142191 -364112
5542 -364112 -3322342 -5738688 -6635307 -6083237 -5131091 -4631314 -4675736 -4547200 -3790845 -2538748
5532 -2538748 -961131 595406 1268986 935832 725383 1092900 900267 -344305 -2109018
5523 -2109018 -4520268 -6915654 -7845191 -6736894 -4637629 -2697029 -985405 518135
5515 518135 1602989 1798263 824670 -190895 -104673 442222 799821 917327 988273 1576960
5505 1576960 2917615 4204588 4644921 4684417 4610246 4894779 5707022 5664066 4032340 2026167
5495 2026167 1185707 1645864 2445705 2660705 2334196 2116736 2460090 3083064 3552051 3480421
5485 3480421 2526006 1365447 439852 -220858 -236403 540677 2292119 4783703 7195814
5476 7195814 8590964 8682545 8441370 8337235 8297765 8044343 7032282 5327128 3959136
5467 3959136 3589161 3646848 3426637 2582661 1364499 345295 -317016 -708324 -1521628
5458 -1521628 -3218567 -5163738 -6741947 -8179415 -9857879 -11310820 -11459113 -10101387
5450 -10101387 -8395725 -7278137 -6498320 -5545837 -4489515 -3591803 -3037138 -3094487 -3978657
5441 -3978657 -5328886 -6382710 -6400839 -5370546 -4225146 -3504288 -3736555 -5167667 -6485234
5432 -6485234 -6590974 -5396105 -3552409 -2366357 -2348772 -3008516 -3704091 -3959263 -3679414
5423 -3679414 -2476919 -111933 2562189 4562158 5949111 6710298 6980600 7223156 7269837
5414 7269837 6655846 5005461 2848408 1371873 763008 464708 277319 -170741 -1273193
5405 -1273193 -2514814 -3673084 -4513307 -4699580 -4308168 -3315691 -1925469 -289221 1539722
5396 1539722 3054073 3890234 4038426 3819655 3425327 2518951 899352 -674274 -1512489
5387 -1512489 -2012403 -2499293 -2731999 -2929649 -3261684 -3294038 -2568833 -1196518 401625
5378 401625 1890732 2927314 2652504 1274427 277640 -156549 -524345 -866085 -1096194
5369 -1096194 -1117964 -969576 -751381 -188262 900493 1860659 1776742 879478 -42421 -777628
5359 -777628 -1438806 -1661658 -1102846 -34813 833867 1232223 1554805 1868559 1903220 1709097
5349 1709097 1728191 2086822 2543139 2916082 3265456 3110860 2615780 2311813 1836729 1094187
5339 1094187 589052 566985 478744 -1631 -630777 -865598 -272877 1257789 3002089 4033210
5329 4033210 4191170 3340402 1569305 -166258 -948755 -1253371 -1782355 -2284104 -2287554 -1574911
5319 -1574911 -484650 184992 -115775 -1181034 -2056652 -2030025 -1495836 -1010070 -262578
5310 -262578 1192900 2579139 3122587 3225319 3187555 2686751 1860423 1301470 793073 -271499
5300 -271499 -1430431 -2150588 -2995474 -4209715 -4871096 -5215744 -5866805 -6140879 -5313220
5291 -5313220 -3871136 -2810139 -1986212 -721669 1115393 3384805 5222970 6015871 6130620
5282 6130620 5608482 4485319 2997078 1577924 551532 274999 797313 1137402 142192
5273 142192 -1986758 -3970873 -5033728 -5258872 -5403974 -5501052 -5714306 -6630018 -7411100
$$ [...]
##END NTUPLES=NMR SPECTRUM
##END=
