##TITLE=dept_SR-167-R23_TFA CH-,CH3- -up, CH2- -down
 CDCl3, 2900 sc
 28.12.2023
##JCAMPDX= 6.0         $$ Bruker NMR JCAMP-DX V2.0
##DATA TYPE= NMR SPECTRUM
##DATA CLASS= NTUPLES
##ORIGIN= UXNMR, Bruker Analytische Messtechnik GmbH
##OWNER= root
$$ XWIN-NMR		Version 3.5
$$ Thu Dec 28 16:20:37 2023 Russian Standard Time (UT+4h)  she@DPX200
##.OBSERVE FREQUENCY= 50.327992884445
##.OBSERVE NUCLEUS= ^13C
##.ACQUISITION MODE= SIMULTANEOUS
##.ACQUISITION SCHEME= undefined
##.AVERAGES= 2901
##.DIGITISER RES= 17
##SPECTROMETER/DATA SYSTEM= spect
##.PULSE SEQUENCE= dept135
##.SOLVENT NAME= CDCl3
##.SHIFT REFERENCE= (INTERNAL, CDCl3, 0, 214.665)
##AUDIT TRAIL= $$ (NUMBER, WHEN, WHO, WHERE, WHAT)
$$ ##TITLE= Audit trail, XWIN-NMR		Version 3.5
$$ ##JCAMPDX= 5.01
$$ ##ORIGIN= Bruker BioSpin GmbH
$$ ##OWNER= she
$$ F:/spectra/data/she/nmr/depta/1/pdata/1/auditp.txt
$$ ##AUDIT TRAIL=  $$ (NUMBER, WHEN, WHO, WHERE, WHAT)
(   1,<2023-12-28 16:19:27.59 +0400>,<she>,<DPX200>,
      <created by zg, POWCHK disabled, PULCHK disabled
       terminated by command 'halt'
       configuration hash MD5:
       00 E9 B6 7A A2 85 ED C7 34 08 36 98 17 FE 4E 26
       data hash MD5: 16K
       0F F0 E9 F1 34 70 9D CF 7D D2 36 75 E8 11 79 90>)
(   2,<2023-12-28 16:19:30.09 +0400>,<she>,<DPX200>,
      <Start of raw data processing
       efp BC_mod = 2 LB = 3.5 FT_mod = 6 PKNL = 1 PHC0 = -3456.496 PHC1 = -1752.8 SI = 16K 
       data hash MD5: 16K
       0B 6B 27 52 65 40 0A 44 E6 A8 B5 4C D5 6B E9 B9>)
(   3,<2023-12-28 16:19:54.68 +0400>,<she>,<DPX200>,
      <pk PHC0 = 2.763615 PHC1 = -5.399996 
       data hash MD5: 16K
       CB 54 15 CC A9 C7 AF EC 7A 7F 21 60 B2 8D BD FD>)
(   4,<2023-12-28 16:19:58.00 +0400>,<she>,<DPX200>,
      <abs ABSG = 5 
       data hash MD5: 16K
       EE 5C 0C C5 C2 80 98 09 1C E4 D1 39 F7 B6 BA E1>)
$$ ##END=
$$ 
$$ hash MD5
$$ CD 76 CF 67 C2 F1 DD E0 61 27 D9 2B 1E AC 61 B4
##$RELAX= 
##$RELAX= 
##$RELAX= 
##$RELAX= 
##$RELAX= 
##$RELAX= 
##$RELAX= 
##$RELAX= 
$$ Bruker specific parameters
$$ --------------------------
##$DU= <F:/spectra>
##$EXPNO= 1
##$NAME= <depta>
##$PROCNO= 1
##$TYPE= <nmr>
##$USER= <she>
##$AMP= (0..31)
100 100 100 100 100 100 100 100 100 100 100 100 100 100 100 100 100 100 
100 100 100 100 100 100 100 100 100 100 100 100 100 100 
##$AQSEQ= 0
##$AQ_mod= 1
##$AUNM= <au_zg>
##$AUTOPOS= <>
##$BF1= 50.322709
##$BF2= 200.13
##$BF3= 200.13
##$BF4= 200.13
##$BF5= 200.13
##$BF6= 200.13
##$BF7= 200.13
##$BF8= 200.13
##$BYTORDA= 1
##$CFDGTYP= 0
##$CFRGTYP= 5
##$CHEMSTR= <none>
##$CNST= (0..31)
1 1 145 1 1 1 1 1 1 1 1 1 1 1 1 1 1 1 1 1 1 1 1 1 1 1 1 1 1 1 1 1 
##$CPDPRG= <>
##$CPDPRG1= <waltz16>
##$CPDPRG2= <waltz16>
##$CPDPRG3= <>
##$CPDPRG4= <mlev>
##$CPDPRG5= <mlev>
##$CPDPRG6= <mlev>
##$CPDPRG7= <mlev>
##$CPDPRG8= <mlev>
##$CPDPRGB= <>
##$CPDPRGT= <>
##$D= (0..31)
0 2 0.003448276 0 0 0 0 0 0 0 0 0 2e-05 0 0 0 0 0 0 0 0 0 0 0 0 0 0 0 
0 0 0 0 
##$DATE= 1703757944
##$DBL= (0..7)
120 120 120 120 120 120 120 120 
##$DBP= (0..7)
$$ [...]
##$SUBNAM2= <"">
##$SUBNAM3= <"">
##$SUBNAM4= <"">
##$SUBNAM5= <"">
##$SUBNAM6= <"">
##$SUBNAM7= <"">
##$SUBNAM8= <"">
##$SUBNAM9= <"">
##$SW= 219.3118970423
##$SWIBOX= (0..15)
0 1 3 0 0 0 0 0 0 0 0 0 0 0 0 0 
##$SW_h= 11037.527593819
##$TD= 16384
##$TD0= 1
##$TE= 0
##$TE2= 300
##$TE3= 300
##$TEG= 300
##$TL= (0..7)
120 120 120 120 120 120 120 120 
##$TP= (0..7)
150 150 150 150 150 150 150 150 
##$TP07= 0
##$TPNAME0= <>
##$TPNAME1= <>
##$TPNAME2= <>
##$TPNAME3= <>
##$TPNAME4= <>
##$TPNAME5= <>
##$TPNAME6= <>
##$TPNAME7= <>
##$TPOAL= (0..7)
0.5 0.5 0.5 0.5 0.5 0.5 0.5 0.5 
##$TPOFFS= (0..7)
0 0 0 0 0 0 0 0 
##$TUNHIN= 0
##$TUNHOUT= 0
##$TUNXOUT= 0
##$USERA1= <user>
##$USERA2= <user>
##$USERA3= <user>
##$USERA4= <user>
##$USERA5= <user>
##$V9= 5
##$VALIST= <valist>
##$VCLIST= <CCCCCCCCCCCCCCC>
##$VD= 0
##$VDLIST= <DDDDDDDDDDDDDDD>
##$VPLIST= <PPPPPPPPPPPPPPP>
##$VTLIST= <TTTTTTTTTTTTTTT>
##$WBST= 1024
##$WBSW= 2
##$XGAIN= (0..3)
0 0 0 0 
##$XL= 0
##$YL= 0
##$YMAX_a= 5253995
##$YMIN_a= -4359621
##$ZGOPTNS= <>
##$ZL1= 120
##$ZL2= 120
##$ZL3= 120
##$ZL4= 120
##$ABSF1= 214.6655
##$ABSF2= -4.669434
##$ABSG= 5
##$ABSL= 3
##$ALPHA= 0
##$AQORDER= 0
##$ASSFAC= 0
##$ASSFACI= 0
##$ASSFACX= 0
##$ASSWID= 0
##$AUNMP= <proc_1d>
##$AZFE= 0.1
##$AZFW= 0.1
##$BCFW= 0
##$BC_mod= 2
##$BYTORDP= 0
##$COROFFS= 0
##$CY= -3
##$DATMOD= 1
##$DC= 0
##$DFILT= <>
##$DTYPP= 0
##$F1P= 0
##$F2P= 0
##$FCOR= 0.5
##$FTSIZE= 16384
##$FT_mod= 6
##$GAMMA= 0
##$GB= 0
##$INTBC= 1
##$INTSCL= 0
##$ISEN= 128
##$LB= 3.5
##$LEV0= 0
##$LPBIN= 0
##$MAXI= 10000
##$MC2= 0
##$MEAN= 0
##$ME_mod= 0
##$MI= 0.4000791
##$NCOEF= 0
##$NC_proc= 0
##$NLEV= 6
##$NOISF1= 120.0001
##$NOISF2= 80.00006
##$NSP= 0
##$NTH_PI= 0
##$NZP= 0
##$OFFSET= 214.6655
##$PC= 4
##$PHC0= -3453.732
##$PHC1= -1758.2
##$PH_mod= 1
##$PKNL= yes
##$PPARMOD= 0
##$PSCAL= 0
##$PSIGN= 0
##$REVERSE= no
##$SF= 50.3227091
##$SI= 16384
##$SIGF1= 140
##$SIGF2= 120
##$SINO= 80
##$SIOLD= 32768
##$SREGLST= <13C.CDCl3>
##$SSB= 0
##$STSI= 16384
##$STSR= 0
##$SW_p= 11037.527593819
##$SYMM= 0
##$S_DEV= 0
##$TDeff= 16384
##$TDoff= 0
##$TI= <>
##$TILT= no
##$TM1= 0
##$TM2= 0
##$TOPLEV= 0
##$USERP1= <user>
##$USERP2= <user>
##$USERP3= <user>
##$USERP4= <user>
##$USERP5= <user>
##$WDW= 1
##$XDIM= 16384
##$YMAX_p= 369538384
##$YMIN_p= -31023350
$$ End of Bruker specific parameters
$$ ---------------------------------
##NTUPLES= NMR SPECTRUM
##VAR_NAME=  FREQUENCY,     SPECTRUM/REAL,   SPECTRUM/IMAG
##SYMBOL=    X,             R,               I
##VAR_TYPE=  INDEPENDENT,   DEPENDENT,       DEPENDENT
##VAR_FORM=  AFFN,          ASDF,            ASDF
##VAR_DIM=   16384,         16384,           16384
##UNITS=     HZ,            ARBITRARY UNITS, ARBITRARY UNITS
##FACTOR=    0.67371834180669, 1,            1
##FIRST=     10802.5493505904, 0,            0
##LAST=      -234.978243228581, 0,           0
##MIN=       -234.978243228581, -31023350,   0
##MAX=       10802.5493505904, 369538384,    0
$$ Real data points
##PAGE= N=1
##DATA TABLE= (X++(R..R)), XYDATA
$$ [...]
$$ plain form
12723 3718725 3599386 3264840 3049387 2952274 2867288 3033432 3381760 3434166 3097567 2631496
12713 2631496 2253139 1861095 1314942 758131 468404 637666 919774 1009626 983917 935701
12703 935701 1003417 1309982 1690391 1807711 1724135 1683534 1858853 2127420 2353526 2704936
12693 2704936 3098621 3184497 2960623 2839243 3091710 3637232 4178277 4306409 3851363 3070609
12683 3070609 2384405 2095584 2207748 2368688 2347252 2204744 2216452 2464671 2729968 2686353
12673 2686353 2268784 1754363 1292967 871853 597749 521579 631559 850898 992908 979280
12663 979280 712499 321762 216567 463944 842427 1146689 1225851 997219 586858 242345
12653 242345 279796 800660 1438025 1659096 1236547 535377 162810 125135 132002 361979
$$ packed form
12723C718725j19339l34546k15453r7113q4986J66144L48328N2406l36599m66071
12713B631496l78357l92044n46153n56811k89727J69262K82108Q9852k5709m8216
12703I35701O7716L06565L80409J17320q3576m0601J75319K68567K26106L51410
12693B704936L93685Q5876k23874j21380K52467N45522N41045J28132m55046p80754
12683C070609o86204k88821J12164J60940k1436j42508J1708K48219K65297m3615
12673B686353m17569n14421m61396m21114k74104p6170J09980K19339J42010j3628
12663I79280k66781l90737j05195K47377L78483L04262P9162k28632m10361l44513
12653B42345L7451N20864O37365K21071m22549p01170l72567l7675O867K29977
$$ plain form
12643 361979 989989 1760705 2430863 3047716 3504737 3448653 2931976 2524148 2435985 2284576
12633 2284576 1808147 1491224 1664288 1934999 1843287 1584374 1580701 1880385 2525618 3324541
12623 3324541 3912855 4256084 4513063 4577656 4456937 4454277 4413555 4069012 3536594 3230679
12613 3230679 3219393 3196359 3130978 3297051 3809567 4467139 5004957 5259474 5280756 5268726
12603 5268726 5266544 5083882 4601532 3978751 3368429 2874320 2798451 3307683 3974223 4167952
12593 4167952 3973034 3837264 3769698 3653498 3465053 3274953 3267786 3510191 3774984 3934889
12583 3934889 4080517 4086484 3814184 3363320 2888425 2817010 3367367 4191597 4744047 4913656
12573 4913656 4852375 4683784 4447290 3967985 3354436 2896410 2806763 2985188 3117651 3002736
$$ packed form
12643C61979O28010P70716O70158O16853M57021n6084n16677m07828q8163j51409
12633B284576m76429l16923J73064K70711r1712k58913l673K99684O45233P98923
12623C324541N88314L43229K56979O4593j20719k660m0722l44543n32418l05915
12613C230679j1286k3034o5381J66073N12516O57572N37818K54517K1282j2030
12603E268726k182j82662m82350o22781o10322m94109p5869N09232O66540J93729
12593D167952j94918j35770o7566j16200j88445j90100p167K42405K64793J59905
12583C934889J45628N967k72300m50864m74895p1415N50357Q24230N52450J69609
12573D913656o1281j68591k36494m79305o13549m58026q9647J78425J32463j14915
$$ plain form
12563 3002736 2808415 2915967 3320621 3881951 4672319 5629789 6410322 6681569 6392583
12554 6392583 5604063 4720698 4162277 4048918 4293319 4610311 4769862 4861433 4907432 4886207
12544 4886207 5256916 6077600 6798690 6965564 6433426 5542601 4902264 4825558 5160531 5467645
12534 5467645 5475209 5296568 5101551 4672681 3827627 2743277 1653409 736825 200947
12525 200947 160285 470426 822432 1025691 1042303 1092805 1278413 1573263 2064825 2729307
12515 2729307 3448969 3884942 3768402 3142492 2388507 1786256 1342461 1044498 932756
12506 932756 1030947 1084583 942940 958952 1412043 2176285 2969545 3696100 4243183 4342877
12496 4342877 3950773 3372966 2858910 2573941 2596892 2774991 2942457 3007826 3101193 3494565
$$ packed form
12563C002736j94321J07552M04654N61330P90368R57470P80533K71247k88986
12554F392583p88520q83365n58421j13359K44401L16992J59551R1571M5999k1225
12544D886207L70709Q20684P21090J66874n32138q90825o40337p6706L34973L07114
12534E467645P564j78641j95017m28870q45054j084350j089868r16584n35878
12525B00947m0662L10141L52006K03259J6612N0502J85608K94850M91562O64482
12515B729307P19662M35973j16540o25910p53985o02251m43795k97963j11742
12506I32756R8191N3636j41643J6012M53091P64242P93260P26555N47083R9694
12496D342877l92104n77807n14056k84969K2951J78099J67466O5369R3367L93372
$$ plain form
12486 3494565 4122056 4588046 4720130 4625360 4460597 4321701 4097210 3807947 3626279 3437924
12476 3437924 2978408 2394237 2160997 2535480 3481034 4457566 4996324 5254732 5459937
12467 5459937 5650919 5857828 6004209 5860069 5444937 4761695 3665890 2441193 1580249
12458 1580249 1302269 1475790 1755163 1958697 2117366 2141752 1901405 1404900 923986 707248
12448 707248 464261 -22698 -524369 -689409 -379036 363533 1330851 2068551 2403389 2514425
12438 2514425 2356663 1866583 1340476 867628 375765 170360 544561 1265245 1789349
12429 1789349 1938006 1906785 1976430 2176596 2342819 2361216 2507433 3039435 3572702 3571405
12419 3571405 2902704 1880441 975023 432290 407287 934268 1665340 2102151 1961567
$$ packed form
12486C494565O27491M65990J32084r4770j64763j38896k24491k89263j81668j88355
12476C437924m59516n84171k33240L74483R45554R76532N38758K58408K05205
12467E459937J90982K06909J46381j44140m15132o83242j095805j224697q60944
12458A580249k77980J73521K79373K03534J58669K4386k40347m96505m80914k16738
12448G07248k42987m86959n01671j65040L10373P42569R67318P37700L34838J11036
12438B514425j57762m90080n26107m72848m91863k05405L74201P20684N24104
12429A789349J48657l1221O9645K00166J66223J8397J46217N32002N33267j297
12419C571405o68701j022263r05418n42733k5003N26981P31072M36811j40584
$$ plain form
12410 1961567 1484487 1403458 2040886 2883536 3411383 3562724 3376308 2729992 1693413
12401 1693413 804647 563127 835399 1312787 1747260 2182133 2727056 3311364 3738722
12392 3738722 3577669 2752674 1872773 1391674 1259604 1103845 623548 119266 31993 303572
12382 303572 679641 1093641 1607540 2209258 2859895 3461447 3937725 4338120 4566924 4603747
12372 4603747 4620074 4570168 4388071 4085117 3602643 3183821 2920987 2686725 2638518 2857959
12362 2857959 3258480 3754166 4182419 4313473 4097245 3724025 3344784 3049273 2964889 3106932
12352 3106932 3296652 3247087 2806688 2202790 1820048 1734864 1849616 2133659 2516354 2740901
12342 2740901 2626603 2440754 2496999 2675532 2672860 2535032 2286374 1900086 1740849 2087487
$$ packed form
12410A961567m77080q1029O37428Q42650N27847J51341j86416o46316j036579
12401A693413q88766k41520K72272M77388M34473M34873N44923N84308M27358
12392C738722j61053q24995q79901m81099j32070j55759m80297n04282q7273K71579
12382C03572L76069M14000N13899O01718O50637O01552M76278M00395K28804L6823
12372D603747J6327m9906j82097l02954m82474m18822k62834k34262m8207K19441
12362B857959M00521M95686M28253J31054k16228l73220l79241k95511q4384J42043
12352C106932J89720m9565m40399o03898l82742q5184J14752K84043L82695K24547
12342B740901j14298j85849N6245J78533k672j37828k48658l86288j59237L46638
$$ plain form
12332 2087487 2597779 2824422 2631940 2058500 1321269 647819 165043 -10177 226127
12323 226127 681354 1034221 1226050 1423638 1885332 2559257 3045700 3215946 3227530 3128601
12313 3128601 2913656 2715382 2656430 2704860 2729848 2944989 3414004 3737437 3654872 3145743
12303 3145743 2381660 1741427 1559177 1716687 1901685 1867193 1553011 1157196 850811 724426
12293 724426 893674 1102172 1012615 732329 623645 941854 1510523 2042204 2310975 2372939
12283 2372939 2497484 2591020 2482092 2208671 1851745 1562689 1322796 998650 744503 680507
12273 680507 807797 1075911 1304246 1406805 1424070 1570000 1994303 2559102 3037768 3276249
12263 3276249 3328862 3123460 2655224 2191629 1922168 1715172 1453552 1223213 1050795 923268
$$ packed form
12332B087487N10292K26643j92482n73440p37231o73450m82776j75220K36304
12323B26127M55227L52867J91829J97588M61694O73925M86443J70246J1584r8929
12313C128601k14945j98274n8952M8430K4988K15141M69015L23433q2565n09129
12303C145743p64083o40233j82250J57510J84998l4492l14182l95815l06385j26385
12293G24426J69248K08498q9557k80286j08684L18209N68669N31681K68771O1964
12283B372939J24545R3536j08928k73421l56926k89056k39893l24146k54147o3996
12273F80507J27290K68114K28335J02559J7265J45930M24303N64799M78666K38481
12263C276249N2613k05402m68236m63595k69461k06996k61620k30339j72418j27527
$$ plain form
12253 923268 976645 1354937 1983237 2669166 3284531 3654542 3796212 3857075 3840505 3565054
12243 3565054 3170200 3128861 3413265 3656763 3668983 3417313 2924150 2506215 2460931 2647654
12233 2647654 3072404 3906001 4768846 5100720 4696568 3861671 3131873 2727395 2537494
12224 2537494 2405365 2435806 2771006 2952643 2777147 2699620 3087160 3558293 3615209 3255816
12214 3255816 2732526 2317323 2278081 2666999 2990965 3013829 2985551 3085776 3025262 2656389
12204 2656389 2089425 1234526 317228 -70842 285420 991123 1542176 1671275 1608276 1702365
12194 1702365 1878005 2124838 2458159 2623188 2688192 2908796 3142677 3127243 2864384 2438526
12184 2438526 2104093 1980479 1704520 1176000 844602 932758 1246220 1684880 2278753 2995670
$$ packed form
12253I23268N3377L78292O28300O85929O15365L70011J41670O0863j6570k75451
12243C565054l94854m1339K84404K43498J2220k51670m93163m17935m5284J86723
12233B647654M24750Q33597Q62845L31874m04152q34897p29798m04478j89901
12224B537494j32129L0441L35200J81637j75496p7527L87540M71133N6916l59393
12214C255816n23290m15203l9242L88918L23966K2864k8278J00225o0514l68873
12204B656389n66964q54899r17298l88070L56262P05703N51053J29099o2999R4089
12194A702365J75640K46833L33321J65029O5004K20604K33881j5434k62859m25858
12184B438526l34433j23614k75959n28520l31398Q8156L13462M38660N93873P16917
$$ plain form
12174 2995670 3775288 4365178 4457626 4153941 3635692 3091176 2830526 2862929 2936691 3165327
12164 3165327 3623093 4070654 4423188 4712541 4818319 4620582 4065906 3096393 2134476
12155 2134476 1680649 1584119 1560453 1442843 1402588 1788583 2497038 3306448 3976308 4245505
12145 4245505 4259414 4241910 4217767 4176931 4103379 4035043 3907965 3347013 2227054 1075232
12135 1075232 398168 121940 -85048 -317742 -517535 -475044 -180787 175692 576317 1102713
12125 1102713 1780257 2569599 3354928 4063811 4489589 4405221 4068984 3947513 4121283 4100677
12115 4100677 3609310 3094875 2939430 3122456 3569252 4091210 4435524 4471531 4444359 4473804
12105 4473804 4361319 4097831 3827400 3434612 2878674 2479167 2443511 2585004 2812551 3109197
$$ packed form
12174B995670P79618N89890R2448l03685n18249n44516k60650L2403P3762K28636
12164C165327M57766M47561L52534K89353J05778j97737n54676r69513r61917
12155B134476m53827r6530k3666j17610m0255L85995P08455Q09410O69860K69197
12145D245505J3909j7504k4143m0836p3552o8336j27078n60952j119959j151822
12135A075232o77064k76228k06988k32694j99793M2491K94257L56479M00625N26396
12125A102713O77544P89342P85329P08883M25778q4368l36237j21471J73770k0606
12115D100677m91367n14435j55445J83026M46796N21958L44314L6007k7172K9445
12105D473804j12485k63488k70431l92788n55938l99507l5656J41493K27547K96646
$$ plain form
12095 3109197 3058739 2492950 1799127 1153567 590424 404217 715657 1284316 1796433 2085860
12085 2085860 1971955 1614522 1352489 1043445 567113 237362 109341 154347 566070 1315303
12075 1315303 1947288 2236998 2403283 2583469 2889492 3362478 3849911 4132710 4134066 3927955
12065 3927955 3661701 3384232 3034051 2476866 1794759 1297300 1119741 1380683 1962101
12056 1962101 2391916 2593324 2844028 3041727 2893287 2314099 1555348 912076 291341
12047 291341 -405785 -952889 -1075244 -847936 -421265 90929 618623 1093892 1478503 1847002
12037 1847002 2175500 2476258 2659401 2453138 2084833 2088570 2493655 2980002 3246798 3062493
12027 3062493 2510337 2001513 1758825 1824777 2214522 2773632 3195503 3433997 3606224 3546405
$$ packed form
12095C109197n0458n65789o93823o45560n63143j86207L11440N68659N12117K89427
12085B085860j13905l57433k62033l09044m76332l29751j28021M5006M11723P49233
12075A315303O31985K89710J66285J80186L06023M72986M87433K82799J356k06111
12065C927955k66254k77469l50181n57185o82107m97459j77559K60942N81418
12056A962101M29815K01408K50704J97699j48440n79188p58751o43272o20735
12047B91341o97126n47104j22355K27308M26671N12194N27694M75269L84611L68499
12037A847002L28498L00758J83143k06263l68305L737M05085M86347K66796j84305
12027C062493n52156n08824k42688O5952L89745N59110M21871K38494J72227n9819
$$ plain form
12017 3546405 3019961 2268177 1801273 1719617 1823867 2004928 2274298 2695043 3191853 3795422
12007 3795422 4380381 4707887 4691825 4344279 3786023 3294383 3004389 2716195 2352575 2034203
11997 2034203 1774011 1555510 1424147 1403539 1368397 1317215 1245002 1172798 1165061 1374163 1757555
11986 1757555 1904324 1776189 1476153 1183367 984720 822032 650329 583513 748258 934350
11976 934350 940685 776318 591644 480927 266599 12226 -51659 207744 695155 1197024
11966 1197024 1684936 2174914 2546015 2732122 2954906 3395830 3667660 3642613 3727684 4242269
11956 4242269 4935483 5275230 5101453 4840157 4776259 4673545 4321801 3828851 3292265 2660262
11946 2660262 2199870 2405763 3201948 3793793 3912936 3813938 3744012 3658438 3543172 3689005
$$ packed form
12017C546405n26444p51784m66904q1656J04250J81061K69370M20745M96810O03569
12007C795422N84959L27506j6062l47546n58256m91640k89994k88194l63620l18372
11997B034203k60192k18501j31363k0608l5142n1182p2213p2204p737K09102L83392
11986A757555J46769j28135l00036k92786j98647j62688j71703o6816J64745J86092
11976I34350O335j64367j84674j10717k14328k54373o3885K59403M87411N01869
11966A197024M87912M89978L71101J86107K22784M40924K71830k5047Q5071N14585
11956D242269O93214L39747j73777k61296o3898j02714l51744m92950n36586o32003
11946B660262m60392K05893P96185N91845J19143r8998o9926q5574j15266J45833
$$ plain form
11936 3689005 3902659 3819524 3545409 3241200 2943665 2749884 2692948 2755459 2923581 3236633
11926 3236633 3586516 3781383 3772350 3595475 3408477 3320517 3194133 3049301 3070170 3033207
11916 3033207 2690013 2207058 1680611 1204703 948345 850955 681655 268846 -287313 -753209
11906 -753209 -1007930 -1102485 -1088594 -937159 -699938 -551297 -590023 -734058 -868982 -863784
11896 -863784 -703630 -586918 -381432 72162 465214 521184 527270 826620 1496244 2339844
11886 2339844 3024218 3253951 3031124 2674456 2320962 1675349 686612 -193820 -626840
11877 -626840 -814042 -1028701 -1050395 -686649 -111363 487548 1001465 1606710 2493354 3340667
11867 3340667 3793229 3872439 3925667 4029826 4000744 4010108 4253008 4542348 4752352 5113844
$$ packed form
11936C689005K13654q3135k74115l04209k97535j93781n6936O2511J68122L13052
11926C236633L49883J94867r033j76875j86998q7960j26384j44832K0869l6963
11916C033207l43194m82955n26447m75908k56358r7390j69300m12809n56159m65896
11906g53209k54721r4555J3891J51435K37221J48641l8726j44035j34924N198
11896h63784J60154J16712K05486M53594L93052N5970O086K99350O69624Q43600
11886B339844O84374K29733k22827l56668l53494o45613r88737q80432m33020
11877f26840j87202k14659k1694L63746N75286N98911N13917O05245Q86644Q47313
11867C340667M52562P9210N3228J04159k9082R364K42900K89340K10004L61492
$$ plain form
11857 5113844 5790634 6425812 6760271 7066041 7406919 7470775 6936650 5892376 4815382
11848 4815382 4088889 3629825 3147398 2550054 1852021 1315263 1329776 1812342 2286723 2552576
11838 2552576 2579642 2402588 2232195 2228709 2472696 3071981 3811774 4210855 4077908 3573092
11828 3573092 2872665 2292525 2150758 2500244 3106523 3756900 4435597 5054055 5581458
11819 5581458 6090185 6372426 6088871 5414833 4930719 4770250 4496316 4070709 3763498
11810 3763498 3560637 3186874 2593477 1742054 678441 -125797 -127518 714139 1846899
11801 1846899 2706940 3114524 3166215 3145570 3368155 3806735 4194446 4334412 4149626 3764299
11791 3764299 3284590 2702243 2039146 1548114 1515220 1655394 1625445 1325225 668876 -93461
$$ packed form
11857E113844O76790O35178L34459L05770L40878O3856n34125j044274j076994
11848D815382p26493m59064m82427n97344o98033n36758J4513M82566M74381K65853
11838B552576K7066j77054j70393l486K43987N99285P39793L99081j32947n04816
11828C573092p00427n80140j41767L49486O06279O50377O78697O18458N27403
11819E581458N08727K82241k83555o74038m84114j60469k73934m25607l07211
11810C763498k02861l73763n93397q51423j063613q04238j721Q41657J132760
11801A846899Q60041M07584N1691k0645K22585M38580L87711J39966j84786l85327
11791C764299m79709n82347o63097m91032l2894J40174k9949l00220o56349p62337
$$ plain form
11781 -93461 -501508 -474452 -157155 227686 690821 1169317 1466004 1672746 1900103 1978125
11771 1978125 1625133 834352 -68699 -584767 -586848 -416986 -342644 -339563 -205461 288753
11761 288753 972587 1662186 2340773 2674503 2453978 1759982 1098628 1139853 2005876 3173381
11751 3173381 4260512 4945317 4896090 4395054 3817283 3276595 2919884 2838818 2803502 2572121
11741 2572121 2331583 2190396 2048333 1930399 1886440 2017048 2443019 3094258 3749932 4147817
11731 4147817 4135351 3831796 3353211 2881320 2582963 2432108 2397949 2475015 2610079 2767902
11721 2767902 3056090 3367195 3322071 3074544 2900813 2702316 2444607 2356173 2592320 2954147
11711 2954147 3251572 3514874 3794330 4104483 4343693 4344468 4088062 3677053 3197820 2724030
$$ packed form
11781i3461m08047K7056L17297L84841M63135M78496K96687K06742K27357P8022
11771A978125l52992p90781r03051n16068k081J69862P4342L081J34102M94214
11761B88753O83834O89599O78587L33730k20525o93996o61354M1225Q66023J167505
11751C173381J087131O84805m9227n01036n77771n40688l56711q1066l5316k31381
11741B572121k40538j41187j42063j17934m3959J30608M25971O51239O55674L97885
11731D147817j2466l03555m78585m71891k98357j50855l4159P7066J35064J57823
11721B767902K88188L11105m5124k47527j73731j98497k57709q8434K36147L61827
11711B954147K97425K63302K79456L10153K39210P75k56406m11009m79233m73790
$$ plain form
11701 2724030 2317889 1986907 1807066 1834186 2053500 2415242 2614001 2516663 2357040 2131263
11691 2131263 1807473 1525858 1507733 1765467 2064287 2301142 2488429 2786393 3343607 3939275
11681 3939275 4297638 4501010 4777957 5096515 5383202 5592378 5578604 5381549 5186960 5174992
11671 5174992 5411188 5852336 6387344 6706104 6635068 6218628 5609374 5006778 4441095 3890813
11661 3890813 3346982 3031553 3272742 3927604 4384346 4240156 3754348 3387066 3197583
11652 3197583 2954195 2770372 2818603 2983748 3045455 2870574 2693604 2712300 2788123 2629054
11642 2629054 2330582 2025138 1592848 989901 287647 -286656 -415826 -96221 339321
11633 339321 587104 619469 477437 150679 -96279 108067 481508 366348 -320424 -1214424
$$ packed form
11701B724030m06141l30982j79841K7120K19314L61742J98759r7338j59623k25777
11691B131263l23790k81615j8125K57734K98820K36855J87287K97964N57214N95668
11681C939275L58363K03372K76947L18558K86687K09176j3774j97055j94589j1968
11671E174992K36196M41148N35008L18760p1036m16440o09254o02596n65683n50282
11661C890813n43831l15429K41189O54862M56742j44190m85808l67282j89483
11652C197583k43388j83823M8231J65145O1707j74881j76970J8696P5823j59069
11642B629054k98472l05444m32290o02947p02254n74303j29170L19605M35542
11633C39321K47783L2365j42032l26758k46958K04346L73441j15160o86772q94000
$$ plain form
11623 -1214424 -1912321 -2280529 -2263651 -1888069 -1399660 -929782 -345772 366387 1118008 1867160
11613 1867160 2631967 3431772 4087775 4382542 4130556 3501657 3019460 2934550 3091201 3152539
11603 3152539 2838604 2018079 1093379 484650 126906 -96226 -289964 -28295 1089617
11594 1089617 2659764 3915544 4517513 4488749 3788994 2678464 1553310 579611 -24453
11585 -24453 14542 529609 1046743 1167450 924443 761436 881184 1124893 1346803 1493406
11575 1493406 1478162 1240736 935943 735325 691859 934672 1411915 1967906 2421922 2533678
11565 2533678 2327582 2027265 1837738 1831832 1911472 2153147 2477776 2706419 2911995 3229090
11555 3229090 3689072 4076953 4127496 3659241 2765393 2040332 1923229 2048625 1994009 1865241
$$ packed form
11623a214424o97897l68208J6878L75582M88409M69878N84010P12159P51621P49152
11613A867160P64807P99805O56003K94767k51986o28899m82197q4910J56651O1338
11603C152539l13935q20525r24700o08729l57744k23132j93738K61669J117912
11594A089617J570147J255780O01969k8764o99755j110530j125154r73699o04064
11585b4453L8995N15067N17134J20707k43007j63007J19748K43709K21910J46603
11575A493406j5244k37426l04793k00618m3466K42813M77243N55991M54016J11756
11565B533678k06096l00317j89527n906P9640K41675L24629K28643K05576L17095
11555C229090M59982L87881N0543m68255q93848p25061j17103J25396n4616j28768
$$ plain form
11545 1865241 2006446 2411591 2832419 2877336 2202349 1045686 -5553 -563539 -689949
11536 -689949 -511863 -202759 132624 464627 730218 1115034 1775589 2457893 2938646 3187039
11526 3187039 3076973 2560611 1826650 1184812 997814 1349510 1937717 2457712 2917282
11517 2917282 3473673 3976782 4192573 3940984 3344273 2775258 2495776 2607376 3103148
11508 3103148 3701942 3996075 3722577 2946188 2121240 1525953 936164 273951 2596
11499 2596 397558 827635 739980 284661 -242734 -655980 -936546 -907998 -603083 -364795
11489 -364795 -342208 -428267 -643246 -1055659 -1665380 -2368447 -2896387 -2934686 -2496043 -1844295
11479 -1844295 -1032108 -16210 1102862 2105052 2761120 3000660 2897116 2519204 2109885
$$ packed form
11545A865241J41205M05145M20828M4917o74987j156663j051239n57986j26410
11536f89949J78086L09104L35383L32003K65591L84816O60555O82304M80753K48393
11526C187039j10066n16362p33961o41838j86998L51696N88207N19995M59570
11517B917282N56391N03109K15791k51589n96711n69015k79482J11600M95772
11508C103148N98794K94133k73498p76389q24948n95287n89789o62213k71355
11499B596L94962M30077q7655m55319n27395m13246k80566K8548L04915K38288
11489c64795K2587q6059k14979m12413o09721p03067n27940l8299M38643O51748
11479a844295Q12187J015898J119072J002190O56068K39540j03544l77912m09319
$$ plain form
11470 2109885 1757527 1439881 1267028 1070830 729108 556812 705950 1025924 1218258
11461 1218258 1180823 1005068 675339 250992 -58392 -137865 -45733 149255 364000 473874
11451 473874 434226 267413 154598 226424 536200 997042 1402318 1764323 2118731 2438938
11441 2438938 2657823 2764398 2733061 2414696 1906465 1667669 1762771 1841430 1844426 2030016
11431 2030016 2412596 2709748 2759878 2587423 2377092 2442136 2766030 3086444 3298186 3467004
11421 3467004 3451615 3058632 2470374 1893733 1400871 944141 421516 -286658 -1126788 -1750003
11411 -1750003 -1981911 -1940008 -1715302 -1411582 -1218136 -1161087 -1022445 -616621 156240 1015717
11401 1015717 1506140 1565538 1355256 998724 716988 545450 385874 402731 582333 663374
$$ packed form
11470B109885l52358l17646j72853j96198l41722j72296J49138L19974J92334
11461A218258l7435j75755l29729m24347l09384p9473R2132J94988K14745J09874
11451D73874l9648j66813j12815P1826L09776M60842M05276L62005L54408L20207
11441B438938K18885J06575l1337l18365n08231k38796R5102P8659K996J85590
11431B030016L82580K97152N0130j72455k10331O5044L23894L20414K11742J68818
11421C467004j5389l92983n88258n76641m92862m56730n22625p08174q40130o23215
11411a750003k31908M1903K24706L03720J93446N7049J38642M05824P72861Q59477
11401A015717M90423N9398k10282l56532k81736j71538j59576J6857J79602Q1041
$$ plain form
11391 663374 299810 -612717 -1576530 -1958026 -1549624 -615490 356555 1129524 1799226 2265899
11381 2265899 2295242 1928252 1373669 730435 188243 -58912 -139278 -59857 315226 1047228
11371 1047228 1996449 2695086 2818334 2706733 2575504 2123150 1146172 -101591 -1255107
11362 -1255107 -2071513 -2279566 -2022643 -1827209 -2074537 -2798342 -3864063 -4777909 -5021772
11353 -5021772 -4628167 -3923333 -3214969 -2658441 -2230495 -1959617 -1918603 -2072943 -2256829 -2318116
11343 -2318116 -2147924 -1750320 -1158599 -677225 -603460 -684359 -604613 -371745 -297997 -416461
11333 -416461 -506913 -611559 -732457 -839854 -1137755 -1577866 -2033847 -2433764 -2563964 -2392996
11323 -2392996 -1976708 -1386401 -853741 -557483 -320850 53834 595879 1171778 1518805
$$ packed form
11391F63374l63564r12527r63813l81496M08402R34134R72045P72969O69702M66673
11381B265899K9343l66990n54583o43234n42192k47155q0366P9421L75083P32002
11371A047228R49221O98637J23248j11601j31229m52354r76978j247763j153516
11362a255107q16406k08053K56923J95434k47328p23805j065721r13846k43863
11353e021772L93605P04834P08364N56528M27946K70878M1014j54340j83886o1287
11343b318116J70192L97604N91721M81374P3765q0899P9746K32868P3748j18464
11333d16461r0452j04646j20898j07397k97901m40111m55981l99917j30200J70968
11323b392996M16288N90307N32660K96258K36633L74684N42045N75899L47027
$$ plain form
11314 1518805 1551905 1265953 678289 19845 -412337 -723757 -1039097 -1227060 -1310381 -1249884
11304 -1249884 -740070 225978 1189962 1819891 2178448 2330227 2179518 1599007 579916
11295 579916 -467955 -1072132 -1381719 -1493231 -1364846 -1352619 -1662370 -1919038 -1962352 -2101987
11285 -2101987 -2307570 -2342686 -2344553 -2526474 -2770085 -2735464 -2344516 -1870749 -1425596 -1081185
11275 -1081185 -1147098 -1704868 -2330225 -2576023 -2535677 -2469448 -2305460 -2044465 -1845508 -1768674
11265 -1768674 -1653593 -1336559 -1096769 -1077575 -1294539 -1887689 -2687247 -3210434 -3290851 -3108670
11255 -3108670 -2791364 -2545111 -2535552 -2589602 -2319790 -1628077 -767417 3537 408695 140877
11245 140877 -674702 -1603018 -2443501 -3089999 -3324504 -3350368 -3559170 -3736957 -3282943 -2273390
$$ packed form
11314A518805L3100k85952n87664o58444m32182l11420l15340j87963q3321O0497
11304a249884N09814R66048R63984O29929L58557J51779j50709n80511j019091
11295E79916j047871o04177l09587j11512J28385J2227l09751k56668m3314j39635
11285b101987k05583l5116j867j81921k43611L4621L90948M73767M45153L44411
11275a081185o5913n57770o25357k45798M0346O6229J63988K60995J98957P6834
11265a768674J15081L17034K39790J9194k16964n93150p99558n23187q0417J82181
11255c108670L17306K46253R559n4050K69812O91713Q60660P70954M05158k67818
11245A40877q15579r28316q40483o46498k34505k5864k08802j77787M54014J009553
$$ plain form
11235 -2273390 -1276548 -483840 -2071 16367 -492453 -1302775 -1889872 -1952185 -1781099 -2034961
11225 -2034961 -2763978 -3471523 -3643588 -3190377 -2447568 -1674479 -1168045 -846551 -316118
11216 -316118 284927 758234 1191671 1435767 1104214 409442 -261332 -914634 -1530513 -2086670
11206 -2086670 -2551740 -2703122 -2554557 -2252545 -1877122 -1692197 -1735794 -1762818 -1609168 -1395503
11196 -1395503 -1174438 -927375 -788147 -874353 -1273041 -2129289 -3197097 -3965990 -4150453
11187 -4150453 -3828347 -3525068 -3545295 -3613341 -3568134 -3527548 -3385796 -2961264 -2404142 -1931643
11177 -1931643 -1512714 -1111154 -728361 -534996 -827240 -1517824 -2141676 -2457355 -2324940
11168 -2324940 -1862540 -1627567 -1616999 -1485734 -1490174 -1827679 -2318315 -2763813 -2796149 -2253984
$$ packed form
11235b273390R96842P92708M81769J8438n08820q10322n87097o2313J71086k53862
11225b034961p29017p07545j72065M53211P42809P73089N06434L21494N30433
11216c16118O01045M73307M33437K44096l31553o94772o70774o53302o15879n56157
11206b086670m65070j51382J48565L02012L75423J84925m3597k7024J53650K13665
11196a395503K21065K47063J39228q6206l98688q56248j067808p68893j84463
11187d150453L22106L03279k0227o8046M5207M0586J41752M24532N57122M72499
11177a931643M18929M01560L82793J93365k92244o90584o23852l15679J32415
11168b324940M62400K34973J0568J31265m440l37505m90636m45498l2336N42165
$$ plain form
11158 -2253984 -1485874 -862413 -400530 -207404 -350771 -581819 -687860 -819429 -929622
11149 -929622 -867514 -791350 -940250 -1493405 -2200064 -2619044 -2654286 -2642051 -2824764 -3061459
11139 -3061459 -3162086 -3161016 -3031125 -2866095 -2829096 -2905563 -2855618 -2558655 -2279187 -2376759
11129 -2376759 -2781998 -3107912 -3366021 -3751848 -4201205 -4317832 -3994780 -3510436 -2842892
11120 -2842892 -2051218 -1664504 -1931681 -2528858 -2785491 -2624463 -2571097 -2651456 -2659569 -2597527
11110 -2597527 -2372494 -2055142 -2064154 -2565269 -3092449 -3254825 -3127202 -2916081 -2542660 -1997458
11100 -1997458 -1571037 -1312903 -1067587 -815756 -703946 -795127 -796568 -541977 -319929 -429083
11090 -429083 -911803 -1614178 -2419426 -3239798 -3809825 -3848171 -3349771 -2494169 -1622700 -973511
$$ packed form
11158b253984P68110O23461M61883J93126j43367k31048j06041j31569j10193
11149i29622O2108P6164j48900n53155p06659m18980l5242J2235j82713k36695
11139c061459j00627J070J29891J65030L6999p6467M9945K96963K79468r7572
11129b376759m05239l25914k58109l85827m49357j16627L23052M84344O67544
11120b842892P91674L86714k67177n97177k56633J61028N3366q0359q113O2042
11110b597527K25033L17352r012n01115n27180j62376J27623K11121L73421N45202
11100a997458M26421K58134K45316K51831J11810r1181j441K54591K22048j09154
11090d29083m82720p02375q05248q20372n70027l8346M98400Q55602Q71469O49189
$$ plain form
11080 -973511 -500697 -215141 -279945 -600692 -875457 -775197 -432224 -191086 -125967 -354775
11070 -354775 -893978 -1478373 -1924405 -2099485 -2071957 -2064698 -2155957 -2349685 -2681473 -3052406
11060 -3052406 -3371289 -3607167 -3579063 -3357523 -2983333 -2551777 -2270746 -2147286 -1850071 -1296118
11050 -1296118 -954057 -1144797 -1912224 -2778201 -3101581 -2755069 -2114428 -1548858 -1167939
11041 -1167939 -978874 -963914 -1044291 -1189060 -1511543 -2047748 -2727669 -3412083 -3966071 -4226726
11031 -4226726 -4238932 -4049717 -3902840 -3993635 -4239320 -4725670 -5431858 -6039999 -6229434 -6008080
11021 -6008080 -5445294 -4491945 -3631541 -3498888 -3878489 -4345438 -4620218 -4405942 -3819631
11012 -3819631 -3275922 -2994260 -3010687 -3158329 -3297712 -3463588 -3649603 -4058367 -4829734 -5422743
$$ packed form
11080i73511M72814K85556o4804l20747k74765J00260L42973K41138O5119k28808
11070c54775n39203n84395m46032j75080K7528P259r1259j93728l31788l70933
11060c052406l18883k35878K8104K21540L74190M31556K81031J23460K97215N53953
11050a296118L42061j90740p67427q65977l23380L46512O40641N65570L80919
11041a167939J89065J4960q0377j44769l22483n36205o79921o84414n53988k60655
11031d226726j2206J89215J46877r0795k45685m86350p06188o08141j89435K21354
11021f008080N62786R53349Q60404J32653l79601m66949k74780K14276N86311
11012c819631N43709K81662j6427j47642j39383j65876j86015m08764p71367n93009
$$ plain form
11002 -5422743 -5450745 -5251404 -5224865 -5306449 -5227521 -5200967 -5526559 -6022305 -6419058 -6557602
10992 -6557602 -6502438 -6396045 -6362342 -6435514 -6438876 -6284039 -5952930 -5505222 -5187912 -5256325
10982 -5256325 -5632100 -5908571 -5812262 -5439875 -4833707 -4148537 -3777485 -3750478 -3644472 -3305661
10972 -3305661 -3069120 -2978977 -2704340 -2264848 -2031620 -2177740 -2546225 -3027218 -3580625 -4049802
10962 -4049802 -4296367 -4407721 -4457662 -4396984 -4352168 -4596243 -5152624 -5979715 -6956725 -7435901
10952 -7435901 -7200061 -6670216 -6229375 -5985536 -5761564 -5331192 -4844237 -4783452 -5253943 -5988285
10942 -5988285 -6640052 -6906294 -6700564 -6314235 -5979708 -5589181 -5034325 -4476268 -4129359
10933 -4129359 -4017656 -4001049 -3792857 -3348023 -2948114 -2735201 -2509991 -2066997 -1599002 -1420882
$$ packed form
11002e422743k8002J99341K6539q1584P8928K6554l25592m95746l96753j38544
10992f557602N5164J06393L3703p3172l362J54837L31109M47708L17310o8413
10982e256325l75775k76471R6309L72387O06168O85170L71052K7007J06006L38811
10972c305661K36541R0143K74637M39492K33228j46120l68485m80993n53407m69177
10962d049802k46565j11354m9941O0678M4816k44075n56381q27091r77010m79176
10952g435901K35840N29845M40841K43839K23972M30372M86955O0785m70491p34342
10942e988285o51767k66242K05730L86329L34527L90527N54856N58057L46909
10933d129359J11703J6607K08192M44834L99909K12913K25210M42994M67995J78120
$$ plain form
10923 -1420882 -1572948 -1764638 -1537904 -800155 -168221 -128034 -551739 -1275358 -2158345 -2901626
10913 -2901626 -3314088 -3635990 -3981564 -4332276 -4801453 -5217110 -5263019 -4970493 -4493742 -3824140
10903 -3824140 -3129131 -2653907 -2426493 -2270269 -2147165 -2206069 -2269805 -2054007 -1672103 -1471250
10893 -1471250 -1615266 -2046445 -2568461 -2775677 -2519581 -2157220 -1995143 -1961268 -1881184 -1783673
10883 -1783673 -1638315 -1448137 -1559749 -2212061 -3076757 -3834874 -4497850 -4997297 -5210932
10874 -5210932 -5224548 -5213502 -5146805 -4945727 -4781086 -4719563 -4817299 -5144665 -5552220 -5790897
10864 -5790897 -5661469 -5201535 -4687383 -4413871 -4536991 -4729516 -4375856 -3601399 -3033552
10855 -3033552 -2811820 -2892944 -3311460 -3951750 -4558448 -5075116 -5542895 -5733792 -5472931 -4736155
$$ packed form
10923a420882j52066j91690K26734P37749O31934M0187m23705p23619q82987p43281
10913b901626m12462l21902l45574l50712m69177m15657m5909K92526M76751O69602
10903c824140O95009M75224K27414J56224J23104n8904o3736K15798L81904K00853
10893a471250j44016m31179n22016k07216K56096L62361J62077L3875Q0084R7511
10883a783673J45358J90178j11612o52312q64696p58117o62976m99447k13635
10874e210932j3616J1046O6697K01078J64641O1523r7736l27366m07555k38677
10864e790897J29428M59934N14152K73512j23120j92525L53660P74457N67847
10855c033552K21732q1124m18516o40290o06698n16668m67779j90897K60861P36776
$$ plain form
10845 -4736155 -3677387 -2765226 -2219995 -1814125 -1544323 -1558349 -1628569 -1512267 -1230474 -1046404
10835 -1046404 -1503733 -2719997 -4248862 -5599516 -6416231 -6659392 -6502858 -6231517 -6193576
10826 -6193576 -6286025 -6022811 -5366023 -4836704 -4726759 -4852267 -5069951 -5377030 -5713770 -5890503
10816 -5890503 -5728073 -5327350 -5052472 -5077546 -5173073 -5152232 -4989751 -4616203 -4059309 -3584167
10806 -3584167 -3457036 -3627180 -3847482 -4017072 -4227684 -4407712 -4317558 -3993200 -3774230 -3784338
10796 -3784338 -3677592 -3196463 -2594870 -2279378 -2386955 -2737901 -2910601 -2559137 -2010343
10787 -2010343 -1738571 -1795055 -2205794 -2847438 -3301298 -3275198 -2910383 -2655001 -2782600 -3144609
10777 -3144609 -3725803 -4443475 -5050071 -5357869 -5424375 -5403489 -5265766 -5010556 -4796851 -4719419
$$ packed form
10845d736155J058768R12161N45231M05870K69802j4026p0220J16302K81793J84070
10835a046404m57329j216264j528865j350654q16715k43161J56534K71341L7941
10826f193576r2449K63214O56788N29319J09945j25508k17684l07079l36740j76733
10816e890503J62430M00723K74878k5074r5527K0841J62481L73548N56894M75142
10806c584167J27131j70144k20302j69590k10612j80028R0154L24358K18970j0108
10796c784338J06746M81129O01593L15492j07577l50946j72700L51464N48794
10787b010343K71772n6484m10739o41644m53860K6100L64815K55382j27599l62009
10777c144609n81194p17672o06596l07798o6506K0886J37723K55210K13705P7432
$$ plain form
10767 -4719419 -4748852 -4696750 -4617094 -4593208 -4436171 -4286566 -4329692 -4399719 -4408094 -4403169 -4438043
10756 -4438043 -4600201 -4996271 -5454107 -5544150 -5103176 -4633944 -4775242 -5275321 -5547730 -5551423
10746 -5551423 -5570759 -5779529 -6075024 -6119370 -5731113 -5105055 -4557307 -4198584 -3954707 -3850899
10736 -3850899 -4048975 -4384567 -4393765 -3988326 -3527539 -3310793 -3420503 -3805751 -4266238 -4583423
10726 -4583423 -4875514 -5266518 -5742890 -6238246 -6606296 -6538570 -5897065 -5099469 -4511278 -4086820
10716 -4086820 -3900504 -4038335 -4271222 -4411612 -4398147 -4167662 -3750481 -3340898 -3069639 -2788228
10706 -2788228 -2315467 -1881902 -1748711 -1737937 -1564519 -1425001 -1573623 -1676390 -1542780 -1303005
10696 -1303005 -951730 -854323 -1302506 -1989892 -2593268 -3034376 -3559452 -4189208 -4710230 -5270003
$$ packed form
10767d719419k9433N2102P9656K3886J57037J49605m3126p0027q375M925l4874
10756d438043j62158l96070m57836r0043M40974M69232j41298n00079k72409l693
10746e551423j9336k08770k95495m4346L88257O26058N47748L58723K43877J03808
10736c850899j98076l35592r198M05439M60787K16746j09710l85248m60487l17185
10726d583423k92091l91004m76372m95356l68050O7726O41505P97596N88191M24458
10716d086820J86316j37831k32887j40390J3465K30485M17181M09583K71259K81411
10706b788228M72761M33565J33191J0774J73418J39518j48622j02767J33610K39775
10696a303005L51275R7407m48183o87386o03376m41108n25076o29756n21022n59773
$$ plain form
10686 -5270003 -6015745 -6775082 -7191262 -7328593 -7400927 -7389958 -7339159 -7312257 -7401223 -7703897
10676 -7703897 -8151281 -8449793 -8448658 -8250610 -7902254 -7498586 -7290090 -7321479 -7480728 -7539022
10666 -7539022 -7231392 -6564467 -5971385 -5710524 -5662889 -5596185 -5300731 -4910648 -4640992 -4602999
10656 -4602999 -4895369 -5358407 -5656853 -5773402 -5799622 -5925863 -6213781 -6245386 -5934723 -5664772
10646 -5664772 -5725433 -6190902 -6780388 -7067620 -7012165 -6985296 -7321781 -7826033 -8020244 -7826189
10636 -7826189 -7397884 -6920154 -6693664 -6784731 -6921331 -6832237 -6404100 -5739038 -5180320 -4930885
10626 -4930885 -4800029 -4524109 -4185869 -4168291 -4711674 -5570678 -6356502 -6928874 -7235648 -7041371
10616 -7041371 -6453508 -5978591 -5969123 -6366120 -6794949 -6886382 -6672886 -6481873 -6246648 -5809449
$$ packed form
10686e270003p45742p59337m16180j37331p2334J0969N0799K6902q8966l02674
10676g703897m47384k98512J135J98048L48356M03668K08496l1389j59249n8294
10666g539022L07630O66925N93082K60861M7635O6704K95454L90083K69656L7993
10656d602999k92370m63038k98446j16549k6220j26241k87918l1605L10663K69951
10646e664772o0661m65469n89486k87232N5455K6869l36485n04252j94211J94055
10636g826189M28305M77730K26490r1067j36600Q9094M28137O65062N58718K49435
10626d930885J30856K75920L38240J7578n43383q59004p85824n72372l06774J94277
10616g041371N87863M74917R468l96997m28829r1433K13496J91013K35225M37199
$$ plain form
10606 -5809449 -5340677 -5022741 -4784609 -4480870 -4205962 -4170517 -4344012 -4522197 -4525385 -4391990
10596 -4391990 -4164640 -3814674 -3515241 -3293038 -2847578 -2248488 -1990238 -2363614 -3117883
10587 -3117883 -4053745 -4991082 -5521177 -5488308 -5090677 -4729762 -4702955 -4979078 -5196409 -5150152
10577 -5150152 -5009626 -5033152 -5431593 -6208033 -6912099 -7058225 -6705411 -6256953 -6051244 -6081306
10567 -6081306 -6031346 -5716954 -5240500 -4825796 -4694016 -4824706 -5022578 -5068617 -4871967 -4608151
10557 -4608151 -4451957 -4480639 -4788999 -5316549 -5733047 -5866694 -5871799 -5954668 -6112837 -6358030
10547 -6358030 -6710382 -7026730 -7031213 -6763011 -6593513 -6612141 -6815634 -7355220 -8127264 -8782376
10537 -8782376 -9045480 -8743483 -7837712 -6704842 -5923938 -5782025 -5934724 -6002226 -5930848 -5676268
$$ packed form
10606e809449M68772L17936K38132L03739K74908L5445j73495j78185l188J33395
10596d391990K27350L49966K99433K22203M45460N99090K58250l73376p54269
10587c117883r35862r37337n30095L2869L97631L60915K6807k76123k17331M6257
10577e150152J40526k3526l98441p76440p04066j46126L52814M48458K05709l0062
10567f081306M9960L14392M76454M14704J31780j30690j97872m6039J96650K63816
10557d608151J56194k8682l08360n27550m16498j33647n105q2869j58169k45193
10547f358030l52352l16348m483K68202J69498j8628k03493n39586p72044o55112
10537h782376k63104L01997R05771J132870P80904J41913j52699o7502P1378K54580
$$ plain form
10527 -5676268 -5573384 -5897893 -6379763 -6637724 -6571421 -6267029 -6065125 -6130554 -6214191 -6250018
10517 -6250018 -6381383 -6552333 -6617644 -6526072 -6221418 -5851942 -5749335 -5933502 -6093841 -5962434
10507 -5962434 -5517539 -5020042 -4753371 -4833512 -4976437 -4865817 -4508787 -4112393 -3991066 -4478181
10497 -4478181 -5638504 -6806813 -7347027 -7310216 -6942284 -6289806 -5288971 -4186669 -3446399
10488 -3446399 -3398367 -3951783 -4871390 -5855366 -6697042 -7569287 -8526324 -9193432 -9348184 -9148112
10478 -9148112 -8795054 -8423668 -7973500 -7549283 -7183932 -6766789 -6464106 -6585137 -7081172
10469 -7081172 -7597197 -8016428 -8271435 -8172797 -7849538 -7801815 -8267825 -8978967 -9421821 -9385437
10459 -9385437 -9036841 -8603152 -8431485 -8480204 -8541108 -8534720 -8347141 -8128026 -8225567 -8531685
$$ packed form
10527e676268J02884l24509m81870k57961O6303L04392K01904o5429q3637l5827
10517f250018j31365j70950o5311R1572L04654L69476J02607j84167j60339J31407
10507e962434M44895M97497K66671q0141j42925J10620L57030L96394J21327m87115
10497d478181j160323j168309n40214L6811L67932O52478J000835J102302P40270
10488c446399M8032n53416r19607r83976q41676q72245r57037o67108j54752K00072
10478i148112L53058L71386M50168M24217L65351M17143L02683j21031m96035
10469g081172n16025m19231k55007R8638L23259M7723m66010p11142m42854L6384
10459i385437L48596M33689J71667m8719o0904O388J87579K19115r7541l06118
$$ plain form
10449 -8531685 -8849171 -8982290 -8757393 -8403229 -8043126 -7802091 -8061635 -8551657 -8658858
10440 -8658858 -8341329 -8019189 -8016282 -8274768 -8704202 -9077460 -9192901 -9111396 -8790813 -8296126
10430 -8296126 -8022007 -8026036 -8128022 -8227473 -8127413 -7874779 -7711566 -7816436 -8085438 -8203780
10420 -8203780 -8170598 -8213077 -8173923 -7717419 -6933226 -6159384 -5506944 -5066900 -5150818 -5844621
10410 -5844621 -6937107 -8064135 -8903683 -9333175 -9182297 -8445080 -7600542 -7069176 -6893684
10401 -6893684 -6992421 -7261242 -7572897 -7930085 -8163366 -8041936 -7779348 -7823126 -8302934 -9168478
10391 -9168478 -10234977 -11094418 -11298747 -10807476 -10208610 -10006695 -10251955 -10706080 -11047764
10382 -11047764 -11154092 -10986423 -10553619 -9958414 -9215526 -8372793 -7513825 -6742339 -6215276
$$ packed form
10449h531685l17486j33119K24897L54164L60103K41035k59544m90022j07201
10440h658858L17529L22140K907k58486m29434l73258j15441Q1505L20583M94687
10430h296126K74119m029j01986r9451J00060K52634J63213j04870k69002j18342
10420h203780L3182m2479L9154M56504P84193P73842O52440M40044q3918o93803
10410e844621j092486j127028q39548m29492J50878P37217Q44538N31366J75492
10401f893684r8737k68821l11655l57188k33281J21430K62588m3778m79808q65544
10391i168478j066499q59441k04329M91271N98866K01915k45260m54125l41684
10382a1047764j06328J67669M32804N95205P42888Q42733Q58968P71486N27063
$$ plain form
10373 -6215276 -5944688 -5828224 -5526884 -4947184 -4535121 -4608596 -5127075 -6088653 -7585852
10364 -7585852 -9322253 -10706780 -11282571 -11066577 -10559043 -10241947 -10169505 -10095453 -10053217 -10300947
10354 -10300947 -10807865 -11326644 -11691327 -11972692 -12287911 -12557629 -12588863 -12293914 -11835630
10345 -11835630 -11421729 -11085591 -10797703 -10647939 -10477941 -9971985 -9405446 -8955068 -8532925
10336 -8532925 -8192299 -7919311 -7714073 -7605667 -7793029 -8380175 -9135698 -9645286 -9486432
10327 -9486432 -8828623 -8139691 -7433826 -6603472 -5860240 -5628152 -5928485 -6323121 -6389891 -6052562
10317 -6052562 -5843037 -6226995 -6985123 -7725554 -8333278 -8652415 -8715160 -8956510 -9370612 -9666578
10307 -9666578 -9836964 -9754782 -9214838 -8452690 -7710890 -7017351 -6730682 -7132847 -7833638 -8207910
$$ packed form
10373f215276K70588J16464L01340N79700M12063p3475n18479r61578j497199
10364g585852j736401j384527n75791K15994N07534L17096P2442P4052M2236k47730
10354a0300947n06918n18779l64683k81365l15219k69718l1234K94949M58284
10345a1835630M13901L36138K87888J49764J69998N05956N66539M50378M22143
10336h532925L40626K72988K05238J08406j87362n87146p55523n09588J58854
10327i486432O57809O88932P05865Q30354P43232K32088l00333l94636o6770L37329
10317f052562K09525l83958p58128p40431o07724l19137o2745k41350m14102k95966
10307i666578j70386Q2182N39944P62148P41800O93539K86669m02165p00791l74272
$$ plain form
10297 -8207910 -7924616 -7243274 -6556410 -6089239 -5962467 -5998895 -5854963 -5817247 -6404619 -7584554
10287 -7584554 -8871169 -9796250 -10287721 -10321175 -9897644 -9213462 -8731069 -8624537 -8807876
10278 -8807876 -9069189 -9117638 -8873209 -8256487 -7412866 -6805039 -6622455 -6775628 -7040185 -7397726
10268 -7397726 -7876911 -8375038 -8781712 -8997616 -9163195 -9289505 -9290554 -9220560 -9174764 -8994356
10258 -8994356 -8532067 -7782232 -6933501 -6351955 -6174899 -6015531 -5773866 -5763552 -5945147 -6093510
10248 -6093510 -6139372 -6168619 -6263576 -6388299 -6577102 -7068533 -7595061 -7680131 -7241133 -6447933
10238 -6447933 -5739191 -5626061 -6107075 -6836586 -7479283 -7882776 -8033723 -8002821 -7917701 -7914701
10228 -7914701 -8217391 -8768351 -9408003 -10196340 -11063671 -11723410 -11955476 -11828668 -11549575
$$ packed form
10297h207910K83294O81342O86864M67171J26772l6428J43932L7716n87372j179935
10287g584554j286615r25081m91471l3454M23531O84182M82393J06532j83339
10278h807876k61313m8449K44429O16722Q43621O07827J82584j53173k64557l57541
10268g397726m79185m98127m06674k15904j65579j26310j049O9994M5796J80408
10258h994356M62289P49835Q48731N81546J77056J59368K41665J0314j81595j48363
10248f093510m5862k9247r4957j24723j88803m91431n26528q5070M38998P93200
10238f447933P08742J13130m81014p29511o42697m03493j50947L0902Q5120L000
10228g914701l02690n50960o39652p88337q67331o59739k32066J26808K79093
$$ plain form
10219 -11549575 -11251831 -10851300 -10228304 -9548559 -8995327 -8705108 -8673508 -8714706 -8690223 -8517899
10209 -8517899 -8234309 -7995761 -7982118 -8141208 -8336717 -8575805 -8989367 -9560339 -10152689 -10590963
10199 -10590963 -10611957 -10193025 -9515987 -8844984 -8453088 -8426013 -8750049 -9184068 -9383921 -9442183
10189 -9442183 -9405969 -9164206 -8993750 -8917101 -8658897 -8233185 -7931642 -7908885 -7950162 -7847712
10179 -7847712 -7501800 -7020050 -6807443 -7031845 -7361210 -7464951 -7490879 -7790170 -8377544 -8900880
10169 -8900880 -9072818 -9072064 -8923877 -8544424 -8125328 -7951111 -8049628 -8014833 -7729960 -7493465
10159 -7493465 -7453533 -7643871 -7976626 -8286687 -8414928 -8452628 -8580845 -8673114 -8582116 -8404011
10149 -8404011 -8361822 -8671197 -9268300 -9736938 -9762156 -9314070 -8477726 -7486982 -6742803 -6431041
$$ packed form
10219a1549575K97744M00531O22996O79745N53232K90219L1600m1198K4483J72324
10209h517899K83590K38548J3643j59090j95509k39088m13562n70972n92350m38274
10199a0590963k0994M18932O77038O71003L91896K7075l24036m34019j99853n8262
10189i442183L6214K41763J70456P6649K58204M25712L01543K2757m1277J02450
10179g847712L45912M81750K12607k24402l29365j03741k5928k99291n87374n23336
10169h900880j71938P54J48187L79453M19096J74217r8517L4795K84873K36495
10159g493465L9932j90338l32755l10061j28241l7700j28217r2269R0998J78105
10149h404011M2189l09375n97103m68638k5218M48086Q36344R90744P44179L11762
$$ plain form
10139 -6431041 -6241870 -5907969 -5798765 -6276491 -6974583 -7668794 -8468107 -9176290 -9493927
10130 -9493927 -9445048 -9574250 -10064439 -10507642 -10827248 -11226786 -11414931 -11135905 -10618698 -10034553
10120 -10034553 -9380798 -8580598 -7718990 -7209971 -7079991 -6972005 -6669602 -6156128 -5823668
10111 -5823668 -5999113 -6486183 -7083089 -7820098 -8458119 -8762475 -8895608 -9048288 -9093951 -8723554
10101 -8723554 -7999927 -7236441 -6729912 -6469314 -6277869 -6352814 -6823202 -7431880 -7970392 -8187433
10091 -8187433 -8134199 -8183008 -8370966 -8436265 -8235235 -7904127 -7751740 -8047058 -8616930 -9046370
10081 -9046370 -9209659 -9247304 -9100743 -8587598 -7860231 -7414603 -7413468 -7454680 -7292894 -7003542
10071 -7003542 -6713041 -6645807 -6961395 -7473598 -7969880 -8395751 -8706760 -8775817 -8655750 -8628819
$$ packed form
10139f431041J89171L33901J09204m77726o98092o94211p99313p08183l17637
10130i493927M8879j29202m90189m43203l19606l99538j88145K79026N17207N84145
10120a0034553O53755Q00200Q61608N09019J29980J07986L02403N13474L32460
10111e823668j75445m87070n96906p37009o38021l04356j33133j52680m5663L70397
10101h723554P23627P63486N06529K60598J91445p4945m70388o08678n38512k17041
10091h187433N3234m8809j87958o5299K01030L31108J52387k95318n69872m29440
10081i046370j63289l7645J46561N13145P27367M45628J135m1212J61786K89352
10071g003542K90501O7234l15588n12203m96282m25871l11009o9057J20067K6931
$$ plain form
10061 -8628819 -8666714 -8508368 -8063084 -7491992 -7054750 -6764699 -6603103 -6750760 -7143244 -7558117
10051 -7558117 -7736579 -7517021 -7161266 -6930857 -6791220 -6666420 -6769646 -7206539 -7378350
10042 -7378350 -6763176 -5445758 -3868858 -2429653 -1066849 436104 1978335 3385474
10034 3385474 4861729 6648986 8602894 10606105 12998768 16352593 20964612 26725695
10026 26725695 33348911 40732090 49343889 59887735 72998480 89574801 110324651
10019 110324651 134937960 161445346 186126615 205513456 216850367 218253876 211421020
10012 211421020 200269217 186783221 171924807 158137734 148504157 144958288 148153965
10005 148153965 157835712 172636765 190716650 211332648 234857470 261543157 291285368
$$ packed form
10061h628819l7895J58346M45284N71092M37242K90051J61596j47657l92484m14873
10051g558117j78462K19558L55755K30409J39637J24800j03226m36893j71811
10042g378350O15174J317418J576900J439205J362804J502953J542231J407139
10034C385474J476255J787257J953908K003211K392663L353825M612019N761083
10026B6725695O623216P383179Q611799J0543846J3110745J6576321K0749850
10019A10324651K4613309K6507386K4681269J9386841J1336911J403509o832856
10012B11421020j1151803j3485996j4858414j3787073r633577l545869L195677
10005A48153965R681747J4801053J8079885K0615998K3524822K6685687K9742211
$$ plain form
9998 291285368 322857405 351025736 367931566 369538384 358512602 341245237 325210827
9991 325210827 315708424 311386299 301440105 274917213 236902880 200212369 171312261
9984 171312261 151038769 138301480 132051674 131825011 137307743 147865018 161112746 171127902
9976 171127902 171086687 160634798 145449749 131125605 120484221 113037937 106550429 98831500
9968 98831500 88316379 75746014 63694445 53707678 46050033 40155407 35496027 31649431
9960 31649431 28370673 25520223 23070544 21096786 19516900 18334252 17502394 16823817
9952 16823817 16151751 15421713 14873676 14932364 15928896 17828638 20448089 23737586 28031790
9943 28031790 33689879 40887031 49878326 60837236 74351317 91620325 113411071 138214556
$$ packed form
9998B91285368L1572037K8168331J6905830J606818j1025782j7267365j6034410
9991C25210827r502403m322125r946194k6522892l8014333l6690511k8900108
9984A71312261k0273492j2737289o249806k26663N482732J0557275J3247728J0015156
9976A71127902m1215j0451889j5185049j4324144j0641384p446284o487508p718929
9968I8831500j0515121j2570365j2051569r986767p657645n894626m659380l846596
9960C1649431l278758k850450k449679j973758j579886j182648q31858o78577
9952A6823817o72066p30038n48037N8688R96532J899742K619451L289497M294204
9943B8031790N658089P197152Q991295J0958910J3514081J7269008K1790746K4803485
$$ plain form
9935 138214556 159637388 166614501 153391809 127242658 99665907 76747109 59401024
9928 59401024 46729505 37434477 30537435 25563305 22140668 19812413 18024057 16294653
9920 16294653 14602517 13301058 12354451 11333861 10090691 8918811 7991880 7026940 5996376
9911 5996376 5279288 4838507 4327909 3644945 2867095 1973470 1034150 471335 664199 1534446
9901 1534446 2486774 3102325 3369931 3519112 3927374 4737683 5522937 5940182 6256334 6875061
9891 6875061 8009242 9684991 11935498 14630401 17563979 20948547 25006201 29932869
9883 29932869 35992604 43474885 52555376 63116689 74556002 85589123 94266007 98004048
9875 98004048 94741136 84712479 70889480 56589917 43953996 33746867 25739245
$$ packed form
9935A38214556K1422832O977113j3222692k6149151k7576751k2918798j7346085
9928E9401024j2671519r295028o897042m974130l422637k328255j788356j729404
9920A6294653j692136j301459r46607j020590j243170j171880r26931r64940j030564
9911E996376p17088m40781n10598o82964p77850q93625r39320n62815J92864Q70247
9901A534446R52328O15551K67606J49181M08262Q10309P85254M17245L16152O18727
9891F875061J134181J675749K250507K694903K933578L384568M057654M926668
9883B9932869O059735P482281R080491J0561313J1439313J1033121Q676884L738041
9875I8004048l262912j0028657j3822999j4299563j2635921j0207129q007622
$$ plain form
9868 25739245 19591139 14813993 10799446 7167068 3931454 1485083 -67845 -1045181
9860 -1045181 -1632803 -1818525 -1687528 -1452851 -1305050 -1565627 -2225246 -2889069 -3390316 -3774020
9850 -3774020 -4113357 -4334765 -4354921 -4411586 -4709575 -5139955 -5499832 -5593156 -5353003 -4984839
9840 -4984839 -4685704 -4349422 -3834681 -3368096 -3370023 -3754524 -4091641 -4261509 -4432826 -4570471
9830 -4570471 -4787344 -5139666 -5309388 -5120268 -5025364 -5378944 -5820983 -6082053 -6113603 -5957850
9820 -5957850 -5700768 -5535519 -5614374 -5788700 -5829273 -5763206 -5811589 -5915958 -5703255 -5031995
9810 -5031995 -4164771 -3428895 -3093306 -3388596 -4070998 -4564931 -4981815 -5514400 -5991126 -6172224
9800 -6172224 -6022910 -5915653 -5956539 -5922394 -5757071 -5545992 -5424932 -5325714 -5043792 -4701680
$$ packed form
9868B5739245o148106m777146m014547l632378l235614k446371j552928r77336
9860a045181n87622j85722J30997K34677J47801k60577o59619o63823n01247l83704
9850c774020l39337k21408k0156n6665k97989m30380l59877r3324K40153L68164
9840d984839K99135L36282N14741M66585j927l84501l37117j69868j71317j37645
9830d570471k16873l52322j69722J89120R4904l53580m42039k61070l1550J55753
9820e957850K57082J65249p8855j74326m0573O6067m8383j04369K12703O71260
9810e031995Q67224P35876L35589k95290o82402m93933m16884n32585m76726j81098
9800f172224J49314J07257m0886L4145J65323K11079J21060R9218K81922L42112
$$ plain form
9790 -4701680 -4719335 -5045768 -5241261 -5182110 -5048809 -4972348 -4899384 -4867817 -4918585 -5147133 -5719149
9779 -5719149 -6590636 -7543886 -8239301 -8429106 -8315779 -8219745 -8214560 -8150755 -7997051 -7693689
9769 -7693689 -7182631 -6579926 -6017590 -5458496 -4747935 -4016243 -3722700 -4094966 -4595215 -4833245
9759 -4833245 -5029627 -5366533 -5709715 -5980142 -6264454 -6678742 -7181131 -7724077 -8367038 -9067504
9749 -9067504 -9733243 -10206487 -10468066 -10692093 -11102458 -11691947 -12196893 -12536255 -12754346 -12576627
9739 -12576627 -11767709 -10585141 -9453601 -8500811 -7602242 -6831244 -6442757 -6396076 -6371324
9730 -6371324 -6382826 -6770421 -7467308 -8128302 -8614958 -8689144 -8262181 -7761961 -7424170 -7221562
9720 -7221562 -7222058 -7498909 -7706590 -7422503 -6876053 -6582693 -6940532 -8114747 -9539487 -10544615
$$ packed form
9790d701680j7655l26433j95493N9151J33301P6461P2964L1567n0768k28548n72016
9779e719149q71487r53250o95415j89805J13327R6034N185O3805J53704L03362
9769g693689N11058O02705N62336N59094P10561P31692K93543l72266n00249k38030
9759d833245j96382l36906l43182k70427k84312m14288n02389n42946o42961p00466
9749i067504o65739m73244k61579k24027m10365n89489n04946l39362k18091J77719
9739a2576627Q08918J182568J131540R52790Q98569P70998L88487M6681K4752
9730f371324j1502l87595o96887o60994m86656p4186M26963N00220L37791K02608
9720g221562m96k76851k07681K84087N46450K93360l57839j174215j424740j005128
$$ plain form
9710 -10544615 -10927316 -10642623 -9896102 -8820492 -7453978 -6119343 -5273958 -5030905 -5078972
9701 -5078972 -5278760 -5649279 -6149513 -6840228 -7608692 -8075540 -8213613 -8325118 -8595465 -9009075
9691 -9009075 -9369027 -9539645 -9554632 -9379353 -8824586 -7988532 -7109131 -6214669 -5506209 -5531373
9681 -5531373 -6451903 -7383112 -7427343 -6643415 -5660595 -5102120 -5192496 -5811425 -6647420 -7379358
9671 -7379358 -7650127 -7455027 -7103753 -6694021 -6158118 -5495699 -4969642 -4617445 -4359148 -4301467
9661 -4301467 -4463457 -4767809 -5383964 -6353711 -7333264 -8160681 -8910467 -9586078 -9989941 -9791300
9651 -9791300 -8874524 -7771310 -7066320 -6840328 -6761229 -6667891 -6611599 -6654702 -7013943 -7667309
9641 -7667309 -8108112 -7878204 -7148918 -6424423 -5936751 -5646119 -5496539 -5532049 -5855033 -6300337
$$ packed form
9710a0544615l82701K84693P46521J075610J366514J334635Q45385K43053m8067
9701e078972j99788l70519n00234o90715p68464m66848j38073j11505k70347m13610
9691i009075l59952j70618j4987J75279N54767Q36054Q79401Q94462P08460k5164
9681e531373r20530r31209m4231P83928R82820N58475r0376o18929q35995p31938
9671g379358k70769J95100L51274M09732N35903O62419N26057L52197K58297N7681
9661d301467j61990l04352o16155r69747r79553q27417p49786o75611m03863J98641
9651i791300R16776J103214P04990K25992P9099R3338N6292m3103l59241o53366
9641g667309m40803K29908P29286P24495M87672K90632J49580l5510l22984m45304
$$ plain form
9631 -6300337 -6621468 -6792122 -6779715 -6445624 -5914448 -5551470 -5609679 -5819889 -5792389 -5534916
9621 -5534916 -5407391 -5863554 -6770021 -7750007 -8460089 -8783132 -8800433 -8727462 -8707318 -8427294
9611 -8427294 -7855078 -7511439 -7579228 -7676844 -7512636 -7054553 -6464960 -6130924 -6322843 -6825174
9601 -6825174 -7229874 -7235846 -6945938 -6728814 -6927764 -7575040 -8354829 -8988731 -9140421 -8769091
9591 -8769091 -8187851 -7660998 -7488564 -7742972 -8070392 -8158803 -8013425 -7730038 -7567915 -7601823
9581 -7601823 -7604300 -7578600 -7742327 -7893934 -7720532 -7394923 -7265737 -7327328 -7474866 -7660932
9571 -7660932 -7748676 -7703598 -7529950 -7243521 -6833462 -6501489 -6387083 -6584254 -7086014 -7471932
9561 -7471932 -7693658 -8059182 -8369260 -8175605 -7604583 -7312750 -7579657 -8103162 -8495837 -8613851
$$ packed form
9631f300337l21131j70654J2407L34091N31176L62978n8209k10210K7500K57473
9621e534916J27525m56163r06467r79986p10082l23043j7301P2971K0144K80024
9611h427294N72216L43639o7789r7616J64208M58083N89593L34036j91919n02331
9601f825174m04700n972K89908K17124j98950o47276p79789o33902j51690L71330
9591h769091N81240N26853J72434k54408l27420q8411J45378K83387J62123l3908
9581g601823k477K5700j63727j51607J73402L25609J29186o1591j47538j86066
9571g660932q7744M5078J73648K86429M10059L31973J14406j97171n01760l85918
9561g471932k21726l65524l10078J93655N71022K91833k66907n23505l92675j18014
$$ plain form
9551 -8613851 -8393506 -8046008 -8118627 -8558267 -8822893 -8745714 -8615757 -8758191 -9197497 -9607220
9541 -9607220 -9757346 -9934225 -10256557 -10356113 -10092302 -9708827 -9332785 -8924413 -8480446 -8102319
9531 -8102319 -7926729 -7772830 -7603439 -7575266 -7661118 -7685870 -7514474 -7030862 -6465122 -6015618
9521 -6015618 -5348490 -4522363 -4031028 -4109252 -4815901 -5822289 -6593912 -7089477 -7611840 -8328670
9511 -8328670 -9106155 -9475512 -9310831 -9046642 -8882701 -8775905 -8591418 -8404666 -8279457 -8080720
9501 -8080720 -7741757 -7229218 -6808439 -6558915 -6406106 -6486903 -6619077 -6729497 -7100270 -7756781
9491 -7756781 -8433967 -8931579 -9089393 -8883594 -8357473 -7688709 -7263307 -7050220 -6662327 -6151877
9481 -6151877 -5736122 -5466075 -5434316 -5503326 -5564528 -5679468 -5945874 -6393935 -6928736 -7427710
$$ packed form
9551h613851K20345L47498p2619m39640k64626P7179J29957j42434m39306m09723
9541i607220j50126j76879l22332r9556K63811L83475L76042M08372M43967L78127
9531h102319J75590J53899J69391K8173q5852k4752J71396M83612N65740M49504
9521f015618O67128Q26127M91335p8224p06649j006388p71623m95565n22363p16830
9511h328670p77485l69357J64681K64189J63941J06796J84487J86752J25209J98737
9501h080720L38963N12539M20779K49524J52809q0797j32174j10420l70773o56511
9491g756781o77186m97612j57814K05799N26121O68764M25402K13087L87893N10450
9481f151877M15755K70047L1759o9010o1202j14940k66406m48061n34801m98974
$$ plain form
9471 -7427710 -7781601 -8083502 -8557648 -9150158 -9422165 -9019006 -8084794 -6916536 -5836131
9462 -5836131 -5240113 -5187839 -5467793 -5721591 -5622684 -5227382 -4856482 -4723203 -4854689 -5256785
9452 -5256785 -5687889 -5817042 -5769636 -5739341 -5924851 -6537375 -7328665 -7654468 -7539468 -7478124
9442 -7478124 -7603454 -7604412 -7289588 -6909847 -6881196 -7363260 -7869189 -7839910 -7398600 -6921479
9432 -6921479 -6409410 -5875145 -5490537 -5407182 -5494178 -5418468 -5136203 -4817038 -4705060 -4955866
9422 -4955866 -5381092 -5643807 -5636788 -5628421 -5856392 -6384076 -7167021 -7782220 -7952114 -7982350
9412 -7982350 -8243862 -8788622 -9378486 -9669417 -9448800 -8668952 -7640853 -6768388 -6266787
9403 -6266787 -6206486 -6571732 -6970143 -6843434 -6469024 -6507611 -6826528 -6820736 -6349979 -5886176
$$ packed form
9471g427710l53891l01901m74146n92510k72007M03159R34212J168258J080405
9462e836131N96018N2274k79954k53798R8907L95302L70900J33279j31486m02096
9452e256785m31104j29153M7406L0295j85510o12524p91290l25803J15000O1344
9442g478124j25330r58L14824L79741K8651m82064n05929K9279M41310M77121
9432f921479N12069N34265L84608Q3355q6996P5710K82265L19165J11978k50806
9422d955866m25226k62715P019Q367k27971n27684p82945o15199j69894l0236
9412g982350k61512n44760n89864k90931K20617P79848J028099Q72465N01601
9403f266787O0301l65246l98411J26709L74410l8587l18917N792M70757M63803
$$ plain form
9393 -5886176 -5716670 -5807173 -6059805 -6294785 -6361780 -6336849 -6392460 -6455157 -6349352 -5978607
9383 -5978607 -5319503 -4516920 -4167901 -4562882 -5295834 -6011679 -6511969 -6696528 -6719409 -6688271
9373 -6688271 -6654405 -6670106 -6860341 -7070975 -6853716 -6110556 -5295504 -4809063 -4676447 -4656601
9363 -4656601 -4378828 -3777581 -3246223 -2993565 -2822954 -2739219 -2890897 -3137453 -3271116 -3355936
9353 -3355936 -3649003 -4111676 -4458344 -4696422 -5001845 -5245403 -5157168 -4772276 -4247594 -3634389
9343 -3634389 -3172507 -3088790 -3461760 -4191302 -4950019 -5537659 -5969614 -6198704 -6200822 -6081625
9333 -6081625 -5911865 -5716405 -5580611 -5694899 -6068897 -6532422 -6782675 -6697032 -6333616 -5675432
9323 -5675432 -4914602 -4322666 -4039346 -4106675 -4367458 -4861757 -5688676 -6503501 -6901881 -6600462
$$ packed form
9393e886176J69506r0503k52632k34980o6995K4931n5611o2697J05805L70745
9383e978607O59104Q02583L49019l94981p32952p15845n00290j84559k2881L1138
9373f688271L3866j5701j90235k10634K17259P43160Q15052M86441J32616J9846
9363d656601K77773O01247N31358K52658J70611Q3735j51678k46556j33663q4820
9353c355936k93067m62673l46668k38078l05423k43558Q8235L84892N24682O13205
9343c634389M61882Q3717l72970p29542p58717n87640m31955k29090k118J19197
9333f081625J69760J95460J35794j14288l73998m63525k50253Q5643L63416O58184
9323e675432P60830N91936K83320o7329k60783m94299q26919q14825l98380L01419
$$ plain form
9313 -6600462 -5838453 -5217169 -4960324 -5145485 -5788940 -6553470 -7045868 -7165751 -6980516 -6782662
9303 -6782662 -6754378 -6725462 -6528664 -6145062 -5887379 -5868793 -5808434 -5507864 -5056214 -4682338
9293 -4682338 -4512611 -4434036 -4310478 -4238457 -4282215 -4287812 -4056157 -3610122 -3109429 -2848573
9283 -2848573 -3115561 -3918594 -4864732 -5518263 -5949944 -6314061 -6614043 -6918129 -7131103 -7117630
9273 -7117630 -7066744 -6892946 -6194012 -4991930 -3731901 -2901387 -2833554 -3519233 -4390474 -4832361
9263 -4832361 -4879685 -4679014 -4255247 -3724040 -3199147 -2576533 -1895246 -1486356 -1651750 -2395845
9253 -2395845 -3416408 -4253331 -4528862 -4220049 -3717430 -3674982 -4511360 -5775453 -6698080
9244 -6698080 -6930734 -6864948 -6971304 -6931992 -6407032 -5591684 -4763396 -4055831 -3593328 -3347969
$$ packed form
9313f600462P62009O21284K56845j85161o43455p64530m92398j19883J85235J97854
9303f782662K8284K8916J96798L83602K57683J8586O0359L00570M51650L73876
9293d682338J69727P8575J23558P2021m3758n597K31655M46035N00693K60856
9283b848573k66988q03033r46138o53531m31681l64117k99982l04086k12974J3473
9273g117630N0886J73798O98934J202082J260029Q30514O7833o85679q71241m41887
9263d832361m7324K00671M23767N31207N24893O22614O81287M08890j65394p44095
9253b395845j020563q36923k75531L08813N02619M2448q36378j264093r22627
9244f698080k32654O5786j06356L9312N24960Q15348Q28288P07565M62503K45359
$$ plain form
9234 -3347969 -3174445 -3017156 -2923269 -2707029 -2234266 -1570430 -1421650 -2135984 -3039400 -3434130
9224 -3434130 -3252347 -2735987 -2358414 -2497343 -2911103 -3127142 -3101590 -3067622 -2995009 -2717414
9214 -2717414 -2235221 -1784556 -1588570 -1660975 -1895200 -2252363 -2722845 -3354911 -4090994 -4647666
9204 -4647666 -4960759 -5239307 -5550059 -5842336 -6100549 -6231504 -6165327 -5887704 -5421056 -5099352
9194 -5099352 -5221474 -5536840 -5778328 -6075134 -6535150 -7057175 -7526406 -7791487 -7691610 -7293406
9184 -7293406 -6859007 -6558849 -6452178 -6450208 -6471035 -6322629 -5787877 -5058647 -4533414 -4253267
9174 -4253267 -3999736 -3662783 -3321857 -3072751 -3135347 -3690177 -4294591 -4466945 -4130470 -3542306
9164 -3542306 -2954673 -2538189 -2611687 -3115441 -3749689 -4353109 -4909162 -5519506 -6165786 -6749885
$$ packed form
9234c347969J73524J57289R3887K16240M72763O63836J48780p14334r03416l94730
9224c434130J81783N16360L77573j38929m13760k16039K5552L3968P2613K77595
9214b717414M82193M50665J95986p2405k34225l57163m70482o32066p36083n56672
9204d647666l13093k78548l10752k92277k58213j30955O6177K77623M66648L21704
9194e099352j22122l15366k41488k96806m60016n22025m69231k65081R9877L98204
9184g293406M34399L00158J06671J970k0827J48406N34752P29230N25233K80147
9174d253267K53531L36953L40926K49106o2596n54830o04414j72354L36475N88164
9164c542306N87633M16484p3498n03754o34248o03420n56053o10344o46280n84099
$$ plain form
9154 -6749885 -7014614 -6876943 -6518740 -5993383 -5428608 -4946043 -4507020 -3947542 -3374269 -3070133
9144 -3070133 -2992395 -2931188 -2727206 -2262406 -1681011 -1235501 -976936 -916133 -1173592 -1807162
9134 -1807162 -2742573 -3606399 -4048070 -4385361 -4932550 -5468174 -5581040 -5242785 -4631433 -4082855
9124 -4082855 -3800426 -3652467 -3576815 -3527774 -3488646 -3606210 -3963913 -4425539 -4911738 -5288252
9114 -5288252 -5362992 -5138899 -4574037 -3972279 -3711177 -3686280 -3778685 -3994664 -4305228 -4622326
9104 -4622326 -4762508 -4411747 -3687516 -2975379 -2403462 -2184359 -2340926 -2405865 -2215553 -1905190
9094 -1905190 -1345543 -532643 212669 404588 -33312 -876092 -1793519 -2544048 -2818208 -2525469
9084 -2525469 -2231590 -2225188 -2182148 -2106316 -2263279 -2663438 -3220887 -4007295 -5100032 -6051898
$$ packed form
9154f749885k64729J37671L58203N25357N64775M82565M39023N59478N73273L04136
9144c070133P7738O1207K03982M64800N81395M45510K58565O0803k57459o33570
9134a807162r35411q63826m41671l37291n47189n35624j12866L38255O11352N48578
9124d082855K82429J47959P5652M9041L9128j17564l57703m61626m86199l76514
9114e288252p4740K24093N64862O01758K61102K4897r2405k15979l10564l17098
9104d622326j40182L50761P24231P12137N71917K19103j56567o4939J90312L10363
9094a905190N59647Q12900P45312J91919m37900q42780r17427p50529k74160K92739
9084b525469K93879O402M3040P5832j56963m00159n57449p86408j092737r51866
$$ plain form
9074 -6051898 -6319989 -5962249 -5439541 -5219266 -5346379 -5430109 -5423082 -5477297 -5604210 -5678248
9064 -5678248 -5762047 -6009195 -6199173 -6098139 -5715198 -5279694 -4997456 -4906447 -5049455 -5318786
9054 -5318786 -5519017 -5767687 -6140943 -6539561 -6949907 -7415408 -7611741 -7400353 -6982219 -6416644
9044 -6416644 -5784051 -5100674 -4361846 -3764885 -3499331 -3501500 -3747879 -4169655 -4560139 -4933007
9034 -4933007 -5255172 -5491469 -5736776 -5822837 -5508087 -4881689 -4345817 -4114421 -3998105 -3870650
9024 -3870650 -3510067 -2760183 -1976805 -1382057 -1130971 -1340862 -1799173 -2069804 -2014435 -1972036
9014 -1972036 -2236228 -2784513 -3384940 -3723674 -3729132 -3421425 -2885748 -2549949 -2867193 -3996137
9004 -3996137 -5526334 -6977293 -8181293 -8854609 -8836536 -8465383 -8063796 -7671407 -7235432
$$ packed form
9074f051898k68091L57740N22708K20275j27113q3730P027n4215j26913p4038
9064e678248q3799k47148j89978J01034L82941M35504K82238R1009j43008k69331
9054e318786k00231k48670l73256l98618m10346m65501j96333K11388M18134N65575
9044f416644O32593O83377P38828N96961K65554k169k46379m21776l90484l72868
9034d933007l22165k36297k45307q6061L14750O26398N35872K31396J16316J27455
9024c870650L60583P49884P83378N94748K51086k09891m58311k70631N5369M2399
9014a972036k64192n48285o00427l38734n458L07707N35677L35799l17244j128944
9004c996137j530197j450959j204000o73316J8073L71153M01587L92389M35975
$$ plain form
8995 -7235432 -6836925 -6405963 -5745974 -5103288 -4675223 -4358364 -4083782 -3771677 -3413268 -3100695
8985 -3100695 -2920745 -2976067 -3210310 -3565789 -4044447 -4497003 -4932342 -5317863 -5512421 -5632622
8975 -5632622 -5875779 -6152343 -6057668 -5561163 -5037006 -4714583 -4602042 -4548130 -4334240 -4116159
8965 -4116159 -4152794 -4245491 -4228028 -4266336 -4235190 -4037684 -3866605 -3629865 -3281822 -3137624
8955 -3137624 -3186939 -3118382 -2943656 -2845835 -2747660 -2693720 -2823248 -2919442 -2612977 -2007133 -1403741
8944 -1403741 -984891 -901391 -1112041 -1520297 -2104452 -2706668 -3186422 -3509333 -3708927 -3733525
8934 -3733525 -3471751 -3077587 -3038493 -3465563 -3830358 -3785024 -3549860 -3209620 -2605121 -2028653
8924 -2028653 -1851451 -2003019 -2233058 -2502294 -2975166 -3604358 -4155645 -4632743 -5105966 -5279381
$$ packed form
8995g235432L98507M30962O59989O42686M28065L16859K74582L12105L58409L12573
8985c100695J79950n5322k34243l55479m78658m52556m35339l85521j94558j20201
8975e632622k43157k76564R4675M96505N24157L22423J12541N3912K13890K18081
8965d116159l6635r2697J7463l8308L1146J97506J71079K36740L48043J44198
8955c137624m9315O8557J74726R7821R8175N3940j29528r6194L06465O05844O03392
8944a403741M18850Q3500k10650m08256n84155o02216m79754l22911j99594k4598
8934c733525K61774L94164L9094m27070l64795M5334K35164L40240O04499N76468
8924b028653J77202j51568k30039k69236m72872o29192n51287m77098m73223j73415
$$ plain form
8914 -5279381 -5003703 -4741060 -4882618 -5225276 -5188049 -4485619 -3493347 -2685547 -2321380 -2355012
8904 -2355012 -2587042 -2873934 -2986356 -2819637 -2579925 -2573895 -2687557 -2705419 -2479641 -2141196
8894 -2141196 -1866800 -1567561 -1238938 -949455 -681651 -465555 -351076 -348775 -462088 -741181
8884 -741181 -1144204 -1548729 -1971951 -2579844 -3281420 -3719780 -3721498 -3446993 -3163347 -3047969
8874 -3047969 -3149310 -3290026 -3203387 -2880408 -2417455 -1861386 -1305605 -939366 -923603 -1151799
8864 -1151799 -1480107 -1835748 -2038493 -2092758 -2320266 -2924752 -3645881 -3894211 -3353464 -2513112
8854 -2513112 -1959467 -1712190 -1662625 -1633450 -1364974 -1062391 -1048032 -1332763 -1816850 -2303777
8844 -2303777 -2540553 -2499788 -2406737 -2327702 -2096316 -1764402 -1572471 -1565412 -1620953 -1893101 -2367161
$$ packed form
8914e279381K75678K62643j41558l42658L7227P02430R92272Q07800L64167l3632
8904b355012k32030k86892j12422J66719K39712O030j13662j7862K25778L38445
8894b141196K74396K99239L28623K89483K67804K16096J14479K301j13313k79093
8884g41181m03023m04525m23222o07893p01576m38360j718K74505K83646J15378
8874c047969j01341j40716Q6639L22979M62953N56069N55781L66239J5763k28196
8864a151799l28308l55641k02745n4265k27508o04486p21129k48330N40747Q40352
8854b513112N53645K47277M9565K9175K68476L02583J4359k84731m84087m86927
8844b303777k36776M0765R3051P9035K31386L31914J91931P059n5541k72148m74060
$$ plain form
8833 -2367161 -2790506 -3072732 -3076136 -2949175 -2729008 -2134833 -1344514 -773940 -532008 -490686
8823 -490686 -473869 -590609 -957874 -1478196 -2059800 -2568234 -2791174 -2788877 -2786834 -2839307 -2852094
8812 -2852094 -2915124 -3006226 -3021225 -3179900 -3386195 -3277292 -3009734 -2939381 -2971743 -2945311 -2914704
8801 -2914704 -3138453 -3531906 -3563366 -3103095 -2643224 -2475788 -2448923 -2263057 -1865900 -1523434
8791 -1523434 -1386769 -1425884 -1684745 -2241338 -2908455 -3270760 -3151179 -2850645 -2553910 -2298571
8781 -2298571 -2191759 -2330365 -2499988 -2421398 -2321365 -2606777 -3169307 -3610720 -3865846 -4160185
8771 -4160185 -4641494 -5178589 -5501068 -5595799 -5574531 -5461806 -5247486 -4985798 -4950184 -5478342
8761 -5478342 -6400668 -7011950 -6773641 -6020907 -5322904 -4699491 -3963982 -3131181 -2429561 -2223225
$$ packed form
8833b367161m23345k82226l404J26961K20167N94175P90319N70574K41932M1322
8823d90686J6817j16740l67265n20322n81604n08434k22940K297K043n2473j2787
8812b852094o3030r1102j4999j58675k06295J08903K67558P0353l2362K6432L0607
8801b914704k23749l93453l1460M60271M59871J67436K6865J85866L97157L42466
8791a523434J36665l9115k58861n56593o67117l62305J19581L00534K96735K55339
8781b298571J06812j38606j69623P8590J00033k85412n62530m41413k55126k94339
8771d160185m81309n37095l22479r4731K1268J12725K14320K61688L5614n28158
8761e478342r22326o11282K38309P52734O98003O23413P35509Q32801P01620K06336
$$ plain form
8751 -2223225 -2626676 -3099702 -3004413 -2473545 -1878786 -1430033 -1457264 -2092973 -3057528 -3831612
8741 -3831612 -4068762 -3835081 -3554711 -3338273 -3041774 -2749472 -2629638 -2532324 -2302366 -2181112
8731 -2181112 -2309167 -2708459 -3216101 -3512992 -3567210 -3511538 -3430668 -3298175 -3008744 -2582902
8721 -2582902 -2239281 -2163068 -2353265 -2624974 -2765393 -2986281 -3651990 -4427972 -4688057 -4611292
8711 -4611292 -4575351 -4581410 -4470739 -4283300 -4175165 -4030079 -3786772 -3711110 -3899770 -4087163
8701 -4087163 -4226534 -4428827 -4650263 -4826689 -4984966 -5125738 -5022414 -4524273 -3758756 -2842331
8691 -2842331 -2007950 -1411566 -970815 -498175 -100226 -43149 -292184 -624392 -809149 -755969
8681 -755969 -726631 -1019279 -1634596 -2258500 -2400193 -2020828 -1567357 -1209468 -885714 -722160
$$ packed form
8751b223225m03451m73026R5289N30868N94759M48753k7231o35709r64555p74084
8741c831612k37150K33681K80370K16438K96499K92302J19834R7314K29958J21254
8731b181112j28055l99292n07642k96891n4218N5672Q0870J32493K89431M25842
8721b582902L43621P6213j90197k71709j40419k20888o65709p75982k60085P6765
8711d611292L5941o059J10671J87439J08135J45086K43307P5662j88660j87393
8701d087163j39371k02293k21436j76426j58277j40772J03324M98141P65517R16425
8691b842331Q34381N96384M40751M72640L97949N7077k49035l32208j84757N3180
8681g55969K9338k92648o15317o23904j41693L79365M53471L57889L23754J63554
$$ plain form
8671 -722160 -777587 -857895 -825718 -745702 -710357 -799991 -978378 -1094286 -1095310 -1214855 -1606173
8660 -1606173 -2057778 -2300121 -2162777 -1696279 -1182803 -869057 -736050 -644717 -684334 -933419
8650 -933419 -1208073 -1231923 -917305 -534973 -441980 -782204 -1338262 -1725231 -1769008 -1344572
8640 -1344572 -662559 -422149 -714060 -1077120 -1496569 -2083114 -2541320 -2611463 -2339703 -1936019
8630 -1936019 -1463763 -922191 -522880 -448306 -627195 -951380 -1053445 -584838 357994 1342617
8620 1342617 2044726 2273476 1949348 1234020 400087 -417922 -1031410 -1247340 -1262894 -1348648
8610 -1348648 -1401427 -1044888 -382906 218715 726982 1177838 1285648 1069430 681588 143405
8600 143405 -320772 -423949 -205413 -212670 -800201 -1710513 -2577858 -3349468 -4001562 -4499885
$$ packed form
8671g22160n5427q0308L2177Q0016L5345q9634j78387j15908j024j19545l91318
8660a606173m51605k42343J37344M66498N13476L13746J33007R1333l9617k49085
8650i33419k74654k3850L14618L82332R2993l40224n56058l86969m3777M24436
8640a344572O82013K40410k91911l63060m19449n86545m58206p0143K71760M03684
8630a936019M72256N41572L99311P4574j78889l24185j02065M68607R42832R84623
8620A342617P02109K28750l24128p15328q33933q18009o13488k15930j5554q5754
8610a348648n2779L56539O61982O01621N08267M50856J07810k16218l87842n38183
8600A43405m64177j03177K18536p257n87531r10312q67345p71610o52094m98323
$$ plain form
8590 -4499885 -4965960 -5475018 -5905410 -6141297 -6121441 -5862808 -5420670 -5040046 -4723218 -4308768
8580 -4308768 -3985534 -3699963 -3136340 -2397783 -2130505 -2461474 -2875507 -3031481 -2939816 -2682571
8570 -2682571 -2226635 -1772376 -1495956 -1171219 -819913 -765814 -967802 -1020948 -839769 -620159
8560 -620159 -558873 -627559 -786181 -1139683 -1474311 -1492489 -1237677 -884514 -582782 -531725
8550 -531725 -800029 -1335175 -1942335 -2367754 -2668791 -2972321 -3136368 -3071474 -2906689 -2600671
8540 -2600671 -2009721 -1229017 -516653 -97907 -64890 -182633 -253459 -362548 -502329 -666494
8530 -666494 -1077169 -1689400 -2211646 -2540301 -2459785 -1807928 -1072225 -859564 -1080863 -1285492
8520 -1285492 -1180809 -837015 -499508 -137907 311184 485408 267847 51456 -92253 -326853
$$ packed form
8590d499885m66075n09058m30392k35887J9856K58633M42138L80624L16828M14450
8580d308768L23234K85571N63623P38557K67278l30969m14033j55974R1665K57245
8570b682571M55936M54259K76420L24737L51306N4099k01988n3146J81179K19610
8560f20159O1286o8686j58622l53502l34628j8178K54812L53163L01732N1057
8550e31725k68304n35146o07160m25419l01037l03530j64047O4894J64785L06018
8540b600671N90950P80704P12364M18746L3017j17743p0826j09089j39781j64165
8530f66494m10675o12231n22246l28655Q0516O51857P35703K12661k21299k04629
8520a285492J04683L43794L37507L61601M49091J74224k17561k16391j43709k34600
$$ plain form
8510 -326853 -555353 -528782 -460042 -589228 -857988 -1108136 -1328661 -1685518 -2096814 -2262267
8500 -2262267 -2261845 -2281689 -2043170 -1419508 -746471 -462426 -632336 -953197 -1041734 -790729
8490 -790729 -396724 -31046 133389 -76927 -438331 -462664 -202330 127549 426375 774412
8480 774412 1093363 1008757 668347 543343 739714 857081 563547 14867 -442190 -732223
8470 -732223 -910396 -988333 -858653 -623915 -490645 -420937 -308758 -222916 -284842 -381228 -243872
8459 -243872 132129 608329 1031316 1254964 1193635 914667 534200 93885 -376738 -893137
8449 -893137 -1336392 -1577326 -1646346 -1424948 -719440 349628 1324673 1921837 2102461 1909402
8439 1909402 1660241 1603440 1764920 2048776 2132389 1867986 1586019 1532599 1531117 1245942
$$ packed form
8510c26853k28500K6571O8740j29186k68760k50148k20525l56857m11296j65453
8500b262267M22j9844K38519O23662O73037K84045j69910l20861q8537K51005
8490g90729L94005L65678J64435k10316l61404k4333K60334L29879K98826L48037
8480G74412L18951q4606l40410j25004J96371J17367k93534n48680m57057k90033
8470g32223j78173p7937J29680K34738J33270O9708J12179Q5842o1926r6386J37356
8459b43872L76001M76200M22987K23648o1329k78968l80467m40315m70623n16399
8449h93137m43255k40934o9020K21398P05508J069068R75045N97164J80624j93059
8439A909402k49161n6801J61480K83856Q3613k64403k81967n3420j482k85175
$$ plain form
8429 1245942 627597 -20986 -331862 -248389 -278428 -702117 -1088257 -1012970 -597004 -395384
8419 -395384 -643198 -1192824 -1877220 -2254461 -2089309 -1471956 -544834 385195 1220551 1978375
8409 1978375 2425852 2308702 1833289 1511457 1307923 1030714 668843 457084 638549 1089051
8399 1089051 1420413 1715403 2218871 2666406 2816335 2821971 2907854 3036051 3045167 2918711
8389 2918711 2779002 2537603 2139520 1716351 1294445 928718 822836 1046455 1430498 1922150
8379 1922150 2433539 2746870 2622176 2125928 1595679 1074066 506815 -146849 -723206 -1032217
8369 -1032217 -966940 -583389 -317397 -541819 -994689 -1167127 -929074 -465848 -23785 250089
8359 250089 252867 28517 -249082 -411460 -549748 -788494 -857417 -494884 344126 1216307
$$ packed form
8429A245942o18345o48583l10876Q3473l0039m23689l86140P5287M15966K01620
8419c95384k47814n49626o84396l77241J65152O17353R27122R30029Q35356P57824
8409A978375M47477j17150m75413l21832k03534k77209l61871k11759J81465M50502
8399A089051L31362K94990N03468M47535J49929N636Q5883J28197R116j26456
8389B918711j39709k41399l98083m23169m21906l65727j05882K23619L84043M91652
8379A922150N11389L13331j24694m96248n30249n21613n67251o53664n76357l09011
8369a032217O5277L83551K65992k24422m52870j72438K38053M63226M42063K73874
8359B50089K778k24350k77599j62378j38288k38746o8923L62533Q39010Q72181
$$ plain form
8349 1216307 1671959 1630204 1209899 836087 880964 1144028 1171002 1014202 1227037 1862990
8339 1862990 2619557 3255014 3721104 4294615 4908658 5387601 5806224 6002323 5868644 5637701
8329 5637701 5537973 5572177 5566425 5472147 5601829 6068126 6360755 6100364 5382010 4495691
8319 4495691 3714540 3176870 2966650 3091858 3384985 3664710 3733496 3580091 3324069 3084100
8309 3084100 2934989 2735139 2240399 1436696 650285 173168 -125254 -530606 -1035948 -1498602
8299 -1498602 -1840970 -2181213 -2527674 -2804330 -2668825 -1970723 -1304660 -1023241 -704994 -112920
8289 -112920 348857 414670 214356 -161784 -495182 -582870 -557910 -656371 -933303 -1007738 -579366
8278 -579366 129657 812441 1236361 1354454 1385492 1404523 1289943 964921 484871 1095
$$ packed form
8349A216307M55652m1755m20305l73812M4877K63064K6974j56800K12835O35953
8339A862990P56567O35457M66090N73511O14043M78943M18623J96099j33679k30943
8329E637701r9728L4204n752r4278J29682M66297K92629k60391p18354q86319
8319D495691p81151n37670k10220J25208K93127K79725O8786j53405k56022k39969
8309C084100j49111j99850m94740q03703p86411m77117k98422m05352n05342m62654
8299a498602l42368l40243l46461k76656J35505O98102O66063K81419L18247N92074
8289a12920M61777O5813k00314l76140l33398q7688K4960r8461k76932p4435M28372
8278e79366P09023O82784M23920J18093L1038J9031j14580l25022m80050m83776
$$ plain form
8268 1095 -263214 -199150 124464 582102 910730 996461 1189638 1771024 2423466 2741194
8258 2741194 2709909 2613290 2771116 3181523 3563529 3790621 3856068 3918085 3950486 3859225 3566457
8247 3566457 3055030 2454946 1992082 1870739 2074183 2305147 2281923 2241555 2366178 2389785
8237 2389785 2068127 1393536 698079 499648 790497 1061988 1031940 953459 1089634 1576639
8227 1576639 2273814 2909416 3300527 3453318 3549494 3805641 4211845 4566954 4775462 5056462
8217 5056462 5357915 5467125 5385314 5073913 4543059 3971141 3564793 3382086 3219355 2964047
8207 2964047 2713455 2482406 2436836 2710865 3022651 3305217 3722898 3991503 3971321 3873941
8197 3873941 3956399 4407386 5208845 6271526 7143458 7062314 5938854 4510370 3402699
$$ packed form
8268A095k64309O4064L23614M57638L28628Q5731J93177N81386O52442L17728
8258B741194l1285r6619J57826M10407L82006K27092O5447O2017L2401r1261k92768
8247C566457n11427o00084m62864j21343K03444K30964k3224m0368J24623K3607
8237B389785l21658o74591o95457j98431K90849K71491l0048p8481J36175M87005
8227A576639O97175O35602L91111J52791R6176K56147M06204L55109K08508K81000
8217E056462L01453J09210q1811l11401n30854n71918m06348j82707j62731k55308
8207B964047k50592k31049m5570K74029L11786K82566M17681K68605k0182r7380
8197C873941Q2458M50987Q01459J062681Q71932q1144j123460j428484j107671
$$ plain form
8188 3402699 2776801 2438195 2214332 2195287 2283221 2101617 1652654 1385797 1522361 1747351
8178 1747351 1851793 1898201 1922028 1696941 1218657 807908 729610 1053677 1407437 1534177
8168 1534177 1766305 2139213 2235849 1970677 1646747 1584285 1829432 2131284 2131808 1580768
8158 1580768 782085 301934 203586 248605 204141 31076 -199068 -348765 -228856 196658
8148 196658 741759 1107166 1127932 1012258 1124674 1480035 1798072 1941382 1974997 1880280
8138 1880280 1517519 1043995 893158 1331012 2213508 3124603 3696242 3847054 3839817 3863647
8128 3863647 3904225 3848908 3664150 3412579 2893626 1903826 848955 253585 260425 809068
8118 809068 1656704 2170824 2033865 1642605 1240193 954882 928929 850871 469362 63793
$$ packed form
8188C402699o25898l38606k23863j9045Q7934j81604m48963k66857J36564K24990
8178A747351J04442M6408K3827k25087m78284m10749p8298L24067L53760J26740
8168A534177K32128L72908R6636k65172l23930o2462K45147L01852N24n51040
8158A580768p98683m80151r8348M5019m4464j73065k30144j49697J19909M25514
8148A96658N45101L65407K0766j15674J12416L55361L18037J43310L3615r4717
8138A880280l62761m73524j50837M37854Q82496R11095N71639J50812p237K3830
8128C863647M0578n5317j84758k51571n18953r89800j054871n95370O840N48643
8118H09068Q47636N14120j36959l91260m02412k85311k5953p8058l81509m05569
$$ plain form
8108 63793 -137894 -103998 -123530 -344752 -588289 -852253 -1285352 -1638652 -1668931 -1502306
8098 -1502306 -1261501 -955844 -817566 -990431 -1273455 -1478711 -1487188 -1215236 -501522 709322
8088 709322 2024920 2904173 3099667 2821787 2462490 2130066 1759027 1429453 1160922 908147
8078 908147 705972 546847 482695 621910 1053555 1808722 2711198 3625941 4371496 4840322
8068 4840322 5184288 5374421 5316053 5070052 4625321 4118866 3742398 3181082 2121587 882059
8058 882059 153504 196333 702445 1067333 1032174 957583 1311242 1967339 2475995 2813987
8048 2813987 2910505 2592168 1948765 1301105 829899 772701 1138617 1353579 1154953 984015
8038 984015 1036508 983560 821820 848568 1012084 972949 796905 825834 1035668 1259434 1453321
$$ packed form
8108F3793k01687L3896j9532k21222k43537k63964m33099l53300l0279J66625
8098a502306K40805L05657J38278j72865k83024k05256q477K71952P13714J210844
8088G09322J315598Q79253J95494k77880l59297l32424l71039l29574k68531k52775
8078I08147k02175j59125o4152J39215M31645P55167R02476R14743P45555M68826
8068D840322L43966J90133n8368k46001m44731n06455l76468n61316j059495j239528
8058H82059p28555M2829N06112L64888l5159p4591L53659O56097N08656L37992
8048B813987R6518l18337o43403o47660m71206n7198L65916K14962j98626j70938
8038I84015N2493n2948j61740K6748J63516l9135j76044K8929K09834K23766J93887
$$ plain form
8027 1453321 1604334 1926866 2403811 2620670 2610481 2706845 3243080 3996010 4289537 4187978
8017 4187978 4053330 3882973 3753178 3830226 4172699 4428627 4258649 4072545 4268779 4603036
8007 4603036 4820547 4844067 4622011 4304592 4115067 4287107 4897424 5661340 6137126 6306525
7997 6306525 6363168 6322294 6129719 5833174 5613216 5358937 4802609 4256746 4152819 4407361
7987 4407361 4610019 4496939 4176624 4060000 4348485 4885685 5316202 5235800 4857404 4558073
7977 4558073 4262119 3834927 3600150 3670441 3768124 3738178 3556101 3340643 3063150 2744480
7967 2744480 2540295 2518618 2571791 2453462 2049217 1655593 1462129 1307571 1235572 1458767
7957 1458767 1815542 1902553 1599115 981420 201168 -307266 -492185 -560165 -531290 -361747
$$ packed form
8027A453321J51013L22532M76945K16859j0189R6364N36235P52930K93527j01559
8017D187978j34648j70357j29795P7048L42473K55928j69978j86104J96234L34257
8007D603036K17511K3520k22056l17419j89525J72040O10317P63916M75786J69399
7997F306525N6643m0874j92575k96545k19958k54279n56328n45863j03927K54542
7987D407361K02658j13080l20315j16624K88485N37200M30517q0402l78396k99331
7977D558073k95954m27192k34777P0291R7683k9946j82077k15458k77493l18670
7967B744480k04185k1677N3173j18329m04245l93624j93464j54558p1999K23195
7957A458767L56775Q7011l03438o17695p80252n08434j84919o7980K8875J69543
$$ plain form
7947 -361747 -60839 303750 842477 1533187 2109719 2472466 2564479 2373891 1997854 1617370
7937 1617370 1332073 1199139 1233304 1282349 1391189 1581799 1661450 1507571 1150773 614704
7927 614704 89757 33175 492849 1122318 1730541 2194295 2387552 2486823 2984078 3799123
7917 3799123 4215330 4043141 3489984 2709289 2056857 1714410 1657152 1839243 2104861 2231480
7907 2231480 2006913 1615517 1551559 1981836 2620488 3229977 3864684 4599222 5455755 6235113
7897 6235113 6640800 6664483 6414211 5897501 5219537 4531899 3947227 3428972 2996029 2802732
7887 2802732 2876218 3223697 3858793 4663075 5573880 6642924 7465601 7562037 7092069 6454254
7877 6454254 5762892 5354107 5463437 5685920 5755255 5756071 5979527 6370914 6548328 6367151
$$ packed form
7947c61747L00908L64589N38727O90710N76532L62747R2013j90588l76037l80484
7937A617370k85297j32934L4165M9045J08840J90610P9651j53879l56798n36069
7927F14704n24947n6582M59674O29469O08223M63754J93257R9271M97255Q15045
7917C799123M16207j72189n53157p80695o52432l42447n7258J82091K65618J26619
7907B231480k24567l91396o3958M30277O38652O09489O34707P34538Q56533P79358
7897F235113M05687K3683k50272n16710o77964o87638n84672n18255m32943j93297
7887B802732P3486L47479O35096Q04282R10805J069044Q22677R6436m69968o37815
7877F454254o91362m08785J09330K22483O9335Q16K23456L91387J77414j81177
$$ plain form
7867 6367151 5905210 5279573 4598683 3979934 3560712 3420526 3379840 3080136 2611768 2269155
7857 2269155 2032707 1981137 2435604 3355633 4106517 4235612 3947245 3594449 3216182 2857321
7847 2857321 2732653 2859286 3058846 3293567 3474606 3528967 3575560 3610301 3530974 3492777
7837 3492777 3726602 4234360 4648969 4768790 5027150 5734500 6336351 6280413 5843640 5354440
7827 5354440 4801052 4142055 3542618 3235077 3261858 3611419 4376579 5409313 6381824 7020720
7817 7020720 7244225 7179038 6684639 5844860 5206192 5018983 5049863 5000368 4867837 4706220
7807 4706220 4471014 4357654 4493231 4554121 4496111 4476242 4469122 4334441 3810036 3075380
7797 3075380 2507508 2137098 1825347 1606762 1677969 2153406 2910388 3827302 4704098 5124136
$$ packed form
7867F367151m61941o25637o80890o18749m19222j40186m0686k99704m68368l42613
7857B269155k36448n1570M54467R20029P50884J29095k88367l52796l78267l58861
7847B857321j24668J26633J99560K34721J81039N4361M6593L4741p9327l8197
7837C492777K33825N07758M14609J19821K58360P07350O01851n5938m36773m89200
7827E354440n53388o58997n99437l07541K6781L49561P65160J032734R72511O38896
7817G020720K23505o5187m94399q39779o38668j87209L0880m9495j32531j61617
7807D706220k35206j13360J35577O0890n8010j9869p120j34681n24405p34656
7797C075380n67872l70410l11751k18585P1207M75437P56982R16914Q76796M20038
$$ plain form
7787 5124136 4961918 4267501 3273580 2384163 1840734 1675847 1693115 1826973 2261977 2788141
7777 2788141 2942289 2778826 2524008 2252217 2256550 2493687 2579075 2468369 2586634 3161294
7767 3161294 3874773 4306742 4357891 4231710 3888375 3173497 2511119 2332955 2484262 2686594
7757 2686594 2869484 3232376 3856796 4445870 4652574 4504103 4177997 3890338 4039111 4561376
7747 4561376 4832322 4573717 4130889 3842774 3820733 3857349 3865224 4073268 4479947 4893571
7737 4893571 5172936 5207677 4849584 4138191 3442025 3164077 3241851 3308552 3177404 2861868
7727 2861868 2538837 2370588 2412901 2798431 3557852 4349366 4784242 4681559 4105453 3371678
7717 3371678 2981035 3049848 3368184 3980077 4811914 5534332 6128969 6786062 7345423 7576530
$$ packed form
7787E124136j62218o94417r93921q89417n43429j64887J7268J33858M35004N26164
7777B788141J54148j63463k54818k71791M333K37137Q5388j10706J18265N74660
7767C161294P13479M31969N1149j26181l43335p14878o62378j78164J51307K02332
7757B686594J82890L62892O24420N89074K06704j48471l26106k87659J48773N22265
7747D561376K70946k58605m42828k88115k2041L6616P875K08044M06679M13624
7737D893571K79365L4741l58093p11393o96166k77948P7774O6701j31148l15536
7727B861868l23031j68249M2313L85530P59421P91514M34876j02683n76106p33775
7717C371678l90643O8813L18336O11893Q31837P22418N94637O57093N59361K31107
$$ plain form
7707 7576530 7211443 6317283 5440364 5019255 5062561 5340697 5846665 6481183 6907657 6948363
7697 6948363 6645958 6196310 5843371 5738535 5935165 6323435 6571724 6619451 6605525 6576363
7687 6576363 6333636 5593231 4425844 3161027 2096254 1460956 1372806 1641378 1968256
7678 1968256 2444844 3099534 3943762 4875889 5190829 4645627 3722374 2863184 2359784 2365373
7668 2365373 2626464 2853944 2998651 2969849 2563495 1928185 1649050 1849821 2283564 2956398
7658 2956398 3894447 4693447 4946020 4685521 4115923 3594069 3470744 3623203 3745145 3944448
7648 3944448 4520851 5386397 6202816 6875376 7279939 7224313 6809882 6189185 5365950 4648801
7638 4648801 4411049 4532635 4678493 4772061 4834146 4759531 4618172 4626670 4902452 5184553
$$ packed form
7707G576530l65087q94160q76919m21109M3306K78136N05968O34518M26474M0706
7697F948363l02405m49648l52939j04836J96630L88270K48289M7727j3926k9162
7687F576363k42727p40405j167387j264817j064773o35298q8150K68572L26878
7678A968256M76588O54690Q44228R32127L14940n45202r23253q59190n03400N589
7668B365373K61091K27480J44707k8802m06354o35310k79135K00771M33743O72834
7658B956398R38049P99000K52573k60499n69598n21854j23325J52459J21942J99303
7648C944448N76403Q65546Q16419O72560M04563n5626m14431o20697q23235p17149
7638D648801k37752J21586J45858R3568O2085p4615j41359Q498K75782K82101
$$ plain form
7628 5184553 5399459 5710947 6077859 6389494 6527690 6531340 6531108 6432746 6071027 5585786 5274391
7617 5274391 5100467 4870125 4591623 4401460 4232947 4117283 4220071 4510776 4856698 5086500
7607 5086500 5081148 4824377 4461069 4211179 4119840 4252255 4691170 5304853 5960691 6518484
7597 6518484 6658960 6245179 5584216 4979140 4673875 4823169 5276181 5546992 5332437 4881761
7587 4881761 4345615 3583740 2748214 2235036 2255784 2509584 2633024 2524832 2341010 2415266
7577 2415266 2893494 3537254 4035391 4252801 4386672 4615641 4924304 5389180 5823602 5900950
7567 5900950 5600721 5352961 5572791 5993686 5982988 5449266 4814394 4377375 4106653 3974941
7557 3974941 3974387 3773711 3151370 2329774 1763450 1714141 1949054 2167299 2380290 2973793
$$ packed form
7628E184553K14906L11488L66912L11635J38196L650k32r8362l61719m85241l11395
7617E274391j73924k30342k78502j90163j68513j15664J02788K90705L45922K29802
7607E086500n352k56771l63308k49890r1339J32415M38915O13683O55838N57793
7597F518484J40476m13781o60963o05076l05265J49294M53012K70811k14555m50676
7587D881761n36146p61875q35526n13178K0748K53800J23440j08192j83822P4256
7577B415266M78228O43760M98137K17410J33871K28969L08663M64876M34422P7348
7567E900950l00229k47760K19830M20895j0698n33722o34872m37019k70722j31712
7557C974941n54k00676o22341q21596n66324m9309K34913K18245K12991N93503
$$ plain form
7547 2973793 4059985 5140688 5851607 6057902 5945566 5910229 5971408 6050083 6206986 6233805
7537 6233805 5913886 5227516 4422348 3571956 2687518 1906453 1181555 501410 108556 186080
7527 186080 532026 792261 922981 1039080 1223987 1594890 2031330 2328350 2560414 2950702
7517 2950702 3459413 3797935 3747201 3591692 3740834 4032444 4200014 4206768 3929046 3360109
7507 3360109 2963537 3013126 3330566 3571063 3522976 3398381 3414792 3492329 3505782 3322292
7497 3322292 2883256 2563367 2481815 2423452 2366279 2334812 2245345 2093008 1986283 1859721
7487 1859721 1496640 1078103 1149701 1935654 3134055 4221973 4692800 4515051 4062028
7478 4062028 3616026 3190578 2703016 2308781 2096886 1906908 1676098 1523994 1747902 2414011
$$ packed form
7547B973793J086192J080703P10919K06295j12336l5337O1179P8675J56903K6819
7537F233805l19919o86370q05168q50392q84438p81065p24898o80145l92854P7524
7527A86080L45946K60235J30720J16099J84907L70903M36440K97020K32064L90288
7517B950702N08711L38522n0734j55509J49142K91610J67570O754k77722n68937
7507C360109l96572M9589L17440K40497m8087j24595J6411P7537J3453j83490
7497C322292m39036l19889q1552n8363n7173l1467q9467j52337j06725j26562
7487A859721l63081m18537P1598P85953J198401J087918M70827j77749m53023
7478D062028m46002m25448m87562l94235k11895j89978k30810j52104K23908O66109
$$ plain form
7468 2414011 3271127 4034200 4549641 4742345 4637022 4429951 4275201 4251977 4341972 4347329
7458 4347329 4081539 3667279 3420707 3230907 2842547 2371261 2043518 2110461 2608124 3385657
7448 3385657 3975412 4273010 4546514 4812658 4938748 4891731 4692052 4301672 3671595 2727478
7438 2727478 1668376 847120 630275 1008694 1534324 1780961 1588594 1350046 1488231
7429 1488231 1952784 2487062 2841016 3065224 3432094 3893608 4372391 4692379 4573461 4229419
7419 4229419 3969365 3778317 3425701 3114451 2905364 2531973 2139901 1923296 1887546 2027313
7409 2027313 2166348 2182709 2164974 2005106 1537618 1008164 763641 912192 1401698 2113111
7399 2113111 2948831 3780849 4244771 4082255 3795482 3853304 3918827 3569567 2911889 2397341
$$ packed form
7468B414011Q57116P63073N15441J92704j05323k07071j54750k3224Q9995N357
7458D347329k65790m14260k46572j89800l88360m71286l27743O6943M97663P77533
7448C385657N89755K97598K73504K66144J26090m7017j99679l90380o30077r44117
7438B727478j059102q21256k16845L78419N25630K46637j92367k38548J38185
7429A488231M64553N34278L53954K24208L66870M61514M78783L19988j18918l44042
7419D229419k60054j91048l52616l11250k09087l73391l92072k16605l5750J39767
7409B027313J39035J6361j7735j59868m67488n29454k44523J48551M89506P11413
7399B113111Q35720Q32018M63922j62516k86773N7822O5523l49260o57678n14548
$$ plain form
7389 2397341 2409632 3025239 3898750 4563974 4996397 5532388 6190927 6613444 6719526 6594666
7379 6594666 6338046 6042195 5791213 5819032 6176188 6527610 6536788 6281637 6011540 6029848
7369 6029848 6265613 6262979 5818039 5224063 4763477 4186535 3492321 3271709 3641310 3942633
7359 3942633 4014062 4089810 4130265 4234662 4439180 4713166 5343888 6321711 7323467 7814010
7349 7814010 7441668 6536563 5501132 4421939 3659175 3472951 3665361 4017462 4264513
7340 4264513 4323421 4230730 4189885 4333663 4616190 4838210 4824706 4599078 4172017 3750782
7330 3750782 3728372 4047921 4271431 4320400 4401270 4479217 4296682 3681345 2948998 2530551
7320 2530551 2489722 2757820 3160893 3556427 3926511 4152948 3978134 3582293 3404964 3647909
$$ packed form
7389B397341J2291O15607Q73511O65224M32423N35991O58539M22517J06082j24860
7379F594666k56620k95851k50982K7819L57156L51422R178k55151k70097J8308
7369F029848K35765k634m44940n93976m60586n76942o94214k20612L69601L01323
7359C942633P1429P5748M0455J04397K04518K73986O30722R77823J001756M90543
7349G814010l72342r05105j035431j079193p62764j86224J92410L52101K47051
7340D264513N8908r2691m0845J43778K82527K22020j3504k25628m27061m21235
7330C750782k2410L19549K23510M8969Q0870P7947j82535o15337p32347m18447
7320B530551m0829K68098M03073L95534L70084K26437j74814l95841j77329K42945
$$ plain form
7310 3647909 4194759 4636027 4750344 4630460 4411643 4052002 3456814 2695915 1880241 1308987
7300 1308987 1291717 1627480 1987022 2278156 2558012 2837238 3052409 3241352 3201643 2570374
7290 2570374 1633447 989912 1012038 1448206 1749588 1809376 1913398 2411019 3089006 3432191
7280 3432191 3378953 3258766 3214866 3229594 3351942 3700428 4241019 4707004 5066054 5480485
7270 5480485 5979916 6479391 6646823 6469369 6137256 5633528 5126741 4813207 4647251 4682894
7260 4682894 4993858 5310451 5535869 5774871 5890626 5680834 5040141 4160053 3194905 2368263
7250 2368263 2040933 2322811 2744720 2844266 2699331 2343264 1796707 1399399 1436473 1741477
7240 1741477 1918438 1680865 1273085 1112344 1191517 1296868 1490525 2044499 2883119 3472281
$$ packed form
7310C647909N46850M41268J14317j19884k18817l59641n95188p60899q15674n71254
7300A308987j7270L35763L59542K91134K79856K79226K15171J88943l9709o31269
7290B570374r36927o43535K2126M36168L01382N9788J04022M97621O77987L43185
7280C432191n3238j20187m3900J4728J22348L48486N40591M65985L59050M14431
7270E480485M99431M99475J67432j77454l32113n03728n06787l13534j65956L5643
7260D682894L10964L16593K25418K39002J15755k09792o40693q80088r65148q26642
7250B368263l27330K81878M21909R9546j44935l56067n46557l97308L7074L05004
7240A741477J76961k37573m07780j60741P9173J05351J93657N53974Q38620N89162
$$ plain form
7230 3472281 3569663 3218931 2659346 2102989 1747623 1749417 2106041 2670281 3318061 3998329
7220 3998329 4686365 5232713 5415468 5206403 4610298 3834759 3086839 2284367 1406318 863889
7210 863889 922010 1430236 2088412 2420843 2186375 1623495 1144779 1112987 1327506 1343316
7200 1343316 1187456 1181928 1455225 1713977 1630661 1365605 1247320 1480622 1888013 2167102
$$ packed form
7230C472281R7382l50732n59585n56357l55366J794L56624N64240O47780O80268
7220C998329O88036N46348J82755k09065n96105p75539p47920q02472q78049n42429
7210H63889N8121N08226O58176L32431k34468n62880m78716l1792K14519J5810
7200A343316j55860n528K73297K58752q3316k65056j18285K33302M07391K79089
$$ [...]
##END NTUPLES=NMR SPECTRUM
##END=
