##TITLE=dept_SR-157-K3-TFAA1 CH-,CH3- -up, CH2- -down
 CDCl3, 2000 sc
 6.05.2023
##JCAMPDX= 6.0         $$ Bruker NMR JCAMP-DX V2.0
##DATA TYPE= NMR SPECTRUM
##DATA CLASS= NTUPLES
##ORIGIN= UXNMR, Bruker Analytische Messtechnik GmbH
##OWNER= root
$$ XWIN-NMR		Version 3.5
$$ Tue Jun  6 15:16:53 2023 Russian Standard Time (UT+4h)  she@DPX200
##.OBSERVE FREQUENCY= 50.327992884445
##.OBSERVE NUCLEUS= ^13C
##.ACQUISITION MODE= SIMULTANEOUS
##.ACQUISITION SCHEME= undefined
##.AVERAGES= 2001
##.DIGITISER RES= 17
##SPECTROMETER/DATA SYSTEM= spect
##.PULSE SEQUENCE= dept135
##.SOLVENT NAME= CDCl3
##.SHIFT REFERENCE= (INTERNAL, CDCl3, 0, 214.665)
##AUDIT TRAIL= $$ (NUMBER, WHEN, WHO, WHERE, WHAT)
$$ ##TITLE= Audit trail, XWIN-NMR		Version 3.5
$$ ##JCAMPDX= 5.01
$$ ##ORIGIN= Bruker BioSpin GmbH
$$ ##OWNER= she
$$ F:/spectra/data/she/nmr/depta/1/pdata/1/auditp.txt
$$ ##AUDIT TRAIL=  $$ (NUMBER, WHEN, WHO, WHERE, WHAT)
(   1,<2023-06-06 15:15:44.01 +0400>,<she>,<DPX200>,
      <created by zg, POWCHK disabled, PULCHK disabled
       terminated by command 'halt'
       configuration hash MD5:
       00 E9 B6 7A A2 85 ED C7 34 08 36 98 17 FE 4E 26
       data hash MD5: 16K
       B0 33 16 3D CA 9D 27 1C 6F 2A F3 2C 1A 18 BD 59>)
(   2,<2023-06-06 15:15:47.59 +0400>,<she>,<DPX200>,
      <Start of raw data processing
       efp BC_mod = 2 LB = 3.5 FT_mod = 6 PKNL = 1 PHC0 = -3738.649 PHC1 = -1056.6 SI = 16K 
       data hash MD5: 16K
       3B 1C 9A EC FF BD 5B 63 42 60 D1 4C 52 E2 42 0E>)
(   3,<2023-06-06 15:16:03.32 +0400>,<she>,<DPX200>,
      <pk PHC0 = -7.498834 PHC1 = 4.8 
       data hash MD5: 16K
       39 1B C7 F0 30 5F EC 26 F3 83 1F AB 9A 20 D0 36>)
(   4,<2023-06-06 15:16:07.26 +0400>,<she>,<DPX200>,
      <abs ABSG = 5 
       data hash MD5: 16K
       5A 93 4F 7A 6E 6A 9A D6 3A 8A F7 66 7B BC 04 78>)
$$ ##END=
$$ 
$$ hash MD5
$$ 78 82 59 17 26 0C 67 B2 32 3D 57 A1 C9 ED EB 0C
##$RELAX= 
##$RELAX= 
##$RELAX= 
##$RELAX= 
##$RELAX= 
##$RELAX= 
##$RELAX= 
##$RELAX= 
$$ Bruker specific parameters
$$ --------------------------
##$DU= <F:/spectra>
##$EXPNO= 1
##$NAME= <depta>
##$PROCNO= 1
##$TYPE= <nmr>
##$USER= <she>
##$AMP= (0..31)
100 100 100 100 100 100 100 100 100 100 100 100 100 100 100 100 100 100 
100 100 100 100 100 100 100 100 100 100 100 100 100 100 
##$AQSEQ= 0
##$AQ_mod= 1
##$AUNM= <au_zg>
##$AUTOPOS= <>
##$BF1= 50.322709
##$BF2= 200.13
##$BF3= 200.13
##$BF4= 200.13
##$BF5= 200.13
##$BF6= 200.13
##$BF7= 200.13
##$BF8= 200.13
##$BYTORDA= 1
##$CFDGTYP= 0
##$CFRGTYP= 5
##$CHEMSTR= <none>
##$CNST= (0..31)
1 1 145 1 1 1 1 1 1 1 1 1 1 1 1 1 1 1 1 1 1 1 1 1 1 1 1 1 1 1 1 1 
##$CPDPRG= <>
##$CPDPRG1= <waltz16>
##$CPDPRG2= <waltz16>
##$CPDPRG3= <>
##$CPDPRG4= <mlev>
##$CPDPRG5= <mlev>
##$CPDPRG6= <mlev>
##$CPDPRG7= <mlev>
##$CPDPRG8= <mlev>
##$CPDPRGB= <>
##$CPDPRGT= <>
##$D= (0..31)
0 2 0.003448276 0 0 0 0 0 0 0 0 0 2e-05 0 0 0 0 0 0 0 0 0 0 0 0 0 0 0 
0 0 0 0 
##$DATE= 1686044728
##$DBL= (0..7)
120 120 120 120 120 120 120 120 
##$DBP= (0..7)
$$ [...]
##$SUBNAM2= <"">
##$SUBNAM3= <"">
##$SUBNAM4= <"">
##$SUBNAM5= <"">
##$SUBNAM6= <"">
##$SUBNAM7= <"">
##$SUBNAM8= <"">
##$SUBNAM9= <"">
##$SW= 219.3118970423
##$SWIBOX= (0..15)
0 1 3 0 0 0 0 0 0 0 0 0 0 0 0 0 
##$SW_h= 11037.527593819
##$TD= 16384
##$TD0= 1
##$TE= 0
##$TE2= 300
##$TE3= 300
##$TEG= 300
##$TL= (0..7)
120 120 120 120 120 120 120 120 
##$TP= (0..7)
150 150 150 150 150 150 150 150 
##$TP07= 0
##$TPNAME0= <>
##$TPNAME1= <>
##$TPNAME2= <>
##$TPNAME3= <>
##$TPNAME4= <>
##$TPNAME5= <>
##$TPNAME6= <>
##$TPNAME7= <>
##$TPOAL= (0..7)
0.5 0.5 0.5 0.5 0.5 0.5 0.5 0.5 
##$TPOFFS= (0..7)
0 0 0 0 0 0 0 0 
##$TUNHIN= 0
##$TUNHOUT= 0
##$TUNXOUT= 0
##$USERA1= <user>
##$USERA2= <user>
##$USERA3= <user>
##$USERA4= <user>
##$USERA5= <user>
##$V9= 5
##$VALIST= <valist>
##$VCLIST= <CCCCCCCCCCCCCCC>
##$VD= 0
##$VDLIST= <DDDDDDDDDDDDDDD>
##$VPLIST= <PPPPPPPPPPPPPPP>
##$VTLIST= <TTTTTTTTTTTTTTT>
##$WBST= 1024
##$WBSW= 2
##$XGAIN= (0..3)
0 0 0 0 
##$XL= 0
##$YL= 0
##$YMAX_a= 3969513
##$YMIN_a= -2920907
##$ZGOPTNS= <>
##$ZL1= 120
##$ZL2= 120
##$ZL3= 120
##$ZL4= 120
##$ABSF1= 214.6655
##$ABSF2= -4.669434
##$ABSG= 5
##$ABSL= 3
##$ALPHA= 0
##$AQORDER= 0
##$ASSFAC= 0
##$ASSFACI= 0
##$ASSFACX= 0
##$ASSWID= 0
##$AUNMP= <proc_1d>
##$AZFE= 0.1
##$AZFW= 0.1
##$BCFW= 0
##$BC_mod= 2
##$BYTORDP= 0
##$COROFFS= 0
##$CY= -3
##$DATMOD= 1
##$DC= 0
##$DFILT= <>
##$DTYPP= 0
##$F1P= 0
##$F2P= 0
##$FCOR= 0.5
##$FTSIZE= 16384
##$FT_mod= 6
##$GAMMA= 0
##$GB= 0
##$INTBC= 1
##$INTSCL= 0
##$ISEN= 128
##$LB= 3.5
##$LEV0= 0
##$LPBIN= 0
##$MAXI= 10000
##$MC2= 0
##$MEAN= 0
##$ME_mod= 0
##$MI= 0.4000791
##$NCOEF= 0
##$NC_proc= 0
##$NLEV= 6
##$NOISF1= 120.0001
##$NOISF2= 80.00006
##$NSP= 0
##$NTH_PI= 0
##$NZP= 0
##$OFFSET= 214.6655
##$PC= 4
##$PHC0= -3746.148
##$PHC1= -1051.8
##$PH_mod= 1
##$PKNL= yes
##$PPARMOD= 0
##$PSCAL= 0
##$PSIGN= 0
##$REVERSE= no
##$SF= 50.3227091
##$SI= 16384
##$SIGF1= 140
##$SIGF2= 120
##$SINO= 80
##$SIOLD= 32768
##$SREGLST= <13C.CDCl3>
##$SSB= 0
##$STSI= 16384
##$STSR= 0
##$SW_p= 11037.527593819
##$SYMM= 0
##$S_DEV= 0
##$TDeff= 16384
##$TDoff= 0
##$TI= <>
##$TILT= no
##$TM1= 0
##$TM2= 0
##$TOPLEV= 0
##$USERP1= <user>
##$USERP2= <user>
##$USERP3= <user>
##$USERP4= <user>
##$USERP5= <user>
##$WDW= 1
##$XDIM= 16384
##$YMAX_p= 285923923
##$YMIN_p= -98809734
$$ End of Bruker specific parameters
$$ ---------------------------------
##NTUPLES= NMR SPECTRUM
##VAR_NAME=  FREQUENCY,     SPECTRUM/REAL,   SPECTRUM/IMAG
##SYMBOL=    X,             R,               I
##VAR_TYPE=  INDEPENDENT,   DEPENDENT,       DEPENDENT
##VAR_FORM=  AFFN,          ASDF,            ASDF
##VAR_DIM=   16384,         16384,           16384
##UNITS=     HZ,            ARBITRARY UNITS, ARBITRARY UNITS
##FACTOR=    0.67371834180669, 1,            1
##FIRST=     10802.5493505904, 0,            0
##LAST=      -234.978243228581, 0,           0
##MIN=       -234.978243228581, -98809734,   0
##MAX=       10802.5493505904, 285923923,    0
$$ Real data points
##PAGE= N=1
##DATA TABLE= (X++(R..R)), XYDATA
$$ [...]
12845i18663j88562L24456P80848J109606J142471P21770J57206n0852k32035
$$ -918663 -1107225 -782769 -1921 1107685 2250156 2971926 3129132 3078280 2846245
12836B846245m60037k62358J1912j340j40473k77240k47008j23238L6725J30409
$$ 2846245 2386208 2123850 2135762 2134422 1993949 1716709 1469701 1346463 1383188 1513597
12826A513597O8813k8084j18017k52795m71023n89656m52595j48109J10503K32434
$$ 1513597 1582410 1554326 1436309 1183514 712491 122835 -329760 -477869 -367366 -134932
12816a34932K33316R8980J79301M44976N35861M80938K79551j15652n66149p38322
$$ -134932 98384 197364 376665 821641 1357502 1838440 2117991 2002339 1436190 697868
12806F97868n17910r2180K87593L53376Q7763o2030o6511j42152k40903k38022
$$ 697868 179958 87778 375371 728747 816510 754480 687969 545817 304914 66892
12796F6892k40036k28841L1188L25824L08912J01840R0J39834M21312O27800N79777
$$ 66892 -173144 -401985 -370797 -44973 263939 365779 365869 505703 927015 1554815 2134592
12785B134592L46667K1473n07220j074069j257549p95017J67770J151017J397812
$$ 2134592 2481259 2502732 1995512 921443 -336106 -1131123 -963353 187664 1585476
12776A585476Q76506J66110m67221q96699r05459n36977m0341J91516J73355K56523
$$ 1585476 2461982 2628092 2160871 1264172 358713 -178264 -218605 -27089 146266 402789
12766D02789M69256M72236L04056P8015k21441l31931j65915k17389m47257m96407
$$ 402789 872045 1344281 1648337 1726352 1504911 1172980 1007065 789676 342419 -153988
12756a53988o24634o95851m86999j33217K40494N44894O76696P29704P13165M26994
$$ -153988 -778622 -1474473 -1961472 -2094689 -1854195 -1309301 -632605 97099 810264 1237258
12746A237258l122k76103k22374J2436P3717o708l8974N7826J61011N0777k10475
$$ 1237258 1234136 958033 735659 748095 821812 815104 776130 833956 994967 1045744 835269
12735H35269m82147n46961j95315J99801K81870K52865L05866K17531J53389K46478
$$ 835269 353122 -193839 -389154 -189353 92517 345382 651248 868779 1022168 1268646
12725A268646K02122p8738k80984l06821j91521O1782L04589K67841r8415l47595
$$ 1268646 1470768 1392030 1111046 804225 612704 674486 979075 1246916 1148501 800906
12715H00906k63394l17M26150O21522L94609P9433j39143k11930j41806o2332
$$ 800906 537512 537195 963345 1584867 1979476 2058909 1919766 1707836 1566030 1503698
12705A503698r0888j82388k50634j74441m449l1944j75855k22056k76332k90776
$$ 1503698 1412810 1230422 979788 805347 800898 768954 593099 371043 94711 -196065
12695a96065j51615o9665p7766o74L84819Q77754R22418N13585J7842m04673n57021
$$ -196065 -347680 -417345 -495111 -495785 -110966 766788 1689206 2202791 2220633 1815960 1258939
12684A258939m29257k17108j18165k44904m13978m17511k13980J22964L41375
$$ 1258939 829682 612574 494409 249505 -164473 -581984 -795964 -673000 -331625
12675c31625K32726K8057j44398m04815o57850n86998k97343L1217L96446N04297
$$ -331625 -98899 -70842 -215240 -620055 -1277905 -1864903 -2162246 -2131029 -1734583 -1230286
12665a230286L06495J21869K38597N32849O85468O34885L49597K39739J84059
$$ -1230286 -923791 -801922 -563325 -30476 654992 1289877 1639474 1879213 2063272
12656B063272j37933m06679k84816P6216K48211N5232j07677j50512l00479n51300
$$ 2063272 1925339 1518660 1233844 1310060 1558271 1613503 1505826 1355314 1054835 503535
12646E03535o97847o37173n20908j65324L29814L09603M5990L5466J90359L74082
$$ 503535 -194312 -831485 -1352393 -1517717 -1187903 -878300 -832310 -796844 -606485 -232403
12636b32403M77040M22936K56679Q8050n1318j66404k79288k87488j67977j98222
$$ -232403 244637 667573 924252 1012302 960984 794580 515292 227804 59827 -138395
12626a38395j79489J05908L03505K45949J24374J50184K42845L06644L30262K96744
$$ -138395 -317884 -211976 91529 337478 461852 612036 854881 1161525 1491787 1788531
12616A788531J65234j4455j09811k12073l84363l65286l7220K63682K63365o6286
$$ 1788531 1953765 1939310 1829499 1617426 1233063 867777 830557 1094239 1357604 1291318
12606A291318n53987o53608l21227j17418O5251J25645j53431m54250l81928j08640
$$ 1291318 737331 83723 -237504 -354922 -289671 -164026 -317457 -771707 -1153635 -1262275
12596a262275J33418L36835L83066K93474J74435P9718J92759M74506M32705J53198
$$ -1262275 -1128857 -792022 -408956 -115482 58953 138671 331430 805936 1238641 1391839
12586A391839l9304j66728j29245J57515L54572K91676J27251q7658m57048q60621
$$ 1391839 1352535 1185807 1056562 1214077 1568649 1860325 1987576 1899918 1442870 582249
12576E82249p86152j85659L11056L68160J5711l01607k68248R161J75332J64578
$$ 582249 -203903 -389562 -78506 289654 305365 3758 -264490 -255329 -79997 84581
12566H4581J35243J07804M6633j33714l52028n26829n29818j52114L40778N82163
$$ 84581 219824 327628 374261 240547 -111481 -638310 -1168128 -1320242 -979464 -397301
12556c97301N10553K91983J11338P1730J25030R6616r1819k20099j65302k13887
$$ -397301 113252 405235 516573 588303 713333 809949 718130 498031 332729 118842
12546A18842m69942l69036J13185L74695M36438M10186K15970M9614l5919j35256
$$ 118842 -351100 -720136 -606951 -232256 204182 614368 830338 879952 844033 708777
12536G08777p0245K32829M57355J82125m27105q04221o40238l6821N41209O23072
$$ 708777 638532 871361 1328716 1510841 1083736 279515 -360723 -397544 143665 766737
12526G66737J89267r6128J0565K15970K61601r387l43865n24033n68218m72906
$$ 766737 956004 859876 870441 1086411 1348012 1338625 994760 470727 -97491 -570397
12516e70397l95792l97201m13853m45734n78842n77191j59767M76486Q26803P92535
$$ -570397 -966189 -1363390 -1777243 -2222977 -2801819 -3379010 -3538777 -3062291 -2235488 -1442953
12506a442953O15138M13707K38408M9932N1665J97024R1859k10791k88604k24696
$$ -1442953 -827815 -414108 -175700 -125768 -74103 122921 214780 3989 -284615 -509311
12496e09311m23528o88616m46926J29778M97462M94478L64295K32687J75895J72854
$$ -509311 -932839 -1621455 -2068381 -1938603 -1441141 -946663 -582368 -349681 -173786 -932
12486i32M3141j70093j39517P3016K6222j05560n8773m5815l46505o90766n28908
$$ -932 42209 -127884 -267401 -194385 -168163 -273723 -332496 -378311 -724816 -1415582 -1944490
12475a944490j18491O4110J28007J85287L51158N39999L84984J05555J5164M1666
$$ -1944490 -2062981 -1998871 -1870864 -1685577 -1334419 -794420 -409436 -303881 -288717 -247051
12465b47051J46865L40015K30536l93275q42158q21424o54952l63071j7270K56365
$$ -247051 -100186 239829 470365 77090 -765068 -1586492 -2241444 -2604515 -2621785 -2365420
12455b365420L13193J24945o878J17278M18023O15267O90033P06409N94538M12266
$$ -2365420 -2052227 -1927282 -1934160 -1816882 -1398859 -783592 -93559 612850 1207388 1619654
12445A619654L40629K66879K2360k85767n78935q12427q53283m65545K54295O31459
$$ 1619654 1960283 2227162 2249522 1963755 1384820 572393 -280890 -746435 -492140 139319
12435A39319K61789l37007m72175k28327P6378L05656M42772N88775N78515K07966
$$ 139319 401108 64101 -408074 -636401 -560023 -254367 188405 777180 1355695 1563661
12425A563661l13563n75796n53023m34696m44560n06587l03360J27951N47573
$$ 1563661 1250098 674302 121279 -313417 -757977 -1264564 -1567924 -1439973 -892400
12416h92400P53969P53698N26405O3342k93764n07255m92560j87056N3532J08569
$$ -892400 -138431 615267 1141672 1205014 911250 403995 -88565 -275621 -222089 -113520
12406a13520K63085M25572M51597M64437M31712J05002l03449l06028m6577J21476
$$ -113520 149565 575137 1026734 1491171 1922883 2027885 1724436 1418408 1371831 1493307
12396A493307K26680J70404k09364n72526o52005m80297j98099m0567k24635m92972
$$ 1493307 1719987 1890391 1681027 1108501 456496 -23801 -221900 -262467 -487102 -980074
12386i80074m40140j80375J64083N71351O49812M03761L25579M53114L64392J7653
$$ -980074 -1420214 -1600589 -1436506 -865155 -215343 188418 513997 967111 1331503 1349156
12376A349156k89861m21282l42575q6864J49502J80405O4834O8993K65620K07543
$$ 1349156 1059295 638013 295438 208574 358076 538481 603315 672308 937928 1145471
12366A145471k49458o78461p57098n86212l33757Q8517M83020N28391J92226k11848
$$ 1145471 896013 217552 -539546 -1125758 -1459515 -1370998 -887978 -359587 -167361 -379209
12356c79209l57312j45811J99060L17467K87755M00668O59012O21158J07077n13996
$$ -379209 -736521 -882332 -683272 -365805 -78050 322618 981630 1602788 1709865 1195869
12346A195869p83740n79120j65762J26402L44835N59484N31568J79875k51916
$$ 1195869 412129 -166991 -332753 -206351 138484 697968 1229536 1409411 1157495
12337A157495l69286k04143p7479m5349K2524J15245J07863M5034j17098k77443
$$ 1157495 788209 584066 506587 461238 483762 599007 706870 751904 634806 357363
12327C57363r8456K81716N45550O95653P08525M30110j05128m82487o54331r06027
$$ 357363 258907 540623 1086173 1781826 2490351 2920461 2815333 2332846 1678515 772488
12317G72488j071460q24607j45746N91438R46844P45034J83364k65794l54520
$$ 772488 -298972 -1123579 -1269325 -677887 268957 1013991 1197355 931561 577041
12308E77041k35781j98700j92580j99906k82114l22948k49804l323J11409L469
$$ 577041 341260 142560 -50020 -249926 -532040 -854988 -1104792 -1108115 -996706 -993237
12298i93237J368J60309K88179L82332L73868M60334M81738L32745K43613o9631
$$ -993237 -991869 -831560 -543381 -161049 212819 673153 1154891 1487636 1731249 1661618
12288A661618n73151q85809q47214o27435m48981k78145k64019m31128m50203
$$ 1661618 1088467 202658 -644556 -1271991 -1720972 -1999117 -2263136 -2694264 -3144467
12279c144467l12364j40225J24770J91392q5439k18933K20591Q31778R98453J021493
$$ -3144467 -3456831 -3597056 -3472286 -3280894 -3366333 -3585266 -3364675 -2532897 -1534444 -512951
12269e12951J163534J118677P00611J90140p3457j34932j26605k28738l41123
$$ -512951 650583 1769260 2469871 2660011 2586554 2451622 2325017 2096279 1755156
12260A755156l87187l66756l14829m19277o83908p87791k86902L96403N96718
$$ 1755156 1367969 1001213 686384 267107 -416801 -1204592 -1491494 -1095091 -498373
12251d98373M18754K82274L06746K18203m9003j54166j82835k00295l6709J78757
$$ -498373 -79619 202655 509401 727604 678601 524435 341600 141305 104596 283353
12241B83353K51776J92010J38915J07152J5978j53392k77060l32514l95260n51632
$$ 283353 535129 727139 866054 973206 989184 835792 558732 226218 -169042 -720674
12231g20674o21183k81684K36960N26726P04592Q56748P35292L39642j33852n83613
$$ -720674 -1341857 -1623541 -1386581 -859855 -155263 701485 1436777 1776419 1642567 1058954
12221A058954r01818r26230o69505l70944j83864Q0912K85990J43616j85779l17504
$$ 1058954 157136 -769094 -1438599 -1809543 -1993407 -1912495 -1626505 -1482889 -1668668 -1986172
12211a986172r7756J91108M07082N47305M29682J42467j1338P4208K18204K49866
$$ -1986172 -2083928 -1892820 -1485738 -938433 -508751 -366284 -377622 -303414 -85210 164656
12201A64656P4395l92454p21878n37941j93114N3304K89063N47170O50591N11759
$$ 164656 239051 -153403 -875281 -1413222 -1606336 -1553032 -1263969 -716799 -66208 445551
12191D45551K46040J4870l4976m5766M2656K70129L51348L77433M51820K90816
$$ 445551 691591 706461 671485 625719 668375 938504 1289852 1667285 2119105 2409921
12181B409921j95257p02770r64044r59218q23913o09738k62230J70091O07033
$$ 2409921 2214664 1511894 547850 -411368 -1235281 -1845019 -2107249 -1937158 -1330125
12172a330125Q49889P14172K41679k60395m01421j13466K39581K55193J17058
$$ -1330125 -480236 233936 475615 215220 -186201 -299667 -60086 195107 312165
12163C12165J93439M83716O97942N51142q569m41823m85290k83357M9196q9037
$$ 312165 505604 989320 1687262 2238404 2229835 1788012 1302722 1019365 1068561 979524
12153I79524n67997q82450q72283o04793j70151n192j62378k9466L87920P63478
$$ 979524 411527 -470923 -1343206 -1947999 -2118150 -2123342 -2285720 -2315186 -1927266 -1163788
12143a163788Q80417P79698N28946K18588m3091j30391j21829o4791K00458L65733
$$ -1163788 -283371 496327 1025273 1243861 1200770 1070379 948550 883759 1084217 1449950
12133A449950O6524j46015J37244M66341M61566J41675j20122j75432l28123o60650
$$ 1449950 1516474 1370459 1507703 1974044 2435610 2577285 2457163 2281731 1953608 1292958
12123A292958q27235o69211l89683j94683j01959L0541J44642O3290m2062j70649
$$ 1292958 465723 -203488 -593171 -787854 -889813 -859272 -714630 -651340 -693402 -864051
12113h64051k82831k39354j08020O3932O8528j66964l71958k08577J10424J54201
$$ -864051 -1146882 -1386236 -1494256 -1430324 -1361796 -1528760 -1900718 -2109295 -1998871 -1844670
12103a844670L2916J18174L66782N12138M10488L00996J05045k8010P1136J73378
$$ -1844670 -1811754 -1693580 -1326798 -814660 -404172 -103176 1869 -26141 44995 218373
12093B18373J73861N2307j05188l7095K29934K27585l0092p3655J86733M75781
$$ 218373 392234 444541 339353 302258 532192 759777 729685 656030 842763 1318544
12083A318544M89577K50087q5216k08747j67304j52166j59455k64417l09481k32017
$$ 1318544 1808121 2058208 1972992 1764245 1596941 1444775 1285320 1020903 711422 479405
12073D79405N4902L07519J56031l00497l53105p4137J39420L05108K36898P3587
$$ 479405 534307 841826 997857 697360 344255 270118 409538 714646 951544 1025131
12063A025131M1500P2120J97473K91244J27908l35646o92008o70896n46072n15515
$$ 1025131 1066631 1138751 1336224 1627468 1755376 1419730 727722 56826 -489246 -1004761
12053a004761l95211M9916L87370L11937l4872k08324M6463M01167O48438P16289
$$ -1004761 -1399972 -1350056 -962686 -650749 -685621 -893945 -847482 -446315 202123 918412
12043I18412N23083J29457l23899n31825m10308k88296l46033k44030q0066q7767
$$ 918412 1441495 1570952 1247053 715228 304920 16624 -329409 -573439 -653505 -741272
12033g41272o5170n6097k0009J43090J80965J20095J45621L4872j25750K226K97160
$$ -741272 -806442 -862539 -882548 -739458 -558493 -438398 -292777 -257905 -383655 -381429 -84269
12022h4269L98150J67047j33746j51338R7462J23901k29565n00534n64153m28766
$$ -84269 313881 480928 347182 195844 293306 417207 187642 -312892 -877045 -1305811
12012a305811k5400K94650R9710j19718K523J75374J83461N3238q2294K7803K71467
$$ -1305811 -1331211 -1036561 -936851 -1056569 -1054046 -878672 -695211 -641973 -724267 -696464 -424997
12001d24997K19140j38244l57653j58271K73576N36933M71265M67113O22192N32476
$$ -424997 -205857 -344101 -701754 -860025 -586449 -49516 421749 888862 1511054 2043530
11991B043530L74089M30241L72092p635k37601k60979m84917r90083j297644j039964
$$ 2043530 2417619 2847860 3219952 3212317 2974716 2713737 2228820 1238737 -58907 -1098871
11981a098871n86531l48601l70783l99409k54832j07990k12725l54170j35731
$$ -1098871 -1685402 -2034003 -2404786 -2804195 -3059027 -3167017 -3379742 -3733912 -3869643
11972c869643K05176J81412J22032K97231L56890K01743J9435k8329n4708j56931
$$ -3869643 -3664467 -3483055 -3361023 -3063792 -2706902 -2505159 -2485724 -2514053 -2568761 -2725692
11962b725692j84848q5418j3978M8302L15631N81475N04247K99023L31416L13332
$$ -2725692 -2910540 -2995958 -3009936 -2961634 -2646003 -2064528 -1560281 -1261258 -929842 -616510
11952f16510J79345K85160N07972N00901K20454Q1444J64665L13300K48082k02182
$$ -616510 -437165 -152005 355967 856868 1077322 1158766 1323431 1636731 1884813 1682631
11942A682631n12698l26938K4689N8146j98268m68422n38920l92000k78693j86151
$$ 1682631 1169933 842995 867684 925830 727562 259140 -279780 -671780 -950473 -1136624
11932a136624L7537K63524K55124N460k82264n06596n80556l25130J16461K75445
$$ -1136624 -1099087 -835563 -580439 -574979 -857243 -1363839 -1944395 -2269525 -2153064 -1877619
11922a877619M9638m0199J09727J08783J72331L69060L29053L3053k23822k19068
$$ -1877619 -1827981 -1868180 -1758453 -1649670 -1477339 -1108279 -779226 -746173 -969995 -1189063
11912a189063K3187K05838K03181K51438L28870K80091J82031J30770J1569j17524
$$ -1189063 -1165876 -960038 -756857 -505419 -176549 103542 285573 416343 427912 310388
11902C10388j51797j68371l10503n53739k82212M02981P68956P94525N43873J30166
$$ 310388 158591 -9780 -320283 -874022 -1156234 -753253 15703 810228 1354101 1484267
11892A484267K790n5077l95286p59627o71267m41024o84639j127446j091725n46572
$$ 1484267 1487057 1431980 1036694 277067 -394200 -835224 -1519863 -2647309 -3739034 -4285606
11882d285606J74507P81064R24920O00670J19257k0705K80877M80519M09373J89388
$$ -4285606 -4111099 -3330035 -2405115 -1804445 -1685188 -1705893 -1425016 -944497 -535124 -345736
11872c45736r2885j36823K9062R4031q6595k88530m56291o57830n41849k81924
$$ -345736 -438621 -575444 -546382 -452351 -538946 -827476 -1283767 -1941597 -2483446 -2765370
11862b765370j64022J5093L67491O87361Q09740Q42913P07649L49612o6255k68749
$$ -2765370 -2929392 -2914299 -2546808 -1859447 -1049707 -206794 500855 850467 784212 515463
11852E15463j77540j6031p1455j58676K4731L34454M06218m9173l92231j60017
$$ 515463 337923 321892 250437 91761 116492 450946 857164 807991 415760 255743
11842B55743M13616O01207K28072k11145m40322n08934o02839n59617l18472m5367
$$ 255743 669359 1270566 1498638 1287493 847171 338237 -264602 -824219 -1142691 -1188058
11832a188058L55876O82526O79392L42602j81032l85183k02417k8777P6154R9217
$$ -1188058 -832182 -149656 529736 872338 691306 306123 103706 74929 151083 250300
11822B50300j9194r4301k22723m21743l90608j92386j13107j41589k21739k50888
$$ 250300 231106 136805 -85918 -507661 -898269 -1090655 -1203762 -1345351 -1567090 -1817978
11812a817978j84298j24541q6476J24270M79923P47548Q29488N31825m5407l28378
$$ -1817978 -2002276 -2126817 -2213293 -2089023 -1609100 -861552 -32064 499761 454354 125976
11802A25976j60398J71601L65448K71627Q3889J3139M4403J74112J32533o7045
$$ 125976 -34422 137179 502627 774254 858143 871282 915685 1089797 1222330 1155285
11792A155285j08795n5257l0858M4276J57717K56505K79415K51041J86229J74508
$$ 1155285 1046490 991233 960375 1004651 1162368 1418873 1698288 1949329 2135558 2310066
11782B310066K74142M46391P05988N51380Q487j62435J1007l5558k25997k52575
$$ 2310066 2584208 3030599 3736587 4287967 4296454 4134019 4145026 4109468 3883471 3630896
11772C630896k03953k96684n13508o49678o46282m38862k23074L3154K13432K7839
$$ 3630896 3426943 3130259 2616751 1967073 1320791 881929 658855 692009 905441 933280
11762I33280k76097l50107k30809r4432o8077r3778N4214K22351K36706J30888
$$ 933280 657183 307076 76267 -18165 -86242 -180020 -125806 96545 333251 464139
11752D64139q6543l15044l55772k77103j76918J28492N47659P24442N33876J55198
$$ 464139 377596 62552 -293220 -570323 -747241 -618749 -71090 653352 1187228 1342426
11742A342426k83403n73879m50439K8456K13397j7878n7348p639k21015m11723
$$ 1342426 1059023 485144 34705 63161 276558 258680 201332 193693 -27322 -439045
11732d39045l52969j68695m075N069m2170J04286R1544j61464m06834m19113k02655
$$ -439045 -792014 -960709 -964784 -959715 -1001885 -897599 -806055 -967519 -1374353 -1793466 -1996121
11721a996121j19914j61425J7538L81693O28791P32036P60366O13173J55952j69997
$$ -1996121 -2116035 -2277460 -2259922 -1878229 -1249438 -517402 242964 856137 1012089 842092
11711H42092k24829j82965M8691L64161M55202L09925K19199L07490J40230m71454
$$ 842092 617263 434298 482989 847150 1302352 1612277 1831476 2138966 2279196 1807742
11701A807742r01740p62434k54267Q2880O9234k1324n8689j67033j55778o0877
$$ 1807742 906002 143568 -110699 -27819 41415 20091 -38598 -205631 -361409 -422286
11691d22286L8845L61184N44272L09465J13988J75419K76435L32071K45569o9076
$$ -422286 -383441 -22257 522015 831480 945468 1120887 1397322 1729393 1974962 1905886
11681A905886l72792l50117j56042M6688P2827L2731Q0869J78775K39674K60213
$$ 1905886 1533094 1182977 1026935 1073623 1146450 1179181 1260050 1438825 1678499 1938712
11671A938712K39372n954l54160l53015k00336j06959j73715m55447o58193n94655
$$ 1938712 2178084 2172130 1817970 1464955 1264619 1157660 983945 528498 -129695 -724350
11661g24350m61933k21975R4109K23190K30811K27614K617l08066l80552j57240
$$ -724350 -1186283 -1408258 -1314149 -1090959 -860148 -632534 -629917 -937983 -1318535 -1475775
11651a475775J91109M50327M53975J68904j48067k47342k31147j76146R7745K93118
$$ -1475775 -1284666 -834339 -380364 -211460 -359527 -606869 -838016 -1014162 -916417 -623299
11641f23299J79531O3998J16160J80683Q9760j73121m61506n58676l21831l7895
$$ -623299 -443768 -379770 -263610 -82927 6833 -166288 -627794 -1186470 -1508301 -1546196
11631a546196O9669J14198K28091K35381j253j26373P5642M60770O57715N59422
$$ -1546196 -1476527 -1362329 -1134238 -898857 -900110 -1026483 -950841 -490071 167644 727066
11621G27066L87846J54952j12478k98292k94937k58298l08113j54463j9841k35101
$$ 727066 1114912 1269864 1157386 859094 564157 305859 -2254 -156717 -176558 -411659
11611d11659m42038m22934k15119Q6084L70685L23249j04246l78790l45780k49984
$$ -411659 -853697 -1276631 -1491750 -1405666 -1034981 -711732 -815978 -1194768 -1540548 -1790532
11601a790532l16007m82740n09024k00356L55392O92604N63095K61989K55774
$$ -1790532 -2106539 -2589279 -3098303 -3298659 -2943267 -2250663 -1687568 -1425579 -1169805
11592a169805L10450J99428K23762M48328O88202O83202L94820P7928j97195l91276
$$ -1169805 -859355 -659927 -436165 12163 700365 1383567 1778387 1856315 1659120 1267844
11582A267844k53182L9189J71628J06957l7543o6289j72782m07713p84163j116194
$$ 1267844 1014662 1053851 1225479 1332436 1294893 1228604 1055822 648109 -136054 -1252248
11572a252248q71591j17943N16668O57947M16735K72560M25468M43777M0653l49871
$$ -1252248 -2123839 -2241782 -1725114 -1067167 -650432 -377872 47596 491373 532026 182155
11562A82155m02812j38270J34921P0317J438K10746M34028K42354m16614j015578
$$ 182155 -220657 -358927 -224006 -153689 -152251 58495 492523 734877 318263 -697315
11552f97315r38070l05924M43705Q03142P66030O24469K62406l63580q59218p48073
$$ -697315 -1635385 -1941309 -1497604 -694462 71568 696037 958443 594863 -264355 -1012428
11542a012428l72831j50537J22178N44607P91219P16240M79440P5882k41653j37300
$$ -1012428 -1385259 -1535796 -1413618 -869011 -77792 638448 1117888 1193770 952117 814817
11532H14817J18792K00121K21952K68130L66012L29988J63962M873l21963p05700
$$ 814817 933609 1133730 1355682 1623812 1989824 2319812 2483774 2488647 2166684 1460984
11522A460984q35138q38493q44154n72056p9058K44894J89910J1161K09020N65136
$$ 1460984 625846 -212647 -1056801 -1628857 -1707915 -1463021 -1273111 -1261950 -1052930 -487794
11512d87794O13698O08639P64794Q33693N99213K30690j47986l81500l83698l27622
$$ -487794 125904 734543 1499337 2333030 2932243 3162933 3014947 2633447 2249749 1922127
11502A922127k87108m16221o28383o69798o25924m45784j51928K01831O79560
$$ 1922127 1635019 1218798 590415 -79383 -705307 -1151091 -1303019 -1101188 -421628
11493d21628J026372Q94458L83474j59697n91305r10304r44894o40077j46100
$$ -421628 604744 1499202 1882676 1722979 1131674 221370 -723524 -1363601 -1509701
11484a509701J19600J97562L50526L56528J87205L6301o507L356j02632k37908
$$ -1509701 -1390101 -1192539 -842013 -485485 -298280 -261979 -268486 -265130 -367762 -605670
11474f05670p2217K97315M52624N19060O22831M17117j1901j16150J48276K90151
$$ -605670 -677887 -380572 72052 591112 1213943 1631060 1619159 1503009 1651285 1941436
11464A941436J45636j3029j39584k94879k80586O6235K43054K9372q3606m5814
$$ 1941436 2087072 2074043 1934459 1639580 1358994 1425229 1668283 1697655 1614049 1568235
11454A568235o8223k07612k85905n4016L71489N86394M48341K52721J40434L9054
$$ 1568235 1500012 1292400 1006495 952479 1323968 1910362 2358703 2611424 2751858 2790912
11444B790912r1090k20495l76559m42550m67785n88700o31306n43836l70683n0172
$$ 2790912 2699822 2479327 2102768 1660218 1192433 603733 -27573 -571409 -942092 -992264
11434i92264K40781K88129K26308J46544L3795m4927m4099j46844l37481n33603
$$ -992264 -751483 -463354 -237046 -90502 -56707 -101634 -145733 -292577 -630058 -1163661
11424a163661n74815j93665K86630N72652O95737M81833P6869k78722l37317R5044
$$ -1163661 -1738476 -1932141 -1645511 -1072859 -377122 104711 181580 -97142 -434459 -339415
11414c39415O48698Q29202P36673M27512L6829j86747l05011m14553n05391m66066
$$ -339415 309283 1138485 1875158 2302670 2339499 2152752 1847741 1433188 927797 461731
11404D61731k90759l2146K97274L19151P3993k6375n2424j73194k74059k08609
$$ 461731 170972 138826 436100 755251 829244 802869 750445 577251 303192 94583
11394I4583n6857J25093L09672M09644N25511N32911L55378J94933J27789M5087
$$ 94583 37726 162819 472491 882135 1407646 1940557 2295935 2490868 2618657 2663744
11384B663744j14080k04471j80613o5713j39008l91886m54655l44121k36899j63139
$$ 2663744 2549664 2345193 2164580 2098867 1959859 1567973 1113318 769197 532298 369159
11374C69159J4433M0782k07160m78700k97882K32610N07794M94079L86589K28326
$$ 369159 383592 424374 217214 -261486 -559368 -326758 181036 675115 1061704 1290030
11364A290030P0878K3317O3827J6676j52629m21578o03832o54779n92317k82163
$$ 1290030 1360908 1384225 1448052 1464728 1312099 890521 286689 -368090 -960407 -1242570
11354a242570R5016K42776J11094j16288j39565J26493J58762j45214l30002l68499
$$ -1242570 -1147554 -904778 -793684 -909972 -1049537 -923044 -764282 -909496 -1239498 -1607997
11344a607997j58347J84969M31095O45465O79147M01672K374p6318j0906j47870
$$ -1607997 -1766344 -1581375 -1150280 -504815 174332 576004 578378 502060 491154 343284
11334C43284k15171j2600K10699L00946K06799J98710L13418K07268j69399o52952
$$ 343284 128113 115513 326212 627158 833957 1032667 1346085 1553353 1383954 731002
11324G31002r25738q79928o74657m47988k97094k03061k38160j63130K07077N30688
$$ 731002 -194736 -1074664 -1749321 -2197309 -2494403 -2697464 -2935624 -3098754 -2891677 -2360989
11314b360989O68814O91041N88930M45622J26755l26159o13323o55974m75639
$$ -2360989 -1692175 -1001134 -412204 33418 160173 -165986 -779309 -1435283 -1910922
11305a910922j45408J59010L11155M03924N32332N35140K61180j04235k94870
$$ -1910922 -2056330 -1897320 -1586165 -1182241 -649909 -114769 146411 42176 -252694
11296b52694k18276j0222K60292M95179L55826j19766m78574m45195k35100k2882
$$ -252694 -470970 -481192 -220900 274279 630105 510339 31765 -413430 -648530 -671412
11286f71412J62386J76142J01j23024k03640l10020l24017o7686K61611L25239
$$ -671412 -509026 -332884 -332783 -455807 -659447 -969467 -1293484 -1361170 -1099559 -774320
11276g74320J91632R8223k9291j32103O368J52828K27703L58084M20735J81999
$$ -774320 -582688 -484465 -513756 -645859 -639491 -486663 -258960 99124 519859 701858
11266G01858k6808J17851K65250J54897r5872j90800J8514J74732n1575m54712
$$ 701858 675050 792901 1058151 1213048 1117176 926376 944890 1119622 1068047 613335
11256F13335o08457k83002L18844P09071O54252M34098K85830K64543K80700J53803
$$ 613335 4878 -278124 40720 749791 1404043 1838141 2123971 2388514 2669214 2823017
11246B823017j53410l88999m03576k29372l4451l0864l49206p94468j001619r17382
$$ 2823017 2669607 2280608 1877032 1647660 1613209 1582345 1233139 438671 -562948 -1480330
11236a480330n86912j59608L42483O90019P04839N59135M37099J86324j93873
$$ -1480330 -2067242 -2226850 -1884367 -1194348 -489509 69626 506725 693049 499176
11227D99176l84059j72825J64452J97942J02574J45881K48133L98023M33332J70416
$$ 499176 115117 -57708 106744 304686 407260 553141 801274 1199297 1632629 1803045
11217A803045k52790m76393m59789m86946l16218K36836N31219K58202j50020
$$ 1803045 1550255 1073862 614073 127127 -189091 47745 578964 837166 687146
11208F87146l49307l46760l48409l20139j28019k9969k58214m88074k81804J00696
$$ 687146 337839 -8921 -357330 -677469 -805488 -835457 -1093671 -1581745 -1863549 -1762853
11198a762853L45003K93634J6783l2824O6857J33072L02679M12526K48863R9334
$$ -1762853 -1417850 -1124216 -1107433 -1140257 -1073400 -940328 -637649 -225123 23740 123074
11188A23074J32547K3792k62372l13342j47700k72612n71937n65858m17418k57112
$$ 123074 255621 279413 17041 -296301 -444001 -716613 -1288550 -1854408 -2271826 -2528938
11178b528938q6883J30686L13874K19435l2494k29326l32967l06072n960M07301
$$ -2528938 -2615821 -2485135 -2171261 -1951826 -1984320 -2213646 -2546613 -2852685 -2858645 -2451344
11168b451344N53652N18575L44156O7975J64737M66305M04436L4252k49162j81402
$$ -2451344 -1897692 -1379117 -1034961 -966986 -802249 -335944 68492 102744 -146418 -327820
11158c27820O5343K06834J77695K05278L45935M39225M03895K21812l3253k14208
$$ -327820 -262477 -55643 122052 327330 673265 1112490 1516385 1738197 1704944 1490736
11148A490736j43271L5873J75519J88498j24370n55453q14145p87999n84475m33627
$$ 1490736 1347465 1383338 1558857 1747355 1622985 1067532 253387 -534612 -1119087 -1552714
11138a552714l24151j93288p195J13137J45328J20811J39132K78766K27801J48750
$$ -1552714 -1876865 -2070153 -2077348 -1964211 -1818883 -1698072 -1558940 -1280174 -1052373 -903623
11128i03623L38327M93854M41061K17329n8659j47889p3491J4474K7651r9546
$$ -903623 -565296 -71442 369619 586948 528289 380400 306909 321383 349034 249488
11118B49488j85465k98897m77594m66257k82001j17918J65143N07475O82661M69923
$$ 249488 64023 -234874 -712468 -1178725 -1460726 -1578644 -1413501 -906026 -223365 246558
11108B46558Q1035l5973J04283L75791N20765K47711k41395o36171q46087q15963
$$ 246558 327593 291620 395903 771694 1292459 1540170 1298775 662604 -183483 -999446
11098i99446n50625l02579j81281J24925L02420R2754p4977j50943j68559K7921
$$ -999446 -1550071 -1852650 -2033931 -1909006 -1606586 -1513832 -1588809 -1739752 -1908311 -1880390
11088a880390L45963M81066L62264L25760J65765l46537p25533n30742k1091L13994
$$ -1880390 -1534427 -1053361 -691097 -365337 -199572 -546109 -1271642 -1802384 -1823475 -1509481
11078a509481M24366L94397K51323Q8966L9678m8473j69557j84371n829J58121
$$ -1509481 -1085115 -690718 -439395 -350429 -310751 -359224 -528781 -713152 -718981 -560860
11068e60860J25167K01158K19323o586j04419L7877r0196o02086q75415n05988
$$ -560860 -435693 -234535 -15212 -21798 -126217 -88340 -178536 -780622 -1656037 -2162025
11058b162025K16120P32086P72317M00315O789o2541l3040j31173j73730q2355
$$ -2162025 -1945905 -1213819 -441502 -41187 -34398 -96939 -129979 -261152 -434882 -517237
11048e17237O505O0784O2053J15963J77416J57066J46239P7156j00858k11000
$$ -517237 -510732 -449948 -387895 -271932 -94516 62550 208789 285945 185087 -25913
11038b5913r7106J34995L17614L08843J15732j01995k15095k11140k0854J33728
$$ -25913 -123019 11976 329590 638433 754165 652170 437075 225935 205081 338809
11028C38809J31479J59628M3927o0604K7943M7372N0970K3326j03161q3949l1655
$$ 338809 470288 629916 673843 613239 641182 688554 739524 762850 659689 575740 544085
11017E44085k41883o36454q70297q68758p76628m34483J65710O94375Q35225M68608
$$ 544085 302202 -334252 -1204549 -2073307 -2849935 -3284418 -3118708 -2424333 -1589108 -1120500
11007a120500R0417M9983L39252N39053M51856J89153j18164k76931k23333o9686
$$ -1120500 -1030083 -980100 -640848 -101795 350061 539214 421050 144119 -79214 -148900
10997a48900j4228p0582j315J94887K12108J07384R6227J48444J01272j3830j24827
$$ -148900 -163128 -233710 -235025 -40138 171970 279354 375581 524025 625297 611467 486640
10986D86640j59073j65615j90284j86682j66050j9096J19104J51518N9825p2883
$$ 486640 327567 161952 -28332 -215014 -381064 -400160 -281056 -129538 -69713 -142596
10976a42596j96724n2815L90137O06339M53724m5676n48867n48200j32608J53096
$$ -142596 -339320 -392135 -1998 604341 1058065 1012389 463522 -84678 -217286 -64190
10966f4190J27930L760r7378k81678m34884k31778N9789L1726k79250l79946r7887
$$ -64190 63740 67500 -29878 -311556 -746440 -978218 -918429 -886703 -1165953 -1545899 -1643786
10955a643786K37120P01931J107289J051607N38680j8986k95974l10690l41532
$$ -1643786 -1406666 -704735 402554 1454161 1992841 1973855 1677881 1367191 1025659
10946A025659m09890l88661l67831m83245n10019k47778J5157K21425N64942P78777
$$ 1025659 615769 227108 -140723 -623968 -1133987 -1381765 -1366608 -1145183 -580241 198536
10936A98536N54541J12826r462K28878L06388J33909j26783l79703l61469o7183
$$ 198536 753077 865903 856441 1085319 1391707 1525616 1398833 1019130 657661 590478
10926E90478J16521J02727J10043N1534k39122n19292m26994j72392n6550l1006
$$ 590478 706999 809726 919769 971303 732181 212889 -214105 -386497 -443047 -474053
10916d74053l59l2097K9320J49340O4733j66899l16166l94004m63129k86634K34530
$$ -474053 -474412 -506509 -477189 -327849 -263116 -430015 -746181 -1140185 -1603314 -1889948 -1655418
10905a655418Q19196R94997P24828L22120j32043m13928n60593o09546l04990
$$ -1655418 -836222 158775 883603 1205723 1073680 659752 99159 -510387 -815377
10896h15377l501K15527L42892R5018k94453m97382m45833l47199l75756k03547
$$ -815377 -818878 -603351 -260459 -165441 -459894 -957276 -1403109 -1750308 -2126064 -2329611
10886b329611J98065N36477N86228M56946K94885J87597J33108J21131Q9609l2587
$$ -2329611 -2131546 -1595069 -1008841 -551895 -257010 -69413 63695 184826 274435 241848
10876B41848N4311K64473K32593M8729j83323m47771m60553l71570m95431n33028
$$ 241848 296159 560632 793225 841954 658631 210860 -249693 -621263 -1116694 -1649722
10866a649722r2791L99601L72049Q4271K1090J16352K8115j01419m706N8876M7341
$$ -1649722 -1742513 -1342912 -970863 -886592 -865502 -749150 -721035 -822454 -827160 -768284 -720943
10855g20943M1693j22272l55156l48348j70591j03443j06078K4826L49919O95423
$$ -720943 -679250 -801522 -1156678 -1505026 -1675617 -1779060 -1885138 -1860312 -1510393 -814970
10845h14970Q07384N54313N4674k80148l52362l33840k73779p4515L06329M71835
$$ -814970 -7586 546727 601401 321253 -31109 -364949 -638728 -713243 -406914 64921
10835F4921K27320j76992m58335l58022j25933j93115j25779K00693K39707N4253
$$ 64921 292241 115249 -343086 -701108 -827041 -1020156 -1145935 -945242 -705535 -651282
10825f51282J06378K34467J16191j4101j9897j7227n1915m4486k3504p0615j37805
$$ -651282 -544904 -310437 -194246 -208347 -228244 -245471 -297386 -341872 -365376 -435991 -573796
10814e73796j94327k17452j63547J29286M21088M54399K41321j05488l95216l90400
$$ -573796 -768123 -985575 -1149122 -1019836 -598748 -144349 96972 -8516 -403732 -794132
10804g94132j36360Q3024P2510j00656r9914K6207m7302p3567R9466M3552p4751
$$ -794132 -930492 -847468 -774958 -875614 -975528 -949321 -996623 -1070190 -970724 -927172 -1001923
10793a001923j30421k47322j30183J25713J85530J89850J91628J55036J70034
$$ -1001923 -1132344 -1379666 -1509849 -1384136 -1198606 -1008756 -817128 -662092 -492058
10784d92058J69884n8230k41726l7371J43739O5541J41881M25157M35851J29483
$$ -492058 -322174 -380404 -622130 -659501 -515762 -450221 -308340 116817 552668 682151
10774F82151k34602m03804j44514K06489L69108M64423M38477K16901n2987q3389
$$ 682151 447549 43745 -100769 105720 474828 939251 1377728 1594629 1541642 1458253
10764A458253r0390l83457o17456p38088q58541o99513k61026K82448Q06547Q77571
$$ 1458253 1367863 984406 366950 -371138 -1229679 -1929192 -2190218 -1907770 -1101223 -223652
10754b23652N24396L27965K50167P1996j18340O986L09222K98505O6493j75612
$$ -223652 300744 628709 878876 950872 832532 839518 1148740 1447245 1513738 1338126
10744A338126k20256L5257L01493L66142K80550K46199J72834j60591n02410m38121
$$ 1338126 1117870 1153127 1454620 1820762 2101312 2347511 2520345 2359754 1857344 1419223
10734A419223q8869O1923q0437j67041k59163l82183j74853J64509J75474j33495
$$ 1419223 1330354 1392277 1311840 1144799 885636 503453 328600 493109 668583 535088
10724E35088n01702p62440q16637n41293J7313M56306L91874j03446l13326r8244
$$ 535088 33386 -729054 -1545691 -2086984 -2069671 -1613365 -1221491 -1324937 -1638263 -1736507
10714a736507R3640K30514M81841O34212L53309k29029o13746n74755m40910k63978
$$ -1736507 -1642867 -1412353 -930512 -296300 57009 -172020 -785766 -1360521 -1801431 -2065409
10704b065409L151K25147K75890N4719k09821k61947n019L82653O77037Q26712
$$ -2065409 -2062258 -1837111 -1561221 -1506502 -1716323 -1978270 -1983289 -1600636 -923599 -96887
10694i6887Q45471N35307O6886j17550j84705l36278m28139l46641r8474P2069
$$ -96887 748584 1283891 1350777 1233227 1048522 712244 284105 -62536 -161010 -88941
10684h8941O5292N1923n4021j07114n57Q2152J6834j54036l33272k81489R1614
$$ -88941 -23649 28274 -25747 -132861 -133418 -51266 -34432 -188468 -521740 -803229 -711615
10673g11615M19469M51190M65566N40029K01893m62116p42614n10800k32553j42098
$$ -711615 -292146 159044 624610 1164639 1366532 904416 161802 -348998 -581551 -723649
10663g23649p3586R2350J15285Q0196J18071J60601J56919L1049k34561l89620
$$ -723649 -797235 -704885 -589600 -509404 -391333 -230732 -73813 -42764 -277325 -666945
10653f66945j39395K30161L00904K37338J37793M8031K19549L22155k7272l97911
$$ -666945 -806340 -576179 -275275 -37937 99856 147887 367436 689591 662319 264408
10643B64408k25415J4601p8926k89194m36738n17687m28239q4132L24841P20233
$$ 264408 38993 53594 -25332 -314526 -751264 -1268951 -1697190 -1781322 -1456481 -736248
10633g36248J033625R27257L81225k57756o31401n74453j62934L49858M80956
$$ -736248 297377 1224634 1605859 1348103 716702 142249 -20685 329173 810129
10624H10129J11236l97449o55052n57014l48060k70849j60325q9990k63636l89935
$$ 810129 921365 523916 -131136 -688150 -1036210 -1307059 -1467384 -1557374 -1821010 -2210945
10614b210945l16496o2409L35180O14561N98040M27065M31514M12736J57519n8753
$$ -2210945 -2527441 -2589850 -2254670 -1640109 -1042069 -615004 -183490 229246 386765 328012
10604C28012j34634k69321n75114o01056k37469L6419M6108N085J11777L18907
$$ 328012 193378 -75943 -651057 -1252113 -1489582 -1453163 -1407055 -1401970 -1290193 -971286
10594i71286N74274O90080N78747L53744R3460k1286m6804l14403o04921p30517
$$ -971286 -397012 293068 871815 1225559 1319019 1297733 1250929 936526 331605 -398912
10584c98912o12273k73220r0515j83123j25105Q9594J61041J98826K75503L08470
$$ -398912 -1011185 -1284405 -1374920 -1558043 -1683148 -1593554 -1432513 -1233687 -958184 -649714
10574f49714K70942J50150J04834J61165J27297o5017k98080m05932k25785Q2827
$$ -649714 -378772 -228622 -123788 37377 164674 99657 -198423 -604355 -830140 -747313
10564g47313K17832J83019L4948j22362j03534O0087Q2531J07307K90555L58794
$$ -747313 -529481 -346462 -311514 -433876 -537410 -477323 -394792 -287485 3070 361864
10554C61864J31697j57566k73873l15959l02089k08199j78007j60821k44005m66367
$$ 361864 493561 335995 62122 -253837 -555926 -764125 -942132 -1102953 -1346958 -1813325
10544a813325n26485k63159J16531N19965Q10227P28884L29531J6749j27810j62239
$$ -1813325 -2339810 -2602969 -2486438 -1966473 -1156246 -427362 -97831 -81082 -208892 -371131
10534c71131n2583L9006j9890r1593j36749j08837l1021M7191K21260L65349L42598
$$ -371131 -423714 -384708 -404598 -496191 -632940 -741777 -772798 -725607 -504347 -138998 203600
10523B03600K16168O9079k9897j25427k44661l98164n53575p00426o48472m07861
$$ 203600 419768 488847 458950 333523 88862 -309302 -862877 -1563303 -2211775 -2619636
10513b619636k4962N41509Q88485Q10241N49281K85502k2229m16106o54640n39919
$$ -2619636 -2644598 -2103089 -1214604 -404363 144918 430420 408191 -7915 -662555 -1202474
10503a202474l40825j9863L75587N32480L90828K36998J73450L7379k18361n34538
$$ -1202474 -1543299 -1563162 -1187575 -655095 -264267 -27269 146181 183560 -34801 -569339
10493e69339o83910m79345l83166n62716n39001k14968J66608M35843N52787M10162
$$ -569339 -1253249 -1732594 -2115760 -2678476 -3217477 -3432445 -3265837 -2829994 -2277207 -1867045
10483a867045K62598L50872N23048N13800K96750M9903j22626m71106q89310q20208
$$ -1867045 -1604447 -1253575 -730527 -216727 80023 129926 7300 -463806 -1353116 -2173324
10473b173324m72348j60153J67820L33458M64560O58056O65658M12281Q8431K138
$$ -2173324 -2645672 -2805825 -2638005 -2304547 -1839987 -1181931 -516273 -103992 -15561 -13423
10463a3423R2120K07970J12449k46271n00083n49579m51545m9358K76980J23937
$$ -13423 78697 286667 399116 152845 -347238 -896817 -1348362 -1397720 -1120740 -996803
10453i96803k4433j8402n2086M5824J89095K05430M0708q6593J08222L82414L45948
$$ -996803 -1021236 -1039638 -1091724 -1045900 -856805 -651375 -610667 -697260 -589038 -206624 139324
10442A39324J80882n9717m30613o45515o68663n65740m49066m95626m29945j18597
$$ 139324 320206 260489 -170124 -815639 -1484302 -2050042 -2499108 -2994734 -3424679 -3543276
10432c543276K33924N19935O88133O82176N80990L76101J10817J31129K63463
$$ -3543276 -3309352 -2789417 -2101284 -1419108 -838118 -462017 -351200 -220071 43392
10423D3392P0746j48221j71042j34719j16882k01013j89224k9173J16917P9020
$$ 43392 114138 -34083 -205125 -339844 -456726 -657739 -846963 -876136 -759219 -680199
10413f80199j18285k55568l18179k16524Q0553K74190L69301N08973M35167J12689
$$ -680199 -798484 -1054052 -1372231 -1588755 -1508202 -1234012 -864711 -355738 79429 192118
10403A92118O2790J80643Q1657j37686j80425m483K02894K95377J72076m3321
$$ 192118 254908 435551 517208 379522 199097 194614 397508 692885 864961 821640
10393H21640k12540l63851n15249n08669l93341j88631J43487M65132N35416L09663
$$ 821640 609100 245249 -270000 -778669 -1172010 -1360641 -1217154 -752022 -216606 93057
10383I3057o4212l34584k43077m1445j53695k30348p2450J68712M33548N75623
$$ 93057 28845 -305739 -548816 -590261 -743956 -974304 -1046754 -878042 -444494 131129
10373A31129L81373L7208j39734j4827J13669j54516n87475p35147m46348J00778
$$ 131129 512502 549710 409976 395149 508818 354302 -233173 -968320 -1414668 -1313890
10363a313890M82679M01099O4659k15419j95073q3258N4269K05340L33878M52506
$$ -1313890 -831211 -430112 -365453 -580872 -775945 -859203 -804934 -599594 -265716 186790
10353A86790K98751k62142q81495j114577p44132j15588J55326J08090J10816
$$ 186790 485541 223399 -658096 -1772673 -2516805 -2632393 -2477067 -2368977 -2258161
10344b258161L09712N75826O17832N33958L43985p6171m56814n31166m35230j65724
$$ -2258161 -1948449 -1372623 -754791 -220833 123152 46981 -409833 -940999 -1376229 -1541953
10334a541953L73407P41082O53598K36309j35484r4403J36936K37673K26668J89126
$$ -1541953 -1168546 -427464 226134 462443 326959 232556 369492 607165 833833 1022959
10324A022959q2129m68179n27575j40646J95197L58625M95505L83456n7802l62013
$$ 1022959 940830 472651 -54924 -195570 -373 358252 853757 1237213 1179411 817398
10314H17398l26506k92255k08222n1575n2194k71617n09462m64103o3510K58569
$$ 817398 490892 198637 -9585 -61160 -113354 -384971 -894433 -1358536 -1422046 -1163477
10304a163477K76864L54799M31978L19859J22165m6060k72784m80522l72933q8655
$$ -1163477 -886613 -531814 -99836 220023 342188 296128 23344 -457178 -830111 -918766
10294i18766R2385J26377J57044K15168J67023J7547q5343q9471j77586n18491
$$ -918766 -826381 -700004 -542960 -327792 -160769 -143222 -228565 -318036 -495622 -1014113
10284a014113p24309o37980m14690J6513M36876O55085P31504O11633L06628n0285
$$ -1014113 -1738422 -2376402 -2791092 -2774579 -2337703 -1682618 -951114 -339481 -32853 -83138
10274h3138k36151l85812n00487l82172j24399O9469L02021L44059J59043P1360
$$ -83138 -319289 -705101 -1205588 -1587760 -1712159 -1642690 -1340669 -996610 -837567 -766207
10264g66207J7011p5105j14670r7937k202K27784N04537O13956M59197L09626
$$ -766207 -749196 -824301 -938971 -1036908 -1039110 -811326 -306789 307167 766364 1075990
10254A075990K13141k4927l85513o70711o68505l84447j53922r3880j03531m4867
$$ 1075990 1289131 1264204 878691 207980 -460525 -844972 -998894 -1092774 -1196305 -1241172
10244a241172J2267L9547L19132O26424N19602J37255j70055k48239j69177M9822
$$ -1241172 -1228905 -1189358 -870226 -243802 275800 413055 243000 -5239 -174416 -124594
10234a24594K84569L95534M69918M36906K70625L7585j51724l34266m46851k03762
$$ -124594 159975 555509 1025427 1462333 1732958 1770543 1618819 1284553 837702 633940
10224F33940N293n5984Q8789L55584M10237K27122l6515k42025j99485J57416
$$ 633940 639233 583249 672038 1027622 1437859 1664981 1628466 1386441 1186956 1344372
10214A344372M94119L91742p724l22235m97212l93275j16861R9137J68241J9414
$$ 1344372 1838491 2230233 2222509 1900274 1403062 1009787 892926 992063 1160304 1179718
10204A179718l33379n20973m62803k36425K05576O45505Q26155O57342L63314
$$ 1179718 846339 325366 -137437 -373862 -168286 477219 1303374 1960716 2324030
10195B324030j37354o42469p87245n90371j38206N3966k06526k95030k58449l59758
$$ 2324030 2186676 1544207 756962 166591 28385 82351 -124175 -419205 -677654 -1037412
10185a037412m41133m13479r2789L77928N91312O00287N98524N44408K35290l56654
$$ -1037412 -1478545 -1892024 -1984813 -1606885 -1015573 -415286 183238 727646 962936 606282
10175F06282q38077r54439q14067m28991J25981N74440N31936J24003k14690m31988
$$ 606282 -231795 -1186234 -2000301 -2429292 -2303311 -1728871 -1196935 -1072932 -1287622 -1719610
10165a719610n80232m98010j19221K11827K56567J91431K39233K39023J52341
$$ -1719610 -2299842 -2797852 -2917073 -2705246 -2448679 -2257248 -2018015 -1778992 -1626651
10156a626651Q4088J30988K81459L20073R5813k70545m95596l48349o935L08516
$$ -1626651 -1542563 -1411575 -1130116 -810043 -714230 -984775 -1480371 -1828720 -1835655 -1527139
10146a527139M52832L51052J04748l4314M3170K21851M31799M38607l2125n06584
$$ -1527139 -1074307 -723255 -618507 -652821 -609651 -387800 43999 482606 450481 -56103
10136e6103n46823l46655n5073K34043K03634M098l115j19096m38195o39281n50890
$$ -56103 -602926 -949581 -1004654 -770611 -566977 -562879 -565994 -685090 -1123285 -1762566 -2313456
10125b313456j04372L74810N05144M19299K01724j42871l12926k24693J00793
$$ -2313456 -2417828 -2043018 -1537874 -1118575 -916851 -1059722 -1372648 -1597341 -1496548
10116a496548L84156N24868L51391j57427o60905o73598k08444L08601N94698
$$ -1496548 -1112392 -587524 -236133 -393560 -1054465 -1728063 -1936507 -1627906 -1033208
10107a033208M47307P0392j70339p3038O6028J27409K71630M43396N16792N28189
$$ -1033208 -585901 -515509 -685848 -758886 -692858 -565449 -293819 149577 666369 1194558
10097A194558N45033N43655M78277K21862j77330m34792o11560p19902m95344
$$ 1194558 1739591 2283246 2761523 2983385 2806055 2371263 1759703 1039801 544457
10088E44457O5334N45689O37654N52656K93077r8226j61165q6205j09722j64860
$$ 544457 609791 1155480 1793134 2345790 2638867 2540641 2379476 2293271 2183549 2018689
10078B018689j68341J35773N89977O85001M86834k9273m64592l34971l1738J16496
$$ 2018689 1850348 1986121 2576098 3261099 3747933 3718660 3254068 2919097 2887359 3003855
10068C003855L03095M29715K69258l0954l89995m43189n2313K34660L33929L51350
$$ 3003855 3306950 3736665 4005923 3974969 3584974 3141785 3089472 3324132 3658061 4009411
10058D009411K82900K02602J34670O5554l8063n9579N183r5678l12794l21383
$$ 4009411 4292311 4494913 4629583 4695137 4657074 4597495 4602678 4507000 4194206 3872823
10048C872823r2943L8356J2911P3159J94099K27490J71399J21112K70845P03537
$$ 3872823 3779880 3818236 3831147 3904306 4098405 4325895 4497294 4618406 4889251 5592788
10038E592788R93230Q38709O73507P61861J029030J312819J596803J764187J857994
$$ 5592788 6586018 7424727 8098234 8860095 9889125 11201944 12798747 14562934 16420928
10029A6420928K211755K799606L594289M486343N108117M822672L072950Q99469
$$ 16420928 18632683 21432289 25026578 29512921 34621038 39443710 42516660 43416129
10021D3416129o53820j863541k400296k043561j274422l60275K55505L25311M31099
$$ 43416129 42762309 40898768 38498472 36454911 35180489 34820214 35075719 35401030 35832129
10012C5832129J142523K381350L954789N728230P627036R782637J2389834J5541944
$$ 35832129 36974652 39356002 43310791 49039021 56666057 66448694 78838528 94380472
10004I4380472J8714714K0229179J7585409J1419679P510709R069439J3807085
$$ 94380472 113095186 133324365 150909774 162329453 169840162 178909601 192716686
9997A92716686J8051366K0612293K2967401K1981826R594351j4175563l4273121
$$ 192716686 210768052 231380345 254347746 276329572 285923923 271748360 237475239
9990B37475239m0928634l8642318l2523604k5292081j8620353j3360630r572210
$$ 237475239 196546605 157904287 125380683 100088602 81468249 68107619 58535409
9983E8535409o855463n111859m649921n322652n592895m781140l590393k531667
$$ 58535409 51679946 46568087 41918166 36595514 31002619 26221479 22631086 20099419
9975B0099419j664708q18563r3838M04253Q30262J114733N11561j143018k420847
$$ 20099419 18434711 17616148 17522310 17926563 18756825 19871558 20383119 19240101 16819254
9966A6819254k516994j970144j173624l55765J47498M26238O75294P06655O16819
$$ 16819254 14302260 12332116 11158492 10802727 10950225 11376463 12051757 12758412 13375231
9957A3375231L94840o0160k01390L37394J352827K497648L515492M492714N693401
$$ 13375231 13770071 13709911 13508521 13845915 15198742 17696390 21211882 25704596 31397997
9948C1397997P387359R554497J2004578J4798897J7844634J9895581J7538070
$$ 31397997 38785356 48339853 60344431 75143328 92987962 112883543 130421613
9941A30421613N828045j2047879k3026696k3126018j8420427j3528425r834616
$$ 130421613 136249658 124201779 101175083 78049065 59628638 46100213 36265597
9934C6265597p257478n580250m352441l313187k562814k107128j510105p44479
$$ 36265597 29008119 23427869 19075428 15762241 13199427 11092299 9582194 8837715
9926H837715l41937l84280p06987q90007n75490r2976n5998l27124m10880m61933
$$ 8837715 8495778 8111498 7404511 6514504 5939014 5846038 5790040 5462916 5052036 4590103
9916D590103m13975n37089r19492j092484q26411l60860j48137l29797n65635
$$ 4590103 4176128 3639039 2719547 1627063 800652 439792 291655 -38142 -603777
9907f03777n17643k38275p2449N6127J89088J64959P4877r8700l68969m98093
$$ -603777 -1121420 -1359695 -1432144 -1376017 -1186929 -1021970 -947093 -1045793 -1414762 -1912855
9897a912855l76452J5086L95680M31627L10247K10073K62458M21203L93401J52024
$$ -1912855 -2289307 -2274221 -1878541 -1446914 -1136667 -926594 -664136 -242933 150468 302492
9887C02492k60619p31868q47164o07149m72503n11236m98019j62442K25223K29582
$$ 302492 41873 -689995 -1537159 -2144308 -2616811 -3128047 -3626066 -3788508 -3563285 -3333703
9877c333703J21109J78842K44416M11509N37912K21087l19632l67506L6101K94990
$$ -3333703 -3212594 -3033752 -2789336 -2377827 -1839915 -1618828 -1938460 -2305966 -2269865 -1974875
9867a974875L30663L84649N59671O37799M80599K32895l7855l34861m52113k50211
$$ -1974875 -1644212 -1259563 -699892 -62093 418506 651401 613546 278685 -173428 -423639
9857d23639n1629K3556J47911L09979L79068K62072J09418k1276k25131m26040
$$ -423639 -475268 -451712 -303801 6178 385246 647318 756736 735460 510329 84289
9847H4289m73312k70073r2399j83143n14863p50910o11451k97557r6424K34663
$$ 84289 -389023 -659096 -751495 -934638 -1449501 -2200411 -2811862 -3109419 -3205843 -2971180
9837b971180O30791P58698P13801N86082M44550J68494k19855m98468n36232l70870
$$ -2971180 -2340389 -1581691 -867890 -281808 162742 331236 111381 -387087 -923319 -1294189
9827a294189L5416L09546K00116R0758P0086Q2464L25993N37599M95123K27799
$$ -1294189 -1258773 -949227 -749111 -658353 -588267 -505803 -179810 357789 852912 1080711
9817A080711m5239k01897n23430p73973n69868j14289K96967N34323N91034N01458
$$ 1080711 1035472 833575 310145 -463828 -1033696 -1147985 -851018 -316695 274339 775797
9807G75797L40066K9908l61366o85271q27506p90832n86461k92282j17050j40857
$$ 775797 1115863 1145771 784405 99134 -728372 -1519204 -2105665 -2397947 -2514997 -2655854
9797b655854k65583m75945n94431l62129p5029P0664K33942L92108M28539L49461
$$ -2655854 -2921437 -3397382 -3991813 -4353942 -4428971 -4358307 -4124365 -3732257 -3303718 -2954257
9787b954257J48620j4886P1525M26329P38197P40157O63805N39505J41796k20278
$$ -2954257 -2805637 -2820523 -2748998 -2322669 -1584472 -844315 -180510 358995 500791 280513
9777B80513k79341k97507n06063o55933m21959N6117K71623K56771L82739N40870
$$ 280513 1172 -296335 -802398 -1458331 -1880290 -1824173 -1552550 -1295779 -913040 -372170
9767c72170K70504j79522l55674l57908k95801k27268k27957r8263J79974L75904
$$ -372170 -101666 -281188 -636862 -994770 -1290571 -1517839 -1745796 -1844059 -1664085 -1288181
9757a288181K58123j23181k46902J5299K86376K46923j14199n55479p65745o61209
$$ -1288181 -1030058 -1153239 -1400141 -1384842 -1098466 -851543 -965742 -1521221 -2286966 -2948175
9747b948175l24238p321l0087j30883n3464R0811J32918J23496K8965j87079k69804
$$ -2948175 -3272413 -3279734 -3309821 -3440704 -3494168 -3403357 -3270439 -3146943 -3117978 -3305057 -3574861
9736c574861j32543K07946L73430J41084j30002n8733K58342M61882M98227M59764
$$ -3574861 -3707404 -3499458 -3126028 -2984944 -3114946 -3173679 -2915337 -2453455 -1955228 -1495464
9726a495464L22974K09041K98725N22963N79413L78454J08420j85292m46966o21976
$$ -1495464 -1172490 -963449 -664724 -141761 437652 816106 924526 739234 292268 -329708
9716c29708o35034k80263J66499K54436P3866l0845J45483L70486M64441M73824
$$ -329708 -964742 -1245005 -1078506 -824070 -750204 -781049 -635566 -265080 199361 673185
9706F73185K29708j03585j87264m0382j7461k39416n70439q29748p27507l27497
$$ 673185 902893 799308 612044 571662 554201 314785 -255654 -1085402 -1812909 -2140406
9696b140406l8568k13825n86330o63124l17561P2931J21635J09188K48695L09213
$$ -2140406 -2178974 -2392799 -2979129 -3642253 -3959814 -3886883 -3765248 -3656060 -3407365 -3098152
9686c098152K14672J00646j04268k83409k28066q2740K1380P6991K24524N96017
$$ -3098152 -2883480 -2782834 -2887102 -3170511 -3398577 -3481317 -3459937 -3382946 -3158422 -2562405
9676b562405P57114N06177J94980O0827k8904k13551n52516p53090n53753l13000
$$ -2562405 -1805291 -1299114 -1104134 -1043307 -1072211 -1285762 -1838278 -2591368 -3145121 -3458121
9666c458121l87126m88110j12943M53776N71233K98111K5466L2748K81212L16990
$$ -3458121 -3845247 -4333357 -4446300 -3992524 -3421291 -3123180 -3097714 -3064966 -2783754 -2466764
9656b466764j8620l57951l04213j3130K92997N84343N00677K12264K45578M38361
$$ -2466764 -2485384 -2843335 -3147548 -3160678 -2867681 -2283338 -1782661 -1570397 -1324819 -886458
9646h86458L96362K18403K23281L76804L34069N5070k75988l50617k84119l00473
$$ -886458 -490096 -271693 -48412 328392 662461 717531 441543 90926 -193193 -493666
9636d93666k08887L9969J86227K92912K37552n9692k38120n04933q30414o90033
$$ -493666 -702553 -662584 -476357 -183445 54107 -5585 -243705 -748638 -1579052 -2269085
9626b269085o0202M45358M03111P4887k8900Q060J22323K64033L29222L11697
$$ -2269085 -2329287 -1883929 -1480818 -1405931 -1434831 -1426771 -1304448 -1040415 -711193 -399496
9616c99496P6264j19019P360Q8005k02007m33356j85017R9937J08328M2864r466
$$ -399496 -323232 -442251 -434891 -346886 -548893 -982249 -1167266 -1067329 -959001 -916137 -925603
9605i25603J07620L19131K81420p9745n89143r42801r01167m77543p8413K8186
$$ -925603 -817983 -498852 -217432 -297177 -886320 -1829121 -2730288 -3207831 -3286244 -3258058
9595c258058J85554N84511Q53015R13972Q81279O79586J33072l13955k96899j89678
$$ -3258058 -3072504 -2487993 -1634978 -721006 160273 839859 972931 658976 362077 172399
9585A72399j17989J29192L92637L74151J44309o1341m04620p36829q16926o40708
$$ 172399 54410 183602 576239 950390 1094699 1033358 628738 -108091 -925017 -1565725
9575a565725k30196K18685M57642L80915O7905k63879m14088l79822l13952k10156
$$ -1565725 -1795921 -1577236 -1119594 -738679 -670774 -934653 -1348741 -1728563 -2042515 -2252671
9565b252671j53414j41389q8294K0464L0513j20947j27635K2354K12680K28113
$$ -2252671 -2406085 -2547474 -2635768 -2615304 -2584791 -2705738 -2833373 -2811019 -2598339 -2370226
9555b370226J77506L64375N12211L67400K10347L18033M61070M09818L02046K09443
$$ -2370226 -2192720 -1828345 -1316134 -948734 -738387 -420354 40716 450534 752580 962023
9545I62023N0766r4484k36824l84407n25774n76299l05730j82284k85695k52750
$$ 962023 1012789 918305 681481 297074 -228700 -804999 -1110729 -1293013 -1578708 -1831458
9535a831458l0666L04529O10796P98262P84306N19255K64989J98524K13159J49873
$$ -1831458 -1862124 -1557595 -946799 -148537 635769 1155024 1420013 1618537 1831696 1981569
9525A981569j84773o65132r38377q14562n27669m31380m17491k51663j01723J9526
$$ 1981569 1796796 1131664 193287 -621275 -1148944 -1580324 -1997815 -2249478 -2351201 -2331675
9515b331675K67112L84453J16390k76519l86368k01230K0717J49854O1635j49723
$$ -2331675 -2064563 -1680110 -1563720 -1840239 -2226607 -2427837 -2407120 -2257266 -2195631 -2345354
9505b345354k31664j54154k4257N0716K47131M55951M39724K70291J66032r967
$$ -2345354 -2577018 -2731172 -2755429 -2704713 -2457582 -2001631 -1561907 -1291616 -1125584 -1135551
9495a135551l08245l65725j44461k1192p2956n1416J29845J43206O3290K3079
$$ -1135551 -1443796 -1809521 -1953982 -1975174 -2048130 -2099546 -1969701 -1826495 -1763205 -1740126
9485a740126J83054N69391O54375K95502j06030j99713l0640J38117K60732L78072
$$ -1740126 -1557072 -987681 -333306 -37804 -143834 -343547 -374187 -236070 24662 402734
9475D02734K62341k0654j32882k24466m11460l69585m4788K47986L22710L35728
$$ 402734 665075 644421 511539 287073 -124387 -493972 -538760 -290774 31936 367664
9465C67664L86555L40600J44046j19519k60547j57381n8103j40026j86886j73557
$$ 367664 754219 1094819 1238865 1119346 858799 701418 643315 503289 316403 142846
9455A42846j66320r9453j28492j85612j77996o3233J33385K11720J30240j8718
$$ 142846 -23474 -122927 -251419 -437031 -615027 -678260 -544875 -333155 -202915 -221633
9445b21633l5183K9235j08687q0869Q5745j18871k15358L444J09141P7227J23143
$$ -221633 -256816 -227581 -336268 -417137 -331392 -450263 -665621 -662177 -553036 -475809 -352666
9434c52666J29154N5846M5728Q3238q8184l93182n52015n08365l67582k20132
$$ -352666 -223512 -167666 -121938 -38700 -126884 -520066 -1072081 -1580446 -1948028 -2168160
9424b168160j69805j07292K24170M87547L81948J55931J5232Q8672L32242L36362
$$ -2168160 -2337965 -2445257 -2221087 -1733540 -1351592 -1195661 -1180429 -1091757 -759515 -423153
9414d23153J53110N4645p3857k07884j93610r2363Q7799K44577L48823M08308
$$ -423153 -270043 -215398 -289255 -497139 -690749 -783112 -695313 -450736 -101913 306395
9404C06395K64953n7558k67501k42954p32L27150M54789K10331j02353l6698J56895
$$ 306395 571348 513790 246289 3335 2603 329753 784542 994873 892520 855822 1012717
9393A012717M6513l39997o00186o22940o30536m47675p7807R8290O1104P8531
$$ 1012717 1059230 719233 119047 -503893 -1134429 -1582104 -1659911 -1561621 -1500517 -1421986
9383a421986J38518J53684M2547k95784o50349o33812l20878J3082L27467L59623
$$ -1421986 -1283468 -1129784 -1087237 -1383021 -2033370 -2667182 -2988060 -2974978 -2647511 -2287888
9373b287888J30526P5524L14351O08341O25230L78656K39143L42183M61914M15339
$$ -2287888 -2157362 -2081838 -1767487 -1159146 -533916 -155260 83883 426066 887980 1303319
9363A303319K38029k6134m00884n44725l62208k33735k18549j70096K5595L03666
$$ 1303319 1541348 1515214 1114330 569605 207397 -26338 -244887 -414983 -389388 -85722
9353h5722L56106J91372O3282j01400l00903k65747k8676K00448J11530r7871
$$ -85722 270384 461756 525038 423638 122735 -143012 -171688 28760 140290 42419
9343D2419k58434m30990m22113j36010K58093N06232M39399J34926j71682k71981
$$ 42419 -216015 -647005 -1069118 -1205128 -947035 -440803 -1404 133522 -38160 -310141
9333c10141k60038j97866j19325l0550j0600l1436l5401K7544K74112L27325j455
$$ -310141 -570179 -768045 -887370 -917920 -928520 -959956 -995357 -967813 -693701 -366376 -367831
9322c67831m48989n92821k14798K08406L98218N88150O37321M03205J24041P3674
$$ -367831 -816820 -1409641 -1624439 -1416033 -1017815 -429665 207656 610861 734902 808576
9312H08576R0643q8787k49751j52882R190j08617m47052n53446m60488k46457
$$ 808576 899219 810432 560681 407799 416989 308372 -138680 -692126 -1152614 -1399071
9302a399071l1129l01870p53290p72574m54727p4814K10844M25157N12191L74548
$$ -1399071 -1430200 -1732070 -2485360 -3257934 -3712661 -3787475 -3576631 -3151474 -2639283 -2264735
9292b264735K82744L33479L61788L47224K99879K06978k0448k38252l68055n96138
$$ -2264735 -1981991 -1648512 -1286724 -939500 -639621 -432643 -453091 -691343 -1059398 -1655536
9282a655536p70905m21041Q9257L67688M12463L22715N7181l99048o00242k41770
$$ -1655536 -2426441 -2847482 -2758225 -2390537 -1978074 -1655359 -1598178 -1997226 -2597468 -2839238
9272b839238J51942j69778p83385p01902K7789N94698O23410M31125J43898k16645
$$ -2839238 -2687296 -2857074 -3640459 -4342361 -4314572 -3719874 -3096464 -2665339 -2521441 -2738086
9262b738086l58714j67953J80956L85841L11888K10913J35926o0303j97991j88803
$$ -2738086 -3096800 -3264753 -3083797 -2697956 -2386068 -2175155 -2039229 -2099532 -2297523 -2486326
9252b486326j02988k783N1815J9953k44482o21534o94628m65031k15734j10923
$$ -2486326 -2589314 -2592097 -2540282 -2520329 -2764811 -3386345 -4080973 -4546004 -4761738 -4872661
9242d872661j36097l0895K96873O25319O45261L67614J38794L2032J3844K51911
$$ -4872661 -5008758 -5039653 -4742780 -4117461 -3472200 -3104586 -2965792 -2933760 -2919916 -2668005
9232b668005N95635O78119L46680o2832k16982k70199l45112l18522k03668k76825
$$ -2668005 -2072370 -1394251 -1047571 -1110403 -1327385 -1597584 -1942696 -2261218 -2464886 -2741711
9222b741711n32744m64629P4537O18016Q11250N97616J97580k15118m81981m31404
$$ -2741711 -3274455 -3739084 -3664547 -3046531 -2235281 -1637665 -1440085 -1655203 -2137184 -2568588
9212b568588k51610k10444j54281J59903O07488P13317N18414L68604L56997L72542
$$ -2568588 -2820198 -3030642 -3184923 -3025020 -2417532 -1704215 -1185801 -817197 -460200 -87658
9202h7658L61419K36702q407j59483j74708k70299m48745o16886m71608k14171
$$ -87658 273761 510463 502056 342573 167865 -102434 -551179 -1168065 -1639673 -1853844
9192a853844j99776j02154K20391M80846O13477P08477P04459M62244J28730j16390
$$ -1853844 -2053620 -2155774 -1935383 -1454537 -841060 -132583 571876 1034120 1162850 1046460
9182A046460l30995n34348n94673l03457L5980n6755l22415k33978J6698J02652
$$ 1046460 715465 181117 -413556 -717013 -681033 -737788 -1060203 -1294181 -1277483 -1174831
9172a174831J73583K76342M63263N90813L77443M8295j8779J4985o5425o5097
$$ -1174831 -1001248 -724906 -261643 329170 706613 754908 736129 751114 685689 620592
9162F20592O832J3891j124Q7503m0545m39652o53077n32026j13207L98461L86769
$$ 620592 627424 641315 640191 727694 687149 247497 -405580 -937606 -1050813 -652352 -265583
9151b65583j7697k22800j71289j32431k83986k71955J18466L53531K11483j60440
$$ -265583 -283280 -506080 -677369 -809800 -1093786 -1365741 -1247275 -893744 -682261 -842701
9141h42701n21200n13824l18438j09897J18957L28751M88610L77579J88806J83570
$$ -842701 -1363901 -1877725 -2196163 -2306060 -2187103 -1858352 -1369742 -992163 -803357 -619787
9131f19787K57579L38531K11446j45428l52779n25047o05389l35621q885N2822
$$ -619787 -362208 -23677 187769 42341 -310438 -835485 -1440874 -1776495 -1785380 -1732558
9121a732558q6472o252L32318M71974L16081J5866k21870m48531q52828j119825
$$ -1732558 -1819030 -1825282 -1492964 -1020990 -704909 -689043 -910913 -1359444 -2212272 -3332097
9111c332097p94348j54703L97390N57536L35485K21258M61628Q11542Q25881M68915
$$ -3332097 -4126445 -4281148 -3883758 -3326222 -2990737 -2769479 -2307851 -1496309 -670428 -201513
9101b01513J76498o1921k80784k00985j21085r5399l0470L9403J33314J80992
$$ -201513 -25015 -86936 -367720 -568705 -689790 -785189 -815659 -776256 -642942 -461950
9091d61950J47432L5385j35292l87796n01401k84776m3562M1805K69719P02417
$$ -461950 -314518 -279133 -414425 -802221 -1303622 -1588398 -1631960 -1590155 -1320436 -618019
9081f18019R53763R67290Q34963M65822P1826j30518l22639m67958m86704m37677
$$ -618019 335744 1303034 2137997 2603819 2675645 2545127 2222488 1754530 1267826 830149
9071H30149k80671j69714k63001l14951k98080k46832r5207Q6886J4901o5812
$$ 830149 549478 379764 116763 -198188 -496268 -743100 -838307 -751421 -736520 -802332
9061h02332J67787M68272N06686L14316N8078r4748k75913n66339p64051o79595
$$ -802332 -634545 -166273 340413 654729 712807 618059 342146 -224193 -988244 -1667839
9051a667839k37318K19291L39208L79972K57134P0510M7015J74389L94106L43257
$$ -1667839 -1905157 -1685866 -1346658 -966686 -709552 -639042 -592027 -417638 -23532 319725
9041C19725J58753J4846k20376l29291j08377J60308K74765K36818N4897j29617
$$ 319725 478478 493324 272948 -56343 -164720 -4412 270353 507171 562068 432451
9031D32451j86976m06620p39096o68279j99547L23294M76931Q7281n05551p31351
$$ 432451 245475 -161145 -900241 -1568520 -1768067 -1444773 -967842 -880561 -1386112 -2117463
9021b117463m16862L4894L70167N34360N74982M60577K86639p1383l37451j09760
$$ -2117463 -2534325 -2499431 -2129264 -1594904 -1019922 -559345 -272706 -344089 -681540 -791300
9011g91300K13828J46882L4486J76649L42313L39444K61278O1712m02414p70328
$$ -791300 -577472 -430590 -396104 -219455 122858 462302 723580 785292 382878 -387450
9001c87450p20696l01204Q3008j03488n16348n15129j46191J94498L52932L22064
$$ -387450 -1108146 -1409350 -1326342 -1429830 -1946178 -2461307 -2607498 -2413000 -2060068 -1738004
8991a738004K40307K33949J08661O940Q2993J01151M3495Q2703n429k40072l50713
$$ -1738004 -1497697 -1263748 -1155087 -1148147 -1065154 -964003 -920508 -837805 -843234 -1083306 -1434019
8980a434019k30576J78244K96787L897j99793k54215k37613j09730J33201L69606
$$ -1434019 -1664595 -1486351 -1189564 -1185667 -1385460 -1639675 -1877288 -1987018 -1853817 -1484211
8970a484211M89114N53924M97058L23872J56826l0326k92548m21071l98344j78033
$$ -1484211 -995097 -441173 55885 379757 536583 506257 213709 -207362 -605706 -783739
8960g83739K82505O05878O21810L93765J22920k39493n96822p01601o37732n00611
$$ -783739 -501234 104644 726454 1120219 1243139 1003646 406824 -294777 -932509 -1433120
8950a433120k57048K0509N3516k7753M5815J33878J66153L5849k0901K57517N77498
$$ -1433120 -1690168 -1669659 -1616143 -1643896 -1598081 -1464203 -1298050 -1262201 -1283102 -1025585 -448087
8939d48087O65916M64255M0416m93960q31129n72030k6671L58952L42425L5911
$$ -448087 217829 682084 722500 228540 -602589 -1174619 -1201290 -842338 -499913 -464002
8929d64002k93115l33890m469K45420L67021K79885l1781k22440l60580n47295
$$ -464002 -757117 -1091007 -1095476 -850056 -483035 -203150 -234931 -457371 -817951 -1365246
8919a365246n20025j88497K0486k045n9007J29802N34526P11716N70131L02148
$$ -1365246 -1885271 -2073768 -2053282 -2055327 -2114334 -1984532 -1450006 -738290 -168159 133989
8909A33989K10554K63231J69173O2233P8010n1364m81078q75016r26264o84500
$$ 133989 344543 607774 776947 839180 917190 865826 384748 -490268 -1416532 -2101032
8899b101032l18878j42779j33625M2886J23793P6744O7010M4244J24067K55621
$$ -2101032 -2419910 -2562689 -2696314 -2653428 -2529635 -2452891 -2385881 -2341637 -2217570 -1961949
8889a961949L04337L34583K98504Q6704l3504R5942P7584l03513n73935n22753
$$ -1961949 -1657612 -1323029 -1024525 -937821 -971325 -875383 -797799 -1101312 -1675247 -2198000
8879b198000l00733q5347P8052J32649O307j69841k22502j80718K8226M10942
$$ -2198000 -2498733 -2584080 -2506028 -2373379 -2367072 -2536913 -2759415 -2940133 -2911907 -2500965
8869b500965O24418M66273L33796L35646L03238L95580M64002K66826k5003k02552
$$ -2500965 -1876547 -1410274 -1076478 -740832 -437594 -42014 421988 688814 663811 461259
8859D61259m10401p98838r93536p36821m01656k24189j83075J0186L10443M88594
$$ 461259 50858 -747980 -1741516 -2478337 -2879993 -3104182 -3287257 -3277071 -2966628 -2478034
8849b478034O39980N67834K01239j11413j87091K8852L73678N06211M90494L55364
$$ -2478034 -1838054 -1270220 -1068981 -1180394 -1367485 -1338633 -964955 -458744 31750 387114
8839C87114R4821j03582k27147l46780m51238l25650R8783M79444O28065N69732
$$ 387114 481935 378353 151206 -195574 -646812 -972462 -873679 -394235 233830 803562
8829H03562L76901J39383j05018l63675o62893r13092j101016j079881o66549
$$ 803562 1180463 1319846 1214828 851153 188260 -724832 -1825848 -2905729 -3572278
8820c572278r5930L17918M64735M88376N12937K72365j33998l85460k74847l3406
$$ -3572278 -3668208 -3350290 -2885555 -2397179 -1884242 -1611877 -1745875 -2131335 -2406182 -2439588
8810b439588M7465J6369j08916J2117L56090N95511N91458L00399j37797l83385
$$ -2439588 -2392123 -2375754 -2484670 -2472553 -2116463 -1520952 -929494 -629095 -766892 -1150277
8800a150277m04597l30659j10727J61104L15527M92725P47598Q20000M54460j78124
$$ -1150277 -1554874 -1885533 -1996260 -1835156 -1519629 -1026904 -279306 540694 995154 817030
8790H17030n42984n88140n37542m35604l88970l56209j91533J06573K47907J03483
$$ 817030 274046 -314094 -851636 -1287240 -1676210 -2032419 -2223952 -2117379 -1869472 -1765989
8780a765989l6285j44670k69875k13086J12157M18548M79349L75597K85518K13765
$$ -1765989 -1802274 -1946944 -2216819 -2429905 -2317748 -1899200 -1419851 -1044254 -758736 -544971
8770e44971K1349j65199m10898o81096p04799l81785J71182N13107M57369L11675
$$ -544971 -523622 -688821 -1099719 -1780815 -2485614 -2867399 -2696217 -2183110 -1725741 -1414066
8760a414066J88318k925j39525k68909l16053j87293n287R3868K81931M90432
$$ -1414066 -1225748 -1228673 -1368198 -1637107 -1953160 -2140453 -2145740 -2051872 -1769941 -1279509
8750a279509M38799J53634j38629k08096r2693j29032k48269r3370L9334L6655
$$ -1279509 -840710 -687076 -825705 -1033801 -1126494 -1255526 -1503795 -1597165 -1557831 -1521176
8740a521176K24089N19539N29671K99343K30056J28949j93147o05255q09754n70922
$$ -1521176 -1297087 -777548 -247877 51466 281522 410471 217324 -387931 -1197685 -1768607
8730a768607m82309n65441l37084J28692N53845O71891M81949J44609l62305r03677
$$ -1768607 -2250916 -2816357 -3153441 -3024749 -2470904 -1799013 -1317064 -1172455 -1534760 -2438437
8720b438437j042813o26818j40245R0188L58882O74705O64450N02604M57871K65799
$$ -2438437 -3481250 -4108068 -4248313 -4158125 -3799243 -3124538 -2460088 -1957484 -1499613 -1233814
8710a233814o1404j97190o5798L0766N912K3149Q1460L01197N73215O28088L25235
$$ -1233814 -1295218 -1492408 -1558206 -1527440 -1521528 -1498379 -1416919 -1115722 -542507 85581 410816
8699D10816o8746l44103m61964k27387J76826J85591k47094n33471m29302j41093
$$ 410816 342070 -2033 -463997 -691384 -514558 -328967 -576061 -1109532 -1538834 -1679927
8689a679927K31103M26119K87420R0716j51487m34784m85739k18580J59401L41305
$$ -1679927 -1448824 -1022705 -735285 -644569 -796056 -1230840 -1716579 -1935159 -1775758 -1434453
8679a434453K71910Q5797j55078m86126p79680o49148j44410K99629M94795N24569
$$ -1434453 -1162543 -1076746 -1231824 -1717950 -2497630 -3146778 -3291188 -2991559 -2496764 -1972195
8669a972195M16081K20039l744j37057r4714L3203O5373M3827K05770M74685O12194
$$ -1972195 -1556114 -1336075 -1339819 -1476876 -1571590 -1538387 -1473014 -1429187 -1223417 -748732 -136538
8658a36538O85212P04214N85600J58050m44565p90927n55544M1713L78187K47402
$$ -136538 548674 1252888 1838488 1996538 1551973 761046 205502 247215 625402 872804
8648H72804n1065k30213k41196p7145J76962K57388O0932n8212L0859R5841M8403
$$ 872804 821739 591526 350330 273185 450147 707535 768467 710255 741114 836955 885358
8637H85358j52510m22419m31420j87060J06988M43675P34776O78394J68963l94108
$$ 885358 732848 310429 -120991 -308051 -201063 242612 977388 1655782 1824745 1430637
8627A430637n37557m25010l19426k19430j34665j27921j58141j40957p203L04078
$$ 1430637 893080 468070 148644 -70786 -205451 -333372 -491513 -632470 -639673 -335595
8617c35595N43169N11324L07316R9368j27877k53810j91219j76402l19700m62839
$$ -335595 207574 718898 1026214 1125582 997705 743895 552676 376274 56574 -406265
8607d06265n46082m96396k29779N6429J95395J74979J76494K46185L57965K98206
$$ -406265 -952347 -1448743 -1678522 -1622093 -1426698 -1251719 -1075225 -829040 -471075 -172869
8597a72869p3772m48275n99150n14641l39236l17190l43325j90889M1936Q5627
$$ -172869 -246641 -694916 -1294066 -1808707 -2147943 -2465133 -2808458 -2999347 -2957411 -2871784
8587b871784O917Q5270K47687K88779O0391j71342j78447j33813j35202j07093
$$ -2871784 -2864867 -2779597 -2531910 -2243131 -2182740 -2354082 -2532529 -2666342 -2801544 -2908637
8577b908637J3936L67680N75514M85022N75425Q63736R26377O25729K04930j75794
$$ -2908637 -2894701 -2527021 -1951507 -1466485 -891060 -27324 899053 1524782 1729712 1553918
8567A553918k44702j92548l27022l86014j42498K18152L07877Q1255j02763n1016
$$ 1553918 1309216 1116668 789646 403632 261134 479286 787163 868418 765655 714639
8557G14639J24642J03715j35062k60047j22799K03437M67217L70160L9228j53948
$$ 714639 839281 942996 807934 547887 425088 628525 1095742 1465902 1505130 1351182
8547A351182k35967k79295j31434L0407j9799l46450o59505q97427q62588l38319
$$ 1351182 1115215 835920 704486 734893 715094 368644 -290861 -1188288 -2050876 -2389195
8537b389195L12544P90595Q57714O18366M05531K49056P0680k36369n22555o72952
$$ -2389195 -2076651 -1286056 -428342 190024 595555 844611 915291 678922 156367 -516585
8527e16585p39434n00066N0744M03815L45456J97788K6461j70139k46358j66388
$$ -516585 -1256019 -1756085 -1705341 -1301526 -956070 -758282 -731821 -901960 -1148318 -1314706
8517a314706J01607N36021Q29024P49650N02917K12313M9223L954j33712k91540
$$ -1314706 -1213099 -677078 151946 901596 1404513 1616826 1666049 1670003 1536291 1244751
8507A244751l45505l39092l04304k44520k86028k24923Q157J21341P6904J31457
$$ 1244751 899246 560154 255850 11330 -274698 -499621 -491464 -370123 -293219 -161762
8497a61762K40211J20419j9554R6526R2766k22983o03099o44779k71318J68490
$$ -161762 78449 198868 179314 275840 368606 145623 -457476 -1102255 -1373573 -1205083
8487a205083N05426O11482M51351L43008M07082K89314Q9837N4647Q1670K96200
$$ -1205083 -699657 -88175 363176 706184 1113266 1402580 1492417 1547064 1628734 1924934
8477A924934L65639J42036l4831p1809p1887k8623q6296j86640r2385J33084M03320
$$ 1924934 2290573 2432609 2397778 2325969 2254082 2225459 2139163 1952523 1860138 1993222 2396542
8466B396542M69245L18738J22977Q423J0376j21437m52947p20519o65451l68525
$$ 2396542 2865787 3184525 3307502 3315925 3326301 3204864 2751917 2031398 1365947 997422
8456I97422j01870k3183k12910m39056m91504m63056j93176L35139O31832N39354
$$ 997422 895552 872369 659459 220403 -271101 -734157 -927333 -592194 39638 578992
8446E78992L02699k3187l07614k44374L8227M8958j74525k51552j96176j52808
$$ 578992 881691 858504 550890 306516 344743 393701 219176 -32376 -228552 -381360
8436c81360j20760k3180J94075L54197L46234K06095L3185k00024m18427m64098
$$ -381360 -502120 -525300 -331225 22972 369206 575301 608486 408462 -9965 -474063
8426d74063l65168k16114j97099l76037l89400r4742J34203K33753L25646L57934
$$ -474063 -839231 -1055345 -1252444 -1628481 -2017881 -2112623 -1978420 -1744667 -1419021 -1061087
8416a061087J73888j22793k54698l10338k33370J38746O41087Q36189N46170K29494
$$ -1061087 -887199 -1009992 -1264690 -1575028 -1808398 -1669652 -1028565 -192376 353794 583288
8406E83288J10079o3628j97976k24883j94773j00803l7892K3369K20564M97227
$$ 583288 693367 629739 431763 206880 12107 -88696 -126588 -103219 117345 614572
8396F14572O60059O97674N25050J42769j62474j79255j34917k44533j59885Q0659
$$ 614572 1274631 1972305 2497355 2640124 2477650 2298395 2163478 1918945 1759060 1839719
8386A839719p8776m16461n48038m00780l9310K32340K97545K06917J4306l4720
$$ 1839719 1760943 1344482 796444 395664 356354 588694 886239 1093156 1107462 1072742
8376A072742O287J12645R3647r6964j29572J64940N25694L80286p9175l69122
$$ 1072742 1079029 1191674 1285321 1188357 1058785 1223725 1749419 2129705 2050530 1681408
8366A681408n93192p10883n36664j25122J61493J64806Q3688J5905m3275r9647
$$ 1681408 1088216 377333 -159331 -284453 -122960 41846 125534 141439 98164 -1483
8356a483n3515L5546L7854l6096j42494j29168J53783L91084L25983J43427K2923
$$ -1483 -54998 -19452 18402 -17694 -160188 -289356 -135573 255511 581494 724921 747844
8345G47844q1340k64182j90489R5517J86437J97218L27170M29827L61062J98519
$$ 747844 666504 402322 211833 307350 493787 691005 1018175 1448002 1809064 2007583
8335B007583L2300m8079j10046l42735n70043n61691m88663n75177o01059l89742
$$ 2007583 2039883 1991804 1881758 1539023 968980 407289 -81374 -656551 -1257610 -1647352
8325a647352j9515L73091N23940K39312p5712r7019o8956j22690j63835k39396
$$ -1647352 -1666867 -1293776 -769836 -530524 -606236 -703255 -772211 -894901 -1058736 -1298132
8315a298132l95702k82867J44678O30448J016883J032326O47389K04897k09766
$$ -1298132 -1693834 -1976701 -1832023 -1201575 -184692 847634 1495023 1699920 1490154
8306A490154m63507m77942n35656o92068o99049o00633m43957j51384J79424K64260
$$ 1490154 1026647 548705 13049 -679019 -1378068 -1978701 -2422658 -2574042 -2394618 -2130358
8296b130358K03140L69202M03694J93583L5971q9475q7312J63009L52263K74637
$$ -2130358 -1927218 -1558016 -1154322 -960739 -924768 -1014243 -1101555 -938546 -586283 -311646
8286c11646m1k68882l63508k77356q4767P9213K13937L94976L37578M1633j0479
$$ -311646 -311687 -580569 -944077 -1221433 -1306200 -1226987 -1013050 -618074 -280496 -238863 -249342
8275b49342j6753n5761J09234K69956L29690K61477k1699K8169J79514o0550l15986
$$ -249342 -266095 -321856 -212622 57334 387024 648501 626802 654971 834485 773935 457949
8264D57949l00520j52200K5801K21375L41353L47031L43722J76234k12581n17921
$$ 457949 157429 5229 31030 252405 593758 940789 1284511 1460745 1248164 730243
8254G30243m47767j31737N5154q0032m09505m45245j27020K69134M66444M88375
$$ 730243 282476 150739 205893 125861 -283644 -728889 -855909 -586775 -120331 368044
8244C68044N71030O18353L37099j45096k43454J77154N63027O32131M74523J06872
$$ 368044 939074 1557427 1894526 1749430 1505976 1683130 2246157 2878288 3352811 3459683
8234C459683j79774l79627n46404l66009n1509J56927J30368l7709k27169m93043
$$ 3459683 3279909 2900282 2353878 1987869 1936360 2093287 2223655 2185946 1958777 1465734
8224A465734n68525m14735k31228j38294j60122j38490J37182O44454Q79772O09115
$$ 1465734 897209 482474 251246 112952 -47170 -185660 -48478 595976 1475748 2084863
8214B084863K16364j6387j40400j45848j19329k53300n40496p39270o01954j90470
$$ 2084863 2301227 2284840 2144440 1998592 1879263 1625963 1085467 346197 -255757 -446227
8204d46227J09579L80253N65510N04504L89304J26754j98504k53635o5461J9267
$$ -446227 -336648 43605 609115 1113619 1502923 1629677 1431173 1177538 1112077 1131344
8194A131344R0848J74083J24518J43657J47025n3200j44721j470Q4252K2306j82567
$$ 1131344 1222192 1396275 1520793 1664450 1811475 1758275 1613554 1612084 1696336 1718642 1536075
8183A536075m02077m14091k24419Q5705J93503n8574l04001l53131l08220l02452
$$ 1536075 1133998 719907 495488 581193 774696 716122 412121 58990 -249230 -551682
8173e51682m46504n41007k83710R2298L14669L52547J98257J61215K86787K35588
$$ -551682 -998186 -1539193 -1822903 -1730605 -1415936 -1063389 -865132 -703917 -417130 -181542
8163a81542q8792l80165l63173P3051O36387R86894R29172M31567j30638k43487
$$ -181542 -270334 -650499 -1013672 -940621 -304234 682660 1611832 2043399 1912761 1669274
8153A669274j8677J5597j86541m21271n61491k53500L10420N85499M13664N0493
$$ 1669274 1650597 1666194 1479653 1058382 496891 243391 553811 1139310 1552974 1603467
8143A603467k63162n00817m31710j12805J53813L33453M26055M19093L35145J05578
$$ 1603467 1340305 839488 407778 294973 448786 782239 1208294 1627387 1962532 2068110
8133B068110j74506l60925n00014o18110p33398p26619l81627J16248N32361P53722
$$ 2068110 1893604 1532679 1032665 414555 -318843 -1045462 -1427089 -1310841 -778480 -24758
8123b4758O62380L97761J03345j59131k48048j91707n7649M782L5946J23230l5606
$$ -24758 637622 1035383 1138728 979597 731549 539842 482193 486975 522921 646151 610545
8112F10545n28829q70203n94791j13111j04689k09948R446L81832M94813J70414
$$ 610545 81716 -788487 -1383278 -1496389 -1601078 -1811026 -1801580 -1419748 -924935 -754521
8102g54521r5033J78463N72462P01481N94227N31032Q12963J123582R26073L15961
$$ -754521 -849554 -671091 -98629 602852 1197079 1728111 2541074 3664656 4590729 4906690
8092D906690k42384m85047n13405m64757l95722l16729j90732j8545j43719m99771
$$ 4906690 4664306 4179259 3665854 3201097 2805375 2488646 2297914 2279369 2135650 1635879
8082A635879p50408q07011m75277J4479K45829J71832L1471j48635j33296O0719
$$ 1635879 885471 78460 -396817 -382338 -136509 35323 66794 -81841 -215137 -154418
8072a54418J41590M8165p8359j52378j60435J48961O33096Q44939N44265Q054
$$ -154418 -12828 35337 -43022 -195400 -355835 -206874 426222 1271161 1815426 1823480
8062A823480j75942j9696K40642M49171L53078n5475m87067q09454j005511r54904
$$ 1823480 1647538 1627842 1868484 2317655 2670733 2615258 2128191 1318737 313226 -641678
8052f41678p78980o50903o98188o87239m05094j65620j6649K99649N06299P46645
$$ -641678 -1420658 -2071561 -2769749 -3456988 -3862082 -4027702 -4044351 -3744702 -3238403 -2491758
8042b491758J073019R31012L49581k24514o96442r02887o35806k67080k4889J94172
$$ -2491758 -1418739 -487727 -138146 -362660 -1059102 -1961989 -2597795 -2864875 -2889764 -2695592
8032b695592K94893L46748M82432M83155K53057Q1105J18628J64948K46408J97523
$$ -2695592 -2400699 -2053951 -1571519 -1088364 -835307 -754202 -635574 -470626 -224218 -26695
8022b6695j42809m88023m48404j62824J04809J66074R7313R4449J04468m1759
$$ -26695 -169504 -657527 -1105931 -1268755 -1163946 -997872 -900559 -806110 -701642 -743401
8012g43401k61402k56927j31073q2639j71802l93107o18092o62812l98141J18309
$$ -743401 -1004803 -1261730 -1392803 -1475442 -1647244 -2040351 -2658443 -3321255 -3719396 -3601087
8002c601087N78555Q49529Q87404O72386M16456L33120K76694N2262j93625m03525
$$ -3601087 -3022532 -2173003 -1285599 -613213 -196757 136363 413057 465319 271694 -131831
7992a31831m97105n45207p55296o71062q2179M06561M90415L17456Q5591j09537
$$ -131831 -628936 -1174143 -1929439 -2600501 -2682680 -2276119 -1785704 -1468248 -1382657 -1492194
7982a492194j63479n4434o8283k11964l18989k41233J023N9502j98275l97974
$$ -1492194 -1655673 -1710107 -1778390 -1990354 -2309343 -2550576 -2549553 -2490051 -2688326 -3086300
7972c086300j74646L01892P55571R12403P63506N30028L46658K71572K28143J18823
$$ -3086300 -3260946 -2959054 -2203483 -1291080 -527574 2454 349112 620684 848827 967650
7962I67650P8137J77945K99287L03140J76929N5098J02185J51464N2473k33589
$$ 967650 1045787 1223732 1523019 1826159 2003088 2058186 2160371 2311835 2364308 2130719
7952B130719m95571n36264m02712j65083L2393J7205r718J80840P1857n60134
$$ 2130719 1635148 1098884 696172 531089 563482 580687 570969 751809 823666 263532
7942B63532r99832q85804m48140J55454M11097J55570l10436o07716o06719n13495
$$ 263532 -736300 -1622104 -2070244 -1914790 -1503693 -1348123 -1658559 -2266275 -2872994 -3386489
7932c386489l01406O8735K74870L64981L64144P0336r3971L11542O91557N70872
$$ -3386489 -3687895 -3619160 -3344290 -2979309 -2615165 -2544829 -2638800 -2327258 -1635701 -1064829
7922a064829L69783K94699K10972R7162K22889N77439O01116K04339j50246k98667
$$ -1064829 -695046 -400347 -189375 -92213 130676 708115 1309231 1513570 1363324 1064657
7912A064657k53717m4236K18330L25267J10754k80136l03992p2738n7989j42993
$$ 1064657 810940 766704 985034 1310301 1421055 1140919 836927 764189 706200 563207
7902E63207j28925N6351L80271O47408P64982O18205J00662l71773m55468k55335
$$ 563207 434282 490633 870904 1518312 2283294 2901499 3002161 2630388 2174920 1919585
7892A919585K2001J92840K39690J76040n3314k43944l71051n94643p35722o92421
$$ 1919585 1941586 2134426 2374116 2550156 2496842 2252898 1881847 1287204 551482 -140939
7882a40939n21896l29918j39309J53531M04745N02463N77551O11997N10727K40789
$$ -140939 -662835 -992753 -1132062 -978531 -573786 -71323 506228 1118225 1628952 1869741
7872A869741j65423m74276m88407m06807m51183m82459n12061n07176l24664q0366
$$ 1869741 1704318 1230042 741635 334828 -116355 -598814 -1110875 -1618051 -1942715 -2023081
7862b023081J05504K70783L41439L19334L02557J66293K0701L0225o9208m04363
$$ -2023081 -1917577 -1646794 -1305355 -986021 -683464 -517171 -496470 -466245 -535453 -939816
7852i39816n89370n86564n79298l03689J91225M38484K55479L8962o788J64346
$$ -939816 -1529186 -2115750 -2695048 -2998737 -2807512 -2369028 -2113549 -2074587 -2081375 -1917029
7842a917029L74346L71763L27415K21333J75040M10297M48882P7181j93036l25362
$$ -1917029 -1542683 -1170920 -843505 -622172 -447132 -36835 412047 489228 296192 -29170
7832b9170k02146J74507J55719j27149m26244o41771o18553l47363k1709k3156
$$ -29170 -231316 -56809 98910 -28239 -454483 -1096254 -1714807 -2062170 -2083879 -2107035
7822b107035j99249l07461k10417J12816L23164J17218k64993m50929l55819j05190
$$ -2107035 -2306284 -2613745 -2824162 -2711346 -2388182 -2270964 -2535957 -2986886 -3342705 -3447895
7812c447895J74128L92697O25288Q80062Q69016N28688O3328j86190m3546J20224
$$ -3447895 -3273767 -2881070 -2255782 -1375720 -506704 21984 85312 -100878 -144424 -24200
7802b4200l6481k27457j33081P2367J98460L61689M76727K90397m2082k85543
$$ -24200 -60681 -288138 -421219 -348852 -150392 211297 688024 978421 936339 650796
7792F50796m88903o34409n11204j91664J36857L48491L25347J16327l6304o3404
$$ 650796 161893 -472516 -983720 -1175384 -1038527 -690036 -364689 -248362 -284666 -348070
7782c48070q4471j31457q5219K03334M13856K54583l9139k38610k64621j2020
$$ -348070 -432541 -563998 -649217 -445883 -32027 222556 183417 -55193 -319814 -331834
7772c31834K45453J8622m34022m36883j69545L1155K06491J41367j21838k24730
$$ -331834 -86381 -67759 -501781 -938664 -1108209 -1077054 -870563 -729196 -851034 -1075764
7762a075764q9814J86245K95993O7752m2904R6942J73246P7768k0775L0686K48934
$$ -1075764 -1165578 -979333 -683340 -615588 -658492 -561550 -388304 -310536 -331311 -300625 -51691
7751e1691M91942N22134L87836K09545k3635k00720k26044k70535k95237l32778
$$ -51691 440251 962385 1350221 1559766 1536131 1335411 1109367 838832 543595 210817
7741B10817n10634n28074k82928K8893J62660N0091k8313j34387l08482l44707
$$ 210817 -299817 -827891 -1110819 -1081926 -919266 -869175 -897488 -1031875 -1340357 -1685064
7731a685064j73014J59271M32431M37074K43082j6118r1929K09020M92317N58725
$$ -1685064 -1858078 -1698807 -1266376 -829302 -586220 -602338 -694267 -485247 7070 565795
7721E65795M33225J51448j04023j67832j2843J57846J74041p5530m80555o47047
$$ 565795 999020 1150468 1046445 878613 865770 1023616 1197657 1122127 641572 -5475
7711e475n87912m41100j07160L12734N04836M78550M57274M92765M52061K96381
$$ -5475 -593387 -1034487 -1141647 -828913 -324077 154473 611747 1104512 1556573 1852954
7701A852954K2764l02525n12315m39525M7984M99936N12450K44587j69067n39629
$$ 1852954 1875718 1573193 1060878 621353 669337 1169273 1681723 1926310 1757243 1217614
7691A217614n01338j84330M0232m8993j85422r3348m3529l8121K0591P4346R8304
$$ 1217614 716276 531946 572178 523185 337763 244415 200886 162765 183356 257702 356006
7680C56006j09828k33565L3164L14033M20262L90578J83209j07527m82084r56309
$$ 356006 246178 12613 45777 359810 780072 1170650 1353859 1246332 764248 -192061
7670a92061r04532k63308K66377L77775J93278J9100N3910J42505M3942l51489
$$ -192061 -1096593 -1359901 -1093524 -715749 -522471 -503371 -449461 -306956 -263014 -614503
7660f14503p11477n42949j21467J08679J24379J65571K61120K58081K26605J55395
$$ -614503 -1325980 -1868929 -1990396 -1881717 -1757338 -1591767 -1330647 -1072566 -845961 -690566
7650f90566J89840M54737O69122O11573L60391J44671k33549q27370j063345r25902
$$ -690566 -500726 -45989 623133 1234706 1595097 1739768 1506219 678849 -384496 -1310398
7640a310398o72569k42655K03307L72295K95733J51675P5127K20766N84208P99256
$$ -1310398 -1982967 -2225622 -2022315 -1650020 -1354287 -1202612 -1127485 -906719 -322511 476745
7630D76745O10400J06369k52211k37638l8724L1119o6952j08789j35498p1942
$$ 476745 1087145 1193514 941303 703665 664941 696060 629108 520319 384821 312879
7620C12879J84806L32545L96319M22975K75816J53962M7106j76031l74283m68261
$$ 312879 497685 830230 1226549 1649524 1925340 2079302 2126408 1950377 1576094 1107833
7610A107833m99914n05993m66271k41636o7287J52537O08206Q32746N67751K03368
$$ 1107833 607919 101926 -364345 -605981 -673268 -520731 87475 920221 1487972 1691340
7600A691340l3420k73723m33369k81640L354K09639L73564L57203K35695J74356
$$ 1691340 1657920 1384197 950828 669188 672542 882181 1255745 1612948 1848643 2022999
7590B022999R7317q7263l08751l35736j38149O2200K18382K80536J31389j20744
$$ 2022999 2120316 2033053 1724302 1388566 1250417 1312617 1530999 1811535 1942924 1822180
7580A822180l22567l15025j76711o0305j6800J3375O2034j77926o76885p95350
$$ 1822180 1499613 1184588 1007877 947572 930772 944147 1006181 828255 151370 -643980
7570f43980m06042J03585M33835M78186K30312j5782l9124M094P0449Q7075O7455
$$ -643980 -1050022 -946437 -512602 -34416 195896 180114 140990 145084 215533 302608 370063
7559C70063M8503L03p3744r0362Q7790L75195N58646N69975M41204M30365M49123
$$ 370063 418566 418869 345125 254763 342553 717748 1276394 1846369 2287573 2717938 3167061
7548C167061L35942j576o29508j073705q99001l85997L3794K24211J45160r2831
$$ 3167061 3503003 3501427 2871919 1798214 899213 513216 547010 771221 916381 823550
7538H23550j12451K54205K70724j21087k78650l86059l68632j58874N265P6244
$$ 823550 711099 965304 1236028 1114941 836291 450232 81600 -77274 -72009 4235
7528D235P7778K27214K63777k7590k81104k57513j21426r676J24319J53015K0925
$$ 4235 82013 309227 573004 545414 264310 6797 -114629 -124305 14 153029 173954
7517A73954J8721J27971J27804k6284j81218l12363m98163p42413p55784m11864
$$ 173954 192675 320646 448450 422166 240948 -71415 -569578 -1311991 -2067775 -2479639
7507b479639N2668L33039K59279K41115K38339R4481o9725k39546k46657j54304
$$ -2479639 -2426971 -2093932 -1834653 -1593538 -1355199 -1260718 -1330443 -1569989 -1816646 -1970950
7497a970950k13873l43084k87232K8275N03024Q71476R47156Q63540O67257K92590
$$ -1970950 -2184823 -2527907 -2815139 -2786864 -2283840 -1412364 -465208 398332 1065589 1358179
7487A358179O272K3836J10092J66121J53794k47417p41738p06724l28238j08836
$$ 1358179 1364451 1388287 1498379 1664500 1818294 1570877 829139 122415 -205823 -314659
7477c14659j26858q6603J27379M36409M44305m911m40275m57744l5915K40488
$$ -314659 -441517 -528120 -400741 35668 479973 475062 34787 -422957 -458872 -218384
7467b18384J05396p7227o176J98717J38289j78320k76275l2231K11297K63316
$$ -218384 -112988 -190215 -196391 2326 140615 -37705 -313980 -346211 -134914 128402
7457A28402J27086j88882l15137j96922j26225j72262k14282l58786l23538P0128
$$ 128402 255488 66606 -248531 -445453 -571678 -743940 -958222 -1317008 -1640546 -1570418
7447a570418K68000K89923K78061K48196L83006N26605N03933L96659K19328R2513
$$ -1570418 -1302418 -1012495 -734434 -486238 -103232 423373 927306 1323965 1543293 1635806
7437A635806j23049m75992m98438j51091N4098J16333K32415K28137K72125N59059
$$ 1635806 1512757 1036765 538327 387236 441334 557667 790082 1018219 1290344 1849403
7427A849403Q00297N87049J1138m57579o51728p03613o56604l94543l4853L40279
$$ 1849403 2649700 3236749 3247887 2790308 2138580 1434967 778363 383820 348967 689246
7417F89246P59251R84213Q32847L72565k19536m57822k68698o6038j50137n14207
$$ 689246 1448497 2432710 3265557 3638122 3418586 2960764 2692066 2626028 2475891 1961684
7407A961684p84816n91286o8618K90793K96851J06279L8149K42787N23884N68137
$$ 1961684 1176868 585582 516964 807757 1104608 1210887 1249036 1491823 2015707 2583844
7397B583844N0822p70260j039710o24249l3930L23907J88143j52969k14261K1019
$$ 2583844 2634666 1864406 824696 200447 166517 490424 678567 525598 311337 332356
7387C32356J94816M8232k10449k86972j76062j38954k30028j48931J59232M30985
$$ 332356 527172 575404 364955 77983 -98079 -237033 -467061 -615992 -456760 -25775
7377b5775M93630K55249j10385j85546K9779K32655L04478K11794J10253J48391
$$ -25775 467855 723104 612719 427173 456952 689607 994085 1205879 1316132 1464523
7367A464523K74189L80289M10922L62258K382n27948q24437p32530m83897l41407
$$ 1464523 1738712 2119001 2529923 2892181 2894563 2366615 1542178 809648 325751 -15656
7357a5656m73048p25480p93433o17606k70682M5419L23939N01425M84692M46250
$$ -15656 -488704 -1214184 -2007617 -2625223 -2895905 -2850486 -2526547 -2025122 -1540430 -1094180
7347a094180L43407K81068K29704J05632J058j34544j84915j03757o4376q9277
$$ -1094180 -750773 -469705 -240001 -134369 -133311 -267855 -452770 -556527 -620903 -710180
7337g10180k9899J57618K11998J26160k5117l76816m53348p4206K55175M53870
$$ -710180 -740079 -582461 -370463 -244303 -269420 -646236 -1099584 -1173790 -918615 -464745
7327d64745N74576N21008K67317J5431K0878M9657j40852l09387l07464j55527
$$ -464745 109831 630839 898156 913587 934465 984122 843270 533883 226419 70892
7317G0892J60969L23290K11741j01809l56812j33321L54981O13896N84076L63013
$$ 70892 231861 555151 766892 665083 308271 174950 529931 1143827 1727903 2090916
7307B090916K03773K57121L13342J52104m0389r8314j14847j94900k74558k58832
$$ 2090916 2294689 2551810 2865152 3017256 2976867 2878553 2763706 2568806 2294248 2035416
7297B035416j04452J12857P7243n38M9947O5320P3847M4637j18173m39101o09184
$$ 2035416 1930964 2043821 2121064 2120526 2170473 2235793 2309640 2354277 2236104 1797003 1187819
7286A187819k83271J78125K50440N5427p1814K6661R6206R4997J00348r4422m44187
$$ 1187819 904548 1082673 1333113 1388540 1316726 1343387 1439593 1534590 1634938 1540516 1096329
7275A096329o29191m83110k86692l01989l83669l78265j69976J36925M77478O45314
$$ 1096329 467138 -15972 -302664 -604653 -988322 -1366587 -1536563 -1399638 -922160 -276846
7265b76846M94481K34885P2741P1159N0169O2432N7542R9493J88080K02587J42167
$$ -276846 217635 452520 525261 596420 646589 709021 766563 866056 1054136 1256723 1398890
7254A398890r3390m16327o69964p67118o64794l01402K29001N99684O34679M53053
$$ 1398890 1305500 889173 219209 -547909 -1212703 -1514105 -1285104 -685420 -50741 402312
7244D02312L80248L40682L6553k03960j32356P5996J69073M5519j25951r4751
$$ 402312 782560 1123242 1159795 955835 823479 899475 1068548 1114067 988116 893365
7234H93365L4449m6056j91830j87137p8810J35457K44611J59999Q9766Q656m8747
$$ 893365 927814 881758 689928 502791 423981 559438 804049 964048 1053814 1062470 1013723
7223A013723m3920j36347k84418k25866L5995K24797J54528J36347L68340N38094
$$ 1013723 969803 833456 549038 323172 359167 583964 738492 874839 1243179 1781273
7213A781273P63676R07535N27834j67824o98398j005170j213016j381782j323720
$$ 1781273 2544949 3452484 3980318 3812494 3114096 2108926 895910 -485872 -1809592
7204a809592q17780k43387P0752O8869k40459l90481P1611P65799R42342O13090
$$ -1809592 -2627372 -2870759 -2800007 -2731138 -2971597 -3362078 -3290467 -2524668 -1582326 -969236
7194i69236K53782J69934K53498J70638O3244N0353m4404k47855l22898j19425
$$ -969236 -715454 -545520 -292022 -121384 -58140 -7787 -52191 -300046 -622944 -742369
7184g42369L28804P39783Q48990O15300K17399j22110k97702j47749K59126M43904
$$ -742369 -413565 326218 1175208 1790508 2007907 1885797 1588095 1440346 1699472 2143376
7174B143376M72517O11072O72642M66464J56316j25673l33854l48385k04880j45935
$$ 2143376 2615893 3226965 3899607 4366071 4522387 4396714 4062860 3714475 3509595 3363660
7164C363660k36482l14351k59143l66973p39360q90391p38818p48501p40204l18616
$$ 3363660 3127178 2812827 2553684 2186711 1447351 556960 -181858 -930359 -1670563 -1989179
7154a989179J95124K98265P2423q5250Q9357N68301Q28754N90005R7644j45258
$$ -1989179 -1794055 -1495790 -1423367 -1508617 -1419260 -850959 -22205 567800 665444 520186
7144E20186M3328K08623j123k13271k35271k72892k23231k05470l79487m25393
$$ 520186 563514 772137 771014 557743 322472 49580 -173651 -379121 -758608 -1184001
7134a184001p6666L51780L12959j2001k68683k65239j51178k30507m06186k39158
$$ -1184001 -1260667 -908887 -595928 -607929 -876612 -1141851 -1293029 -1523536 -1929722 -2168880
7124b168880J31957K87151L18970M40095M92797L46896K42013K57266K64333K43277
$$ -2168880 -2036923 -1749772 -1430802 -990707 -497910 -151014 90999 348265 612598 855875
7114H55875K87650M58003M78790L70383M06605L24757J12831l3996j26888j85253
$$ 855875 1143525 1601528 2080318 2450701 2857306 3182063 3294894 3260898 3134010 2948757
7104B948757k64104m24544n33131o26684p01148l70055J27420J68980j92071l64244
$$ 2948757 2684653 2260109 1726978 1100294 399146 29091 156511 325491 133420 -230824
$$ [...]
##END NTUPLES=NMR SPECTRUM
##END=
