##TITLE=dept_LR-708-C1-CHCl3 CH-,CH3- -up, CH2- -down
 2800 sc
 16.12.2019
##JCAMPDX= 6.0         $$ Bruker NMR JCAMP-DX V2.0
##DATA TYPE= NMR SPECTRUM
##DATA CLASS= NTUPLES
##ORIGIN= UXNMR, Bruker Analytische Messtechnik GmbH
##OWNER= root
$$ XWIN-NMR		Version 3.5
$$ Mon Dec 16 16:36:00 2019 Russian Standard Time (UT+4h)  she@DPX200
##.OBSERVE FREQUENCY= 50.327992884445
##.OBSERVE NUCLEUS= ^13C
##.ACQUISITION MODE= SIMULTANEOUS
##.ACQUISITION SCHEME= undefined
##.AVERAGES= 2800
##.DIGITISER RES= 17
##SPECTROMETER/DATA SYSTEM= spect
##.PULSE SEQUENCE= dept135
##.SOLVENT NAME= DMSO
##.SHIFT REFERENCE= (INTERNAL, DMSO, 0, 214.665)
##AUDIT TRAIL= $$ (NUMBER, WHEN, WHO, WHERE, WHAT)
$$ ##TITLE= Audit trail, XWIN-NMR		Version 3.5
$$ ##JCAMPDX= 5.01
$$ ##ORIGIN= Bruker BioSpin GmbH
$$ ##OWNER= she
$$ F:/spectra/data/she/nmr/depta/1/pdata/1/auditp.txt
$$ ##AUDIT TRAIL=  $$ (NUMBER, WHEN, WHO, WHERE, WHAT)
(   1,<2019-12-16 16:34:49.14 +0400>,<she>,<DPX200>,
      <created by zg, POWCHK disabled, PULCHK disabled
       terminated by command 'halt'
       configuration hash MD5:
       00 E9 B6 7A A2 85 ED C7 34 08 36 98 17 FE 4E 26
       data hash MD5: 16K
       CA DE 51 77 CE 9A 6A DB CF C9 D6 B1 1F 90 5D 0E>)
(   2,<2019-12-16 16:34:51.21 +0400>,<she>,<DPX200>,
      <Start of raw data processing
       efp BC_mod = 2 LB = 3.5 FT_mod = 6 PKNL = 1 PHC0 = -2556.148 PHC1 = -1075.801 SI = 16K 
       data hash MD5: 16K
       3B 6A 77 7F AB 1D 4C 8B D1 9C A6 EC D0 F7 F9 12>)
(   3,<2019-12-16 16:35:13.90 +0400>,<she>,<DPX200>,
      <pk PHC0 = -368.5549 PHC1 = 8.400002 
       data hash MD5: 16K
       7D 20 4A 02 25 18 CB 41 4A C8 3E AB 62 56 5E 66>)
(   4,<2019-12-16 16:35:17.92 +0400>,<she>,<DPX200>,
      <abs ABSG = 5 
       data hash MD5: 16K
       C1 65 2F 48 26 F9 BF B7 A4 BD 6C E8 FA 6D 04 78>)
$$ ##END=
$$ 
$$ hash MD5
$$ EF 45 BC 13 D9 B2 A7 5E 1A 55 14 11 4A D4 2A 8C
##$RELAX= 
##$RELAX= 
##$RELAX= 
##$RELAX= 
##$RELAX= 
##$RELAX= 
##$RELAX= 
##$RELAX= 
$$ Bruker specific parameters
$$ --------------------------
##$DU= <F:/spectra>
##$EXPNO= 1
##$NAME= <depta>
##$PROCNO= 1
##$TYPE= <nmr>
##$USER= <she>
##$AMP= (0..31)
100 100 100 100 100 100 100 100 100 100 100 100 100 100 100 100 100 100 
100 100 100 100 100 100 100 100 100 100 100 100 100 100 
##$AQSEQ= 0
##$AQ_mod= 1
##$AUNM= <au_zg>
##$AUTOPOS= <>
##$BF1= 50.322709
##$BF2= 200.13
##$BF3= 200.13
##$BF4= 200.13
##$BF5= 200.13
##$BF6= 200.13
##$BF7= 200.13
##$BF8= 200.13
##$BYTORDA= 1
##$CFDGTYP= 0
##$CFRGTYP= 5
##$CHEMSTR= <none>
##$CNST= (0..31)
1 1 145 1 1 1 1 1 1 1 1 1 1 1 1 1 1 1 1 1 1 1 1 1 1 1 1 1 1 1 1 1 
##$CPDPRG= <>
##$CPDPRG1= <waltz16>
##$CPDPRG2= <waltz16>
##$CPDPRG3= <>
##$CPDPRG4= <mlev>
##$CPDPRG5= <mlev>
##$CPDPRG6= <mlev>
##$CPDPRG7= <mlev>
##$CPDPRG8= <mlev>
##$CPDPRGB= <>
##$CPDPRGT= <>
##$D= (0..31)
0 2 0.003448276 0 0 0 0 0 0 0 0 0 2e-05 0 0 0 0 0 0 0 0 0 0 0 0 0 0 0 
0 0 0 0 
##$DATE= 1576492206
##$DBL= (0..7)
120 120 120 120 120 120 120 120 
##$DBP= (0..7)
$$ [...]
##$SUBNAM2= <"">
##$SUBNAM3= <"">
##$SUBNAM4= <"">
##$SUBNAM5= <"">
##$SUBNAM6= <"">
##$SUBNAM7= <"">
##$SUBNAM8= <"">
##$SUBNAM9= <"">
##$SW= 219.3118970423
##$SWIBOX= (0..15)
0 1 3 0 0 0 0 0 0 0 0 0 0 0 0 0 
##$SW_h= 11037.527593819
##$TD= 16384
##$TD0= 1
##$TE= 0
##$TE2= 300
##$TE3= 300
##$TEG= 300
##$TL= (0..7)
120 120 120 120 120 120 120 120 
##$TP= (0..7)
150 150 150 150 150 150 150 150 
##$TP07= 0
##$TPNAME0= <>
##$TPNAME1= <>
##$TPNAME2= <>
##$TPNAME3= <>
##$TPNAME4= <>
##$TPNAME5= <>
##$TPNAME6= <>
##$TPNAME7= <>
##$TPOAL= (0..7)
0.5 0.5 0.5 0.5 0.5 0.5 0.5 0.5 
##$TPOFFS= (0..7)
0 0 0 0 0 0 0 0 
##$TUNHIN= 0
##$TUNHOUT= 0
##$TUNXOUT= 0
##$USERA1= <user>
##$USERA2= <user>
##$USERA3= <user>
##$USERA4= <user>
##$USERA5= <user>
##$V9= 5
##$VALIST= <valist>
##$VCLIST= <CCCCCCCCCCCCCCC>
##$VD= 0
##$VDLIST= <DDDDDDDDDDDDDDD>
##$VPLIST= <PPPPPPPPPPPPPPP>
##$VTLIST= <TTTTTTTTTTTTTTT>
##$WBST= 1024
##$WBSW= 2
##$XGAIN= (0..3)
0 0 0 0 
##$XL= 0
##$YL= 0
##$YMAX_a= 220656
##$YMIN_a= -208362
##$ZGOPTNS= <>
##$ZL1= 120
##$ZL2= 120
##$ZL3= 120
##$ZL4= 120
##$ABSF1= 214.6655
##$ABSF2= -4.669434
##$ABSG= 5
##$ABSL= 3
##$ALPHA= 0
##$AQORDER= 0
##$ASSFAC= 0
##$ASSFACI= 0
##$ASSFACX= 0
##$ASSWID= 0
##$AUNMP= <proc_1d>
##$AZFE= 0.1
##$AZFW= 0.1
##$BCFW= 0
##$BC_mod= 2
##$BYTORDP= 0
##$COROFFS= 0
##$CY= -3
##$DATMOD= 1
##$DC= 0
##$DFILT= <>
##$DTYPP= 0
##$F1P= 0
##$F2P= 0
##$FCOR= 0.5
##$FTSIZE= 16384
##$FT_mod= 6
##$GAMMA= 0
##$GB= 0
##$INTBC= 1
##$INTSCL= 0
##$ISEN= 128
##$LB= 3.5
##$LEV0= 0
##$LPBIN= 0
##$MAXI= 10000
##$MC2= 0
##$MEAN= 0
##$ME_mod= 0
##$MI= 0.4000791
##$NCOEF= 0
##$NC_proc= -4
##$NLEV= 6
##$NOISF1= 120.0001
##$NOISF2= 80.00006
##$NSP= 0
##$NTH_PI= 0
##$NZP= 0
##$OFFSET= 214.6655
##$PC= 4
##$PHC0= -2924.703
##$PHC1= -1067.401
##$PH_mod= 1
##$PKNL= yes
##$PPARMOD= 0
##$PSCAL= 0
##$PSIGN= 0
##$REVERSE= no
##$SF= 50.3227091
##$SI= 16384
##$SIGF1= 140
##$SIGF2= 120
##$SINO= 80
##$SIOLD= 32768
##$SREGLST= <13C.CDCl3>
##$SSB= 0
##$STSI= 16384
##$STSR= 0
##$SW_p= 11037.527593819
##$SYMM= 0
##$S_DEV= 0
##$TDeff= 16384
##$TDoff= 0
##$TI= <>
##$TILT= no
##$TM1= 0
##$TM2= 0
##$TOPLEV= 0
##$USERP1= <user>
##$USERP2= <user>
##$USERP3= <user>
##$USERP4= <user>
##$USERP5= <user>
##$WDW= 1
##$XDIM= 16384
##$YMAX_p= 291628177
##$YMIN_p= -333411195
$$ End of Bruker specific parameters
$$ ---------------------------------
##NTUPLES= NMR SPECTRUM
##VAR_NAME=  FREQUENCY,     SPECTRUM/REAL,   SPECTRUM/IMAG
##SYMBOL=    X,             R,               I
##VAR_TYPE=  INDEPENDENT,   DEPENDENT,       DEPENDENT
##VAR_FORM=  AFFN,          ASDF,            ASDF
##VAR_DIM=   16384,         16384,           16384
##UNITS=     HZ,            ARBITRARY UNITS, ARBITRARY UNITS
##FACTOR=    0.67371834180669, 1,            1
##FIRST=     10802.5493505904, 0,            0
##LAST=      -234.978243228581, 0,           0
##MIN=       -234.978243228581, -333411195,  0
##MAX=       10802.5493505904, 291628177,    0
$$ Real data points
##PAGE= N=1
##DATA TABLE= (X++(R..R)), XYDATA
$$ [...]
$$ plain form
4311 1302146 800749 323893 131919 -1348 -218237 -485766 -775622 -1054160 -1322278 -1618889
4301 -1618889 -1963173 -2257218 -2256388 -1818436 -991750 -37355 749738 1063123 787809 205513
4291 205513 -355948 -675037 -746650 -641897 -326983 103145 522985 677645 484265 134069
4281 134069 -245582 -508581 -728105 -1107958 -1561294 -1867733 -1981638 -2069423 -2151930 -2147857
4271 -2147857 -1996132 -1614007 -1110492 -612973 -181986 162549 166714 -248582 -671922 -792018
4261 -792018 -714812 -589512 -481913 -419940 -370970 -425334 -773783 -1394711 -2026215 -2302894
4251 -2302894 -2080463 -1527280 -886692 -377209 -86912 -77809 -360614 -702604 -773808 -693812
4241 -693812 -874547 -1309869 -1673613 -1715716 -1634291 -1662917 -1630624 -1278523 -704595 -300189
$$ packed form
4311A302146n01397m76856j91974j33267k16889k67529k89856k78538k68118k96611
4301a618889l44284k94045Q30M37952Q26686R54395P87093L13385k75314n82296
4291B05513n61461l19089p1613J04753L14914M30128M19840J54660j93380l50196
4281A34069l79651k62999k19524l79853m53336l06439j13905q7785q2507M073
4271b147857J51725L82125N03515M97519M30987L44535M165m15296m23340j20096
4261g92018P7206J25300J07599O1973M8970n4364l48449o20928o31504k76679
4251b302894K22431N53183O40588N09483K90297R103k82805l41990p1204P9996
4241f93812j80735m35322l63744m2103Q1425k8626L2293L52101N73928M04406
$$ plain form
4231 -300189 -294863 -592528 -1016393 -1471449 -1799781 -1825154 -1493020 -972124 -546087 -318505
4221 -318505 -16420 540795 1135835 1438289 1473630 1358756 986075 535758 369008 376499
4211 376499 356617 235226 -6518 -160734 -145631 -44746 -32498 -212222 -491516 -723513
4201 -723513 -841878 -1089459 -1627356 -2242977 -2743356 -3124343 -3212433 -2879058 -2370963 -1933989
4191 -1933989 -1721785 -1636692 -1516142 -1352620 -1096202 -837637 -722382 -837307 -1097800 -1493495
4181 -1493495 -2053132 -2564762 -2921722 -3163281 -3217871 -3138308 -3048928 -2931102 -2664143 -2180827
4171 -2180827 -1660783 -1293036 -1112747 -1000417 -955657 -938959 -838112 -623891 -359464 -118115
4161 -118115 15750 24204 69539 247454 566887 892635 1063560 1111929 1082915 790641 340648
$$ packed form
4231c00189N326k97665m23865m55056l28332k5373L32134N20896M26037K27582
4221c18505L02085N57215N95040L02454L5341j14874l72681m50317j66750P491
4211C76499j9882j21391k41744j54216J5103J00885J2248j79724k79294k31997
4201g23513j18365k47581n37897o15621n00379l80987q8090L33375N08095M36974
4191a933989K12204Q5093J20550J63522K56418K58565J15255j14925k60493l95695
4181a493495n59637n11630l56960k41559n4590P9563Q9380J17826K66959M83316
4171b180827N20044L67747J80289J12330M4760J6698J00847K14221K64427K41349
4161a18115J33865Q454M5335J77915L19433L25748J70925M8369k9014k92274m49993
$$ plain form
4150 340648 82274 -72207 -241682 -295300 -104187 131588 11806 -536754 -1251225 -1787742
4140 -1787742 -1977781 -1965273 -1805584 -1525954 -1305572 -1221919 -1116432 -912192 -627187 -332463
4130 -332463 -183292 -221421 -507045 -1174679 -2086522 -2784578 -3180163 -3477528 -3609165 -3439566
4120 -3439566 -3133492 -2941827 -2924430 -2840530 -2520023 -2036349 -1559040 -1161087 -741106 -392033
4110 -392033 -159084 -11917 -40461 -272190 -704456 -1221897 -1650087 -1995671 -2212194 -2401893
4100 -2401893 -2713427 -2942828 -3040963 -3233590 -3464381 -3588708 -3647923 -3770916 -3857855 -3555058
4090 -3555058 -2847378 -2171599 -1828870 -1635198 -1420615 -1038574 -479190 42280 390944 548855
4080 548855 608979 651629 588608 387578 54101 -320823 -515336 -457421 -385573 -459586 -677276
$$ packed form
4150C40648k58374j54481j69475n3618J91113K35775j19782n48560p14471n36517
4140a787742j90039J2508J59689K79630K20382Q3653J05487K04240K85005K94724
4130c32463J49171l8129k85624o67634r11843o98056l95585k97365j31637J69599
4120c439566L06074J91665J7397Q3900L20507M83674M77309L97953M19981L49073
4110c92033K32949J47167k8544k31729m32266n17441m28190l45584k16523j89699
4100b401893l11534k29401r8135j92627k30791j24327n9215j22993q6939L02797
4090c555058P07680O75779L42729J93672K14583L82041N59384N21470L48664J57911
4080E48855O0124M2650o3021k01030l33477l74924j94513N7915P1848p4013k17690
$$ plain form
4069 -677276 -1037628 -1365427 -1558554 -1665190 -1668218 -1566272 -1355515 -1144342 -1151256 -1576307
4059 -1576307 -2347887 -3037056 -3484019 -3831570 -4007590 -3858818 -3428865 -2985926 -2864547 -2982403
4049 -2982403 -3090606 -3213574 -3314767 -3191976 -2900673 -2673211 -2486268 -2197907 -1784728 -1267209
4039 -1267209 -747640 -413122 -238374 -184005 -348360 -499720 -551004 -697887 -923338 -1032053
4029 -1032053 -820975 -409522 -123662 -261871 -696265 -1049668 -1166778 -1130656 -1091046 -1048365
4019 -1048365 -1024641 -1191329 -1569683 -1974049 -2269495 -2469534 -2472815 -2240969 -1991905 -1976174
4009 -1976174 -2221036 -2440112 -2430006 -2206454 -1837401 -1404605 -986524 -598620 -172090 305553
3999 305553 690213 953520 1040575 919481 709851 537429 332885 -904 -441857 -920756
$$ packed form
4069f77276l60352l27799j93127j06636l028J01946K10757K11173o914m25051
4059a576307p71580o89169m46963l47551j76020J48772M29953M42939J21379j17856
4049b982403j08203j22968j01193J22791K91303K27462J86943K88361M13179N17519
4039a267209N19569L34518J74748N4369j64355j51360n1284j46883k25451j08715
4029a032053K11078M11453K85860j38209m34394l53403j17110L6122L9610M2681
4019a048365K3724j66688l78354m04366k95446k00039l281K31846K49064J5731
4009a976174k44862k19076J0106K23552L69053M32796M18081L87904M26530M77643
3999C05553L84660K63307Q7055j21094k09630j72422k04544l33789m40953m78899
$$ plain form
3989 -920756 -1240701 -1106567 -465767 410730 1020586 1086757 825037 695016 920200 1216355
3979 1216355 1204966 905282 699730 699756 759137 646250 312281 -23817 -304905 -650911 -976180
3968 -976180 -1030899 -932392 -880270 -831538 -632002 -279380 117805 391898 394654 183977 -85868
3957 -85868 -310068 -427757 -421414 -378449 -457661 -689773 -937584 -951609 -589581 -7793 532618
3946 532618 1032057 1591509 2101077 2268068 1962342 1437009 1044114 917339 1004762 1301001
3936 1301001 1589643 1570304 1261264 835522 429039 118465 -50222 47245 346458 568060
3926 568060 511790 153283 -313363 -595915 -609375 -502235 -475323 -560576 -776621 -1110069
3916 -1110069 -1264396 -1036942 -676797 -648687 -993028 -1418752 -1733573 -1702353 -1381381 -1150139
$$ packed form
3989i20756l19945J34134O40800Q76497O09856O6171k61720j30021K25184K96155
3979A216355j1389k99684k05552K6N9381j12887l33969l36098k81088l46006l25269
3968i76180n4719R8507N2122M8732J99536L52622L97185K74093K756k10677k69845
3957h5868k24200j17689O343M2965p9212k32112k47811j4025L62028N81788N40411
3946E32618M99439N59452N09568J66991l05726n25333l92895j26775Q7423K96239
3936A301001K88642j9339l09040m25742m06483l10574j68687R7467K99213K21602
3926E68060n6270l58507m66646k82552j3460J07140K6912q5253k16045l33448
3916a110069j54327K27454L60145K8110l44341m25724l14821L1220L20972K31242
$$ plain form
3906 -1150139 -1157803 -1456487 -1957502 -2365841 -2439354 -2116157 -1722428 -1568603 -1719396 -2066023
3896 -2066023 -2368727 -2480398 -2363734 -2058241 -1692931 -1490412 -1464750 -1446458 -1351841 -1249029
3886 -1249029 -1246369 -1462658 -1785613 -1997674 -2085033 -2023793 -1884377 -1651791 -1240052 -729053
3876 -729053 -357667 -265363 -328106 -505109 -750408 -930710 -1003963 -902506 -502532 112441
3866 112441 710347 1066708 1046694 627143 -163188 -1049112 -1570302 -1658862 -1798854 -2272147
3856 -2272147 -2955653 -3518414 -3582424 -3119015 -2530902 -2178709 -1907465 -1453436 -1125423 -995460
3846 -995460 -733208 -464250 -395339 -413633 -490324 -570766 -612803 -685541 -606843 -170658 468526
3835 468526 962405 1158308 1145332 996560 754770 510493 394784 401723 435346 408759 329570
$$ packed form
3906a150139p664k98684n01015m08339p3513L23197L93729J53825j50793l46627
3896b066023l02704j11671J16664L05493L65310K02519K5662J8292R4617J02812
3886a249029K660k16289l22955k12061q7359O1240J39416K32586M11739N10999
3876g29053L71386R2304o2743j77003k45299j80302p3253J01457L99974O14973
3866A12441N97906L56361k0014m19551p90331q85924n21190q8560j39992m73293
3856b272147o83506n62761o4010M63409N88113L52193K71244M54029L28013J29963
3846i95460K62252K68958O8911j8294p6691q0442m2037p2738P8698M36185O39184
3835D68526M93879J95903j2976j48772k41790k44277j15709O939L3623k6587p9189
$$ plain form
3824 329570 376273 537989 541852 181179 -377681 -813017 -942114 -649225 -54723 411783
3814 411783 595674 589337 423428 124182 -246062 -701368 -1185884 -1472341 -1363997 -951091
3804 -951091 -563711 -444051 -543816 -744659 -950506 -1137596 -1353727 -1519896 -1496276 -1220436
3794 -1220436 -896980 -601900 -350637 -294778 -464745 -604414 -735163 -1117023 -1539244 -1745333
3784 -1745333 -1820573 -1786475 -1518095 -1086842 -717967 -589322 -758852 -1131074 -1412102 -1435321
3774 -1435321 -1404859 -1523347 -1691009 -1683423 -1595797 -1768934 -2272383 -2806657 -3183313 -3445244
3764 -3445244 -3555433 -3416044 -3110981 -2843252 -2613529 -2210844 -1761420 -1626655 -1848030 -2240873
3754 -2240873 -2540831 -2424671 -1875073 -1417025 -1273869 -1148093 -905085 -653022 -515003 -401372
$$ packed form
3824C29570M6703J61716L863l60673n58860m35336j29097K92889N94502M66506
3814D11783J83891o337j65909k99246l70244m55306m84516k86457J08344M12906
3804i51091L87380J19660r9765k00843k05847j87090k16131j66169K3620K75840
3794a220436L23456K95080K51263N5859j69967j39669j30749l81860m22221k06089
3784a745333p5240L4098K68380M31253L68875J28645j69530l72222k81028k3219
3774a435321L0462j18488j67662P586Q7626j73137n03449n34274l76656k61931
3764c445244j10189J39389L05063K67729K29723M02685M49424J34765k21375l92843
3754b240873k99958J16160N49598M58048J43156J25776K43008K52063J38019J13631
$$ plain form
3744 -401372 -274004 -194844 -161790 -140753 -200907 -451094 -812105 -1185193 -1563245 -1912204
3734 -1912204 -2017805 -1825370 -1484794 -1227076 -1127996 -1184199 -1487083 -1892771 -2220924 -2566797
3724 -2566797 -2922496 -3023052 -2623989 -1901580 -1343061 -1064332 -848203 -580332 -247700 204729
3714 204729 603842 650157 453100 131700 -293774 -675292 -871734 -964992 -1115957 -1242848
3704 -1242848 -1108631 -856961 -730319 -791275 -986266 -1133927 -1073298 -804438 -501597 -253855
3694 -253855 14728 356745 658078 736767 508720 216111 159807 230230 125962 -269128
3684 -269128 -948007 -1814006 -2490044 -2708929 -2659930 -2661633 -2784171 -2755000 -2373250 -1798556
3674 -1798556 -1187720 -710510 -589174 -785703 -1101176 -1305558 -1348094 -1353218 -1369851 -1476610
$$ packed form
3744d01372J27368P9160L3054K1037o0154k50187l61011l73088l78052l48959
3734a912204j05601J92435L40576K57718R9080n6203l02884m05688l28153l45873
3724b566797l55699j00556L99063P22409N58519K78729K16129K67871L32632M52429
3714B04729L99113M6315j97057l21400m25474l81518j96442r3258j50965j26891
3704a242848J34217K51670J26642o0956j94991j47661O0629K68860L02841K47742
3694b53855K68583L42017L01333P8689k28047k92609n6304P0423j04268l95090
3684b69128o78879q65999o76038k18885M8999j703j22538K9171L81750N74694
3674a798556O10836M77210J21336j96529l15473k04382m2536n124j6633j06759
$$ plain form
3664 -1476610 -1685115 -1738405 -1537211 -1302127 -1224351 -1247150 -1320105 -1464742 -1672151 -1751446
3654 -1751446 -1553871 -1193597 -820957 -697085 -1048899 -1766910 -2496202 -2799888 -2580216 -2128447
3644 -2128447 -1673189 -1280530 -1018560 -813514 -626006 -586131 -642115 -597528 -316421 141525
3634 141525 602649 817699 659549 237208 -252264 -722066 -1009765 -943404 -785296 -856242
3624 -856242 -1066581 -1042867 -762091 -546018 -598840 -881511 -1224313 -1508728 -1689007 -1669358
3614 -1669358 -1522206 -1272391 -935567 -632602 -493920 -582206 -708908 -684678 -432054 -2928
3604 -2928 608341 1299214 1767449 1986711 1969248 1636600 1264828 1194502 1376448 1512504
3594 1512504 1483534 1469471 1516512 1375983 1119059 900055 590321 241189 119505 185659
$$ packed form
3664a476610k08505n3290K01194K35084P7776k2799p2955j44637k07409p9295
3654a751446J97575L60274L72640J23872l51814p18011p29292l03686K19672M51769
3644b128447M55258L92659K61970K05046J87508L9875n5984M4587K81107M57946
3634A41525M61124K15050j58150m22341m89472m69802k87699O6361J58108p0946
3624h56242k10339K3714K80776K16073n2822k82671l42802k84415j80279J9649
3614a669358J47152K49815L36824L02965J38682q8286j26702K4230K52624M29126
3604b928O11269O90873M68235K19262j7463l32648l71772p0326J81946J36056
3594A512504k8970j4063M7041j40529k56924k19004l09734l49132j21684O6154
$$ plain form
3584 185659 4911 -393836 -451683 -31809 446057 779703 1116830 1393434 1461265 1447788
3574 1447788 1496966 1634826 1657939 1450255 1222934 1223400 1165968 652002 -122688 -762075 -1048533
3563 -1048533 -969688 -695607 -620582 -826195 -925322 -837193 -668564 -480689 -466516 -493537 -270244
3552 -270244 218363 757468 1063835 1019880 657668 29997 -717053 -1317940 -1655719 -1855709
3542 -1855709 -1838588 -1535646 -1299214 -1304445 -1303163 -1153476 -872123 -601454 -456548 -341356
3532 -341356 -194898 -64499 -106514 -367750 -691144 -833351 -923107 -1118007 -1307421 -1490479
3522 -1490479 -1529134 -1269105 -781612 -288082 89895 379202 483287 282151 -335771 -1226294
3512 -1226294 -2020180 -2450510 -2519544 -2444323 -2301537 -2059601 -1797963 -1503064 -1012503 -434377
$$ packed form
3584A85659j80748l98747n7847M19874M77866L33646L37127K76604O7831j3477
3574A447788M9178J37860K3113k07684k27321M66n7432n13966p74690o39387k86458
3563a048533P8845K74081P5025k05613r9127Q8129J68629J87875J4173k7021K23293
3552b70244M88607N39105L06367m3955l62212o27671p47050o00887l37779j99990
3542a855709J7121L02942K36432n231J282J49687K81353K70669J44906J15192
3532c41356J46458J30399m2015k61236l23394j42207q9756j94900j89414j83058
3522a490479l8655K60029M87493M93530L77977K89307J04085k01136o17922q90523
3512a226294p93886m30330o9034P5221J42786K41936K61638K94899M90561N78126
$$ plain form
3502 -434377 -24274 223665 472383 678967 778477 781306 679441 494897 417681 545552
3492 545552 761277 949829 1231610 1711490 2233160 2586635 2710654 2673073 2747535 3062798
3482 3062798 3352439 3139795 2381630 1371097 400570 -285161 -511001 -345637 -188283
3473 -188283 -137723 -18197 105314 40978 -194033 -396329 -590340 -935888 -1403812 -1757837
3463 -1757837 -1876607 -1829668 -1497415 -1108979 -970376 -1003909 -1150423 -1526781 -2104758 -2589736
3453 -2589736 -2763586 -2575423 -2132159 -1635212 -1048299 -468812 -151672 -33469 -35100 -149040
3443 -149040 -270540 -344185 -280268 -57513 186093 361421 479099 586996 727854 769426
3433 769426 754091 821223 951881 1048289 1012498 812606 508058 340644 387408 411753 308361
$$ packed form
3502d34377M10103K47939K48718K06584R9510K829j01865j84544p7216J27871
3492E45552K15725J88552K81781M79880N21670L53475J24019l7581P4462L15263
3482C062798K89641k12644p58165j010533r70527o85731k25840J65364J57354
3473a88283N0560J19526J23511o4336k35011k02296j94011l45548m67924l54025
3463a757837j18770M6939L32253L88436J38603l3533j46514l76358n77977m84978
3453b589736j73850J88163M43264M96947N86913N79487L17140J18203j631j13940
3443a49040j21500p3645O3917K22755K43606J75328J17678J07897J40858M1572
3433G69426j5335O7132J30658R6408l5791j99892l04548j67414M6764K4345j03392
$$ plain form
3422 308361 158036 -14386 -239842 -388267 -362508 -370315 -446580 -462282 -448960 -455787 -376381
3411 -376381 -88269 250144 395637 488180 598651 377057 -283884 -1121102 -1954630 -2595348
3401 -2595348 -2782764 -2614761 -2238860 -1815340 -1765221 -2186375 -2903037 -3783760 -4727711 -5480646
3391 -5480646 -5731537 -5376314 -4565052 -3594131 -2651960 -1913019 -1524014 -1372391 -1350212 -1301894
3381 -1301894 -1065357 -739574 -530053 -472584 -375012 -186248 -29135 -112750 -467561 -784017
3371 -784017 -984096 -1111720 -1230693 -1568394 -2192678 -2714344 -2703966 -2264748 -1814535 -1487619
3361 -1487619 -1243679 -1119011 -1199894 -1337769 -1368951 -1387852 -1302555 -1015120 -721426 -563480
3351 -563480 -485724 -497501 -543325 -473787 -263602 -21158 3148 -457326 -1143101 -1512452 -1531777
$$ packed form
3422C08361j50325j72422k25456j48425K5759p807p6265j5702J3322o827P9406
3411c76381K88112L38413J45493R2543J10471k21594o60941q37218q33528o40718
3401b595348j87416J68003L75901M23520N0119m21154p16662q80723r43951p52935
3391e480646k50891L55223Q11262R70921R42171P38941L89005J51623K2179M8318
3381a301894K36537L25783K09521N7469R7572J88764J57113q3615l54811l16456
3371g84017k00079j27624j18973l37701o24284n21666J0378M39218M50213L26916
3361a487619K43940J24668q0883j37875l1182j8901Q5297K87435K93694J57946
3351e63480P7756j1777m5824O9538K10185K42444K4306m60474o85775l69351j9325
$$ plain form
3340 -1531777 -1570610 -1888588 -2382891 -2723963 -2649792 -2186687 -1675079 -1376131 -1279698 -1222452
3330 -1222452 -1241587 -1223297 -946871 -426597 7173 145622 149959 91393 -108138 -251152
3320 -251152 -77367 317334 665331 794130 583837 128667 -208304 -313865 -400993 -603724
3310 -603724 -762112 -753492 -770937 -852748 -906451 -1042927 -1238618 -1308589 -1351411 -1545095 -1837799
3299 -1837799 -2053938 -2114916 -2051520 -1834257 -1539907 -1242711 -920866 -709269 -817054 -1158734
3289 -1158734 -1540780 -1794166 -1709467 -1318735 -853122 -533565 -518046 -710214 -1109566 -1665741
3279 -1665741 -1982703 -1904793 -1763131 -1678602 -1369676 -824505 -396037 -340232 -712914 -1395515
3269 -1395515 -2292990 -3386962 -4489520 -5222995 -5273348 -4674098 -3681117 -2636343 -1846181
$$ packed form
3340a531777l8833l17978m94303l41072P4171M63105N11608K98948R6433N7246
3330a222452j9135J8290K76426N20274M33770J38449M337n8566j99531j43014
3320b51152J73785L94701L47997J28799k10293m55170l36971j05561q7128k02731
3310f03724j58388Q620j7445q1811n3703j36476j95691o9971m2822j93684k92704
3299a837799k16139o0978O3396K17263K94350K97196L21845K11597j07785l41680
3289a158734l82046k53386Q4699L90732M65613L19557J5519j92168l99352n56175
3279a665741l16962P7910J41662Q4529L08926N45171M28468N5805l72682o82601
3269a395515q97475j093972j102558p33475n0353N99250R92981J044774P90162
$$ plain form
3260 -1846181 -1455390 -1449349 -1642735 -1761865 -1718230 -1489833 -1128453 -769276 -540005 -603177
3250 -603177 -807004 -870319 -720748 -515685 -322777 -50090 358368 850666 1332619 1795286
3240 1795286 2241192 2475841 2397511 2138946 1968806 1936646 1857238 1748779 1669861 1565288
3230 1565288 1671201 2173501 2753927 3043794 2914255 2353199 1557616 943237 800031 968870
3220 968870 1043592 1020451 1120586 1270031 1386050 1597726 1749487 1608729 1358877 1257976
3210 1257976 1382217 1701300 1889076 1756037 1525583 1445611 1591557 1950650 2331101 2421850
3200 2421850 2107776 1515346 928518 508962 240934 -49044 -528955 -1068982 -1441149 -1560155
3190 -1560155 -1541350 -1440205 -1245696 -993668 -631290 -179473 367966 1002512 1458782 1498547
$$ packed form
3260a846181L90791O041j93386j19130M3635K28397L61380L59177K29271o3172
3250f03177k03827o3315J49571K05063J92908K72687M08458M92298M81953M62667
3240A795286M45906K34649p8330k58565j70140l2160p9408j08459p8918j04573
3230A565288J05913N02300N80426K89867j29539n61056p95583o14379j43206J68839
3220I68870P4722k3141J00135J49445J16019K11676J51761j40758k49852j00901
3210A257976J24241L19083J87776j33039k30454p9972J45946L59093L80451R0749
3200B421850l14074n92430n86828m19556k68028k89978m79911n40027l72167j19006
3190a560155J8805J01145J94509K52028L62378M51817N47439O34546M56270L9765
$$ plain form
3180 1498547 1321783 1073065 692117 154209 -448019 -828236 -784927 -502272 -377189 -610723
3170 -610723 -1132475 -1748657 -2350469 -2949882 -3338964 -3200337 -2576858 -1798737 -1154851 -578137
3160 -578137 49143 594774 974287 1287751 1526878 1663839 1780108 1727813 1502459 1339943
3150 1339943 1092619 537564 -224929 -989170 -1755509 -2604608 -3609352 -4593811 -5237271
3141 -5237271 -5691255 -6335572 -7286154 -8655526 -10765554 -13873955 -18081748 -23758651 -31633518
3132 -31633518 -42023645 -53369382 -60765938 -58859139 -49169207 -37746111 -28034462 -20686767
3124 -20686767 -15400968 -11550576 -8537220 -6181539 -4501713 -3393044 -2695867 -2395058
3116 -2395058 -2423663 -2628848 -2726343 -2591247 -2357142 -2189202 -2057679 -1856516 -1685586 -1556215
$$ packed form
3180A498547j76764k48718l80948n37908o02228l80217M3309K82655J25083k33534
3170f10723n21752o16182o01812n99413l89082J38627O23479P78121O43886N76714
3160e78137O27280N45631L79513L13464K39127J36961J16269n2295k25354j62516
3150A339943k47324n55055p62493p64241p66339q49099j004744r84459o43460
3141e237271m53984o44317r50582j369372k110028l108401m207793n676903p874867
3132c1633518j0390127j1345737p396556J906799R689932J1423096R711649P347695
3124b0686767N285799L850392L013356K355681J679826J108669O97177L00809
3116b395058k8605k05185r7495J35096K34105J67940J31523K01163J70930J29371
$$ plain form
3106 -1556215 -1306522 -1019431 -998268 -1175352 -1215749 -1132692 -1116137 -1257578 -1395643 -1387651 -1324356
3095 -1324356 -1207798 -1002876 -727721 -351686 117738 687082 1128519 1281811 1033242 380316
3085 380316 -290921 -717056 -924044 -945618 -782551 -660077 -721931 -765455 -751494 -792250 -856145
3074 -856145 -860385 -717757 -517067 -459948 -486654 -463592 -509947 -649851 -698680 -700213 -748469
3063 -748469 -868894 -987106 -983232 -798990 -525309 -429639 -463418 -170170 605819 1452004
3053 1452004 1881868 1780232 1476846 1290038 1302561 1322072 1159381 859564 661037 625205
3043 625205 529995 225847 -172708 -420992 -491189 -496062 -364387 -56086 264145 477430
3033 477430 691576 831571 688372 326357 28640 12217 199358 364868 507665 636989
$$ packed form
3106a556215K49693K87091K1163j77084m0397Q3057J6555j41441j38065P992O3295
3095a324356J16558K04922K75155L76035M69424N69344M41437J53292k48569o52926
3085C80316o71237m26135k06988k1574J63067J22474o1854m3524J3961m0756o3895
3074h56145m240J42628K00690N7119k6706K3062m6355j39904m8829j533m8256
3063g48469j20425j18212L874J84242K73681R5670l3779K93248P75989Q46185
3053A452004M29864j01636l03386j86808J2523J9511j62691k99817j98527l5832
3043F25205r5210l04148l98555k48284p0197m873J31675L08301L20231K13285
3033D77430K14146J39995j43199l62015k97717j6423J87141J65510J42797J29324
$$ plain form
3023 636989 719889 753786 716044 632943 627122 789055 980112 1042167 830933 244114 -608967
3012 -608967 -1461450 -2100078 -2485426 -2619503 -2620851 -2699320 -3018928 -3834764 -5493272 -8038094
3002 -8038094 -10720548 -11970920 -11090902 -9033962 -6741675 -4695829 -3098791 -1909399
2994 -1909399 -983670 -144748 637667 1253841 1586806 1743081 1779897 1478281 914080 401830
2984 401830 202200 457884 931308 1204143 1243478 1140546 930360 749985 849657 1229181
2974 1229181 1748891 2386967 3144736 3888678 4322173 4245879 3793495 3280538 2802822 2395089
2964 2395089 2226593 2300153 2268971 1795762 981351 301762 -9534 -123242 -209582 -202929
2954 -202929 132208 847250 1533665 1838552 1775536 1503211 1222508 1091070 1035428 1010014
$$ packed form
3023F36989Q2900L3897l7742q3101n821J61933J91057O2055k11234n86819q53081
3012f08967q52483o38628l85348j34077j348p8469l19608q15836j658508k544822
3002h038094k682454j250372Q80018K056940K292287K045846J597038J189392
2994a909399R25729Q38922P82415O16174L32965J56275L6816l01616n64201n12250
2984D01830j99630K55684M73424K72835L9335j02932k10186j80375R9672L79524
2974A229181N19710O38076P57769P43942M33495p6294m52384n12957m77716m07733
2964B395089j68496P3560l1182m73209q14411o79589l11296j13708q6340O653
2954b02929L35137P15042O86415L04887o3016k72325k80703j31438n5642k5414
$$ plain form
2944 1010014 1114095 1322613 1487820 1503429 1387438 1086186 607532 -20963 -763305 -1381058
2934 -1381058 -1583458 -1432645 -1211829 -963894 -652367 -386334 -339634 -749454 -1471297 -1997021
2924 -1997021 -2160935 -2082933 -1827106 -1432470 -1046931 -732153 -349407 142412 521791 501066
2914 501066 149653 -118889 -139206 -216185 -591549 -986210 -993204 -537795 4397 310355
2904 310355 520953 734622 769292 701944 848760 1249588 1516462 1571363 1612114 1689877 1699060
2893 1699060 1575959 1378229 1210764 1028744 576035 -163457 -857537 -1246973 -1276642 -1022642
2883 -1022642 -588779 -43928 341734 503861 716779 966866 1030193 844390 580147 302483
2873 302483 -220382 -785507 -873752 -422550 266541 813042 1056047 1072237 980528 895265
$$ packed form
2944A010014J04081K08518J65207J5609j15991l01252m78654o28495p42342o17753
2934a381058k02400J50813K20816K47935L11527K66033M6700m09820p21843n25724
2924a997021j63914P8002K55827L94636L85539L14778L82746M91819L79379k0725
2914E01066l51413k68542k0317p6979l75364l94661o994M55409N42192L05958
2904C10355K10598K13669L4670o7348J46816M00828K66874N4901M0751P7763R183
2893A699060j23101j97730j67465j82020m52709p39492o94080l89436k9669K54000
2883a022642M33863N44851L85662J62127K12918K50087O3327j85803k64243k77664
2873C02483n22865n65125q8245M51202O89091N46501K43005J6190r1709q5263
$$ plain form
2863 895265 975499 1400295 2039076 2432998 2325763 2013251 1945301 2215341 2264139 1873832
2853 1873832 1545280 1391245 1184383 993810 952998 973671 945763 1028139 1391486 1912365
2843 1912365 2199456 2070058 1587359 1124667 1281091 2141581 3403843 4679349 5736531
2834 5736531 6260433 5775339 4471635 2936987 1526255 513078 5375 -63075 51682
2825 51682 144047 203698 356167 718666 946709 785344 505260 352698 359281 371905 167312
2814 167312 -164401 -360752 -490591 -618331 -630739 -502241 -243432 274185 1054295 1770350
2804 1770350 2030405 1855411 1575767 1276101 824769 90107 -920430 -1955261 -2742308
2795 -2742308 -3115921 -3118258 -3111305 -3203073 -3266659 -3234319 -3113053 -2943905 -2739306 -2326794 -1613405
$$ packed form
2863H95265Q0234M24796O38781L93922j07235l12512o7950K70040M8798l90307
2853A873832l28552j54035k06862j90573m0812K0673k7908Q2376L63347N20879
2843A912365K87091j29398m82699m62692J56424Q60490J262262J275506J057182
2834E736531N23902m85094j303704j534648j410732j013177n07703o8450J14757
2825E1682R2365N9651J52469L62499K28043j61365k80084j52562O583J2624k04593
2814A67312l31713j96351j29839j27740j2408J28498K58809N17617P80110P16055
2804A770350K60055j74994k79644k99666m51332p34662j010537j034831p87047
2795b742308l73613k337O953r1768o3586L2340J21266J69148K04599M12512P13389
$$ plain form
2784 -1613405 -846999 -435642 -371161 -286587 82803 610178 893214 925633 872886 824013
2774 824013 826873 709455 504241 356332 215179 -54371 -292202 -222577 -91884 -249265
2764 -249265 -618082 -1059404 -1629244 -2259566 -2834955 -3340887 -3823051 -4429639 -5428412 -7108196
2754 -7108196 -9622274 -13263288 -18387088 -25361709 -34364577 -44017426 -49712622 -46870322
2746 -46870322 -37724134 -27960066 -20242973 -14706286 -10964392 -8565319 -6819377 -5245590
2738 -5245590 -3757185 -2389229 -1237221 -395753 41334 130265 159259 191673 223080 320869
2728 320869 562906 945955 1193530 1059581 706890 396982 189976 96675 156910 516018
2718 516018 1182703 1966732 2726410 3320847 3677053 3699797 3396434 2935832 2531132 2430597
$$ packed form
2784a613405P66406M11357O4481Q4574L69390N27375K83036L2419n2747m8873
2774H24013K860j17418k05214j47909j41153k69550k37831O9625J30693j57381
2764b49265l68817m41322n69840o30322n75389n05932m82164o06588r98773j679784
2754g108196k514078l641014n123800o974621r002868r652849n695196K842300
2746d6870322R146188R764068P717093N536687L741894K399073J745942J573787
2738e245590J488405J367956J152008Q41468M37087Q8931K8994L2414L1407R7789
2728C20869K42037L83049K47575j33949l52691l09908k07006r3301O0235L59108
2718E16018O66685P84029P59678N94437L56206K2744l03363m60602m04700j00535
$$ plain form
2708 2430597 2609202 3004341 3691513 4574356 5327482 5647371 5501439 5226146 5064090 4922782
2698 4922782 4534179 3712494 2718783 1889513 1323427 1046510 1143435 1611525 2157500 2633939
2688 2633939 3048091 3268824 3194801 2977796 2625585 2140310 1713598 1467690 1495741 1777233
2678 1777233 2104007 2254429 2376431 2770349 3386292 3848061 3928769 3674048 3230328 2752585
2668 2752585 2474074 2548115 2740197 2737185 2501419 2233172 2030325 1926264 1966074 1959800 1799090
2657 1799090 1545528 1327985 1223355 1197678 1111354 894186 665599 610290 780114 1172726
2647 1172726 1443377 1223160 782669 534303 555312 757544 951946 931681 716020 510139
2637 510139 359870 405964 664376 743521 570521 512060 679010 823864 778122 584679
$$ packed form
2708B430597J78605L95139O87172Q82843P53126L19889j45932k75293j62056j41308
2698D922782l88603q21685r93711q29270n66086k76917R6925M68090N45975M76439
2688B633939M14152K20733p4023k17005l52211m85275m26712k45908K8051K81492
2678A777233L26774J50422J22002L93918O15943M61769Q0708k54721m43720m77743
2668B752585k78511P4041J92082l012k35766k68247k02847j04061L9810o274j60710
2657A799090k53562k17543j04630k5677q6324k17168k28587n5309J69824L92612
2647A172726K70651k20217m40491k48366K1009K02232J94402k0265k15661k05881
2637E10139j50269M6094K58412P9145j73000n8461J66950J44854m5742j93443
$$ plain form
2627 584679 521733 806424 1434345 2285497 3212612 3949538 4383131 4647070 4850670 4941039
2617 4941039 4881523 4681118 4562127 4664946 4633725 4267328 3864192 3681107 3800458 4179067
2607 4179067 4704092 5311793 6064671 7015276 8061874 9148262 10353093 11741080 13177048
2598 13177048 14241273 14532815 14214626 13817742 13679449 14046064 15078822 16544729 18010704
2589 18010704 19360147 21181964 24258611 28984821 35622544 44101128 52883046 57989136
2581 57989136 56493466 50885306 45386146 41929697 40770203 41642358 44229862 48376063
2573 48376063 54446255 63438959 76649187 95307879 120765957 153741713 191455585
2566 191455585 224277715 237435169 222807421 188476502 149816285 116338904 90284299
$$ packed form
2627E84679o2946K84691O27921Q51152R27115P36926M33593K63939K03600R0369
2617D941039n9516k00405j18991J02819l1221l66397m03136j83085J19351L78609
2607D179067N25025O07701P52878R50605J046598J086388J204831J387987J435968
2598A3177048J064225K91542l18189l96884j38293L66615J032758J465907J465975
2589A8010704J349443J821817L076647M726210O637723Q478584Q781918N106090
2581E7989136j495670n608160n499160l456449j159494Q72155K587504M146201
2573D8376063O070192Q992704J3210228J8658692K5458078L2975756L7713872
2566A91455585L2822130J3157454j4627748l4330919l8660217l3477381k6054605
$$ plain form
2559 90284299 70774695 56341195 45556898 37293464 30831060 25735198 21720528 18572244
2551 18572244 16106118 14262234 12939815 11939028 11247520 11016043 11318467 11945491 12287433
2542 12287433 11719969 10367968 8855407 7713481 6875007 5960572 5079882 4402341 3909313
2533 3909313 3642254 3602549 3755724 3981597 4112311 4141053 3996414 3658175 3278445 2916757
2523 2916757 2803633 3186236 3887233 4412216 4565467 4490293 4399134 4443136 4549109 4662767
2513 4662767 4824593 4968013 5064630 5258568 5591814 5994349 6306131 6178627 5557504 4876573
2503 4876573 4529496 4693198 5312135 6215944 7224038 8311976 9575755 11015687 12614750
2494 12614750 14679807 17539782 21261367 26098731 32415882 39194888 43308640 42111911
$$ packed form
2559I0284299j9509604j4433500j0784297q263434o462404n095862m014670l148284
2551A8572244k466126j843884j322419j000787o91508k31477L02424O27024L41942
2542A2287433n67464j352001j512561j141926q38474r14435q80690o77541m93028
2533C909313k67059l9705J53175K25873J30714K8742j44639l38239l79730l61688
2523B916757j13124L82603P00997N24983J53251p5174r1159M4002J05973J13658
2513D662767J61826J43420R6617J93938L33246M02535L11782j27504o21123o80931
2503D876573l47077J63702O18937R03809J008094J087938J263779J439932J599063
2494A2614750K065057K859975L721585M837364O317151O779006M113752j196729
$$ plain form
2486 42111911 36769039 30601921 25544280 21871185 19198072 17159429 15608016 14425237
2478 14425237 13566748 13071217 12773135 12712675 13170316 14046051 14990476 15897000 17036764
2469 17036764 18747706 21264775 24571648 28899099 34810636 42785633 52472838 61750747
2461 61750747 67629146 69679159 71004708 74920848 83612180 98763454 121173628 149319071
2453 149319071 177502622 194880247 191258799 168232456 137315713 108218265 84901263
2446 84901263 67334198 54200757 44336706 36719947 30613908 25642829 21596225 18338643
2438 18338643 15808968 13952629 12489532 11035873 9600179 8504709 7832363 7493809
2430 7493809 7344876 7237311 7027042 6537005 5855088 5341098 5023149 4826519 4826337 5178700
$$ packed form
2486D2111911n342872o167118n057641l673095k673113k038643j551413j182779
2478A4425237q58489m95531k98082o0460M57641Q75735R44425R06524J139764
2469A7036764J710942K517069L306873M327451N911537P974997R687205R277909
2461F1750747N878399K050013J325549L916140Q691332J5151274K2410174K8145443
2453A49319071K8183551J7377625l621448k3026343l0916743k9097448k3317002
2446H4901263j7567065j3133441r864051p616759o106039m971079m046604l257582
2438A8338643k529675j856339j463097j453659j435694j095470o72346l38554
2430G493809j48933j07565k10269m90037o81917n13990l17949j96630j82L52363
$$ plain form
2420 5178700 5959441 6891940 7308970 6775432 5718412 4645457 3797525 3288989 3042020
2411 3042020 2922599 2885484 2901510 2893149 2844950 2782163 2593855 2299291 2159725 2535200 3292972
2400 3292972 4103519 5047508 6001951 6301448 5530675 4327862 3446402 3011239 2832265
2391 2832265 2812646 2817084 2682636 2452694 2232983 2073574 2010251 1928104 1638397 1168805
2381 1168805 883635 1193959 1957595 2658903 2966933 2964917 2851144 2767511 2734183 2477764
2371 2477764 1795201 936198 406510 381335 668725 1118942 1487163 1639720 1698936 1812201
2361 1812201 1842545 1681165 1605640 1658576 1805669 2114189 2442834 2606157 2614921 2466109
2351 2466109 2236587 2210924 2418886 2765150 3109164 3217768 3073331 2810796 2474602 2170643
$$ packed form
2420E178700P80741R32499M17030n33538j057020j072955q47932n08536k46969
2411C042020j19421l7115J6026q361m8199o2787j88308k94564j39566L75475P57772
2400C292972Q10547R43989R54443K99497p70773j202813q81460m35163j78974
2391B832265j9619M438j34448k29942k19711j59409o3323q2147k89707m69592
2381A168805k85170L10324P63636P01308L08030k016j13773q3633l3328k56419
2371B477764o82563q59003n29688k5175K87390M50217L68221J52557N9216J13265
2361A812201L0344j61380p5525N2936J47093L08520L28645J63323Q764j48812
2351B466109k29522k5663K07962L46264L44014J08604j44437k62535l36194l03959
$$ plain form
2341 2170643 1953895 1780421 1788008 2020025 2341189 2565381 2576734 2406710 2110763 1725299
2331 1725299 1294052 817006 470453 481667 636443 563909 124518 -282054 -210131 116062
2321 116062 319526 406525 616247 1008869 1320402 1233955 720164 65692 -478275 -848865
2311 -848865 -1087072 -1235171 -1240759 -1088332 -770512 -339879 44502 162368 114182 226720
2301 226720 499773 662775 569618 402052 234386 75868 86964 240764 244051 14598
2291 14598 -224323 -213524 97558 500873 776084 840649 723770 535794 294081 23117
2281 23117 -127210 -184961 -193211 -79480 77259 161596 56020 -176432 -423611 -626632 -729511
2270 -729511 -671270 -570951 -614650 -799569 -937599 -848518 -625438 -422542 -372081 -698267
$$ packed form
2341B170643k16748j73474P587K32017L21164K24192J1353j70024k95947l85464
2331A725299m31247m77046l46553J1214J54776p2534m39391m06572P1923L26193
2321A16062K03464Q6999K09722L92622L11533q6447n13791o54472n43967l70590
2311h48865k38207j48099n588J52427L17820M30633L84381J17866m8186J12538
2301B26720K73053J63002r3157j67566j67666j58518J1096J53800L287k29453
2291A4598k38921J0799L11082M03315K75211O4565j16879j87976k41713k70964
2281B3117j50327n7751q250J13731J56739Q4337j05576k32452k47179k03021j02879
2270g29511N8241J00319m3699j84919j38030Q9081K23080K02896N0461l26186
$$ plain form
2260 -698267 -1118598 -1249959 -1118952 -752711 -384407 -245426 -389556 -652164 -711357 -543686
2250 -543686 -423553 -525777 -883608 -1374289 -1838500 -2121075 -2113824 -1978530 -1993529 -2074354
2240 -2074354 -2043049 -1810337 -1262587 -611286 -258122 -222908 -184876 58376 421632 679054
2230 679054 648872 358275 170978 314171 609159 827639 879206 751978 418655 26577
2220 26577 -142921 -91343 -18513 72027 181321 417383 1033230 1979138 2930612 3507274
2210 3507274 3594861 3383266 3041261 2724353 2362183 1770995 1050010 527195 436517 800948
2200 800948 1384656 1864086 2099094 2062304 1932587 1905219 1898029 2049316 2544116 3061313
2190 3061313 3218809 3022390 2646848 2198190 1754185 1528931 1684786 2114463 2459887 2420895
$$ packed form
2260f98267m20331j31361J31007L66241L68304J38981j44130k62608n9193J67671
2250e43686J20133j02224l57831m90681m64211k82575P251J35294j4999q0825
2240b074354L1305K32712N47750O51301L53164L5214L8032K43252L63256K57422
2230F79054l0182k90597j87297J43193K94988K18480N1567j27228l33323l92078
2220B6577j69498N1578P2830R0540J09294K36062O15847R45908R51474N76662
2210C507274Q7587k11595l42005l16908l62170n91188p20985n22815r0678L64431
2200H00948N83708M79430K35008l6790j29717k7368p190J51287M94800N17197
2190C061313J57496j96419l75542m48658m44005k25254J55855M29677L45424l8992
$$ plain form
2180 2420895 2055776 1487857 750451 -42710 -623250 -813197 -734935 -594073 -496051 -390106
2170 -390106 -175308 193496 616871 947557 1147355 1222067 1208391 901325 140954 -700514
2160 -700514 -958254 -615849 -122059 354617 780801 1173501 1513954 1765403 2084395 2344112
2150 2344112 2346454 2091964 1609631 1059796 449260 -215685 -729328 -983145 -1063048 -1166407
2140 -1166407 -1460028 -1879397 -2243429 -2384350 -2182232 -1614633 -842082 -304359 -245472 -345341
2130 -345341 -209023 198075 676557 997624 1082794 960063 567157 -89664 -680304 -971382
2120 -971382 -940692 -623159 -295734 -267611 -430264 -493943 -485366 -548616 -678175 -945836 -1342616
2109 -1342616 -1613204 -1485287 -1018070 -581830 -278363 17661 240411 198965 -130527 -534641
$$ packed form
2180B420895l65119n67919p37406p93161n80540j89947P8262J40862R8022J05945
2170c90106K14798L68804M23375L30686J99798P4712j3676l07066p60371q41468
2160g00514k57740L42405M93790M76676M26184L92700L40453K51449L18992K59717
2150B344112K342k54490m82333n49835o10536o64945n13643k53817p9903j03359
2140a166407k93621m19369l64032j40921K02118N67599P72551N37723N8887r9869
2130c45341J36318M07098M78482L21067Q5170j22731l92906o56821n90640k91078
2120i71382L0690L17533L27425K8123j62653o3679Q577o3250j29559k67661l96780
2109a342616k70588J27917M67217M36240L03467K96024K22750m1446l29492m04114
$$ plain form
2099 -534641 -800582 -872640 -668905 -356944 -229240 -170113 123707 576527 834726 700750
2089 700750 464117 554435 937110 1088836 697300 223183 79622 184408 296540 252499
2079 252499 193249 452531 1150575 1947686 2379679 2482644 2685063 3081718 3383552 3466973
2069 3466973 3410899 3245207 2884761 2417505 2069087 1800684 1520352 1294155 1182286 1161613
2059 1161613 1206143 1162590 1085722 1068476 991313 748891 437014 360889 561465 776494 906076
2048 906076 1030232 1123744 1157279 1215557 1381002 1496986 1397879 1077119 688589 446258
2038 446258 318463 206173 92390 -20381 -27574 67441 245078 579787 1262399 2297035
2028 2297035 3210757 3590047 3446289 3034894 2556951 2215668 1985645 1736496 1455525 1108217
$$ packed form
2099e34641k65941p2058K03735L11961J27704N9127K93820M52820K58199j33976
2089G00750k36633R0318L82675J51726l91536m74117j43561J04786J12132m4041
2079B52499n9250K59282O98044P97111M31993J02965K02419L96655L01834Q3421
2069C466973n6074j65692l60446m67256l48418k68403k80332k26197j11869k0673
2059A161613M4530m3553p6868j7246p7163k42422l11877p6125K00576K15029J29582
2048I06076J24156R3512L3535N8278J65445J15984r9107l20760l88530k42331
2038D46258j27795j12290j13783j12771p193R5015J77637L34709O82612J034636
2028B297035R13722L79290j43758m11395m77943l41283k30023k49149k80971l47308
$$ plain form
2018 1108217 690017 284550 -5008 -276434 -602790 -871957 -1116580 -1306114 -1175898 -649378
2008 -649378 -85611 322976 607740 601444 173598 -373395 -632503 -502117 -218120 -110694
1998 -110694 -248399 -429740 -530594 -615723 -615064 -357148 107565 507585 780562 955939
1988 955939 1091076 1244080 1288795 1231818 1249128 1420889 1514930 1388946 1268447 1212879 1203665
1977 1203665 1218260 1075205 773572 527800 409867 487485 742708 1004209 1038310 840085
1967 840085 715488 885894 1304697 1505510 1091954 455282 163659 302741 574976 673694
1957 673694 471622 156536 -2470 6572 51711 45856 7616 73899 159232 97975 -163536
1946 -163536 -490859 -728326 -920462 -985564 -895769 -803580 -830057 -942958 -1015261 -899723 -603160
$$ packed form
2018A108217m18200m05467k89558k71426l26356k69167k44623j89534J30216N26520
2008f49378N63767M08587K84764o296m27846n46993k59108J30386K83997J07426
1998a10694j37705j81341j00854q5129O59K57916M64713M00020K72977J75377
1988I55939J35137J53004M4715n6977J7310J71761R4041j25984j20499n5568r214
1977A203665J4595j43055l01633k45772j17933P7618K55223K61501L4101j98225
1967H40085j24597J70406M18803K00813m13556o36672k91623J39082K72235R8718
1957F73694k02072l15086j59006R042M5139n855l8240O6283Q5333o1257k61511
1946a63536l27323k37467j92136o5102Q9795R2189k6477j12901p2303J15538K96563
$$ plain form
1935 -603160 -347086 -272005 -323968 -385565 -423535 -447182 -464187 -632391 -1029225 -1471027 -1737802
1924 -1737802 -1843877 -1882789 -1777577 -1494713 -1082816 -696983 -535796 -395771 6655 776865
1914 776865 1777761 2793918 3587101 3847346 3488289 2797444 2155961 1686749 1371709
1905 1371709 1155013 986123 844600 773631 798822 841275 888969 1027447 1337735 1685789
1895 1685789 1782595 1524217 1139865 893509 685392 369325 15084 -247692 -368733 -431941
1885 -431941 -472251 -392670 -250510 -148694 -39751 283600 698889 723426 293038 -123646
1875 -123646 -174929 53420 455165 867033 1222475 1502852 1557020 1305038 1009181 854681
1865 854681 684408 518149 517045 703447 955326 1112259 1158583 1232837 1360870 1491205
$$ packed form
1935f03160K56074P5081n1963o1597l7970k3647j7005j68204l96834m41802k66775
1924a737802j06075l8912J05212K82864M11897L85833J61187J40025M02426P70210
1914G76865J000896J016157P93183K60245l59057o90845o41483m69212l15040
1905A371709k16696j68890j41523p0969K5191M2453M7694J38478L10288L48054
1895A685789R6806k58378l84352k46356k08117l16067l54241k62776j21041o3208
1885d31941m0310P9581J42160J01816J08943L23351M15289K4537m30388m16684
1875a23646n1283K28349M01745M11868L55442K80377N4168k51982k95857j54500
1865H54681j70273j66259j104J86402K51879J56933M6324P4254J28033J30335
$$ plain form
1855 1491205 1620556 1621521 1398531 1071858 732954 351535 -11639 -229994 -315950 -300758
1845 -300758 -366256 -782623 -1613911 -2448318 -2803056 -2557361 -1888129 -1181852 -795608 -1026451
1835 -1026451 -1718289 -2376351 -2651940 -2502703 -2034563 -1552426 -1284504 -1006840 -597049 -388461
1825 -388461 -476305 -530268 -530805 -613284 -623331 -371229 -14925 98956 -140860 -496942 -771966
1814 -771966 -827079 -629827 -527603 -790208 -1235744 -1649883 -1914002 -1871321 -1545855 -1071657
1804 -1071657 -473045 149797 515326 542678 389283 120047 -234130 -567070 -772576 -804571
1794 -804571 -586372 -173595 284301 768446 1078866 1019949 725297 479786 381980 318745
1784 318745 192880 -46002 -396011 -637039 -587550 -460619 -555362 -827516 -1102303 -1278722
$$ packed form
1855A491205J29351R65k22990l26673l38904l81419l63174k18355q5956J5192
1845c00758o5498m16367q31288q34407l54738K45695O69232P06277L86244k30843
1835a026451o91838o58062k75589J49237M68140M82137K67922K77664M09791K08588
1825c88461q7844n3963n37q2479j0047K52102L56304J13881k39816l56082k75024
1814g71966n5113J97252J02224k62605m45536m14139k64119M2681L25466M74198
1804a071657N98612O22842L65529K7352j53395k69236l54177l32940k05506l1995
1794h04571K18199M12777M57896M84145L10420n8917k94652k45511r7806o3235
1784C18745j25865k38882l50009k41028M9489J26931r4743k72154k74787j76419
$$ plain form
1774 -1278722 -1244041 -870292 -128314 750972 1461086 1687376 1437201 1264092 1441296 1719797
1764 1719797 1855901 1807486 1669060 1432328 976389 323311 -393676 -899124 -1110083 -1147298
1754 -1147298 -1087934 -922426 -604113 -124254 520139 1132416 1576753 1857905 1899629 1570059
1744 1570059 1056931 589993 211238 -56752 -226498 -371377 -453064 -402024 -333038 -408083
1734 -408083 -570376 -665583 -830852 -1244337 -1648609 -1660153 -1149382 -347649 337629 777721
1724 777721 990478 1009237 913622 884151 981893 999278 791326 508626 300973 167182 203467
1713 203467 321577 290846 85513 -32289 184008 615452 994935 1388918 2017297 2701470
1703 2701470 3019851 2726242 1935048 1086271 495430 76328 -211773 -364307 -548549 -749006
$$ packed form
1774a278722L4681L73749P41978Q79286P10114K26290k50175j73109J77204K78501
1764A719797J36104m8415j38426k36732m55939o53078p16987n05448k10959l7215
1754a147298N9364J65508L18313M79859O44393O12277M44337K81152M1724l29570
1744A570059n13128m66938l78755k67990j69746j44879q1687N1040O8986p5045
1734d08083j62293r5207j65269m13485m04272j1544N10771Q01733O85278M40092
1724G77721K12757J8759r5615k9471R7742J7385k07952k82700k07653j33791L6285
1713B03467J18110l0731k05333j17802K16297M31444L79483L93983O28379O84173
1703B701470L18381k93609p91194q48777n90841m19102k88101j52534j84242k00457
$$ plain form
1693 -749006 -763435 -721733 -844860 -1047037 -1049405 -806822 -453575 -41999 322466 475026
1683 475026 362459 69904 -318331 -590452 -582484 -436716 -376179 -312930 -115480 259754
1673 259754 851790 1459173 1633318 1267696 760639 372911 15526 -418859 -817538 -1070426
1663 -1070426 -1104745 -1037555 -1030323 -961190 -696239 -338749 -102134 -17920 78075 318005 763007
1652 763007 1312387 1760822 1961635 1872182 1625102 1366588 1291866 1528171 1970380 2516592
1642 2516592 2946293 2999640 2772173 2348053 1730397 1153220 766805 405027 -57636 -491046
1632 -491046 -885248 -1317130 -1741760 -2088561 -2249124 -2164164 -1840368 -1529716 -1414675 -1345937
1622 -1345937 -1042326 -360978 508721 1224079 1582552 1588859 1419657 1262080 1166886 928855
$$ packed form
1693g49006j4429M1702j23127k02177k368K42583L53247M11576L64465J52560
1683D75026j12567k92555l88235k72121P968J45768O0537O3249J97450L75234
1673B59754N92036O07383J74145l65622n07057l87728l57385m34385l98679k52888
1663a070426l4319O7190P232O9133K64951L57490K36615Q4214R5995K39930M45002
1652G63007N49380M48435K00813q9453k47080k58514p4722K36305M42209N46212
1642B516592M29701N3347k27467m24120o17656n77177l86415l61778m62663m33410
1632d91046l94202m31882m24630l46801j60563Q4960L23796L10652J15041O8738
1622a345937L03611O81348Q69699P15358L58473O307j69202j57577r5194k38031
$$ plain form
1612 928855 461347 -56535 -427262 -528385 -463522 -341062 -196747 -309928 -767245 -1287887
1602 -1287887 -1632856 -1867661 -1853502 -1377817 -683529 -53242 351206 641292 909586 1123674
1592 1123674 1367676 1730259 2151062 2382090 2279832 2053692 1982607 2008913 1779002 1042080
1582 1042080 25565 -727387 -1059664 -1072774 -758521 -344662 -147814 -174184 -188451 -83767
1572 -83767 -10509 -44066 -377779 -1078050 -1897981 -2544403 -2876816 -2955080 -2914214 -2839926 -2733936
1561 -2733936 -2620526 -2573706 -2522260 -2209490 -1653729 -1129826 -858126 -1042992 -1430651 -1575083
1551 -1575083 -1465647 -1319341 -1164026 -851306 -457399 -197189 -200074 -574574 -1038795 -1280713
1541 -1280713 -1260622 -920544 -321973 242837 462393 197000 -364221 -939899 -1369431 -1579495
$$ packed form
1612I28855m67508n17882l70727j01123O4863J22460J44315j13181m57317n20642
1602a287887l44969k34805J4159M75685O94288O30287M04448K90086K68294K14088
1592A123674K44002L62583M20803K31028j02258k26140p1085K6306k29911p36922
1582A042080j016515p52952l32277j3110L14253M13859J96848k6370j4267J04684
1572h3767P3258l3557l33713p00271q19931o46422l32413p8264M0866P4288J05990
1561b733936J13410M6820N1446L12770N55761N23903K71700j84866l87659j44432
1551a575083J09436J46306J55315L12720L93907K60210k885l74500m64221k41918
1541a280713K0091L40078N98571N64810K19556k65393n61221n75678m29532k10064
$$ plain form
1531 -1579495 -1702304 -1905424 -2162874 -2421818 -2714051 -2993549 -3080950 -2732230 -2022190 -1385136
1521 -1385136 -1012400 -977550 -1380380 -2002698 -2358861 -2250023 -1880579 -1647174 -1683091 -1714526
1511 -1714526 -1518345 -1207087 -865538 -526395 -347461 -473232 -827543 -1281942 -1576275 -1509948
1501 -1509948 -1316676 -1162096 -855987 -409619 -117073 -271 150979 341139 286548 -169730
1491 -169730 -755435 -1159661 -1317931 -1287548 -1140881 -912950 -568966 -48260 437690 593051
1481 593051 398481 -34592 -637307 -1275329 -1741560 -1945717 -2129370 -2635142 -3341253 -4014692
1471 -4014692 -4683463 -5362441 -6036150 -6641771 -7129886 -7519811 -7747164 -7888645 -8028191 -7992856
1461 -7992856 -7796520 -7770220 -7997792 -8257624 -8608916 -9154493 -9802152 -10350139 -10749187 -11124710
$$ packed form
1531a579495j22809k03120k57450k58944k92233k79498q7401L48720P10040O37054
1521a385136L72736L4850m02830o22318l56163J08838L69444K33405l5917l1435
1511a714526J96181L11258L41549L39143J78934j25771l54311m54399k94333O6327
1501a509948J93272J54580L06109M46368K92546J16802J51250J90160n4591m56278
1491a69730n85705m04226j58270L0383J46667K27931L43984N20706M85950J55361
1481E93051j94570m33073o02715o38022m66231k04157j83653n05772p06111o73439
1471d014692o68771o78978o73709o05621m88115l89925k27353j41481j39546L5335
1461g992856J96336K6300k27572k59832l51292n45577o47659n47987l99048l75523
$$ plain form
1451 -11124710 -11659596 -12484996 -13709203 -15439959 -17736141 -20488884 -23815845 -28174328
1443 -28174328 -33934664 -41339659 -50497135 -61226845 -72844211 -82595029 -86102877 -82971137
1435 -82971137 -78869899 -79182648 -86389260 -101989798 -128231440 -168304180 -224286713 -288875886
1427 -288875886 -333411195 -323146465 -265233075 -198648410 -146097922 -109912798 -85331062
1420 -85331062 -67637807 -53807255 -42708873 -34181723 -28014375 -23499385 -19876914 -16395940
1412 -16395940 -12940168 -9826680 -7391453 -5650573 -4377382 -3508365 -2899519 -2234911 -1627332
1403 -1627332 -1233969 -1014093 -1005976 -1307881 -1736469 -2099555 -2312893 -2301142 -2029264 -1628616
1393 -1628616 -1195638 -833029 -486386 -188840 46982 184603 -84353 -664479 -1211379 -1653568
$$ packed form
1451a1124710n34886q25400j224207j730756k296182k752743l326961m358483
1443b8174328n760336p404995r157476j0729710j1617366r750818l507848L131740
1435h2971137M101238l12749p206612j5600538k6241642m0072740n5982533o4589173
1427b88875886m4535309J0264730N7913390O6584665N2550488L6185124K4581736
1420h5331062J7693255J3830552J1098382Q527150O167348M514990L622471L480974
1412a6395940L455772L113488K435227J740880J273191Q69017O08846O64608O07579
1403a627332L93363K19876Q117l01905m28588l63086k13338J1751K71878M00648
1393a628616M32978L62609L46643K97546K35822J37621k68956n80126n46900m42189
$$ plain form
1383 -1653568 -1963906 -2047287 -1912183 -1651199 -1207792 -619820 -155660 28772 169878 609658
1373 609658 1290407 1724713 1635160 1093762 450573 -138201 -666617 -889674 -803997 -652677
1363 -652677 -589943 -616535 -590085 -411327 -159609 -5199 84466 292575 563117 695057
1353 695057 721036 678113 469610 161527 -22429 1055 16434 -129029 -214807 32429 482582
1342 482582 723268 620073 545416 730855 1036162 1461851 1977547 2366562 2524104 2598782
1332 2598782 2674281 2714786 2652255 2363912 2036771 1906730 1899280 2022924 2277117 2487452
1322 2487452 2592523 2601817 2585587 2578372 2623240 2634966 2499429 2245453 2046627 1947106 1963745
1311 1963745 2170901 2306313 2006981 1517221 1255954 1086982 782420 372630 1164 -142050
$$ packed form
1383a653568l10338q3381J35104K60984M43407N87972M64160J84432J41106M39780
1373F09658O80749M34306q9553n41398o43189n88774n28416k23057Q5677J51320
1363f52677O2734k6592K6450J78758K51718J54410Q9665K08109K70542J31940
1353F95057K5979m2923k08503l08083j83956K3484J5379j45463q5778K47236M50153
1342D82582K40686j03195p4657J85439L05307M25689N15696L89015J57542P4678
1332B598782P5499M0505o2531k88343l27141j30041p450J23644K54193K10335
1322B487452J05071R294j6230p215M4868J1726j35537k53976j98826r9521J6639
1311A963745K07156J35412k99332m89760k61267j68972l04562m09790l71466j43214
$$ plain form
1301 -142050 -169460 -313881 -469695 -425377 -248666 -217250 -360698 -421042 -185333 327924
1291 327924 801789 957096 772709 336692 -170308 -505829 -601960 -583759 -538976 -466423
1281 -466423 -271551 62208 503045 1115761 1870889 2662144 3276656 3432607 3023051 2224537
1271 2224537 1349386 617064 132408 -34794 112661 421384 707889 919630 1157237 1462318
1261 1462318 1619008 1584229 1655879 1917297 2204155 2407680 2359650 1940313 1220162 441060
1251 441060 -159705 -421307 -285059 121203 515261 890996 1376356 1750868 1865076 1900933
1241 1900933 1932547 1937589 1819540 1501729 1260643 1302992 1367182 1255134 1042318 819075
1231 819075 644317 604059 597671 590067 842041 1272560 1490717 1353279 1125745 930830 640798
$$ packed form
1301a42050k7410j44421j55814M4318J76711L1416j43448o0344K35709N13257
1291C27924M73865J55307j84387m36017n07000l35521r6131J8201M4783P2553
1281d66423J94872L33759M40837O12716P55128P91255O14512J55951m09556p98514
1271B224537q75151p32322m84656j67202J47455L08723K86505K11741K37607L05081
1261A462318J56690l4779P1650K61418K86858K03525m8030m19337p20151p79102
1251D41060o00765k61602J36248M06262L94058L75735M85360L74512J14208L5857
1241A900933L1614N042j18049l17811k41086M2349O4190j12048k12816k23243
1231H19075j74758m0258o388p604K51974M30519K18157j37438k27534j94915k90032
$$ plain form
1220 640798 420714 380242 223905 -139361 -518365 -794431 -1006400 -1074084 -803086 -313589
1210 -313589 163451 421636 454658 440695 411145 417302 506263 866658 1527513 2196777 2655990
1199 2655990 2956700 3283562 3606861 3747083 3619206 3311155 2969152 2603340 2134874 1654149
1189 1654149 1294185 942616 455658 -7753 -239054 -353273 -469242 -471798 -282438 23478
1179 23478 328606 647442 1022561 1358373 1574879 1757235 1795780 1638617 1532559 1575297
1169 1575297 1621771 1458983 1164617 1026943 1144815 1365213 1218230 626994 207606 244800
1159 244800 444782 511638 310904 -38859 -266809 -400506 -678664 -1003637 -1101505 -883117
1149 -883117 -613143 -604538 -753200 -863695 -879926 -766518 -560573 -295665 -107838 -196320
$$ packed form
1220F40798k20084m0472j56337l63266l79004k76066k11969o7684K70998M89497
1210c13589M77040K58185L3022j3963k9550O157Q8961L60395O60855O69264M59213
1199B655990L00710L26862L23299J40222j27877l08051l42003l65812m68466m80725
1189A654149l59964l51569m86958m63411k31301j14219j15969k556J89360L05916
1179B3478L05128L18836L75119L35812K16506J82356L8545j57163j06058M2738
1169A575297M6474j62788k94366j37674J17872K20398j46983n91236m19388L7194
1159B44800J99982O6856k00734l49763k27950j33697k78158l24973r7868K18388
1149h83117K69974Q605j48662j10495j6231J13408K05945K64908J87827q8482
$$ plain form
1139 -196320 -516318 -913080 -1246697 -1348199 -1108438 -591456 -60316 191870 247794 352857
1129 352857 400980 248805 129863 275864 536511 592813 423815 181602 12759 -63848
1119 -63848 -121370 -131122 15183 317569 737038 1261909 1678571 1666621 1306598 1034300 884891
1108 884891 618982 210447 -328347 -880012 -1143249 -857921 -160971 584638 1053943 1237472
1098 1237472 1225872 1073905 863988 573092 141800 -307055 -493763 -343941 -70130 195781
1088 195781 395919 378026 157594 -3718 -3516 38880 216410 539372 663128 571351 696160
1077 696160 1058257 1347375 1450103 1400321 1215167 857718 408618 -56572 -401093 -459460
1067 -459460 -294815 -92044 31331 120694 238020 447912 790740 1074015 956186 453271
$$ packed form
1139a96320l19998l96762l33617j01502K39761N16982N31140K52186N5924J05063
1129C52857M8123j52175j18942J46001K60647N6302j68998k42213j68843p6607
1119f3848n7522r752J46305L02386M19469N24871M16662j1950l60023k72298j49409
1108H84891k65909m08535n38794n51665k63237K85328O96950P45609M69305J83529
1098A237472j1600j51967k09917k90896m31292m48855j86708J49822K73811K65911
1088A95781K00138j7893k20432j61312K02M2396J77530L22962J23756r1777J24809
1077F96160L62097K89118J02728m9782j85154l57449m49100m65190l44521n8367
1067d59460J64645K02771J23375Q9363J17326K09892L42828K83275j17829n02915
$$ plain form
1057 453271 948 -148753 -43511 93155 55016 -176758 -526102 -744361 -699224 -703090
1047 -703090 -1054510 -1523136 -1703039 -1388862 -808926 -328836 -103353 -172923 -401449 -609027
1037 -609027 -666825 -538094 -176533 397697 892187 1150085 1194886 1181411 1254697 1413244
1027 1413244 1603999 1858512 2259016 2689399 2932826 2844524 2583185 2329948 1971859 1527575
1017 1527575 1209614 1027008 837371 834813 1169163 1477767 1307043 739120 180545 -150427
1007 -150427 -360088 -439961 -305129 -230661 -401729 -564378 -350648 243829 888384 1229433
997 1229433 1246036 1289974 1593790 1944019 1970069 1692915 1511786 1582771 1707557 1876573
987 1876573 2249043 2785656 3091846 2945713 2634771 2504078 2346613 1937034 1591887 1424061
$$ packed form
1057D53271m52323j49701J05242J36666l8139k31774l49344k18259M5137l866
1047g03090l51420m68626j79903L14177N79936M80090K25483o9570k28526k07578
1037f09027n7798J28731L61561N74230M94490K57898M4801j3475P3286J58547
1027A413244J90755K54513M00504M30383K43427q8302k61339k53237l58089m44284
1017A527575l17961j82606j89637k558L34350L08604j70724n67923n58575l30972
1007a50427k09661p9873J34832P4468j71068j62649K13730N94477O44555L41049
997A229433J6603M3938L03816L50229K6050k77154j81129P0985J24786J69016
987A876573L72470N36613L06190j46133l10942j30693j57465m09579l45147j67826
$$ plain form
977 1424061 1303325 1227230 1281843 1333840 1205545 1028082 909951 668013 202577 -267694
967 -267694 -450911 -309811 34532 374513 613081 950924 1374755 1576008 1513351 1422499
957 1422499 1473109 1605804 1798837 1944454 1848946 1575066 1214068 911549 979836 1387786
947 1387786 1741176 1735646 1410518 1226462 1359680 1464117 1389843 1092252 715531 570079
937 570079 792595 1382558 2165352 2754550 2872583 2605091 2088418 1406157 531052 -340499
927 -340499 -805286 -757520 -477258 -313079 -443127 -747134 -853091 -625371 -344031 -232355
917 -232355 -288145 -378174 -309768 -68579 170862 390454 517602 470897 305456 104403 -111628
906 -111628 -282080 -129518 391440 959651 1325477 1496182 1590251 1581485 1442092 1324893
$$ packed form
977A424061j20736p6095N4613N1997j28295j77463j18131k41938m65436m70271
967b67694j83217J41100L44343L39981K38568L37843M23831K01253o2657r0852
957A422499N0610J32695J93033J45617r5508k73880l60998l02519O8287M07950
947A387786L53390n530l25128j84056J33218J04437p4274k97591l76721j45452
937E70079K22516N89963P82794N89198J18033k67492n16673o82261q75105q71551
927c40499m64787M7766K80262J64179j30048l04007j05957K27720K81340J11676
917b32355n5790r0029O8406K41189K39441K19592J27148m6705j65441k01053k16031
906a11628j70452J52562N20958N68211L65826J70705R4069q766j39393j17199
$$ plain form
896 1324893 1293613 1138286 610083 -151357 -641229 -610436 -205888 451775 1282282 1942146
886 1942146 2291491 2575296 2944269 3374047 3736799 3829165 3643321 3345861 2948247 2472998
876 2472998 2136230 1991184 1826788 1527561 1023227 320260 -406786 -905683 -1223260 -1530383
866 -1530383 -1841566 -2046522 -1949452 -1509859 -1059515 -857056 -811751 -894852 -1051465 -1001634
856 -1001634 -619632 59758 773222 1233703 1401085 1401066 1135333 469558 -348330 -935694
846 -935694 -1135303 -986038 -741646 -728454 -944861 -1034132 -778639 -314980 125055 318039
836 318039 187942 -233542 -786822 -1236922 -1424773 -1454352 -1465985 -1435078 -1382013 -1509616 -1812453
825 -1812453 -2043497 -2135188 -2218409 -2449515 -2795439 -3051544 -2996251 -2600108 -2033328 -1392175
$$ packed form
896A324893l1280j55327n28203p61440m89872L0793M04548O57663Q30507O59864
886A942146L49345K83805L68973M29778L62752R2366j85844k97460l97614m75249
876B472998l36768j45046j64396k99227n04334p02967p27046m98897l17577l07123
866a530383l11183k04956R7070M39593M50344K02459M5305q3101j56613M9831
856a001634L82002O79390P13464M60481J67382j9k65733o65775q17888n87364
846i35694j99609J49265K44392J3192k16407q9271K55493M63659M40035J92984
836C18039j30097m21484n53280m50100j87851k9579j1633L0907N3065j27603l02837
825a812453k31044r1691q3221k31106l45924k56105N5293L96143N66780O41153
$$ plain form
815 -1392175 -759894 -268210 31531 267988 482195 605084 691704 826345 911417 890208
805 890208 803325 542221 161484 18159 226997 548819 565123 150671 -432977 -971894
795 -971894 -1471323 -1994031 -2488533 -2828364 -2958590 -2912942 -2633103 -2145925 -1551441 -1051851
785 -1051851 -882969 -980015 -1105050 -1179745 -1221365 -1230319 -1067715 -678241 -287355 -120783 -116417
774 -116417 -120912 -179866 -353720 -498602 -436136 -94156 545399 1284433 1748812 1809724 1635073
763 1635073 1325108 841359 271325 -260040 -808055 -1345580 -1753784 -1945939 -1974139 -1906950
753 -1906950 -1890702 -1942932 -1902110 -1797256 -1746595 -1701274 -1491194 -1130130 -800279 -569866 -389652
742 -389652 -270016 -44896 495389 1282360 2001111 2392880 2541516 2579764 2485538 2195855
$$ packed form
815a392175O32281M91684K99741K36457K14207J22889Q6620J34641Q5072k1209
805H90208q6883k61104l80737j43325K08838L21822J6304m14452n83648n38917
795i71894m99429n22708m94502l39831j30226M5648K79839M87178N94484M99590
785a051851J68882r7046j25035p4695m1620q954J62604L89474L90886J66572M366
774a16417m495n8954j73854j44882O2466L41980O39555P39034M64379O0912j74651
763A635073l09965m83749n70034n31365n48015n37525m08204j92155k8200O7189
753a906950J6248n2230M0822J04854N0661M5321K10080L61064L29851K30413J80214
742c89652J19636K25120N40285P86971P18751L91769J48636L8248r4226k89683
$$ plain form
732 2195855 1721635 1155639 564383 -6191 -497300 -852646 -986466 -837206 -587055 -352821
722 -352821 -136198 -41476 -3751 114616 369459 903345 1658074 2377919 2958016 3355316
712 3355316 3494844 3452185 3271175 2834550 2196442 1530457 959196 671501 806958 1181284
702 1181284 1390653 1250513 788873 164215 -366809 -725350 -1009502 -1246013 -1290054 -1096207
692 -1096207 -755555 -454402 -389047 -649362 -1099501 -1277966 -1089911 -910064 -1110496 -1575393
682 -1575393 -1759985 -1501066 -1056590 -697067 -391466 -56512 188769 293954 331978 345444
672 345444 356641 395463 435898 289865 -90027 -442943 -504752 -256127 47582 65374 -293432
661 -293432 -847966 -1352355 -1568080 -1509440 -1442047 -1418957 -1139956 -725935 -511270 -397895
$$ packed form
732B195855m74220n65996n91256n70574m91109l55346j33820J49260K50151K34234
722c52821K16623R4722L7725J18367K54843N33886P54729P19845N80097L97300
712C355316J39528m2659j81010m36625o38108o65985n71261k87695J35457L74326
702A181284K09369j40140m61640o24658n31024l58541k84152k36511m4041J93847
692a096207L40652L01153O5355k60315m50139j78465J88055J79847k00432m64897
682a575393j84592K58919M44476L59523L05601L34954K45281J05185L8024J3466
672C45444J1197L8822M0435j46033l79892l52916o1809K48625L03709J7792l58806
661b93432n54534n04389k15725N8640O7393K3090K79001M14021K14665J13375
$$ plain form
651 -397895 -350741 -471130 -596265 -505326 -244327 113677 532088 881739 935482 603528
641 603528 126983 -321013 -735455 -850231 -551143 -83161 349132 647927 755051 668128
631 668128 526110 455010 418227 230023 -201828 -612807 -789718 -941090 -1155241 -1268109
621 -1268109 -1363596 -1483167 -1560666 -1620172 -1536663 -1297208 -1118168 -1194201 -1398977 -1578741 -1676848
610 -1676848 -1667370 -1588670 -1440878 -1340435 -1287156 -1167092 -1037197 -1088143 -1083137 -622564 53970
599 53970 603747 1007082 1252781 1406423 1454530 1225954 774502 321297 38515 -100311
589 -100311 -286813 -420540 -325174 -202914 -272444 -453837 -635110 -839415 -1168730 -1378791
579 -1378791 -1025104 -292109 203436 356985 540038 763170 768620 424100 -205827 -786634
$$ packed form
651c97895M7154j20389j25135R0939K60999L58004M18411L49651N3743l31954
641F03528m76545m47996m14442j14776K99088M67982M32293K98795J07124q6923
631F68128j42018p1100l6783j88204m31851m10979j76911j51372k14151j12868
621a268109r5487j19571p7499n9506Q3509K39455J79040p6033k04776j79764r8107
610a676848R478P8700J47792J00443N3279J20064J29895n0946N006M60573O76534
599E3970N49777M03335K45699J53642M8107k28576m51452m53205k82782j38826
589a00311j86502j33727R5366J22260o9530j81393j81273k04305l29315k10061
579a378791L53687P32995M95545J53549J83053K23132N450l44520o29927n80807
$$ plain form
569 -786634 -1001100 -784609 -334624 112353 543106 864753 771875 273989 -119474 -207650
559 -207650 -355136 -644498 -855742 -944247 -878092 -711292 -553111 -344209 -33505 145758
549 145758 -44059 -407915 -743703 -910465 -747951 -500518 -590603 -1129286 -1961600 -2777189
539 -2777189 -3366482 -3534884 -3273934 -2694040 -1806304 -1047463 -802037 -944918 -1180874 -1207059
529 -1207059 -901665 -467490 -129842 -235371 -899625 -1615896 -2024064 -2143165 -1910039 -1452388
519 -1452388 -1052442 -729597 -515904 -583966 -861854 -930842 -533846 216028 900788 1150421
509 1150421 932986 426645 51553 55603 355698 751008 1035784 1275995 1510066 1376010
499 1376010 780215 100084 -585070 -1198864 -1367232 -1120631 -879896 -893322 -1051817 -1234891
$$ packed form
569g86634k14466K16491M49985M46977M30753L21647r2878m97886l93463q8176
559b07650j47486k89362k11244q8505O6155J66800J58181K08902L10704J79263
549A45758j89817l63856l35788j66762J62514K47433r0085n38683q32314q15589
539b777189n89293j68402K60950N79894Q87736P58841K45426j42881k35956k6185
529a207059L05394M34175L37648j05529o64254p16271m08168j19101K33126M57651
519a452388L99946L22845K13693o8062k77888o8988L96996P49874O84760K49633
509A150421k17435n06341l75092M050L00095L95310K84776K40211K34071j34056
499A376010n95795o80131o85154o13794j68368K46601K40735j3426j58495j83074
$$ plain form
489 -1234891 -1619684 -2094544 -2281999 -2156228 -1828428 -1257352 -521928 197475 646018 476253
479 476253 -178508 -858099 -1327254 -1586669 -1582864 -1233125 -768080 -514781 -484728 -584261 -814372
468 -814372 -1129857 -1257815 -1071958 -880641 -847773 -963303 -1118487 -964896 -554760 -260327
458 -260327 -37173 276801 422673 29507 -698442 -1354661 -1902984 -2375079 -2658187 -2645809
448 -2645809 -2433428 -2134074 -1862520 -1721404 -1644392 -1618806 -1715647 -1761764 -1489361 -1014780
438 -1014780 -668189 -588462 -705724 -889791 -1059713 -924685 -375969 207238 547970 628864
428 628864 325815 -418371 -1339722 -1980769 -2227034 -2228127 -1972944 -1631287 -1387483 -1175933
418 -1175933 -875661 -502275 -298772 -394740 -635978 -855010 -1019799 -1197489 -1273385 -1155481
$$ packed form
489a234891l84793m74860j87455J25771L27800N71076P35424P19403M48543j69765
479D76253o54761o79591m69155k59415L805L49739M65045K53299L0053r9533k30111
468h14372l15485j27958J85857J91317L2868j15530j55184J53591M10136K94433
458b60327K23154L13974J45872l93166p27949o56219n48323m72095k83108J2378
448b645809K12381K99354K71554J41116P7012K5586r6841m6117K72403M74581
438a014780L46591P9727j17262j84067j69922J35028N48716N83207L40732Q0894
428F28864l03049p44186r21351o41047k46265j093K55183L41657K43804K11550
418a175933L00272L73386K03503r5968k41238k19032j64789j77690p5896J17904
$$ plain form
408 -1155481 -1224448 -1625051 -1970850 -2054526 -1916663 -1634462 -1298027 -921530 -518507 -168924
398 -168924 94690 137645 -83245 -346395 -462967 -325015 140747 790323 1266562 1352006
388 1352006 1115962 715231 428598 387339 446662 613773 930200 1172621 1029109 642832
378 642832 444148 479612 540745 464918 368185 378540 467327 532238 484839 269546 -159478
367 -159478 -793411 -1464936 -1879237 -1581795 -677697 207705 750447 835490 634995 470412
357 470412 384901 330936 323986 387254 442072 308062 -28813 -404514 -688409 -877166 -1083824
346 -1083824 -1523885 -2133030 -2474977 -2387024 -2235110 -2347787 -2566906 -2592931 -2336371 -1988397
336 -1988397 -1747432 -1514208 -1242964 -1112217 -1025162 -920653 -820896 -583486 -241463 -4022
$$ packed form
408a155481o8967m00603l45799q3676J37863K82201L36435L76497M03023L49583
398a68924K63614M2955k20890k63150j16572J37952M65762O49576M76239Q5444
388A352006k36044m00731k86633m1259N9323J67111L16427K42421j43512l86277
378F42832j98684L5464O1133p5827r6733J0355Q8787O4911m7399k15293m29024
367a59478o33933o71525m14301K97442R04098Q85402N42742Q5043k00495j64583
357D70412q5511n3965o950O3268N4818j34010l36875l75701k83895j88757k06658
346a083824m40061o09145l41947Q7953J51914j12677k19119k6025K56560L47974
336a988397K40965K33224K71244J30747Q7055J04509R9757K37410L42023K37441
$$ plain form
326 -4022 135771 286330 332754 72995 -424804 -818690 -923883 -825620 -777443 -1007587 -1358439
315 -1358439 -1463865 -1356866 -1379773 -1667670 -2039707 -2302566 -2309444 -2054416 -1632155 -1136683
305 -1136683 -622657 -45161 456554 511201 45789 -413245 -388774 -205150 -182893 -300490
295 -300490 -441503 -434046 -266937 -62126 51343 62754 -11720 -26269 282181 768857 1019996
284 1019996 1080719 1164330 1252576 1429733 1773455 2153097 2488466 2831045 3053391 3086456
274 3086456 2961042 2645766 2236402 1876557 1527499 1108125 560612 -36591 -444332 -642921
264 -642921 -678222 -544120 -467371 -532823 -490854 -232122 87183 240833 124315 -129430 -370910
253 -370910 -611306 -812034 -895368 -907524 -862970 -795894 -848669 -1111394 -1457928 -1779778 -2131758
$$ packed form
326d022J39793J50559M6424k59759m97799l93886j05193R8263M8177k30144l50852
315a358439j05426J06999k2907k87897l72037k62859o878K55028M22261M95472
305a136683N14026N77496N01715N4647m65412m59034K4471J83624K2257j17597
295c00490j41013P457J67109K04811J13469J1411p4474j4549L08450M86676K51139
284A019996O0723Q3611Q8246J77157L43722L79642L35369L42579K22346L3065
274C086456j25414l15276m09364l59845l49058m19374n47513n97203m07741j98589
264f42921l5301J34102P6749o5452M1969K58732L19305J53650j16518k53745k41480
253c70910k40396k00728q3334j2156M4554O7076n2775k62725l46534l21850l51980
$$ plain form
242 -2131758 -2547100 -2954843 -3240948 -3352202 -3327726 -3145788 -2711486 -2222220 -1906579 -1660780
232 -1660780 -1435580 -1321187 -1339924 -1479078 -1608574 -1531736 -1300140 -1157370 -1070472 -918231
222 -918231 -692493 -309833 182308 412981 104360 -585258 -1293901 -1766146 -1932058 -1788583
212 -1788583 -1500645 -1337783 -1282527 -1082037 -797530 -818815 -1168974 -1339981 -1108145 -803016
202 -803016 -584659 -286734 86617 418988 619675 636836 587267 487971 387950 360450 344623
191 344623 340566 364026 323912 91020 -252403 -515067 -666129 -773543 -874175 -1028581 -1429216
180 -1429216 -1912019 -2015451 -1777116 -1411098 -1059101 -835300 -645758 -501640 -593582 -891427
170 -891427 -1063736 -955640 -863601 -926061 -847795 -454767 25022 241664 202626 -4853 -242431
$$ packed form
242b131758m15342m07743k86105j11254K4476J81938M34302M89266L15641K45799
232a660780K25200J14393j8737j39154j29496P6838K31596J42770Q6898J52241
222i18231K25738L82660M92141K30673l08621o89618p08643m72245j65912J43475
212a788583K87938J62862N5256K00490K84507k1285l50159j71007K31836L05129
202h03016K18357K97925L73351L32371K00687J7161m9569r9296j00021k7500j5827
191C44623m057K3460m0114k32892l43423k62664j51062j07414j00632j54406m00635
180a429216m82803j03432K38335L66018L51997K23801J89542J44118r1942k97845
170h91427j72309J08096R2039o2460P8266L93028M79789K16642l9038k07479k37578
$$ plain form
159 -242431 -251822 -118937 -146333 -311476 -360751 -242098 16804 362007 616260 549386 156664
148 156664 -344088 -811829 -1174138 -1443110 -1604337 -1619010 -1623657 -1533830 -1205541 -820039 -464892
137 -464892 -260866 -384668 -714175 -1044231 -1227874 -1107698 -688045 -185010 188747 312739
127 312739 317304 313517 297915 229395 24259 -249967 -453528 -524543 -436202 -295298 -332918
116 -332918 -663853 -1172815 -1583835 -1822652 -1886452 -1695659 -1286328 -816587 -429479 -168567
106 -168567 35251 265537 551983 740261 614379 312128 112995 129221 280728 277306
96 277306 -42673 -654099 -1362184 -1937639 -2277087 -2435685 -2352513 -2006902 -1515037 -1106987
86 -1106987 -1020422 -1266034 -1680087 -2129114 -2546374 -2654671 -2426699 -2155896 -1921857 -1629737
$$ packed form
159b42431r391J32885k7396j65143m9275J18653K58902L45203K54253o6874l92722
148A56664n00752m67741l62309k68972j61227j4673m647Q9827L28289L85502L55147
137d64892K04026j23802l29507l30056j83643J20176M19653N03035L73757J23992
127C12739M565l787j5602o8520k05136k74226k03561p1015Q8341J40904l7620
116c32918l30935n08962m11020k38817o3800J90793M09331M69741L87108K60912
106a68567K03818K30286K86446J88278j25882l02251j99133J6226J51507l422
96B77306l19979o11426p08085n75455l39448j58598Q3172L45611M91865M08050
86a106987Q6565k45612m14053m49027m17260j08297K27972K70803K34039K92120
$$ plain form
76 -1629737 -1209252 -772127 -508528 -401281 -311410 -258568 -288925 -344139 -312157 -244575 -276303
65 -276303 -404237 -617619 -886304 -1052293 -963467 -632105 -262614 -22354 -29141 -383554 -856940
54 -856940 -1075638 -977266 -825274 -926436 -1315402 -1627179 -1670217 -1493358 -1218003 -923570
44 -923570 -603968 -294800 -77816 -50958 -135007 -180392 -237759 -426707 -718353 -906675 -1002251
33 -1002251 -1164977 -1370513 -1539890 -1646556 -1741149 -1858115 -1979586 -2013028 -1841177 -1488570
23 -1488570 -1055541 -713566 -579423 -625004 -747636 -885402 -1081104 -1327341 -1543134 -1526808
13 -1526808 -1250433 -892084 -518991 -204155 -94220 -191216 -287274 -250466 -229713 -365893 -584811
2 -584811 -845379 -1138948
$$ packed form
76a629737M20485M37125K63599J07247Q9871N2842l0357n5214L1982O7582l1728
65b76303j27934k13382k68685j65989Q8826L31362L69491K40260o787l54413m73386
54h56940k18698R8372J51992j01162l88966l11777m3038J76859K75355K94433
44i23570L19602L09168K16984K6858q4049m5385n7367j88948k91646j88322r5576
33a002251j62726k05536j69377j06666r4593j16966j21471l3442J71851L52607
23a488570M33029L41975J34143m5581j22632j37766j95702k46237k15793J6326
13a526808K76375L58349L73093L14836J09935r6996r6058L6808K0753j36180k18918
2e84811k60568k93569
$$ plain form
0 -1138948
$$ packed form
0a138948
$$ Imaginary data points
##PAGE= N=2
##DATA TABLE= (X++(I..I)), XYDATA
$$ plain form
16383 101729 -19622 -209642 -354919 -451223 -462615 -389626 -190890 124601 283100 159218
16373 159218 -96300 -315937 -399898 -343205 -209823 -77483 -26348 -107807 -320538 -569881
16363 -569881 -827196 -1111833 -1360876 -1448349 -1352652 -1147609 -871571 -543549 -311585 -287499
16353 -287499 -376133 -369337 -189832 18679 90232 64907 112602 265929 393099 363403 125811
16342 125811 -142373 -174956 71391 346878 382058 107964 -318369 -598299 -567460 -282579
16332 -282579 -28893 89991 180578 208752 114716 9593 -71109 -166682 -220709 -180553 -128231
16321 -128231 -180300 -380594 -643645 -815458 -832902 -694608 -347869 123249 576345 951374
16311 951374 1131278 1069511 790818 409793 116991 82242 292845 522026 702733 913368
$$ packed form
16383A01729j21351j90020j45277r6304j1392P2989J98736L15491J58499j23882
16373A59218k55518k19637q3961N6693J33382J32340N1135q1459k12731k49343
16363e69881k57315k84637k49043q7473R5697K05043K76038L28022K31964K4086
16353b87499q8634O796J79505K08511P1553k5325M7695J53327J27170k9696k37592
16342A25811k68184l2583K46347K75487L5180k74094m26333k79930L0839K84881
16332b82579K53686J18884R0587K8174r4036j05123q0702r5573n4027M0156N2322
16321a28231n2069k00294k63051j71813j7444J38294L46739M71118M53096L75029
16311I51374J79904o1767k78693l81025k92802l4749K10603K29181J80707K10635
$$ plain form
16301 913368 1085440 1116795 1034484 985915 961430 897888 721374 281034 -281573 -697755
16291 -697755 -936727 -1024184 -918074 -649790 -414274 -336707 -374297 -402788 -472485 -767967
16281 -767967 -1212398 -1410226 -1028908 -154740 813184 1480696 1763038 1855591 1803866 1607829
16271 1607829 1481791 1674686 2105582 2523740 2900282 3254062 3463089 3320430 2858188
16262 2858188 2347266 1868668 1451277 1360580 1649681 2035286 2334712 2617913 2884897 3040055
16252 3040055 3023926 2815288 2389736 1878898 1424182 1156039 1093111 1083678 1159345 1338909
16242 1338909 1456899 1477006 1512092 1483459 1260841 953541 678114 292904 -322747 -1019122
16232 -1019122 -1498051 -1603442 -1386890 -960335 -538754 -397447 -431634 -257999 286178 918145
$$ packed form
16301I13368J72072L1355q2311m8569k4485o3542j76514m40340n62607m16182
16291f97755k38972q7457J06110K68284K35516P7567l7590k8491o9697k95482
16281g67967m44431j97828L81318Q74168R67924O67512K82342R2553n1725j96037
16271A607829j26038J92895M30896M18158L76542L53780K09027j42659m62242
16262B858188n10922m78598m17391r0697K89101L85605K99426K83201K66984J55158
16252C040055j6129k08638m25552n10838m54716k68143o2928r433P5667J79564
16242A338909J17990K0107L5086k8633k22618l07300k75427l85210o15651o96375
16232a019122m78929j05391K16552M26555M21581J41307l4187J73635N44177O31967
$$ plain form
16222 918145 1128881 998595 1001797 1099029 981622 515391 -181668 -776480 -1161305 -1375774
16212 -1375774 -1414708 -1360423 -1426261 -1705911 -2115027 -2531089 -2837172 -2969562 -2783970 -2373565
16202 -2373565 -1967352 -1712581 -1754326 -2034163 -2304339 -2239761 -1864100 -1465629 -1139143 -1093284
16192 -1093284 -1349083 -1520658 -1515966 -1495874 -1594778 -1795530 -1938081 -1880550 -1459496 -721100
16182 -721100 150379 984692 1587127 1897934 2021161 1978388 1745134 1294373 530544 -321644
16172 -321644 -848572 -1079446 -1246020 -1404207 -1492375 -1259837 -757116 -301311 -4113 128209
16162 128209 202055 261448 212734 -14177 -417291 -808777 -1046865 -1063411 -890877 -688450
16152 -688450 -524426 -480361 -539956 -500735 -519984 -770300 -1176397 -1664781 -2072328 -2095618
$$ packed form
16222I18145K10736j30286L202R7232j17407m66231o97059n94812l84825k14469
16212a375774l8934N4285o5838k79650m09116m16062l06083j32390J85592M10405
16202b373565M06213K54771m1745k79837k70176O4578L75661L98471L26486M5859
16192a093284k55799j71575M692K0092r8904k00752j42551N7531M21054P38396
16182g21100Q71479Q34313O02435L10807J23227m2773k33254m50761p63829q52188
16172c21644n26928k30874j66574j58187q8168K32538N02721M55805K97198J32322
16162A28209P3846N9393m8714k26911m03114l91486k38088j6546J72534K02427
16152f88450J64024M4065n9595L9221j9249k50316m06097m88384m07547k3290
$$ plain form
16142 -2095618 -1667225 -1102366 -628500 -352633 -264354 -232552 -251235 -402235 -604516 -639245
16132 -639245 -436488 -121888 161983 481542 837528 945695 733727 481394 325747 196226
16122 196226 115046 58676 -33919 -144600 -225162 -365572 -542352 -569941 -496120 -388280 -100927
16111 -100927 199978 366814 648528 1050876 1333242 1414682 1229090 779670 283202 -113742
16101 -113742 -426063 -668993 -718599 -574209 -423665 -373865 -392266 -461194 -615783 -746452
16091 -746452 -845387 -954944 -873119 -441652 121040 495757 621104 657400 577351 275590
16081 275590 -71000 -293814 -434129 -553548 -649020 -555887 -193434 286949 703968 900309
16071 900309 844626 646181 468308 381724 435998 571396 607034 591139 672202 771690 701367
$$ packed form
16142b095618M28393N64859M73866K75867Q8279L1802j8683j51000k02281l4729
16132f39245K02757L14600K83871L19559L55986J08167k11968k52333j55647j29521
16122A96226q1180n6370r2595j10681q0562j40410j76780k7589P3821J07840K87353
16111a00927L00905J66836K81714M02348K82366Q1440j85592m49420m96468l96944
16101a13742l12321k42930m9606J44390J50544M9800j8401o8928j54589j30669
16091g46452r8935j09557Q1825M31467N62692L74717J25347L6296q0049l01761
16081B75590l46590k22814j40315j19419r5472R3133L62453M80383M17019J96341
16071I00309n5683j98445j77873q6584N4274J35398L5638j5895Q1063R9488p0323
$$ plain form
16060 701367 452520 134162 -91415 -124100 -60908 134449 401302 640346 882781 988771
16050 988771 819682 540635 297377 94457 -18579 -99440 -239933 -311934 -315576 -398757
16040 -398757 -446333 -404059 -430360 -503466 -475119 -528584 -816390 -1124149 -1277921 -1403174 -1607815
16029 -1607815 -1829896 -2093558 -2504980 -2932889 -2986610 -2556601 -2052642 -1731963 -1513549 -1250971
16019 -1250971 -966603 -812224 -816450 -787715 -586409 -237639 277231 858000 1124319 1029409
16009 1029409 900241 865222 942576 1089626 1150328 1097794 1001736 845018 455887 -256331
15999 -256331 -1043899 -1658556 -1922877 -1705356 -1119887 -492047 -28478 335219 644771 910453
15989 910453 1076888 1043707 934692 860095 811858 872980 1095522 1388194 1639919 1760979
$$ packed form
16060G01367k48847l18358k25577l2685O3192J95357K66853K39044K42435J05990
16050I88771j69089k79047k43258k02920j13036q0861j40493p2001l642q3181
16040c98757m7576M2274k6301p3106K8347n3465k87806l07759j53772j25253k04641
16029a607815k22081k63662m11422m27909n3721M30009N03959L20679K18414K62578
16019a250971K84368J54379m226K8735K01306L48770N14870N80769K66319r4910
16009A029409j29168l5019P7354J47050O0702n2534r6058j56718l89131p12218
15999b56331p87568o14657k64321K17521N85469O27840M63569L63697L09552K65682
15989I10453J66435l3181j09015p4597m8237O1122K22542K92672K51725J21060
$$ plain form
15979 1760979 1896167 2133341 2157878 1726693 1092850 604738 310853 154221 212154 501645
15969 501645 901597 1220148 1339056 1215950 930514 625133 405559 221312 502 -267837
15959 -267837 -685138 -1008016 -848907 -232253 581900 1271467 1647340 1927168 2139893 2146944
15949 2146944 2018838 1688382 1230089 919668 799939 825787 924188 959322 1004572 1222897
15939 1222897 1397842 1103376 328406 -539224 -1008837 -900259 -597357 -398987 -362342 -447695
15929 -447695 -380424 -126880 81304 208703 292401 241181 110462 23482 -5214 39716 45451
15918 45451 91316 333941 713862 1054916 1220086 1225211 1127668 869417 573922 527527 746311
15907 746311 869653 723573 608447 739602 1124677 1420770 1338646 971175 533848 294677
$$ packed form
15979A760979J35188K37174K4537m31185o33843m88112k93885j56632N7933K89491
15969E01645L99952L18551J18908j23106k85436l05381k19574j84247k20810k68339
15959b67837m17301l22878J59109O16654Q14153O89567L75873K79828K12725P051
15949B146944j28106l30456m58293l10421j19729K5848R8401L5134M5250K18325
15939A222897J74945k94466p74970q67630m69613J08578L02902J98370L6645q5353
15929d47695O7271K53544K08184J27399Q3698n1220j30719q6980k8696M4930N735
15918D5451M5865K42625L79921L41054J65170N125r7543k58251k95495m6395K18784
15907G46311J23342j46080j15126J31155L85075K96093q2124l67471m37327k39171
$$ plain form
15897 294677 198489 -203244 -996099 -1806189 -2351386 -2696847 -3017983 -3196292 -2892207 -2210353
15887 -2210353 -1527844 -1001871 -672655 -481636 -342686 -277012 -263410 -144016 121069 256212
15877 256212 49827 -448437 -1085966 -1789843 -2348802 -2654421 -2851571 -2922296 -2775632 -2445865
15867 -2445865 -2049729 -1591184 -974557 -93171 1033493 2146029 2781916 2772304 2388936
15858 2388936 1865653 1199661 600844 393164 535263 779366 862845 652752 216857 -315782
15848 -315782 -691494 -710895 -518795 -249999 103523 391945 469512 428564 186417 -433051
15838 -433051 -1338653 -2095791 -2080521 -1241644 -339980 16389 -237550 -719631 -982220 -985845
15828 -985845 -865244 -586501 -219802 -113955 -283182 -378987 -230459 14831 120858 109651
$$ packed form
15897B94677r6188m01733p92855q10090n45197l45461l21136j78309L04085O81854
15887b210353O82509N25973L29216J91019J38950O5674J3602J19394K65085J35143
15877B56212k06385m98264o37529p03877n58959l05619j97150p0725J46664L29767
15867b445865L96136M58545O16627Q81386J126664J112536O35887r612l83368
15858B388936n23283o65992n98817k07680J42099K44103Q3479k10093m35895n32639
15848c15782l75712j9401J92100K68796L53522K88422P7567m0948k42147o19468
15838d33051r05602p57138J5270Q38877R01664L56369k53939m82081k62589l625
15828i85845J20601K78743L66699J05847j69227r5805J48528K45290J06027j1207
$$ plain form
15818 109651 147734 108175 -199844 -700129 -1212397 -1575760 -1721904 -1838991 -1946700 -1910028
15808 -1910028 -1767642 -1650974 -1569021 -1427952 -1199552 -983727 -926448 -995581 -982242 -970759
15798 -970759 -1079958 -1110675 -911647 -716221 -547486 -18570 940896 1970744 2896704 3561848
15788 3561848 3714539 3517576 3259399 3012921 2768784 2510943 2126223 1555620 928528
15779 928528 371853 -53254 -180403 86116 547236 963761 1231691 1333328 1281549 1099754
15769 1099754 919876 849751 765868 590762 424016 490175 789081 1062543 1037379 713535
15759 713535 421569 371271 504694 733205 1063187 1553816 2150133 2663948 2935517 2854259
15749 2854259 2429113 1894935 1403133 937899 481484 -5462 -486643 -763851 -829452 -948340
$$ packed form
15818A09651L8083l9559l08019n00285n12268l63363j46144j17087j07709L6672
15808a910028J42386J16668Q1953J41069K28400K15825N7279o9133J3339J1483
15798i70759j09199l0717J99028J95426J68735N28916R59466J029848R25960O65144
15788C561848J52691j96963k58177k46478k44137k57841l84720n70603o27092
15779I28528n56675m25107j27149K66519M61120M16525K67930J01637n1779j81795
15769A099754j79878p0125q3883j75106j66746O6159K98906K73462k5164l23844
15759G13535k91966n0298J33423K28511L29982M90629N96317N13815K71569q1258
15749B854259m25146n34178m91802m65234m56415m86946m81181k77208o5601j18888
$$ plain form
15739 -948340 -1182318 -1357762 -1360077 -1247010 -914150 -358394 118536 303906 296061 332144
15729 332144 478446 582230 499115 203852 -6775 194419 734627 1346722 1932778 2384693
15719 2384693 2493693 2201835 1752244 1371159 1192270 1261318 1394330 1446398 1334893 1069499
15709 1069499 843840 801661 769766 661894 617220 528840 392249 575720 1131400 1604152
15699 1604152 1871311 2032554 1942043 1492821 777196 131523 -166576 -175109 -169395 -289680
15689 -289680 -553503 -853102 -1025636 -889172 -394732 187063 604385 661385 433503 201417
15679 201417 61202 99987 330895 477881 506123 557486 546005 448411 419430 576281 949903
15668 949903 1220251 1054550 649206 123692 -597569 -1182888 -1344396 -1258024 -1063168 -807842
$$ packed form
15739i48340k33978j75444k315J13067L32860N55756M76930J85370p845L6083
15729C32144J46302J03784q3115k95263k10627K01194N40208O12095N86056M51915
15719B384693J09000k91858m49591l81085j78889O9048J33012N2068j11505k65394
15709A069499k25659m2179l1895j07872m4674q8380j36591J83471N55680M72752
15699A604152K67159J61243r0511m49222p15625o45673k98099q533N714j20285
15689b89680k63823k99599j72534J36464M94440N81795M17322N7000k27882k32086
15679B01417j40215L8785K30908J46986K8242N1363j1481r7594k8981J56851L73622
15668I49903K70348j65701m05344n25514p21261n85319j61508Q6372J94856K55326
$$ plain form
15658 -807842 -608094 -499636 -526812 -767069 -1106220 -1327700 -1488989 -1735601 -1993504 -1932525
15648 -1932525 -1548891 -1172135 -845972 -502593 -155404 215660 606239 908503 944185 572574
15638 572574 -87504 -736662 -1272227 -1758616 -2099266 -2190724 -2064966 -1847722 -1722511 -1711173
15628 -1711173 -1684271 -1668535 -1757542 -1798922 -1563112 -1071125 -570439 -258425 -198399 -246477
15618 -246477 -241462 -351878 -667074 -997276 -1173773 -1184460 -1180177 -1351483 -1736013 -2134182
15608 -2134182 -2353201 -2425147 -2295858 -1955918 -1550515 -1284187 -1224359 -1104148 -941255 -874750
15598 -874750 -662002 -270561 78258 310386 453422 387228 74786 -196729 -227736 -129638
15588 -129638 -54187 39137 273645 663615 1085127 1531111 1902123 2068243 2068713 1949032
$$ packed form
15658h07842J99748J08458k7176k40257l39151k21480j61289k46612k57903O0979
15648a932525L83634L76756L26163L43379L47189L71064L90579L02264L5682l71611
15638E72574o60078o49158n35565m86389l40650r1458J25758K17244J25211J1338
15628a711173K6902J5736q9007m1380K35810M91987N00686L12014O0026m8078
15618b46477N015j10416l15196l30202j76497j0687M283j71306l84530l98169
15608b134182k19019p1946J29289L39940M05403K66328N9828J20211J62893O6505
15598h74750K12748L91441L48819K32128J43036o6194l12442k71515l1007R8098
15588a29638P5451R3324K34508L89970M21512M45984L71012J66120M70j19681
$$ plain form
15578 1949032 1774958 1626168 1573249 1581845 1455598 1153339 826004 650894 715936 910987
15568 910987 981100 927895 985232 1140087 1106573 847476 621745 499104 484276 417658 190298
15557 190298 -52982 -183231 -165936 70680 398662 556279 638293 912397 1336106 1782067
15547 1782067 2059922 2062248 2007403 2072178 2146687 2076353 1881597 1616318 1304376 1123135
15537 1123135 1119016 977202 475058 -151238 -543059 -522685 -95572 551256 1185633 1541033
15527 1541033 1563279 1416032 1242251 1089148 883170 441160 -337301 -1156820 -1633155 -1712770
15517 -1712770 -1546150 -1407865 -1558854 -1803822 -1877575 -1720892 -1380793 -1009803 -777274 -624350
15507 -624350 -372502 69023 591466 988652 1182171 1291965 1342567 1158426 768787 357419
$$ packed form
15578A949032j74074j48790n2919Q596j26247l02259l27335j75110O5042J95051
15568I10987P0113n3205N7337J54855l3514k59097k25731j22641j4828o6618k27360
15557A90298k43280j30249J7295K36616L27982J57617Q2014K74104M23709M45961
15547A782067K77855K326n4845O4775P4509p0334j94756k65279l11942j81241
15537A123135m119j41814n02144o26296l91821K0374M27113O46828O34377L55400
15527A541033K2246j47247j73781j53103k05978m42010p78461q19519m76335p9615
15517a712770J66620J38285j50989k44968p3753J56683L40099L70990K32529J52924
15507f24350K51848M41525N22443L97186J93519J09794N0602j84141l89639m11368
$$ plain form
15497 357419 132634 265772 618532 827156 573418 20977 -405774 -607208 -640146 -565838
15487 -565838 -328813 1131 143179 -49220 -453095 -779300 -875101 -859353 -1042588 -1487660
15477 -1487660 -1832695 -1858563 -1657336 -1438728 -1322068 -1277165 -1201919 -995582 -765668 -675298
15467 -675298 -568176 -300130 39387 242121 310368 378463 530862 767461 1026589 1151067
15457 1151067 1132619 1136365 1245284 1427397 1557685 1635834 1790995 1883487 1762938 1465533
15447 1465533 1055141 635067 398633 501778 887667 1342202 1635294 1702772 1745378 1903798
15437 1903798 2047361 2015849 1730170 1235520 739818 398047 242891 284334 447053 585985
15427 585985 506912 41017 -578355 -940813 -1041443 -1019280 -841467 -546992 -324179 -299575
$$ packed form
15497C57419k24785J33138L52760K08624k53738n52441m26751k01434l2938P4308
15487e65838K37025L29944J42048j92399m03875l26205r5801J5748j83235m45072
15477a487660l45035k5868K01227K18608J16660M4903P5246K06337K29914R0370
15467f75298J07122K68046L39517K02734O8247O8095J52399K36599K59128J24478
15457A151067j8448L746J08919J82113J30288P8149J55161R2492j20549k97405
15447A465533m10392m20074k36434J03145L85889M54535K93092O7478M2606J58420
15437A903798J43563l1512k85679m94650m95702l41771j55156M1443J62719J38932
15427E85985p9073m65895o19372l62458j00630K2163J77813K94475K22813K4604
$$ plain form
15417 -299575 -333212 -305296 -276939 -134136 222446 617452 800210 737617 570318 309000
15407 309000 -67207 -532988 -875235 -742425 -144693 527633 940495 997516 912495 910745
15397 910745 950146 916851 687086 302954 -40039 -187334 -187750 -55079 327003 783288
15387 783288 906702 604220 176185 -53192 -154474 -400482 -802294 -1158357 -1157717 -769132
15377 -769132 -284329 106237 318341 356168 548489 1050993 1480830 1534759 1345223 1120854
15367 1120854 914887 772003 668758 621266 762153 1063888 1296171 1238960 903859 590630
15357 590630 492575 583012 739713 832998 780899 609810 525878 761384 1241808 1724962
15347 1724962 2008371 1927888 1552646 1180106 883118 383033 -411885 -1179288 -1527439 -1424856
$$ packed form
15417b99575l3637K7916K8357J42803L56582L95006J82758o2593j67299k61318
15407C09000l76207m65781l42247J32810N97732O72326M12862N7021q5021j750
15397I10745L9401l3295k29765l84132l42993j47295m16J32671L82082M56285
15387G83288J23414l02482m28035k29377j01282k46008m01812l56063O40L88585
15377g69132M84803L90566K12104L7827J92321N02504M29837N3929j89536k24369
15367A120854k05967j42884j03245m7492J40887L01735K32283n7211l35101l13229
15357E90630r8055R0437J56701R3285n2099j71089q3932K35506M80424M83154
15347A724962K83409q0483l75242l72540k96988n00085p94918p67403l48151J02583
$$ plain form
15337 -1424856 -1128567 -784082 -373383 101388 470197 575354 349416 -195781 -825034
15328 -825034 -1140071 -1098560 -879226 -706078 -810227 -1081501 -1299773 -1361009 -1285499 -1051749
15318 -1051749 -652531 -249168 128823 582044 1076741 1536861 1858804 2075992 2222377
15309 2222377 2285075 2365337 2383727 2240941 1961908 1763000 1678903 1463711 1194342 1123923
15299 1123923 1173733 1140146 950814 614114 187150 -72823 100320 480201 782772 886444
15289 886444 681415 344624 119035 168229 418555 577270 546495 560006 771943 1058166
15279 1058166 1191880 1205066 1325246 1383444 1114495 689183 341358 -23744 -397917 -548170
15269 -548170 -478721 -416459 -422680 -451749 -495351 -559467 -622440 -635739 -515699 -228609 23137
$$ packed form
15337a424856K96289L44485M10699M74771L68809J05157k25938n45197o29253
15328h25034l15037M1511K19334J73148j04149k71274k18272o1236P5510K33750
15318a051749L99218M03363L77991M53221M94697M60120L21943K17188J46385
15309B222377O2698Q0262J8390j42786k79033j98908q4097k15192k69369p0419
15299A123923M9810l3587j89332l36700m26964k59973J73143L79881L02571J03672
15289H86444k05029l36791k25589M9194K50326J58715l0775J3511K11937K86223
15279A058166J33714J3186J20180N8198k68949m25312l47825l65102l74173j50253
15269e48170O9449O2262o221k9069m3602o4116o2973j3299J20040K87090K51746
$$ plain form
15258 23137 -70735 -397864 -498157 -258965 49617 197100 275616 459971 680052 799288
15248 799288 862684 1045989 1334228 1564365 1725385 1941604 2166733 2311302 2280815 2000004
15238 2000004 1652488 1514058 1524228 1197755 302567 -756781 -1496813 -1703933 -1369894
15229 -1369894 -843720 -425467 -140821 60749 385686 860629 1415439 2081386 2666417
15220 2666417 2962385 3056686 3096083 3037429 2733528 2347948 2174631 2230243 2288389 2237881
15210 2237881 2033717 1625735 1060402 429131 -88869 -311168 -272871 -201402 -259111 -385057
15200 -385057 -434958 -547998 -679175 -388924 353131 1149998 1764409 2332784 2872827 3181302
15190 3181302 3167717 2747823 2152717 1801004 1664151 1478986 1328375 1331381 1250819 738959
$$ packed form
15258B3137r3872l27129j00293K39192L08582J47483P8516J84355K20081J19236
15248G99288O3396J83305K88239K30137J61020K16219K25129J44569l0487k80811
15238B000004l47516j38430J0170l26473q95188j059348p40032k07120L34039
15229a369894N26174M18253K84646K01570L24937M74943N54810O65947N85031
15220B666417K95968R4301L9397n8654l03901l85580j73317N5612N8146n0508
15210B237881k04164m07982n65333o31271n18000k22299L8297P1469n7709j25946
15200c85057m9901j13040j31177K90251P42055P96867O14411N68375N40043L08475
15190C181302j3585m19894n95106l51713j36853j85165j50611L006q0562n11860
$$ plain form
15180 738959 -98495 -730403 -852315 -723960 -730878 -874362 -994662 -862340 -449915 67989
15170 67989 507362 722016 720431 542903 394570 572563 990276 1357193 1654223 1933466
15160 1933466 2059682 1834161 1257995 559283 -8018 -355586 -563021 -672013 -705948 -705890
15150 -705890 -529487 -128147 304210 527229 478834 325120 214214 78249 -223598 -649628
15140 -649628 -974058 -1080924 -1151251 -1366723 -1610980 -1579090 -1400692 -1437463 -1508763 -1179390
15130 -1179390 -635184 -347526 -389112 -469322 -440906 -247568 122638 578297 944163 1108572
15120 1108572 1183093 1208862 1107629 916457 592088 139795 -172754 -254521 -252732 -205036
15110 -205036 30073 447482 886628 1157194 1252161 1284017 1259813 1206037 1118551 943212
$$ packed form
15180G38959q37454o31908j21912J28355o918j43484j20300J32322M12425N17904
15170F7989M39373K14654j585j77528j48333J77993M17713L66917K97030K79243
15160A933466J26216k25521n76166o98712n67301l47568k07435j08992l3935N8
15150g05890J76403M01340M32357K23019m8395j53714j10906j35965l01847m26030
15140f49628l24430j06866p0327k15472k44257L1890J78398l6771p1300L29373
15130a179390N44206K87658m1586q0210K8416J93338L70206M55659L65866J64409
15120A108572P4521K5769j01233j91172l24369m52293l12549q1767J789M7696
15110b05036K35109M17409M39146K70566R4967L1856k4204n3776q7486j75339
$$ plain form
15100 943212 798028 852588 880178 806046 924866 1215737 1378329 1246153 874777 353768
15090 353768 -312363 -958337 -1290086 -1241253 -785993 -5542 814784 1399369 1676491 1708912
15080 1708912 1633728 1468731 1191656 859741 504892 -7516 -742974 -1374022 -1436703 -946601
15070 -946601 -171190 725082 1524881 1988526 2085068 1951144 1684003 1122859 314734 -258044
15060 -258044 -307645 -77882 -95932 -551030 -1102271 -1306802 -1067554 -507234 177448 826385
15050 826385 1390833 1845458 2080606 2000555 1784047 1408466 655006 -314536 -1033655 -1260693
15040 -1260693 -1063278 -694228 -240750 253526 351472 16482 -334039 -520809 -453134 -262578
15030 -262578 -301214 -616213 -984718 -1109514 -880303 -501417 -206263 -108129 -201273 -367979
$$ packed form
15100I43212j45184N4560K7590p4132J18820K90871J62592j32176l71376n21009
15090C53768o66131o45974l31749M8833M55260P80451Q20326N84585K77122L2421
15080A708912p5184j64997k77075l31915l54849n12408p35458o31048o2681M90102
15070i46601P75411Q96272P99799M63645R6542j33924k67141n61144q08125n72778
15060b58044m9601K29763j8050m55098n51241k04531K39248N60320O84682O48937
15050H26385N64448M54625K35148q0051k16508l75581p53460r69542p19119k27038
15040a260693J97415L69050M53478M94276R7946l34990l50521j86770O7675J90556
15030b62578l8636l14999l68505j24796K29211L78886K95154R8134r3144j66706
$$ plain form
15020 -367979 -480228 -321302 26938 295426 492580 811866 1176938 1290879 994820 427780
15010 427780 -160807 -708244 -1094299 -1208832 -1040709 -604530 -152914 -48715 -107830 10255
15000 10255 92029 93546 78569 -152620 -536360 -810791 -805606 -564435 -417922 -607794 -894692
14989 -894692 -899999 -485757 62482 390305 552687 633242 474776 59027 -269923 -228281
14979 -228281 62686 249275 90873 -131533 -90977 203499 692131 1228403 1673381 1996267
14969 1996267 2202597 2268241 2378835 2685026 3013193 3204312 3177098 2908394 2432702 1832714
14959 1832714 1157416 510349 82133 -42451 -29705 -122382 -342211 -578268 -779845 -1042923
14949 -1042923 -1382187 -1687380 -1832657 -1692984 -1180019 -500260 -118305 -124474 -93162 245812
$$ packed form
15020c67979j12249J58926L48240K68488J97154L19286L65072J13941k96059n67040
15010D27780n88587n47437l86055j14533J68123M36179M51616J04199n9115J18085
15000A0255Q1774J517j4977k31189l83740k74431N185K41171J46513j89872k86898
14989h94692n307M14242N48239L27823J62382Q0555j58466m15749l28950M1642
14979b28281K90967J86589j58402k22406M0556K94476M88632N36272M44978L22886
14969A996267K06330O5644J10594L06191L28167J91119k7214k68704m75692n99988
14959A832714o75298o47067m28216j24584J2746r2677k19829k36057k01577k63078
14949a042923l39264l05193j45277J39673N12965O79759L81955o169L1312L38974
$$ plain form
14939 245812 617345 798160 858105 773625 608279 455979 225302 -118349 -462251 -589542
14929 -589542 -412328 -212304 -267023 -492407 -557620 -368323 -41337 314597 484758 292075
14919 292075 -199454 -693434 -913271 -865809 -626755 -346699 -243717 -382481 -616560 -823233
$$ packed form
14939B45812L71533J80815N9945q4480j65346j52300k30677l43651l43902j27291
14929e89542J77214K00024n4719k25384o5213J89297L26986L55934J70161j92683
14919B92075m91529m93980k19837M7462K39054K80056J02982j38764k34079k06673
$$ [...]
##END NTUPLES=NMR SPECTRUM
##END=
