##TITLE=dept_DE-76k_NaOH CH-,CH3- -up, CH2- -down
 D2O, 1600 sc
 27.11.2024
##JCAMPDX= 6.0         $$ Bruker NMR JCAMP-DX V2.0
##DATA TYPE= NMR SPECTRUM
##DATA CLASS= NTUPLES
##ORIGIN= UXNMR, Bruker Analytische Messtechnik GmbH
##OWNER= root
$$ XWIN-NMR		Version 3.5
$$ Wed Nov 27 16:05:10 2024 Russian Standard Time (UT+4h)  she@DPX200
##.OBSERVE FREQUENCY= 50.327992884445
##.OBSERVE NUCLEUS= ^13C
##.ACQUISITION MODE= SIMULTANEOUS
##.ACQUISITION SCHEME= undefined
##.AVERAGES= 2135
##.DIGITISER RES= 17
##SPECTROMETER/DATA SYSTEM= spect
##.PULSE SEQUENCE= dept135
##.SOLVENT NAME= Acetone
##.SHIFT REFERENCE= (INTERNAL, Acetone, 0, 214.665)
##AUDIT TRAIL= $$ (NUMBER, WHEN, WHO, WHERE, WHAT)
$$ ##TITLE= Audit trail, XWIN-NMR		Version 3.5
$$ ##JCAMPDX= 5.01
$$ ##ORIGIN= Bruker BioSpin GmbH
$$ ##OWNER= she
$$ F:/spectra/data/she/nmr/depta/1/pdata/1/auditp.txt
$$ ##AUDIT TRAIL=  $$ (NUMBER, WHEN, WHO, WHERE, WHAT)
(   1,<2024-11-27 16:03:11.78 +0400>,<she>,<DPX200>,
      <created by zg, POWCHK disabled, PULCHK disabled
       terminated by command 'halt'
       configuration hash MD5:
       00 E9 B6 7A A2 85 ED C7 34 08 36 98 17 FE 4E 26
       data hash MD5: 16K
       9F 1B D8 96 BA D4 CB 14 36 F0 96 C7 7E 98 E0 B9>)
(   2,<2024-11-27 16:03:15.04 +0400>,<she>,<DPX200>,
      <Start of raw data processing
       efp BC_mod = 2 LB = 3.5 FT_mod = 6 PKNL = 1 PHC0 = -4523.144 PHC1 = -1670.8 SI = 16K 
       data hash MD5: 16K
       41 1B 4E A3 35 EB 92 66 CF AE 6B BB 55 D9 29 09>)
(   3,<2024-11-27 16:04:02.71 +0400>,<she>,<DPX200>,
      <pk PHC0 = -1.279575 PHC1 = -110.2 
       data hash MD5: 16K
       D0 D6 83 67 D6 AC CE 20 C2 CA A7 95 8D 8E 81 A4>)
(   4,<2024-11-27 16:04:38.64 +0400>,<she>,<DPX200>,
      <pk PHC0 = -0.0227289 PHC1 = 9.799982 
       data hash MD5: 16K
       8E F5 DC 3A DF C4 1E 48 A5 5B 1A 02 E3 D5 3A CC>)
$$ ##END=
$$ 
$$ hash MD5
$$ 5B C6 89 B1 2E BE 39 D2 75 77 B6 80 DB 58 CC 98
##$RELAX= 
##$RELAX= 
##$RELAX= 
##$RELAX= 
##$RELAX= 
##$RELAX= 
##$RELAX= 
##$RELAX= 
$$ Bruker specific parameters
$$ --------------------------
##$DU= <F:/spectra>
##$EXPNO= 1
##$NAME= <depta>
##$PROCNO= 1
##$TYPE= <nmr>
##$USER= <she>
##$AMP= (0..31)
100 100 100 100 100 100 100 100 100 100 100 100 100 100 100 100 100 100 
100 100 100 100 100 100 100 100 100 100 100 100 100 100 
##$AQSEQ= 0
##$AQ_mod= 1
##$AUNM= <au_zg>
##$AUTOPOS= <>
##$BF1= 50.322709
##$BF2= 200.13
##$BF3= 200.13
##$BF4= 200.13
##$BF5= 200.13
##$BF6= 200.13
##$BF7= 200.13
##$BF8= 200.13
##$BYTORDA= 1
##$CFDGTYP= 0
##$CFRGTYP= 5
##$CHEMSTR= <none>
##$CNST= (0..31)
1 1 145 1 1 1 1 1 1 1 1 1 1 1 1 1 1 1 1 1 1 1 1 1 1 1 1 1 1 1 1 1 
##$CPDPRG= <>
##$CPDPRG1= <waltz16>
##$CPDPRG2= <waltz16>
##$CPDPRG3= <>
##$CPDPRG4= <mlev>
##$CPDPRG5= <mlev>
##$CPDPRG6= <mlev>
##$CPDPRG7= <mlev>
##$CPDPRG8= <mlev>
##$CPDPRGB= <>
##$CPDPRGT= <>
##$D= (0..31)
0 2 0.003448276 0 0 0 0 0 0 0 0 0 2e-05 0 0 0 0 0 0 0 0 0 0 0 0 0 0 0 
0 0 0 0 
##$DATE= 1732703102
##$DBL= (0..7)
$$ [...]
##$SUBNAM2= <"">
##$SUBNAM3= <"">
##$SUBNAM4= <"">
##$SUBNAM5= <"">
##$SUBNAM6= <"">
##$SUBNAM7= <"">
##$SUBNAM8= <"">
##$SUBNAM9= <"">
##$SW= 219.3118970423
##$SWIBOX= (0..15)
0 1 3 0 0 0 0 0 0 0 0 0 0 0 0 0 
##$SW_h= 11037.527593819
##$TD= 16384
##$TD0= 1
##$TE= 0
##$TE2= 300
##$TE3= 300
##$TEG= 300
##$TL= (0..7)
120 120 120 120 120 120 120 120 
##$TP= (0..7)
150 150 150 150 150 150 150 150 
##$TP07= 0
##$TPNAME0= <>
##$TPNAME1= <>
##$TPNAME2= <>
##$TPNAME3= <>
##$TPNAME4= <>
##$TPNAME5= <>
##$TPNAME6= <>
##$TPNAME7= <>
##$TPOAL= (0..7)
0.5 0.5 0.5 0.5 0.5 0.5 0.5 0.5 
##$TPOFFS= (0..7)
0 0 0 0 0 0 0 0 
##$TUNHIN= 0
##$TUNHOUT= 0
##$TUNXOUT= 0
##$USERA1= <user>
##$USERA2= <user>
##$USERA3= <user>
##$USERA4= <user>
##$USERA5= <user>
##$V9= 5
##$VALIST= <valist>
##$VCLIST= <CCCCCCCCCCCCCCC>
##$VD= 0
##$VDLIST= <DDDDDDDDDDDDDDD>
##$VPLIST= <PPPPPPPPPPPPPPP>
##$VTLIST= <TTTTTTTTTTTTTTT>
##$WBST= 1024
##$WBSW= 2
##$XGAIN= (0..3)
0 0 0 0 
##$XL= 0
##$YL= 0
##$YMAX_a= 1652536
##$YMIN_a= -2621330
##$ZGOPTNS= <>
##$ZL1= 120
##$ZL2= 120
##$ZL3= 120
##$ZL4= 120
##$ABSF1= 0
##$ABSF2= 0
##$ABSG= 0
##$ABSL= 0
##$ALPHA= 0
##$AQORDER= 0
##$ASSFAC= 0
##$ASSFACI= 0
##$ASSFACX= 0
##$ASSWID= 0
##$AUNMP= <proc_1d>
##$AZFE= 0.1
##$AZFW= 0.1
##$BCFW= 0
##$BC_mod= 2
##$BYTORDP= 0
##$COROFFS= 0
##$CY= -3
##$DATMOD= 1
##$DC= 0
##$DFILT= <>
##$DTYPP= 0
##$F1P= 0
##$F2P= 0
##$FCOR= 0.5
##$FTSIZE= 16384
##$FT_mod= 6
##$GAMMA= 0
##$GB= 0
##$INTBC= 1
##$INTSCL= 0
##$ISEN= 128
##$LB= 3.5
##$LEV0= 0
##$LPBIN= 0
##$MAXI= 10000
##$MC2= 0
##$MEAN= 0
##$ME_mod= 0
##$MI= 0.4000791
##$NCOEF= 0
##$NC_proc= -1
##$NLEV= 6
##$NOISF1= 120.0001
##$NOISF2= 80.00006
##$NSP= 0
##$NTH_PI= 0
##$NZP= 0
##$OFFSET= 214.6655
##$PC= 4
##$PHC0= -4524.447
##$PHC1= -1771.2
##$PH_mod= 1
##$PKNL= yes
##$PPARMOD= 0
##$PSCAL= 0
##$PSIGN= 0
##$REVERSE= no
##$SF= 50.3227091
##$SI= 16384
##$SIGF1= 140
##$SIGF2= 120
##$SINO= 80
##$SIOLD= 32768
##$SREGLST= <13C.CDCl3>
##$SSB= 0
##$STSI= 16384
##$STSR= 0
##$SW_p= 11037.527593819
##$SYMM= 0
##$S_DEV= 0
##$TDeff= 16384
##$TDoff= 0
##$TI= <>
##$TILT= no
##$TM1= 0
##$TM2= 0
##$TOPLEV= 0
##$USERP1= <user>
##$USERP2= <user>
##$USERP3= <user>
##$USERP4= <user>
##$USERP5= <user>
##$WDW= 1
##$XDIM= 16384
##$YMAX_p= 31983931
##$YMIN_p= -294735562
$$ End of Bruker specific parameters
$$ ---------------------------------
##NTUPLES= NMR SPECTRUM
##VAR_NAME=  FREQUENCY,     SPECTRUM/REAL,   SPECTRUM/IMAG
##SYMBOL=    X,             R,               I
##VAR_TYPE=  INDEPENDENT,   DEPENDENT,       DEPENDENT
##VAR_FORM=  AFFN,          ASDF,            ASDF
##VAR_DIM=   16384,         16384,           16384
##UNITS=     HZ,            ARBITRARY UNITS, ARBITRARY UNITS
##FACTOR=    0.67371834180669, 1,            1
##FIRST=     10802.5493505904, 0,            0
##LAST=      -234.978243228581, 0,           0
##MIN=       -234.978243228581, -294735562,  0
##MAX=       10802.5493505904, 31983931,     0
$$ Real data points
##PAGE= N=1
##DATA TABLE= (X++(R..R)), XYDATA
$$ [...]
12722c321663j54315r4373q086j63353l1611P22490J457800J563646J352885P66540
12712B089960O7339j3088O8606k77649o74654n93426l75591m82605p50669p27392
12702a669169l04822p6539l30971o51833n07236r6597L62807O56916n7684r50123
12692c625251j026492q72212n73465q4654K44557K42008M8544K44398L76255L30339
12682d695973O01637O37895L33113R2727K20581P81305J229196R65279j07552
12673E8208r80340q00859J83042J001334P52413j0028m12313m54006l66771k15441
12663a244761j18650n93360j202287j123092l23713N03162P84571R48619J057291
12654a312220P02165K51011J29321L78134P64605Q57258M97937O7641n19878j109830
$$ plain form
12722 -3321663 -3475978 -3570351 -3578437 -3741790 -3773401 -3050911 -1593111 -29465 1323420 2089960
12712 2089960 2157299 2144211 2212817 1935168 1260514 667088 291497 -191108 -941777 -1669169
12702 -1669169 -1973991 -2050530 -2381501 -3033334 -3540570 -3637167 -3274360 -2617444 -2675128 -3625251
12692 -3625251 -4651743 -5523955 -6097420 -6182074 -5937517 -5695509 -5646965 -5402567 -5026312 -4695973
12682 -4695973 -4094336 -3456441 -3123328 -3030601 -2810020 -2028715 -799519 165760 58208
12673 58208 -922132 -1722991 -1539949 -538615 213798 203770 -208543 -662549 -1029320 -1244761
12663 -1244761 -1363411 -1956771 -3159058 -4282150 -4605863 -4102701 -3318130 -2369511 -1312220
12654 -1312220 -610055 -359044 -229723 148411 913016 1770274 2268211 2335852 1815974 706144
12644G06144j498169j638004j388501p24719K54033P26538N48278N20409Q13021
12635a680970N94718j12405q69754j148254r37903q33867r06493o37397l56142
12626f888467L843Q26132J653480J772631P43042j43311l57630p22840j050394
12617d163514p23349j64278O6090J32380J03972J62897M23747N38725O54471R37665
12607b031194R31828K21686m76806p77539o49330l68862O3830O97520J109964
12598a278903R72790L25550J72787N64553P27937O2720p25782n15542K16815O85515
12588A208440M32277m06733r01385q99762n76378j71998L57467R26416P72238
12579G40582l3439p53257r08549l50594M31386R19664J084021R32183N27666K1932
$$ plain form
12644 706144 -792025 -2430029 -3818530 -4543249 -4289216 -3562678 -3014400 -2493991 -1680970
12635 -1680970 -1086252 -1198657 -2068411 -3216665 -4154568 -4988435 -5894928 -6532325 -6888467
12626 -6888467 -6884624 -6058492 -4405012 -2632381 -1889339 -2032650 -2390280 -3113120 -4163514
12617 -4163514 -4886863 -5051141 -4985051 -4852671 -4748699 -4585802 -4162055 -3623330 -2968859 -2031194
12607 -2031194 -1099366 -877680 -1354486 -2132025 -2781355 -3150217 -3086387 -2388867 -1278903
12598 -1278903 -306113 19437 192224 756777 1484714 1547434 821652 306110 522925 1208440
12588 1208440 1640717 1233984 332599 -567163 -1143541 -1315539 -958072 -31656 740582
12579 740582 707143 -46114 -954663 -1305257 -873871 45793 1129814 2061997 2589663 2611595
12569B611595o63123q99570m75584j21893j73568l33744m43635k91552K52835
12560e38239L19691l94309r39363j159314j093056l42264L26785J72294l27418
12551c975193l55457K2862L98137N87364L96250Q8291q1177l06230o80534p90569
12541d696256l51341K67360O01920P78699J039832P28104M9125k16101J53032
12532a645626P46172J150107R67524N70079J69618n43166j455138k021274j920321
12523c982025j364441l60706Q53202J518135J330288M95368j28121J7377M20470
12514a200453K31341n37667p08974k09110N8240k99349n81770l90247k78782k13107
12504d129878Q5614M13372O98066O98016L42399R6672P5602P9411K3621k85957
$$ plain form
12569 2611595 1948472 1048902 573318 451425 277857 -55887 -499522 -791074 -538239
12560 -538239 -218548 -612857 -1552220 -2711534 -3804590 -4146854 -3820069 -3647775 -3975193
12551 -3975193 -4330650 -4307788 -3909651 -3322287 -2926037 -2837746 -2918923 -3225153 -3905687 -4696256
12541 -4696256 -5047597 -4780237 -4178317 -3399618 -2359786 -1631682 -1582557 -1798658 -1645626
12532 -1645626 -899454 250653 1218177 1788256 1957874 1414708 -40430 -2061704 -3982025
12523 -3982025 -5346466 -5707172 -4853970 -3335835 -2005547 -1510179 -1638300 -1620923 -1200453
12514 -1200453 -969112 -1506779 -2215753 -2424863 -2366623 -2665972 -3247742 -3637989 -3916771 -4129878
12504 -4129878 -4044264 -3630892 -2932826 -2234810 -1892411 -1795739 -1720137 -1640726 -1617105 -1903062
12494a903062n11387j18897O33915J064274R55931L51331j45627P0822O79921
12485A077221R10674L29246k68132l80263m16764n86354j96874M71409L23167
12476A263330k0517K07887L33228K84389L72392R3492l85228m93768k75264k36368
12466A143573n24287j013383j575583j811285j398700m72343M65366R05078R55467
12457c326097R01956P11786R8143l93034J41569Q26171R61443J105025J135801
12448B162763R80212L93810p22503j524509j869386k088953k000162j695868j477094
12439g841690p81871O24668J972537K556568K330726J790540Q86432J0336m66882
12430A081364q43921j077508p85551m06301j99679J90613N90171Q73520P67668
$$ plain form
12494 -1903062 -2414449 -2533346 -1899431 -835157 120774 472105 326478 397300 1077221
12485 1077221 1987895 2317141 2049009 1668746 1251982 665628 468754 940163 1263330
12476 1263330 1242813 1450700 1783928 2068317 2440709 2534201 2148973 1655205 1379941 1143573
12466 1143573 619286 -394097 -1969680 -3780965 -5179665 -5652008 -5186642 -4281564 -3326097
12457 -3326097 -2424141 -1712355 -1614212 -2007246 -1865677 -1039506 -78063 1026962 2162763
12448 2162763 3142975 3536785 2814282 1289773 -579613 -2668566 -4668728 -6364596 -7841690
12439 -7841690 -8623561 -7998893 -6026356 -3469788 -1139062 651478 1537910 1548246 1081364
12430 1081364 237443 -840065 -1625616 -2031917 -2231596 -2040983 -1450812 -577292 190376
12421A90376R0132n57310q81770o64497J45472P87401N36210K0109j67291m30130
12411i31298n56774j61564L04846J94880p25776j424907j222061q55672o95400
12402f073726k76688M14297P99290O48648K87556L2918m2804P8260J56679N1577
12392c923993R3940K56678L21150P54325J237409J346670J122240P45572K35399
12383B189390j99171n56264j286017j898492j668231j276885q78905l07213J99211
12374e682577K64572k6943M27558J219861J310948J221879J542354J424488K80660
12365A982800q29238r74508p17436l32208j42445j52405L20563O29939K55330
12356D0392k392N3674L47516Q36602J104550J073649P09623P058p86380j127314
$$ plain form
12421 190376 280508 -276802 -1158572 -1823069 -1677597 -890196 -353986 -333877 -501168 -931298
12411 -931298 -1488072 -1649636 -1344790 -1149910 -1875686 -3300593 -4522654 -5378326 -6073726
12402 -6073726 -6350414 -5936117 -5136827 -4488179 -4200623 -4167705 -4210509 -4132249 -3975570 -3923993
12392 -3923993 -3830053 -3573375 -3252225 -2497900 -1260491 86179 1208419 1953991 2189390
12383 2189390 1990219 1433955 147938 -1750554 -3418785 -4695670 -5574575 -5881788 -5682577
12374 -5682577 -5418005 -5444948 -5017390 -3797529 -2486581 -1264702 277652 1702140 1982800
12365 1982800 1153562 179054 -538382 -870590 -1013035 -1165440 -844877 -214938 40392
12356 40392 38000 91674 439190 1275792 2380342 3453991 4163614 4170672 3384292 2256978
12346B256978j264125j270005r69262p09958p12680p55499o44570o42247q86275
12337e597643j135202j138920p20112K08786J373065J855935J299653K19770m13209
12328d047877k14233J61396k11166r21260q95616l71277L8294M37336Q08681J184104
12318d031618J483849J222624L30113k97089l63260l74641n95633r53787j081094
12309d660536o49666P9279N19700M86141L20061M40912R45097J448968J410377
12300C40333R07649L36413o9547n86027r51901p40494k08070J81250N71651Q29185
12290F10442J097176J434155J252670K06439j160641j971473j875644j362849
12282a769725o81312N6626L94286N58882M91162K03959K51429K96701j08616o13139
$$ plain form
12346 2256978 992853 -277152 -1246414 -1956372 -2669052 -3424551 -4069121 -4711368 -5597643
12337 -5597643 -6732845 -7871765 -8591877 -8383091 -7010026 -5154091 -3854438 -3634668 -4047877
12328 -4047877 -4262110 -4100714 -4311880 -5233140 -6128756 -6500033 -6461739 -6024403 -5215722 -4031618
12318 -4031618 -2547769 -1325145 -995032 -1292121 -1655381 -2030022 -2625655 -3579442 -4660536
12309 -4660536 -5310202 -5230923 -4711223 -4225082 -3905021 -3464109 -2519012 -1070044 340333
12300 340333 1247982 1584395 1514848 928821 -23080 -763574 -971644 -790394 -218743 610442
12290 610442 1707618 3141773 4394443 4600882 3440241 1468768 -406876 -1769725
12282 -1769725 -2451037 -2394411 -2000125 -1441243 -950081 -746122 -494693 -197992 -306608 -919747
12272i19747o90574o14060o26533k81908J62616L18438L65617L14114l360o74787
12262b650184j447131j616592r92598j0426M48434L59708N36776O39465N79003
12253d153545L15203l24783q90793j019886o17700P6987P74801J216098J312843
12244c310775J172684J137028R04683L59114M8999k20328n35409m59612j08507
12235a012123K87695P70397P46626j5505p80484j049783p87532l24565k17339
12226b382613m06211o25062q85171j229233q27337L78682J328681J389302N81357
12217b677605j17040j0699M59148M00331k31795n14681j27861M47612L64670m73386
12207b481306o42899k4639L22305K90765J28708j92903l07891J44151N98921M51518
$$ plain form
12272 -919747 -1610321 -2224381 -2850914 -3132822 -2970206 -2651768 -2286151 -1972037 -1975397 -2650184
12262 -2650184 -4097315 -5713907 -6706505 -6716931 -6268497 -5908789 -5372013 -4732548 -4153545
12253 -4153545 -3838342 -4163125 -5053918 -6073804 -6691504 -6614517 -5839716 -4623618 -3310775
12244 -3310775 -2138091 -1001063 -96380 262734 311733 91405 -444004 -903616 -1012123
12235 -1012123 -724428 45969 792595 777090 -3394 -1053177 -1840709 -2165274 -2382613
12226 -2382613 -2788824 -3413886 -4299057 -5528290 -6355627 -5976945 -4648264 -3258962 -2677605
12217 -2677605 -2794645 -2805344 -2346196 -1945865 -2177660 -2692341 -2820202 -2372590 -2007920 -2481306
12207 -2481306 -3124205 -3148844 -2826539 -2535774 -2407066 -2599969 -2907860 -2763709 -2164788 -1713270
12197a713270L42941L85585J13658j83726P7326L83939j15559p26551q33560r48778
12187c217995q82511Q9469J016835J120039J006504R49443N49625m6892m72797
12178A11720m56450J71224P49401O59362K23083j62265l66574l32611l23380l58143
12168h4633l17470m73370q95855o79059M78593J570713K024432J529616L37987
12159C490954j17487J27285J15959k79724r22785r34676l20200L42066P60575
12150B261967K60210r14904j626282j703719j340665n04403K47853L42539j26607
12141c104011m93095o7300O97809P28588J43478l44345m97488o63828o53680l11273
12131d565145l22K51991O81689R73175P45156J61765L334K1086o00407j154630
$$ plain form
12197 -1713270 -1370329 -984744 -871086 -1054812 -977486 -593547 -709106 -1435657 -2269217 -3217995
12187 -3217995 -4100506 -4011037 -2994202 -1874163 -867659 81784 631409 584517 111720
12178 111720 -344730 -173506 575895 1235257 1458340 1296075 929501 596890 273510 -84633
12168 -84633 -402103 -875473 -1771328 -2450387 -1971794 -401081 1623351 3152967 3490954
12159 3490954 3373467 3500752 3616711 3336987 2414202 1479526 1159326 1501392 2261967
12150 2261967 2522177 1607273 -19009 -1722728 -3063393 -3567796 -3319943 -2977404 -3104011
12141 -3104011 -3597106 -3664406 -2966597 -2238009 -2094531 -2438876 -2936364 -3600192 -4253872 -4565145
12131 -4565145 -4565467 -4313476 -3631787 -2658612 -1913456 -1751691 -1748357 -1727271 -2327678 -3482308
12121c482308o66050J17842K28546J70750N01286P58401K94168n12222p97718
12112c387305n56318l61226p6431M58620M40648k80643q85310p90421j23630L83403
12102e178613O55512R07337J187217J428216J284525N76299L7748j55691l01130
12093D41420j18237K40088L52480J94787l08300j089047j489602j222692o19141
12084c618244M237N63837R89291J113628J105772Q00191L38477L75807M89183
12075B162179K30146o6137n4445J63311K67978K68160L00600o1057o22526p45315
12065A842894r44450j289144j202517q42792p27673p40771j18753O05260L62149
12056c055797k23913Q3479Q12288J110963R96569O73449M45518L71850M09465
$$ plain form
12121 -3482308 -4148358 -4030516 -3801970 -3631220 -3129934 -2371533 -2077365 -2589587 -3387305
12112 -3387305 -3943623 -4304849 -4381280 -3922660 -3482012 -3762655 -4647965 -5438386 -5562016 -5178613
12102 -5178613 -4523101 -3615764 -2428547 -1000331 284194 860493 898241 742550 441420
12093 441420 323183 563271 915751 1110538 802238 -286809 -1776411 -2999103 -3618244
12084 -3618244 -3614007 -3050170 -2060879 -947251 158521 958712 1297189 1672996 2162179
12075 2162179 2392325 2326188 2271743 2435054 2703032 2971192 3271792 3210735 2588209 1842894
12065 1842894 898444 -390700 -1593217 -2436009 -3163682 -3904453 -4023206 -3417946 -3055797
12056 -3055797 -3279710 -3196231 -2383943 -1272980 -276411 397038 842556 1214406 1623871
12047A623871J12337m04482l61729j19805K2229O51780J313312J100250K84303
12038D222066j57814J40268P06789R63964N73184m51012j329042j774717j939142
12029I54544j988135j684843r94162k86459L60100P18590M78755k06730m13767
12020c062107j36577k47520q66874j232237j216581p53687K11307Q60658R15193
12011e528425J035595J345038J412107Q65008J54691l46683o65484n13763k0819
12002b262735M11560M77462M44450M35163M10264L12250R9631j31130m57135q77249
11992a137469j028909o95633j99918J79938J39250p8838N66K63444K3123r33456
11982c467902j427663o32123O35423J021537N59891L00839P72178J541791J604320
$$ plain form
12047 1623871 1736208 1331726 969997 850192 872421 1524201 2837513 3937763 4222066
12038 4222066 4064252 4204520 4911309 5875273 6448457 5997445 4668403 2893686 954544
12029 954544 -1033591 -2718434 -3712596 -3999055 -3638955 -2920365 -2441610 -2648340 -3062107
12020 -3062107 -3198684 -3446204 -4313078 -5545315 -6761896 -7515583 -7304276 -6443618 -5528425
12011 -5528425 -4492830 -3147792 -1735685 -870677 -715986 -1062669 -1728153 -2241916 -2262735
12002 -2262735 -1851175 -1373713 -929263 -494100 -83836 228414 328045 196915 -260220 -1137469
11992 -1137469 -2166378 -2862011 -3061929 -2881991 -2742741 -2821579 -2821013 -2557569 -2534446 -3467902
11982 -3467902 -4895565 -5527688 -4892265 -3870728 -3310837 -3009998 -2237820 -696029 908291
11973I08291R95921P35018O94041K5630r59348j357956j330438j335538j109643
11964b734022l25808O76580J091952P95716J34980m86075m21719M24892J282207
11955D38703J315419N97999O8900J38634M09635L52230P4543p9452j21879n41548
11945B653184r50554n35243L1659j10144o79851q66509m93320J19867n4323p81526
11935a666760j294871j086970k64138M71076Q35228J014141Q48679L00181k228
11926h45662j8386J87896P02815J238890J048454P2312r14294j181293o74383
11917c83651j96803o0498J48497L83563L60654J84310J34866k55542q03322o31451
11907a119377m1719M39190Q44670J027094J075024R81576N42718l4078m64718
$$ plain form
11973 908291 1904212 2639230 3333271 3358901 2399553 1041597 -288841 -1624379 -2734022
11964 -2734022 -3059830 -2383250 -1291298 -495582 -360602 -846677 -1268396 -843504 438703
11955 438703 1754122 2352121 2421021 2559655 2969290 3321520 3396063 3316611 3194732 2653184
11945 2653184 1702630 1167387 1199046 1088902 409051 -457458 -950778 -830911 -885234 -1666760
11935 -1666760 -2961631 -4048601 -4312739 -3841663 -3006435 -1992294 -1143615 -843434 -845662
11926 -845662 -864048 -676152 26663 1265553 2314007 2386319 1472025 290732 -383651
11917 -383651 -580454 -640952 -492455 -108892 251762 436072 570938 315396 -487926 -1119377
11907 -1119377 -1161096 -721906 122764 1149858 2224882 3206458 3749176 3715098 3250380
11898C250380p36718q29247p93709p88415q03492m31880K59167R02436J184772
11889A213294P43828R803m91562o41744r33447j441136j364271p31277o3379L45685
11879c354206L22718J29314K8991j06686r0264j03674n81061p71043j68188N60914
11869d133185O97118L43791L01514M18379M75753J16960n07672m59177o9104J54249
11859b661374R7679k33554j77534L32924O89238N53733J13934k08780j18423L36199
11849a275958P86286R52392P51029J07381m89397k76570M74391R87255Q89869
11840B906678N96235P04838R90257J148007Q42179Q6921o35490r79228q72632
11831D787765l81968K70882O13273M30384J95597J11073j17876o88692j286132
$$ plain form
11898 3250380 2513662 1684415 890706 102291 -701201 -1133081 -873914 28522 1213294
11889 1213294 1957122 1966925 1475363 833619 -99828 -1540964 -2905235 -3636512 -3699891 -3354206
11879 -3354206 -3031488 -2902174 -2873183 -2979869 -3070133 -3173807 -3754868 -4525911 -4694099 -4133185
11869 -4133185 -3436067 -3092276 -2790762 -2372383 -1896630 -1779670 -2287342 -2746519 -2815623 -2661374
11859 -2661374 -2563695 -2797249 -2974783 -2641859 -1952621 -1398888 -1284954 -1493734 -1612157 -1275958
11849 -1275958 -489672 462720 1213749 1321130 831733 555163 1029554 2016809 2906678
11840 2906678 3502913 4207751 5198008 6346015 7188194 7275115 6639625 5660397 4787765
11831 4787765 4405797 4676679 5289952 5720336 5915933 6027006 5909130 5220438 3934306
11822C934306j167745m87243J60541L23081L42639M18139L15939J43325L5821
11813D018803k23536k94650j64681m87560j176983j472239j414693j074894m34812
11804b725245o8862K55333O84230Q39918P88156M29640m0516k84455l39240J09335
11794c51706P18465Q66331R10303J045779Q56660K09793l37014j48692K72584
11785D042503K19724l81122j136191j448185j285430p93103L1013O50923R13444
11776H13576J155759J255318J165270J060800O90618k78574j394170j855989j514992
11767A097616r04373l41291L3658J84371L47024P01095J106116J071228O59082
11758C954526J55217o62724j109234o12543L20841Q69780P65621N23703N29400
$$ plain form
11822 3934306 2766561 2279318 2439859 2762940 3105579 3523718 3839657 3982982 4018803
11813 4018803 3795267 3500617 3335936 2848376 1671393 199154 -1215539 -2290433 -2725245
11804 -2725245 -2794107 -2538774 -1854544 -1014626 -226470 203170 162654 -121801 -461041 -351706
11794 -351706 366759 1233090 2143393 3189172 4045832 4255625 3918611 3769919 4042503
11785 4042503 4262227 3881105 2744914 1296729 11299 -781804 -750791 -99868 813576
11776 813576 1969335 3224653 4389923 5450723 6141341 5862767 4468597 2612608 1097616
11767 1097616 193243 -148048 -114390 69981 417005 1118100 2224216 3295444 3954526
11758 3954526 4109743 3447019 2337785 1725242 2046083 2915863 3681484 4205187 4734587
11749D734587L82480K04823P4555p47740j774954j824588j343776o37306K48894
11740f83025M69890O63l69928k9258Q75909J369091R96832O71594P76826M09953
11730D488547n58034j442562j630956j606325j435747p59756k60559m53573q05186
11721d464151o49942j40802L48413M09080K70154K62005M72968P54106R58405
11712a779764O00542l7672q7572R74n77433p53660k0982Q28737J190961P90677
11702A54808J57085o2362K35950N81378L84048L28206O83860L45277l50914o61983
11692A795353o15000m81683m60442l10468J3769O89629J687297J888390J094362
11683E301207K12514k14477k03780J9818N6595k33763l26299j35281j5901l0972
$$ plain form
11749 4734587 5117067 5321890 5396445 4648705 2873751 1049163 -294613 -931919 -683025
11740 -683025 -213135 -212472 -582400 -611658 264251 1633342 2630174 3301768 4078594 4488547
11730 4488547 3930513 2487951 856995 -749330 -2185077 -2944833 -3205392 -3658965 -4464151
11721 -4464151 -5114093 -5254895 -4906482 -4497402 -4227248 -3965243 -3492275 -2738169 -1779764
11712 -1779764 -1179222 -1216894 -1304466 -1303492 -1880925 -2634585 -2655567 -1826830 -635869 154808
11702 154808 311893 249531 485481 1066859 1450907 1779113 2462973 2808250 2457336 1795353
11692 1795353 1180353 698670 238228 -72240 -58471 631158 2318455 4206845 5301207
11683 5301207 5513721 5299244 5095464 5115282 5171877 4938114 4611815 4476534 4460633 4429661
11673D429661m1337o5733n5025j43050l16535l47596R0209O66403O53268R0767
11663D961032l69247k55533J66424J85827j95641m88144o99326p18380m31463
11654B155549l68904l69426j69237n100P3885m9522k40769r3567L88860J013609
11644B335378J249861Q46742L18765p9156m34152p16529q43768j075423j229568
11635C72150n56355M95633R29844R92543Q98243N21078j82777j035787j093503
11626A341069n78072j06837L50950O50568N74182p9324q83617j422113j478960
11617a632154q37326K4556O22992R22803R74167R72498P36196M49353M10963J83827
11607B827875k54865k14503n6633k22889r8693O51377R70368J77768n92297p35406
$$ plain form
11673 4429661 4388324 4322591 4267566 4124516 3807981 3460385 3550594 4216997 4870265 4961032
11663 4961032 4591785 4336252 4502676 4688503 4492862 4004718 3305392 2587012 2155549
11654 2155549 1786645 1417219 1247982 1242882 1316767 1267245 1026476 932909 1321769 2335378
11644 2335378 3585239 4431981 4750746 4671590 4237438 3520909 2677141 1601718 372150
11635 372150 -184205 311428 1241272 2233815 3132058 3653136 3470359 2434572 1341069
11626 1341069 762997 656160 1007110 1657678 2231860 2152536 1268919 -153194 -1632154
11617 -1632154 -2469480 -2444924 -1821932 -899129 75038 1047536 1783732 2233085 2644048 2827875
11607 2827875 2573010 2358507 2301874 2078985 1980292 2631669 3602037 3779805 3187508 2452102
11597B452102p71606o78095q66607j292630j311187r06679j72291P09875J253603
11588a583515J082637K28958n01789o12967p7709M94237N41414R9523k95394L7797
11578e86808K60598j78687n85372k91537O00988J008798M65908j82446l47078
11569A64364k88114l31905n59215o21606m48730j96180J82314N15828Q62564R39615
11559B18935P09661K49441p5489k07089m68050n85143m18118j96613L7605K43573
11549d91287K14339q0263j34996J13701J61312r4695j42862K05525N77074Q55843
11539A183691Q88142N98905J61252j99970m12380n88337j157962k022041k270405
11530c819105j783201p77430M42268J368124J516988J019058Q13677R61633P93690
$$ plain form
11597 2452102 1680496 1002401 135794 -1156836 -2468023 -3374702 -3546993 -2837118 -1583515
11588 -1583515 -500878 -271920 -773709 -1386676 -1464385 -970148 -428734 -329211 -624605 -586808
11578 -586808 -326210 -504897 -1090269 -1381806 -780818 227980 693888 511442 164364
11569 164364 -123750 -455655 -1014870 -1636476 -2085206 -2281386 -2099072 -1583244 -720680 218935
11559 218935 928596 1178037 1102548 895459 427409 -157734 -575852 -772465 -734860 -491287
11549 -491287 -276948 -357211 -492207 -378506 -217194 -311889 -454751 -249226 327848 1183691
11539 1183691 2071833 2670738 2831990 2632020 2219640 1631303 473341 -1548700 -3819105
11530 -3819105 -5602306 -6379736 -5937468 -4569344 -3052356 -2033298 -1219621 -257988 535702
11521E35702P07136J048852R64130R2642r05915j143790q75967n08591n1559M07130
11511B69770P92508P65471J78702r7433k0452k58552k58247M04982J033262J049692
11501C859703M97156k24289o80473o20705J25298Q47804J123539Q59167K67057
11492F054257k90837n37903k41094J6006k82809o96642o54018n92293q48036j082785
11482H43846j106590j404981j475921o22246J93352M02897P90857Q35539N66945
11473i76302J097113J865040J781597O84774k70365k36233J34167P7969n62878
11464C594882q28598k22732J1900k15488k55673q7519k6041o7901K42349O49042
11454B794221O50714L8809q16252j126251p89308n46855n41773j97017M03814
$$ plain form
11521 535702 1242838 2291690 3255820 3348462 2442547 1298757 422790 -85801 -137360 269770
11511 269770 1062278 1827749 2006451 1909018 1888566 1630014 1371767 1776749 2810011 3859703
11501 3859703 4356859 4132570 3452097 2831392 2956690 3804494 4928033 5787200 6054257
11492 6054257 5763420 5225517 4984423 5000429 4717620 4020978 3366960 2774667 1926631 843846
11482 843846 -262744 -1667725 -3143646 -3765892 -3572540 -3169643 -2378786 -1543247 -976302
11473 -976302 120811 1985851 3767448 4452222 4181857 3945624 4079791 4157760 3594882
11464 3594882 2766284 2543552 2555452 2339964 2084291 1996772 1970731 1902830 2145179 2794221
11454 2794221 3444935 3483744 2667492 1541241 751933 205078 -336695 -533712 -129898
11445a29898R22012J148280R55169P27580P76191O93925O0857r90980j955794
11436B207342k182130j575028q78066r49924j285981p42878K57732R34837J032427
11427c181669P35897M80080L17470L80050M85564K40236J06304j2569l77799o90048
11417a516484j037231j344078j205336p49992p12151j221165j085656j84093L73411
11408h682775P06039J525072J938834J101449J92985K37541M91188K44928k86640
11399b531379o37068o73757m59762q422K18752L870j53501J30563N17575M85779
11389c107350J29384k8967K19170O84796R23494Q67286N53482Q1840p7198K42028
11379D87965N53595J9737q30477j404174j683531j373482j64693J146249J292366
$$ plain form
11445 -129898 792114 1940394 2895563 3623143 4399334 5093259 5154116 4163136 2207342
11436 2207342 25212 -1549816 -2427882 -3377806 -4663787 -5406665 -5148933 -4214096 -3181669
11427 -3181669 -2445772 -1965692 -1648222 -1268172 -782608 -542372 -436068 -448637 -826436 -1516484
11417 -1516484 -2553715 -3897793 -5103129 -5853121 -6565272 -7786437 -8872093 -9056186 -8682775
11408 -8682775 -7976736 -6451664 -4512830 -3411381 -3218396 -2980855 -2489667 -2244739 -2531379
11399 -2531379 -3168447 -3842204 -4301966 -4310388 -4091636 -4087766 -4241267 -4110704 -3593129 -3107350
11389 -3107350 -2977966 -3006933 -2787763 -2102967 -1179473 -312187 241295 323135 245937 487965
11379 487965 1041560 1061297 230820 -1173354 -2856885 -4230367 -4395060 -3248811 -1956445
11370a956445N82234k74958m16742J16871P06078R51560L77223k3622M23570P85729
11360A271498O31706L70857J08964l92236o83053m73951l19169k54982K22499
11351D82133O95865N62713J14322l40343o35595m98344j24288l97378j249886
11342a390801j569405r99581m43454l20369J9349L70051M75570O45307P99698
11333b413635R39486J113221J151470R64020N97324L54806O1728l71270n30842
11324A866308l78215l53387n42168p35458o68022j83922L59005L64834l5853l31704
11314f38582K0405P28791J067041R58346L66300k32028l64118j84411J2075p4819
11304A659000n65683q17300n19607L5888N02788K94509k78634o56177o82000k03006
$$ plain form
11370 -1956445 -1374211 -1649169 -2065911 -1949040 -1242962 -291402 85821 62199 485769 1271498
11360 1271498 1903204 2274061 2383025 1990789 1307736 833785 514616 259634 482133
11351 482133 1177998 1740711 1855033 1514690 879095 380751 256463 -140915 -1390801
11342 -1390801 -2960206 -3959787 -4403241 -4723610 -4704261 -4334210 -3858640 -3213333 -2413635
11333 -2413635 -1474149 -360928 790542 1754562 2351886 2706692 2768420 2397150 1866308
11324 1866308 1488093 1134706 592538 -142920 -810942 -994864 -635859 -271025 -306878 -638582
11314 -638582 -618177 110614 1177655 2136001 2502301 2270273 1906155 1721744 1733819 1659000
11304 1659000 1093317 276017 -243590 -207702 295086 589595 310961 -345216 -1027216 -1230222
11294a230222M08500M55900j17055o85120r70479r63266m33175N15202R48225
11285b071490N14272L9632j63146n47811n89223K73945J110057Q80836R0595j72553
11275f34886l926j16174r7460K48075O52303O74276j97209j123744q49307L74722
11265a073330J290389J624533J726972J591980J330108Q86768j30858j153627
11257F092935j402419j300727j250017r06398p27987m58870R1705K39739L1610
11248D09571N06247J235738J080947M38487J68197N88830J097409R70905P0411
11239F566742q01465o81151J77359Q57221R36375K85676k52731k62692l13167
11230F512167q38068j292004j218613j187269r69214l71403R8525N51567P55869
$$ plain form
11294 -1230222 -821722 -365822 -482877 -1167997 -2138476 -3101742 -3534917 -3019715 -2071490
11285 -2071490 -1557218 -1517586 -1680732 -2228543 -2817766 -2543821 -1433764 -552928 -462333 -634886
11275 -634886 -638812 -754986 -852446 -604371 47932 722208 524999 -598745 -1448052 -1073330
11265 -1073330 217059 1841592 3568564 5160544 6490652 7377420 7246562 6092935
11257 6092935 4690516 3389789 2139772 1233374 505387 46517 138222 377961 409571
11248 409571 915818 2151556 3232503 3670990 3839187 4428017 5525426 6496331 6566742
11239 6566742 5765277 5084126 5261485 6118706 7055081 7340757 7088026 6825334 6512167
11230 6512167 5674099 4382095 3163482 1976213 1006999 635596 734121 1285688 2041557
11221B041557M57041l2665l02044n16565m99110k25309j36269j07858l3098N7027
11211G02707K62664P34551J026745O48245L16393K24810m9656k95322k49366k55645
11201C066126n12502o68513n14581k35782l62856m27095n4882J98483L8257m49393
11191G7262n85838l52817k00422K48093M90402K22689M8278K80272K44517k97162
11181A75274o86982o87662m80514j33795j540j46255J3316L24547L46951M77903
11171g98757M97680M83975P53332Q98524R77276R21718L75827o90762j474877
11162A943936j095820j58672L40243K91230K86255Q82845J224217M79460m77825
11153C715869r54636q68726l73782K15252L14298J39018N19765J318843J750410
$$ plain form
11221 2041557 2498598 2465933 2163889 1647324 1148214 922905 786636 678778 645680 702707
11211 702707 965371 1699922 2726667 3374912 3691305 3916115 3866459 3571137 3321771 3066126
11201 3066126 2553624 1885111 1370530 1134748 771892 344797 289915 488398 526655 77262
11191 77262 -508576 -861393 -1061815 -813722 -323320 -100631 -52353 227919 472436 175274
11181 175274 -511708 -1199370 -1679884 -1813679 -1815219 -1961474 -1948158 -1623611 -1276660 -798757
11171 -798757 -301077 182898 936230 1834754 2812030 3733748 4109575 3418813 1943936
11162 1943936 848116 689444 1029687 1320917 1607172 2490017 3714234 4193694 3715869
11153 3715869 2761233 1892507 1518725 1733977 2048275 2187293 2707058 4025901 5776311
11144E776311J060806k25772j174033j470276j202307o94479k87738k60177m65202
11135A057133l02094M4664J53043M7402k08590k55268n78J97946K78470L52434
11125A364562M52807L40154l98209q92227k09794O51715P83409K98012m19026
11116A971403q01207n26696J62791Q50712P94576j66224r86328o50309K59587
11107I08305Q12792Q56858M34891k27084p16684q92357m58189n8708l68075p05049
11097d13300n39009K33777Q97869N79280j64246m88398j07966M44597O59751O20634
11087A722989N6889p26864p81196m00361m46577o11493o44808o07528j38040K60513
11077b316476N47892P04260M07260l7184l33601m20256k35239K60198N37629N19469
$$ plain form
11144 5776311 6837117 6611345 5437312 3967036 2764729 2070250 1782512 1522335 1057133
11135 1057133 755039 799703 952746 1000148 791558 536290 535712 733658 1012128 1364562
11125 1364562 1817369 2157523 1759314 867087 657293 1309008 2092417 2390429 1971403
11116 1971403 1170196 643500 806291 1657003 2451579 2285355 1299027 648718 908305
11107 908305 1721097 2577955 3012846 2785762 2069078 1176721 718532 659824 291749 -413300
11097 -413300 -952309 -718532 179337 758617 594371 105973 -1993 442604 1102355 1722989
11087 1722989 1779878 1053014 271818 -128543 -575120 -1186613 -1831421 -2438949 -2576989 -2316476
11077 -2316476 -1768584 -1064324 -657064 -694248 -1027849 -1448105 -1683344 -1423146 -885517 -366048
11067c66048K92409q8720j67509K31515P27559O86285O886m89827o26195m45929
11057b39574Q2029L11690q1161o88408q37740o72453n31047k10122K91405N44107
11047b031274L02897L20927O35536Q66460J381031J635729J071539K39518l88292
11038D034071n97184p44589j124227j336828j136395n89005L42921J097769J230682
11029A177215J128417J036114P96990M70402M45560O02840K97511j53046k37211
11020E564792k333J90822j56299n69229n32422n99530q38427p27200l97692j59998
11010A772484o8990J11512K73843K18299J72519L74905Q25345J094424P61232
11001E535573k24003r27802o61285r1579N8369l36158o28773l32048k13554o92938
$$ plain form
11067 -366048 -73639 -162359 -329868 -98353 629206 1315491 1322377 832550 206355 -239574
11057 -239574 -157545 154145 72984 -615424 -1453164 -2125617 -2656664 -2866786 -2575381 -2031274
11047 -2031274 -1728377 -1407450 -771914 94546 1475577 3111306 4182845 4422363 4034071
11038 4034071 3436887 2692298 1568071 231243 -905152 -1494157 -1151236 -53467 1177215
11029 1177215 2305632 3341746 4138736 4609138 5054698 5657538 5955049 5802003 5564792
11020 5564792 5562459 5753281 5596982 5027753 4495331 3895801 3057374 2330174 1932482 1772484
11010 1772484 1703494 1815006 2088849 2307148 2479667 2854572 3679917 4774341 5535573
11001 5535573 5311570 4383768 3722483 3630904 3689273 3353115 2724342 2392294 2178740 1485802
10991A485802q01417j15646N25344O21558J48350m37844l05585j08437k92172
10982G19953j85268K05000K16226l12980o90299n83308k15497k69030m33844P867
10972a541180N07109N61454P90189J178815J235091P73330J10132j42340O1973
10963C534573M32164L86858l82152j173726j158670j82644R84596J474622J381381
10954E297002R59282L57968j38401K30347J051016J170334N95045l78907j217070
10945G926616j795327j634141p48544J28476M12411j07978o34414o23218J28011
10936C051892P98141Q10357R18390J317401J382464P43846k7599m81955o91566
10927G821371q97809j136402j062198p63016m39009M9197L38881r5366n69217
$$ plain form
10991 1485802 684385 568739 1094083 1715641 1863991 1426147 1120562 1012125 719953
10982 719953 534685 739685 955911 642931 -47368 -630676 -846173 -1115203 -1549047 -1541180
10972 -1541180 -1034071 -472617 317572 1496387 2731478 3504808 3614940 3472600 3534573
10963 3534573 3966737 4353595 3971443 2797717 1639047 1456403 2440999 3915621 5297002
10954 5297002 6256284 6614252 6475851 6706198 7757214 8927548 9522593 9143686 7926616
10945 7926616 6131289 4497148 3748604 3877080 4289491 4181513 3547099 2923881 3051892
10936 3051892 3850033 4660390 5578780 6896181 8278645 9022491 8994892 8512937 7821371
10927 7821371 6923562 5787160 4724962 3961946 3522937 3572134 3911015 3815649 3246432
10918C246432l90995J10493L19228Q6165l40007n90979m58018j11028L99697J044765
10908C315753J432989J104647N88789L80951M95315N28315M9004n32688j336875
10899F026200j941842j571211n27986J87014J47061p2310r9678l40145n16106
10890A290997m34076l03487j17558P0215M95319P84673O14959O05318O27661K43618
10880C877639m16059r97672j379815j224426o54575k09890M6450O24354J314425
10871I80431J186357M94587q7480k82379J2038L16648J63405J9405J73065P9712
10861C055789k34813l44060m38912n70026l11890K19181K91026k97546o17048
10852G51701o14768l74342O5260N65052J092371J178035R54207O13083K85972
$$ plain form
10918 3246432 2855437 2965930 3285158 3371323 3031316 2440337 1982319 1871291 2270988 3315753
10908 3315753 4748742 5853389 6442178 6823129 7318444 7846759 7895763 7363075 6026200
10899 6026200 4084358 2513147 1985161 2172175 2319236 2246926 2147248 1807103 1290997
10890 1290997 856921 553434 435876 506091 1001410 1786083 2401042 3006360 3634021 3877639
10880 3877639 3461580 2463908 1084093 -140333 -794908 -1004798 -958348 -333994 980431
10871 980431 2166788 2661375 2573895 2291516 2303554 2620202 2783607 2803012 2976077 3055789
10861 3055789 2820976 2476916 2038004 1467978 1156088 1375269 1666295 1368749 751701
10852 751701 136933 -237409 -172149 392903 1485274 2663309 3617516 4230599 4516571
10843D516571K24677M2453j87198Q6030L16244j90882q59747q77619m56594q6605
10833B527330j26328r2791L4732j6740p9532j54403j34920j02179r9077j42174
10823A613918P4648N39643J201337K052861K329118J693841K59183j147448j649765
10814F967336j180317l17256J23631J60347J04061J15936N6250k02530n17854
10805E309604n62642j80168M13522J355931J926303J498840N30654k26995m92852
10796I572197p04864r85704r52277o94001q04775j096551j022337p07240j24070
10787B480378L55699L22331J04467j26035K15579J117948J418561N50976n83732
10778E856172q93153o82959p31559p91977k61290M77688Q16503M66960p3790o00782
$$ plain form
10843 4516571 4741248 4783701 4596503 4682533 4998777 4807895 3948148 3070529 2613935 2527330
10833 2527330 2401002 2308211 2342943 2326203 2246671 2092268 1957348 1855169 1756092 1613918
10823 1613918 1688566 2228209 3429546 5482407 7811525 9505366 9764549 8617101 6967336
10814 6967336 5787019 5469763 5593394 5753741 5857802 5973738 6029988 5827458 5309604
10805 5309604 4746962 4566794 4980316 6336247 8262550 9761390 10292044 10065049 9572197
10796 9572197 8867333 7881629 6929352 6235351 5430576 4334025 3311688 2604448 2480378
10787 2480378 2836077 3158408 3262875 3136840 3352419 4470367 5888928 6439904 5856172
10778 5856172 4963019 4280060 3548501 2756524 2495234 2972922 3789425 4256385 4182595 3581813
10768C581813j162233j452709j350777j076694n40252j60223l88888o43713k45256
10759c438932O85088J386095J391311J018723O90485N20540M10544K27813l74876
10750B516791q14183k72431K08812J77482L38577N55792M09605j16885n19784
10741B483776l93463J96781P26409Q60585K75108k44043k25313m36598o86534
10732B556708m08961K62661O43559N45732L04589p3557m56522n83812m41895q3700
10722B264802P9608n9184j88052j75737J41233O20746O44652N10144P53360J156126
10712E747698J178514P45117Q5127k79753l58620k02286J49502P7323m79789o67038
10702E995795n03584q77375j406824j307195j289731j324319p38538J44043O70833
$$ plain form
10768 3581813 2419580 966871 -383906 -1460600 -2000852 -2161075 -2549963 -3193676 -3438932
10759 -3438932 -2753844 -1367749 23562 1042285 1732770 2253310 2663854 2891667 2516791
10750 2516791 1702608 1430177 1638989 1816471 2155048 2710840 3120445 3003560 2483776
10741 2483776 2090313 2287094 3013503 3874088 4149196 3905153 3679840 3243242 2556708
10732 2556708 2147747 2410408 3053967 3599699 3904288 3830731 3374209 2790397 2348502 2264802
10722 2264802 2344410 2285226 2097174 1921437 2062670 2683416 3328068 3838212 4591572 5747698
10712 5747698 6926212 7671329 7756456 7476703 7118083 6915797 7065299 7142622 6662833 5995795
10702 5995795 5492211 4614836 3208012 1900817 611086 -713233 -1451771 -1307728 -636895
10693f36895P28207N33342K48111J42698R4398k1507O5257O25495J321697J213401
10683D314204M43599k22386m05163J31905Q20110Q78584K53700l61544m42494
10674E410515j90341L3184J62993K9923m23946p37654n81999r0217O8611j09349
10664C571720k85092k19404j6899J84091L94144K95564L02623Q24463J193777
10655F244987R34333K99311k22316k85310J32621M28230L37127J07032k15725
10646G760290o24399q58663o94447j52196L37555L68788J95374K99802O12373
10637G244477R62837J096300J187410J226584P10970O4850p70159j913870k751767
10628G057632k540843j189939P5226M447r66095j761783j521597n16360K79457
$$ plain form
10693 -636895 91312 624654 872765 1015463 1109861 1088354 1153611 1779106 3100803 4314204
10683 4314204 4757803 4535417 4130254 4262159 5082269 5960853 6214553 5853009 5410515
10674 5410515 5220174 5253358 5416351 5446274 5022328 4284674 3702675 3612458 3681069 3571720
10664 3571720 3286628 3067224 3050325 3234416 3628560 3924124 4226747 5051210 6244987
10655 6244987 7179320 7478631 7256315 6971005 7103626 7531856 7868983 7976015 7760290
10646 7760290 7135891 6277228 5582781 5430585 5768140 6136928 6332302 6632104 7244477
10637 7244477 8207314 9303614 10491024 11717608 12428578 12493428 11723269 9809399 7057632
10628 7057632 4516789 3326850 3402076 3406523 2440428 678645 -842952 -1359312 -1079855
10619a079855J57367p00455q73910R6352J267525K000248K160982K255474K289987
10610G573715J431716K44966n9780J9948l13519o78617q08100o63453o94183j094804
10600D957889r17359p0005O66957O26835K07631q1993m16649m51682j65609M01875
10590D757890O87959K11661k38740K29434R63892P84552n61929j610341j482023
10581C742355r62229n34699l46332K9930K60505k07142p63650q47056k68002P00637
10571H04317J315781J507222J381698O50015k64091n42401r4135Q35883J521843
10562G116132J299442M23644k23471o29892r66039j095989j063220q55615m98813
10553C506179l50302j21206L45780M26957J00166L45585R39953P59577L32533
$$ plain form
10619 -1079855 -922488 -1622943 -2496853 -2400501 -1132976 867272 3028254 5283728 7573715
10610 7573715 9005431 9250397 9190617 9210565 8897046 8218429 7410329 6746876 6052693 4957889
10600 4957889 4040530 3970525 4637482 5264317 5471948 5389955 4973306 4521624 4356015 4757890
10590 4757890 5445849 5657510 5418770 5648204 6612096 7396648 6834719 5224378 3742355
10581 3742355 2780126 2245427 1899095 1929025 2189530 1982388 1218738 371682 103680 804317
10571 804317 2120098 3627320 5009018 5659033 5394942 4852541 4758406 5594289 7116132
10562 7116132 8415574 8839218 8615747 7985855 7019816 5923827 4860607 4004992 3506179
10553 3506179 3155877 3034671 3380451 3807408 3907574 4253159 5193112 5952689 6285222
10544F285222N23073Q33964O63822K13893J82313J42734k13857j12158L27819
10535H846825K35733m81726j006324r63083o54458m04545l66565n93402n69733
10526D042722o3213N84226P79210L06231l63047o71060o66654l89996J31601M00592
10516D090612L83723P50076J106319J006945O62804n7436q53259r70150o61413
10507E458221k74824K00378O70350J068559J261948P40272m23195q92732n79881
10498G229096n89206j073585j329744q28489L6200L82506K70801N51079J169630
10489E818288R69057K5786o50217q79025q84279m75088J73807J003029J946451
10480G047809J935447N93570q20753j064716k12933N82790O63617K5473o86013
$$ plain form
10544 6285222 6808295 7642259 8306081 8519974 8702287 8845021 8631164 8519006 8846825
10535 8846825 9082558 8600832 7594508 6631425 5976967 5572422 5205857 4612455 4042722
10526 4042722 3979509 4563735 5342945 5649176 5286129 4615069 3948415 3558419 3690020 4090612
10516 4090612 4474335 5224411 6330730 7337675 8000479 7943043 7089784 6119634 5458221
10507 5458221 5183397 5383775 6054125 7122684 8384632 9124904 8701709 7808977 7229096
10498 7229096 6639890 5566305 4236561 3408072 3444272 3826778 4097579 4648658 5818288
10489 5818288 6787345 6813131 6162914 5283889 4399610 3924522 4098329 5101358 7047809
10480 7047809 8983256 9576826 8756073 7691357 7478424 8061214 8724831 8750304 8064291
10471H064291o61874j42705J41792o0978n74258q97152j011138q77145n22888
10462C457945k20042M37912Q73573O38706L56816M0873l36541q78879j611870
10453B758493j557940p00895K34233Q71989O83604j4093o31934j129788j068816
10444e55147k80509N34428J022713J401813J573651J011096K32548k11033k11611
10435D517949N3693R3638L52575R83038J145104P66325L56047r8573m66316q38647
10425F864833j239301j247901l78976O42777P58086L45169M44862O65458L51304
10416G206311k41521p44625j014124j015879q40358o69831o08137m53249l10785
10407A307802k40927k06035K5944N46947P89322M79200J40248J75419J19965j56816
$$ plain form
10471 8064291 7402417 7259712 7401504 7340526 6766268 5869116 4857978 3980833 3457945
10462 3457945 3237903 3675815 4549388 5188094 5544910 5585783 5249242 4370363 2758493
10453 2758493 1200553 499658 733891 1605880 2289484 2275391 1643457 513669 -555147
10444 -555147 -835656 -301228 721485 2123298 3696949 4708045 4940593 4729560 4517949
10435 4517949 4571642 4665280 5017855 6000893 7145997 7912322 8268369 8169796 7703480 6864833
10425 6864833 5625532 4377631 3998655 4641432 5399518 5744687 6189549 6855007 7206311
10416 7206311 6964790 6220165 5206041 4190162 3349804 2679973 2071836 1618587 1307802
10407 1307802 1066875 860840 886784 1433731 2223053 2702253 2842501 3017920 3137885 2981069
10397B981069k56514r252L95884O35231P14850O22003K78377j89647m41388k54663
10387D475950K39300L83142k7470n13119p69203r77570p99749m4631O02039R01737
10377C470426J330647J509940R74707Q07371J194010J040843J68861l87390j85586
10368I923829L12874L10034j02787n28845j212918j922817j577203m79569K24936
10359D947534N01876O62058K76074p28832j491954j624112j591345j148563J87206
10350a0058J560734J593699P77430J25641m22482o93400j24494N18631Q72986
10341D198687J288251J338840P13967k89518p60406n84598j19772K74418L82833
10332F442702N75632P03706K44813l25900m38181j28531P5183k14550o50276p93605
$$ plain form
10397 2981069 2724555 2715303 3111187 3746418 4461268 5083271 5361648 5172001 4730613 4475950
10387 4475950 4715250 5098392 5070922 4557803 3788600 2811030 2011281 1966650 2568689 3470426
10377 3470426 4801073 6311013 7285720 8093091 9287101 10327944 10496805 10109415 9923829
10368 9923829 10236703 10546737 10443950 9915105 8702187 6779370 5202167 4722598 4947534
10359 4947534 5449410 6111468 6387542 5658710 4166756 2542644 951299 -197264 -10058
10350 -10058 1550676 3144375 3921805 4047446 3624964 2931564 2807070 3325701 4198687
10341 4198687 5486938 6825778 7539745 7250227 6489821 5905223 5785451 6059869 6442702
10332 6442702 7018334 7722040 7966853 7640953 7202772 7074241 7149424 6934874 6284598 5490993
10322E490993m89126J67401N16041O71609N61566m1763r6551J60002J6500N240
10312F961912J80078J79580r5443p14834j079237q62481p62527j150008j659570
10303I97470j422453o09519j17402K82872P76987R59579O20376J86923M95897
10294B170730J254021J593505J516954J169458P67554N23283q3082p59982j012613
10285G139828j186176j290818j418154r16978P5177K77445j59107n68817m56076
10276A496324L0084L05038L97852N19035R94586J423378J388542R91239P25851
10267H271929N64784M0593m99005m84706J07633J90267l31424q41962p12506K54353
10257F559956O86222J61964k29649j00082J94277K92010K7398j43889N77715J496688
$$ plain form
10322 5490993 5001867 5169268 5685309 6356918 6918484 6876721 6780170 6940172 6956672 6961912
10312 6961912 7141990 7321570 7226127 6511293 5432056 4569575 3807048 2657040 997470
10303 997470 -424983 -1034502 -1151904 -869032 -92045 867534 1487910 1674833 2170730
10294 2170730 3424751 5018256 6535210 7704668 8472222 8995505 8912423 8152441 7139828
10285 7139828 5953652 4662834 3244680 2327702 2402879 2680324 2521217 1952400 1496324
10276 1496324 1526408 1831446 2229298 2748333 3742919 5166297 6554839 7546078 8271929
10267 8271929 8836713 8877306 8378301 7893595 8001228 8191495 7860071 7018109 6305603 6559956
10257 6559956 7246178 7408142 7178493 7078411 7272688 7564698 7592096 7448207 8025922 9522610
10247I522610J725713J195746p7102j101394j150845q89001j254136j771938j391423
10238D808230m61612l831J64918J0839k46493r5922K22245P24576J455659J730575
10228H309184J299155P17811N01723M8163r39298j491441j396847j101817o46494
10219E300139N6684M09927K01654o33960j439011j342260k89393Q27272R88068
10210D079120M58411M13198P31808P57883N75305O05510L56853l93040o53293
10201F931755J37510Q80372P29218L45287K98124L36414P660l60634k1407O00861
10191I885160K50790p67814j332037j114214l25692M41781R13527R63167M91424
10182I406092N4961j0788k52313r21007j439064j543058j108524o7098R43494
$$ plain form
10247 9522610 11248323 12444069 12366967 11265573 10114728 9225727 7971591 6199653 4808230
10238 4808230 4346618 4342787 4507705 4518544 4272051 4176129 4398374 5122950 6578609 8309184
10228 8309184 9608339 10326150 10827873 10876036 9936738 8445297 7048450 5946633 5300139
10219 5300139 5356823 5766750 5968404 5334444 3895433 2553173 2263780 3091052 4079120
10210 4079120 4537531 4950729 5682537 6440420 7015725 7621235 7978088 7585048 6931755
10201 6931755 7069265 7949637 8678855 9024142 9322266 9658680 9666340 9305706 9284299 9885160
10191 9885160 10135950 9368136 8036099 6921885 6596193 7037974 7951501 8914668 9406092
10182 9406092 9461053 9450265 9197952 8276945 6837881 5294823 4186299 4119201 5062695
10173E062695J184142R71905P01118K77703m55942q21181n10466K84517J304005
10164G998496J664369J148585L90611j05412j35417j26054n16665j009578j260994
10155H047941j653054j786441r49801L99198J067401Q77451O02763L29588q5595
10146F849451l28904k55961k78390n87025q61599p00354j78204J16408M31440
10137D206862Q02665P69707M19776L22815N12018P71801P57903L77837K19060
10128I160444L28869j49928j098534j382999p28461O4609L43950J42014m19708
10119F260256j163368j521751j100893n27001l1029N07982O80724J70366m41695
10110B833591p74163k05408J105771J660427Q90210k65768o88330p08593o83035
$$ plain form
10173 5062695 6246837 7218742 7919860 8197563 7741621 6920440 6409974 6694491 7998496
10164 7998496 9662865 10811450 11202061 11096649 10961232 10835178 10318513 9308935 8047941
10155 8047941 6394887 4608446 3658645 4057843 5125244 6002695 6605458 6935046 6849451
10146 6849451 6520547 6264586 5986196 5399171 4537572 3837218 3659014 3775422 4206862
10137 4206862 5009527 5779234 6199010 6521825 7033843 7805644 8563547 8941384 9160444
10128 9160444 9489313 9339385 8240851 6857852 6129391 6194000 6537950 6679964 6260256
10119 6260256 5096888 3575137 2474244 1947243 1916214 2424196 3104920 3275286 2833591
10110 2833591 2059428 1854020 2959791 4620218 5510428 5244660 4556330 3847737 3164702
10101C164702l19852j24725j88686j15114K84503P77752P57932K18689n6760L24254
10091D722695J091511J524524J015497j54717o86434l30953J64754k1002n82239
10082F743636p76675o44744n16178l35271j86368j44675L98735Q80699M54310
10073E873469l78412q31188r01913p36953n62084m47005m02579k37201K03258
10064A579392L34879r5933m72730k53343O55011J878553K413644K154788J279653
10055I473914M9608o08814n34466j89145j13992k57986p00213j096595p32476
10046E289835P4302O91781N83553K44640j16247n08688l31725M28604J042592
10037G398647O35317l86101p66257l38218M853j83053n96988q23638q31540n74228
$$ plain form
10101 3164702 2844850 2720125 2531439 2416325 2700828 3478580 4236512 4455201 4398441 4722695
10091 4722695 5814206 7338730 8354227 8199510 7513076 7182123 7346877 7325875 6743636
10082 6743636 5966961 5322217 4806039 4470768 4284400 4139725 4538460 5419159 5873469
10073 5873469 5495057 4663869 3761956 3025003 2462919 2015914 1613335 1376134 1579392
10064 1579392 1914271 1818338 1345608 1092265 1747276 3625829 6039473 8194261 9473914
10055 9473914 9523522 8914708 8380242 8191097 8077105 7819119 7118906 6022311 5289835
10046 5289835 5364137 6055918 6639471 6884111 6767864 6259176 5927451 6356055 7398647
10037 7398647 8033964 7647863 6881606 6543388 6548241 6365188 5768200 4944562 4113022 3538794
10027C538794J45569O51792J78175o61792j249066j366264p99603l69246n73590
10018e05231q62170q07198k82015K24428J28554j91763m23582p70941j297975
10009d787893k226632l090368l348573l270314l551578m345023n463903p572200
10001c7656484j0581459j3698733j7592607k2957417k9453574l6553074m1815305
9994b10308653m0591579l0474184j3361146N901871K1051146K9337615L2919783
9987b05525147L2725721K9343313K4911782K0746194J7043313J3874801J1094052
9980e5785971Q557598O169781M021846K723875K580981K643540J750377J68206
9972b7169767j460008l000158m851174p375771r966493j1950822j3414535j3863523
$$ plain form
10027 3538794 3684363 4336155 4514330 3852538 2603472 1237208 437605 68359 -505231
10018 -505231 -1367401 -2174599 -2456614 -2232186 -2103632 -2295395 -2718977 -3489918 -4787893
10009 -4787893 -7014525 -10104893 -13453466 -16723780 -20275358 -24620381 -30084284 -37656484
10001 -37656484 -48237943 -61936676 -79529283 -102486700 -131940274 -168493348 -210308653
9994 -210308653 -250900232 -281374416 -294735562 -288833691 -267782545 -238444930 -205525147
9987 -205525147 -172799426 -143456113 -118544331 -97798137 -80754824 -66880023 -55785971
9980 -55785971 -47228373 -41058592 -37036746 -34312871 -31731890 -29088350 -27337973 -27169767
9972 -27169767 -28629775 -31629933 -36481107 -43856878 -53823371 -65774193 -79188728 -93052251
9964i3052251j2210701q691727m420933k59699L561289O921119R076801R774288
9956h9301814R899622J0077881R874567R118295P521216N387182L731760K818459
9948c0872832K016360R16372m08114j812709k101933q96994J165356K906752L265635
9939b5822107K542530J753614R65499J51417L06839P48851M60481j52971q93969
9930a9939816j889887k920143l604421m355903n135069n384320n460556n571746
9922e4261861n305112m888083n286428p479057j0828150j3633343j6226958j9595822
9914a37504814k2520848k1847564j5370516m727332P064630J7079787K2046411
9907a55780246K1829719J9151444J6336080J3921781J1816995R669992P267126
$$ plain form
9964 -93052251 -105262952 -113954679 -118375612 -118635311 -115074022 -108152903 -99076102 -89301814
9956 -89301814 -79402192 -69324311 -59449744 -50331449 -42810233 -37423051 -33691291 -30872832
9948 -30872832 -28856472 -27940100 -28348214 -30160923 -32262856 -33159850 -31994494 -29087742 -25822107
9939 -25822107 -23279577 -21525963 -20560464 -20409047 -20102208 -19353357 -18892876 -19045847 -19939816
9930 -19939816 -21829703 -24749846 -28354267 -32710170 -37845239 -43229559 -48690115 -54261861
9922 -54261861 -59566973 -64455056 -69741484 -77220541 -88048691 -101682034 -117908992 -137504814
9914 -137504814 -160025662 -181873226 -197243742 -201971074 -194906444 -177826657 -155780246
9907 -155780246 -133950527 -114799083 -98463003 -84541222 -72724227 -63054235 -55787109
9900e5787109M919435K727414R97995J273805L857189O117392O485320O021498
9892b3387061N494781M512071L433861K922788K639511K284834J754026J412096
9884A066907J345726J375849J019869M02485M6918k83227m66914m54814o34160
9875C418639r38642j029643r80974m80082J79024J69764j94225p70900j039459
9866a666498m78408L46449O28170N34962N42960M00832L04499R22102J706755
9857C241823J833349J489875Q72021N4698n82840o58601n02748m39886l29172
9848D978519l1890J06425K96687O57478P02869P36928R20509P63769L99477L7260
9838I568031n08366j054574j221365j200044j115125p82479l94774K29492R90371
$$ plain form
9900 -55787109 -50867674 -48140260 -47142265 -45868460 -42011271 -35893879 -29408559 -23387061
9892 -23387061 -17892280 -13380209 -9946348 -7023560 -4384049 -2099215 -345189 1066907
9884 1066907 2412633 3788482 4808351 5210836 5257754 4974527 4507613 4052799 3418639
9875 3418639 2479997 1450354 469380 -10702 168322 338086 143861 -627039 -1666498
9866 -1666498 -2144906 -1798457 -1170287 -635325 -92365 308467 612966 1535068 3241823
9857 3241823 5075172 6565047 7437068 7491766 6908926 6250325 5747577 5307691 4978519
9848 4978519 4946629 5053054 5349741 6007219 6710088 7447016 8367525 9131294 9530771 9568031
9838 9568031 9059665 8005091 6783726 5583682 4468557 3686078 3291304 3520796 4511167
9829D511167J408847J123557L70502o57609k068035k922922k349806j208324p00014
9820b492637m8416R18563J663192K248255K208718J243246J55784k65842n51790
9811E079073p28601l49106J25315L11731J30403k32949n04243k97392J03869L0765
9801C668865j96189j57115O5899N44373J081060R18828N34339L93683K2167q76245
9791E999665j521301j347701p74575j25548K50487N4968l23753l41094J39879
9782B011027N32748O31351P92933P05975K18847m41948q34025p41940m20107o8420
9772B386441J68165J83540K95068N54319Q56834J010458Q20326J94450l90991
9763F078610l40488K12790P45781K18441q70826r83929l95676j53960o28338j122752
$$ plain form
9829 4511167 5920014 7043571 7414073 6756464 4688429 1765507 -584299 -1792623 -2492637
9820 -2492637 -2541053 -1622490 40702 2288957 4497675 5740921 5896705 5630863 5079073
9811 5079073 4350472 4001366 4126681 4438412 4568815 4335866 3831623 3534231 3638100 3668865
9801 3668865 3472676 3315561 3381460 3925833 5006893 5925721 6460060 6853743 6875910 5999665
9791 5999665 4478364 3130663 2356088 2230540 2481027 2535995 2212242 1871148 2011027
9782 2011027 2543775 3175126 3968059 4674034 4892881 4450933 3616908 2874968 2454861 2386441
9772 2386441 2554606 2738146 3033214 3587533 4444367 5454825 6275151 6469601 6078610
9763 6078610 5738122 5950912 6696693 6915134 6044308 5060379 4664703 4510743 3882405 2759653
9753B759653q72166k60302P090j13954k62797j30598R4768L15787M87795Q90495
9743B915771J445166J893040J814859R04400m30967j204292q50929k37813k44342
9734F004893l08844K69136J131636J533825J211008M65514k12849o06780o25293
9725H862246m41216l69496l52887m52297n58599r5431N96359M86522k28003m34635
9715G012563r7355J18649N776K8719O07614P78491j35703r11118m74495K34500
9705G167641N84295O64427L94934q4103n56549p76275p57747o63445p29656j033313
9695D210209j044264o18330n13326p82252n83523K14365Q19003P44834O50795
9686C097511Q01181J025710J195066J254015J121011R21615Q62135K41092q55377
$$ plain form
9753 2759653 1887487 1627185 1634275 1520321 1257524 1126926 1221694 1537481 2025276 2915771
9743 2915771 4360937 6253977 8068836 8973236 8542269 7337977 6487048 6249235 6004893
9734 6004893 5696049 5965185 7096821 8630646 9841654 10307168 10094319 9487539 8862246
9725 8862246 8421030 8051534 7698647 7246350 6687751 6592320 7188679 7675201 7447198 7012563
9715 7012563 6915208 7033857 7039633 7068352 7675966 8454457 8318754 7407636 6933141 7167641
9705 7167641 7751936 8416363 8811297 8727194 8170645 7394370 6636623 5973178 5243522 4210209
9695 4210209 3165945 2547615 2034289 1252037 668514 882879 1701882 2446716 3097511
9686 3097511 3898692 4924402 6119468 7373483 8494494 9416109 10278244 10519336 9663959
9677I663959j372114j054657k52734M48942O55506L56199l2555n52015j552014
9668F308517j969536j381868q05961p95540j056316q45714j84524L72961P71025
9659D13044J158491Q87344j21547p50597m74160K6950L2911j98296k06509j0897
9649G56734M03529J042312J419713J085967M26236k42092o36596p53634o60795
9640B841374j79856P33954J439360J280483K92430n25190l50892N93168J304536
9631G429367J319210Q77075J41421n51502j155817j777007k066736j711559j039393
9622A465059r7257Q17087J424934J516585J131848O62806M46694J11984n88603
9613F891137q80996k40233O01550R12124P28658J56838k73978j9375P2917m19245
$$ plain form
9677 9663959 8291845 7237188 6984454 7433396 8088902 8445101 8412546 7860531 6308517
9668 6308517 4338981 2957113 2151152 1355612 299296 -546418 -730942 -357981 413044
9659 413044 1571535 2458879 2337332 1586735 1112575 1139525 1172436 974140 767631 756734
9649 756734 1160263 2202575 3622288 4708255 5134491 4892399 4255803 3502169 2841374
9640 2841374 2661518 3395472 4834832 6115315 6407745 5882555 5531663 6124831 7429367
9631 7429367 8748577 9625652 9767073 9215571 8059754 6282747 4216011 2504452 1465059
9622 1465059 1367802 2184889 3609823 5126408 6258256 6921062 7367756 7479740 6891137
9613 6891137 6010141 5769908 6371458 7283582 8012240 8169078 7895100 7875725 7948642 7529397
9603G529397p55733q73091p95180m30076n65194o63001N4145J117484K344996
9594F963747L053930K412174R51769J37987k7978L6652k5007k65101k46630L7083
9584A3028626J50343j35183n62644p59524o33893l59362J5499K51837j07327p43182
9574A0145190r75296j189327q20761L31160R44516Q50396K65813m86970p31911
9565H332810n27527k91078n13900p28517n02596l70691o56414q67905j30840J209968
9555D953310J847130J378067L96398k62556m97965p31198r44023j253046j470838
9546C415279j035733k8040R23595J251533J189055O70369m0182l62287m43256
9537E540333l07186j10493k89973l65560K51633Q95912J197397J087043P82033
$$ plain form
9603 7529397 6773664 5900573 5105393 4675317 4110123 3447122 3501267 4618751 6963747
9594 6963747 10017677 12429851 13381620 13519607 13491629 13528281 13503274 13238173 12991543 13028626
9584 13028626 13178969 13043786 12481142 11721618 11087725 10728363 10743862 10995699 10888372 10145190
9574 10145190 9169894 7980567 7159806 7490966 8435482 9285878 9551691 9064721 8332810
9565 8332810 7805283 7514205 7000305 6271788 5769192 5398501 4742087 3874182 3743342 4953310
9555 4953310 6800440 8178507 8574905 8312349 7814384 7083186 6139163 4886117 3415279
9546 3415279 2379546 2351506 3275101 4526634 5715689 6386058 6345876 5983589 5540333
9537 5540333 5233147 5122654 4832681 4467121 4718754 5614666 6812063 7899106 8681139
9528H681139P37037L92092p70309j712398j407408k46745M69918O47748R31981
9519G723055J124644J036854O59960l6937m75248j55643M01332K13589l17462
9510A0174144l29590j56595k17840o02886j021268j220560r74121o51575m33142
9501D566567K59285R32660Q46634K39005k56154j42237J46560J87534J12919j9314
9491F873459l26331l67919k5115r4282m81117m66713l36873o12469p75405l39691
9481C047544K31063N92843N24408j13481p65725q49899p06637o88037k72651P23071
9471A722499J576912J565488R01806L92512L90518N27882N76568R74956J455305
9462A0084446J146875M62543j76418p69004j447669k022764j748723p86478J53242
$$ plain form
9528 8681139 9418176 9810268 9039959 7327561 5920153 5673408 6143326 6791074 7723055
9519 7723055 8847699 9884553 10544513 10507576 10032328 9876685 10278017 10491606 10174144
9510 10174144 9844554 9687959 9470119 8867233 7845965 6625405 5651284 4999709 4566567
9501 4566567 4825852 5758512 6605146 6844151 6587997 6445760 6592320 6779854 6892773 6873459
9491 6873459 6547128 6179209 6154094 6059812 5578695 5111982 4775109 4162640 3387235 3047544
9481 3047544 3278607 3871450 4395858 4282377 3516652 2666753 1960116 1272079 999428 1722499
9471 1722499 3299411 4864899 5766705 6159217 6549735 7077617 7654185 8629141 10084446
9462 10084446 11231321 11693864 11517446 10748442 9300773 7278009 5529286 4742808 4896050
9453D896050N48322P41465R64131R12452M30824l25630n61797j23377K31241M39039
9443H152720M65624L4069o16218j243178j341548p43960Q4674L33213K42802N41778
9433E909976O75513K82012J03125J89232J62686j00301n60793q45975p97101n91652
9423D426722l76669n50051p33405p91095o96799j34152M12276R47925J584586
9414D089338J729375J655465J870424J751413J098769L32090m90944j415451j878898
9405H741581j309074l57169J16912L03064M46161M35134L31608J37785l44852
9396H501150j011784j366191j038549m69767p5007j31740o09968r07360l99933
9387B490851J11392L3636j39858l16156m50958l80029j42178K40657N83838J127343
$$ plain form
9453 4896050 5444372 6185837 7149968 8062420 8493244 8167614 7605817 7482440 7713681 8152720
9443 8152720 8618344 8652413 8036195 6793017 5451469 4707509 4792183 5125396 5368198 5909976
9433 5909976 6585489 6867501 6970626 7159858 7322544 7222243 6661450 5815475 5018374 4426722
9423 4426722 4050053 3500002 2766597 1975502 1278703 1144551 1556827 2504752 4089338
9414 4089338 5818713 7474178 9344602 11096015 12194784 12526874 12035930 10620479 8741581
9405 8741581 7432507 7075338 7192250 7495314 7941475 8376609 8708217 8846002 8501150
9396 8501150 7489366 6123175 5084626 4614859 4539852 4408112 3798144 2890784 2490851
9387 2490851 2602243 2635879 2496021 2179865 1728907 1348878 1206700 1447357 2031195 3158538
9377C158538J465706J226280Q29335M04377r9020m83493m65553m18784n45554
9368E071832n21469m03461m92572q43416q70742j59538O86644P03358L49238L37178
9358C857052M00950L90772R9978m07720p27940o87014m38712l08466m14500l09216
9348A455184K66227P90338R50186O74366K79723N32986J314808J847589J392730
9339I504137K76913o41443j047622j065931q07254n90011o02491q94361j208123
9330B923814j164712m84489O30117J515797J761740J210751P03446N17183L13132
9321G926779K47939j40887q45112j501499j577436j007276j57889J071841J687286
9312E703746R19104q6584j97253M95697J105000J238015R41025M41146k28335
$$ plain form
9377 3158538 4624244 5850524 6679859 7084236 6985216 6501723 6036170 5617386 5071832
9368 5071832 4550363 4146902 3654330 2810914 1940172 1780634 2467278 3170636 3519874 3857052
9358 3857052 4258002 4648774 4748752 4341032 3613092 2926078 2487366 2178900 1764400 1455184
9348 1455184 1721411 2511749 3461935 4136301 4416024 4949010 6263818 8111407 9504137
9339 9504137 9781050 9139607 8091985 7026054 6218800 5628789 5026298 4131937 2923814
9330 2923814 1759102 1274613 1904730 3420527 5182267 6393018 7096464 7613647 7926779
9321 7926779 8174718 8033831 7188719 5687220 4109784 3102508 2944619 4016460 5703746
9312 5703746 6622850 6536266 6339013 6834710 7939710 9177725 10118750 10559896 10331561
9303A0331561m60570m24933o33165q71103o55762j96383j67699m50913l25459
9294F145574q4037m66764p07316l62204L06560P29407O01221J13011l95548p39578
9284E140326n80855K62255J113366J575663J488508Q87661k46152j252995j358965
9275G028812j025378m93119K29874R69537P57181k75739m48952K54832R23521
9266G920569J172341R19792J02713o71676l50348K27184L39776K91046k08562
9257I742835j071785j400729j107030m43810P8144R8929n9022Q249K50729J36759
9247F233269k12769j38166M7308L48751P12870Q64064P51167K93943l11996o59791
9237G928650o97543l58225j89259l39194k67599k2001L29578Q14465R23408L34992
$$ plain form
9303 10331561 9870991 9446058 8812893 7941790 7286028 7089645 6921946 6471033 6145574
9294 6145574 6061537 5594773 4887457 4525253 4831813 5561220 6162441 6275452 5879904 5140326
9284 5140326 4559471 4821726 5935092 7510755 8999263 9886924 9640772 8387777 7028812
9275 7028812 6003434 5510315 5740189 6709726 7466907 7191168 6742216 6997048 7920569
9266 7920569 9092910 10012702 10115415 9443739 9093391 9320575 9660351 9951397 9742835
9257 9742835 8671050 7270321 6163291 5719481 5797625 5896554 5837532 5845781 6096510 6233269
9247 6233269 6020500 5882334 5929642 6278393 6991263 7855327 8606494 8900437 8588441 7928650
9237 7928650 7231107 6872882 6683623 6344429 6076830 6054829 6384407 7198872 8122280 8457272
9227H457272k87659k82562L42420P42476M88866j93950r62895j225764r46844
9218F131360p60824q44689p99954m50322L1717M18593L44168m96k6038K17225
9208D260740K22508j10021m18817n12379o26370p05771k49288P65906J225506
9199C852014J081089O56500J0802m70712n13992p9648P08883Q99135O2650q89169
9189E317552j122963r22046p56203n30610n67754r77854r19880k7585R93282J552257
9179B038196J675108J414256J149407J084072J027503O51802r1404r05949j130735
9170F912256o67328l57448n63860r96621r78981k8034J031704J199416P51513
9161F302617L96848K73060L6399l31585q66760j219703j352359j454084j077307
$$ plain form
9227 8457272 8169613 7887051 8229471 8971947 9460813 9266863 8303968 7078204 6131360
9218 6131360 5370536 4525847 3725893 3275571 3307288 3725881 4070049 4069553 4043515 4260740
9208 4260740 4483248 4373227 3954410 3442031 2815661 2109890 1860602 2626508 3852014
9199 3852014 4933103 5589603 5600405 5129693 4615701 4536053 5244936 6144071 6206721 5317552
9189 5317552 4194589 3272543 2516340 1985730 1417976 440122 -479758 -507343 485939 2038196
9179 2038196 3713304 5127560 6276967 7361039 8388542 9040344 8948940 8042991 6912256
9170 6912256 6244928 5887480 5323620 4326999 3348018 3319984 4351688 5551104 6302617
9161 6302617 6699465 6972525 7008924 6677339 5810579 4590876 3238517 1784433 707126
9152G07126k1888R29555J189034J66709j217713j579845q04276L59962J327012
9143A055676J582934J230272P80447j13306q62744p93635m40765k00719J68007
9134B406167Q25339R07769K90065m54262q22342l57107l3957q9531K15827N27541
9124C415509L61003n8637n88997q63456o79264o228N19884K72111m59701p66694
9114A145530n49080l52696m13038p86432q80514j97893J013602K010496J885265
9105B875240P74564k25743o12895n34347o96485q09668k40450M96603P59001N97610
9095B383430M39768K14800j47839k99262j57084K66687Q45393R94374O86086M64007
9085E690360J19115m56501o29300m19019o71638j052800o10943k08102l44757
$$ plain form
9152 707126 685238 1614793 2803827 2970536 1752823 172978 -631298 -271336 1055676
9143 1055676 2638610 3868882 4649329 4536023 3673279 2879644 2438879 2238160 2406167
9134 2406167 3231506 4139275 4429340 3975078 3152736 2795629 2761672 2672141 2887968 3415509
9124 3415509 3776512 3717875 3128878 2265422 1586158 1579930 2099814 2371925 1912224 1145530
9114 1145530 596450 243754 -169284 -955716 -1836230 -2034123 -1020521 989975 2875240
9105 2875240 3649804 3424061 2811166 2276819 1580334 770666 530216 1026819 1785820 2383430
9095 2383430 2823198 3037998 2890159 2590897 2433813 2700500 3545893 4540267 5226353 5690360
9085 5690360 5809475 5352974 4723674 4304655 3633017 2580217 1969274 1761172 1416415
9076A416415j73346K16839J04119k47549j13536N23804R37589Q97877J081976
9067D644188J083943O28320R9237o68998j022307n24366j43975k57769l56603
9058C481670m64011m47022K19574J157037J264699N87431l85744j114307j257768
9049C041559r89036j05004R68620J363104J437829J244896N36630Q9752J85146
9040G773496L26431M84810O14203P41300Q45674L51579k68449k13083l1857k54133
9030A0369971o09115q15999r32519p56072o02603p48871j074523j248199r17265
9021B664805n92295n42689j21781N21917J10135j069607j407050q05227l81740
9012a623532Q5939Q47052J159530J213560J082643M93981L8614l1391j55591k06318
$$ plain form
9076 1416415 1243069 1459908 1564027 1316478 1202942 1726746 2664335 3562212 4644188
9067 4644188 5728131 6356451 6455688 5786690 4764383 4240017 4096042 3838273 3481670
9058 3481670 3017659 2570637 2790211 3947248 5211947 5799378 5413634 4299327 3041559
9049 3041559 2052523 1947519 2916139 4279243 5717072 6961968 7498598 7588350 7773496
9040 7773496 8099927 8584737 9198940 9940240 10785914 11137493 10869044 10655961 10624104 10369971
9030 10369971 9760856 8944857 8012338 7256266 6653663 5904792 4830269 3582070 2664805
9021 2664805 2072510 1529821 1408040 1929957 2040092 970485 -436565 -1241792 -1623532
9012 -1623532 -1537593 -690541 468989 1682549 2765192 3259173 3297787 3266396 3110805 2904487
9002B904487N9236K41641L01101K75378N67104J008019J090168Q16905M94501
8993G758540K98295r3033q15976j233101r99682p57584o36990j84078M65662P55664
8983D557717P11658R16911R12396R9121q35829j113022o29931M91182J674655
8974F784858J652285P66434J7724l55098m27893p12059j013035o81675k61190
8965E770351l77341p23472n96773p9720J19900N0348q2101l22389n55574l84078
8955B819151J59381K98317j26296o80148q93474n80809l00434m80018n94898l75286
8945g54514k42722j63477k45381n03147n71337j19192N12737P07943O02420M20760
8935c55910M44586N41102N53390O02309L74276J73601p6978o69825j067445q34731
$$ plain form
9002 2904487 2963723 3205364 3506465 3781843 4348947 5356966 6447134 7264039 7758540
8993 7758540 8056835 7963802 7147826 5914725 4915043 4157459 3520469 3336391 3802053 4557717
8983 4557717 5269375 6186286 7098682 7197803 6361974 5248952 4619021 5110203 6784858
8974 6784858 8437143 9203577 9221301 8866203 8438310 7726251 6713216 6031541 5770351
8965 5770351 5393010 4669538 4072765 3993045 4112945 4163293 4081192 3758803 3203229 2819151
8955 2819151 2978532 3276849 3150553 2470405 1576931 996122 695688 215670 -379228 -754514
8945 -754514 -997236 -1160713 -1406094 -1909241 -2480578 -2599770 -2087033 -1379090 -776670 -355910
8935 -355910 88676 629778 1183168 1785477 2159753 2333354 2256376 1586551 519106 -315625
8925c15625k44891L9974l3471k05804o06531n97343K87419J200426J396372R37324
8915A857850K18548l80995q09520p39415j84979K84828N14683P48048J232922
8906B741970J645971J234387P2866p75528r11593p28847n65825o14209n95759
8897A503433j09893O33663R49804O29018J16112P9307K97167j7388n65439q83927
8887B631857o29571M38099J053992O56120J62087J97137J13411o07693j429994
8878B585445j677204r60086K66988J042397M58145m64702k98577M52436P92773
8869B197615Q37974Q94954N83655k24171k92209P6792O7234k00934m20067j26791
8859C394052K55531L73609M17934L69205L11354L09127K30476Q7703j69186l91707
$$ plain form
8925 -315625 -560516 -520542 -554013 -759817 -1366348 -1963691 -1676272 -475846 920526 1857850
8915 1857850 2076398 1695403 885883 146468 -38511 246317 761000 1509048 2741970
8906 2741970 4387941 5622328 5695194 4919666 4008073 3279226 2713401 2099192 1503433
8897 1503433 1393540 2027203 2977007 3606025 3722137 3801444 4098611 4081223 3515784 2631857
8887 2631857 2002286 2440385 3494377 4150497 4312584 4509721 4623132 4015439 2585445
8878 2585445 908241 -51845 215143 1257540 1715685 1250983 952406 1404842 2197615
8869 2197615 3035589 3930543 4514198 4290027 3997818 4074610 4141844 3940910 3520843 3394052
8859 3394052 3649583 4023192 4441126 4810331 5121685 5430812 5661288 5748991 5579805 5188098
8849E188098l48316j74803J39543L22405K89845L0860n14975p46756m47774J34472
8839C872599M79327M55010K56841j30344j30706M37122O12551K80773L23160N20753
8829F977086N13476M60643K01343m06234p56281p96890p09466l82890L6145L47331
8819E484263O18468O16216L04526P7524j03356n59848j073911j263504j274092
8810B826286j029809o22102k30363K33825N55530M08571L70626Q62595J144968
8801D520127J95570j200463j619841n07653O72785M68021k12454n6065M74787
8792B734814M55754K12645l3385k5789L70475N74537L70224L93M2309O59056Q95613
8781F256646N10026K97505L32958K14170l46714q18326q04856q53151r18099o43061
$$ plain form
8849 5188098 4839782 4664979 4804522 5126927 5416772 5447632 4932657 4185901 3738127 3872599
8839 3872599 4351926 4806936 5063777 4933433 4802727 5239849 5852400 6133173 6456333 6977086
8829 6977086 7490562 7951205 8152548 7746314 6990033 6193143 5483677 5100787 5136932 5484263
8819 5484263 6102731 6718947 7023473 7100997 6997641 6437793 5363882 4100378 2826286
8810 2826286 1796477 1174375 944012 1177837 1733367 2141938 2512564 3375159 4520127
8801 4520127 4715697 3515234 1895393 1387740 2060525 2528546 2316092 2260027 2734814
8792 2734814 3190568 3403213 3369828 3344039 3714514 4289051 4659275 4659668 4701977 5361033 6256646
8781 6256646 6766672 7064177 7397135 7611305 7264591 6446265 5641409 4788258 3870159 3227098
8771C227098n94538r14334j073579r45537n85023k38368J63829O84992Q82091
8762F06631Q46372R12745R81208N62033k50502r72464j420737j568414j388957
8753a692085o90843M80405J426766J462738R21757M04983l10918r11369q42683
8744B48751m60465j70756l44104n07512j76125K66138K55241o8660K4085M42964
8734d90443M04298J09571p11P9199J43583l05390m14724K74830R60473R05116
8724A665802L62274J10394j52641q58925j470781j241154n66575N187P32397J220700
8714a93322J151047J031108Q55708O35129K31368l87789m84512j71197N7877k84179
8704B441238o45819m63608K6640M32167J48236j37067Q9695M85871R23539J005257
$$ plain form
8771 3227098 2632560 1718226 644647 -300890 -885913 -1124281 -960452 -275460 606631
8762 606631 1453003 2365748 3346956 3908989 3658487 2686023 1265286 -303128 -1692085
8753 -1692085 -2382928 -1902523 -475757 986981 1908738 2313721 2002803 1091434 248751
8744 248751 -211714 -382470 -726574 -1234086 -1410211 -1144073 -888832 -957492 -933407 -490443
8734 -490443 -86145 23426 22715 101914 245497 -59893 -474617 -199787 760686 1665802
8724 1665802 2028076 2138470 1985829 1126904 -343877 -1585031 -2151606 -2146419 -1414022 -193322
8714 -193322 957725 1988833 2844541 3479670 3711038 3323249 2838737 2667540 2725417 2441238
8704 2441238 1795419 1331811 1358451 1790618 1938854 1801787 1891482 2377353 3300892 4306149
8694D306149M84410k5591k49987j24290P7147P3906k152K34499K55882k55193
8684D774780n44855k46454K44819M18368K91272M6417q6374R0584J64220j90709
8674D962068m17082n90516p38334l43614L6628k34435o44476m63050j45570n05016
8664I16603j046274j125112q28057j67959M86391Q87554J435752J831142J347479
8655C737519N61007J71235L42341N93657K55173n38814o74084J99913J205569
8646E853516J224331M51372j93487m65824l06491k9664j33447n30543j014075
8637D855688j488910j251773o81816l30525k65102m24908k91977J00723M73633
8628F95033R70643J240643Q56591J0393p00966q49568l16768K58657L18279O8602
$$ plain form
8694 4306149 4790559 4764968 4514981 4390691 4467838 4541744 4539592 4774091 5029973 4774780
8684 4774780 4229925 3983471 4228290 4646658 4937930 4984347 4897973 4988557 5152777 4962068
8674 4962068 4544986 3954470 3216136 2872522 2909150 2674715 2030239 1567189 1421619 916603
8664 916603 -129671 -1254783 -2082840 -2250799 -1764408 -876854 558898 2390040 3737519
8655 3737519 4298526 4469761 4812102 5405759 5660932 5122118 4448034 4647947 5853516
8646 5853516 7077847 7529219 7335732 6869908 6563417 6533753 6400306 5869763 4855688
8637 4855688 3366778 2115005 1433189 1102664 837562 412654 120677 221400 695033
8628 695033 1665676 2906319 3762910 3773303 3072337 2222769 1906001 2164658 2482937 2551539
8618B551539l07834m61493O7734Q03015R78186N90086k07657j057460j322365
8609A633751j029822n78241j72338l25704q29808p98896n6881P59360P65884K15689
8599d17006k07239m05241n20205j78063P75700J426320J181425M82022j66815
8590A970898l37336k12237j27886k82682o83677q87665j003195q65366j21553
8581b550699O39494Q67486O80734K77421K205k19034j90700M3427O6583j43123
8571e26206m33294q20308p98808l35667o4761r0809L769N53913R86117R81227
8561e44827L40290l88176m07759k81782o22927n82067L13877J086884J263682
8552A77195R66088M19561K79239L02376L66366K58691m36857j115412j339915
$$ plain form
8618 2551539 2243705 1782212 1849946 2652961 3631147 4221233 4013576 2956116 1633751
8609 1633751 603929 25688 -146650 -472354 -1302162 -2101058 -2157939 -1398579 -632695 -417006
8599 -417006 -624245 -1029486 -1549691 -1727754 -952054 474266 1655691 2137713 1970898
8590 1970898 1633562 1421325 1293439 1010757 327080 -560585 -1563780 -2429146 -2550699
8581 -2550699 -1911205 -1043719 -362985 -85564 -83359 -302393 -493093 -449666 -383083 -526206
8571 -526206 -959500 -1779808 -2578616 -2914283 -2979044 -3069853 -3066084 -2512171 -1526054 -544827
8561 -544827 -204537 -592713 -1000472 -1282254 -1905181 -2487248 -2173371 -1086487 177195
8552 177195 1143283 1562844 1842083 2144459 2510825 2769516 2332659 1217247 -122668
8543a22668r25438J66749Q65416M77093r2720l08997p72694j054361l10708N07027
8533a571301M13003J0135o1296P3601L67993O16124Q85746J136632J323633J084884
8523D279154N1087q05491p82256n24753k40557N4893Q7308Q0562k4034n13619
8513A662294q20476o58101m98995k99591N519R4542R5859L91619M13015n3061
8503C32624n54377q77419r69312n89240J65440O98298Q25579J147877J499163
8494A678633J218381N88092j95169o54696n13038P6784P34239J202440J266791
8485E402457P06265j27573p26032j038007j122858p54271R6759R86137J509448
8476D932325J353395M89138k95904m26303n91275j258999j676839j203932l16843
$$ plain form
8543 -122668 -1048106 -881357 -15941 461152 368432 59435 -713259 -1767620 -2078328 -1571301
8533 -1571301 -1158298 -1148163 -1209459 -1135858 -767865 -151741 734005 1870637 3194270 4279154
8523 4279154 4330241 3524750 2742494 2217741 1977184 2032077 2119385 2199947 2175913 1662294
8513 1662294 841818 183717 -315278 -614869 -609350 -514808 -418949 -27330 385685 332624
8503 332624 -221753 -1099172 -2068484 -2657724 -2492284 -1793986 -968407 179470 1678633
8494 1678633 2897014 3485106 3289937 2635241 2122203 2198987 2933226 4135666 5402457
8485 5402457 6108722 5981149 5255117 4217110 3094252 2339981 2436740 3422877 4932325
8476 4932325 6285720 6774858 6478954 6052651 5461376 4202377 2525538 1321606 1004763
8467A004763M14933O38591K00330n07031r50703o72559J36747P08707N14568J83836
8457A672182J76674K42955J42954l14199q53055p53404j22138J54574K05158L72618
8447I24319Q5080m47290p95035q42568p32869p31137o75670o77929o24515n65600
8437e083214p77879p35360k65364J15443l2467l86925k53719M34789J129571J170939
8427d684186P48534N50451N75045L33045k36901q08477r54595m67974M3993M46406
8417d454659N24177j75234r56985j345627j333542n83443O64855J738813J810274
8408d111371J099364N84947O23039O81816J98447n65613r84350p33941l64697
8399c572359l2115J33274M32437Q62318R75445R00697Q19473P53683O88410M13435
$$ plain form
8467 1004763 1419696 2058287 2258617 1751586 800883 128324 265071 973778 1488346 1672182
8457 1672182 1848856 2091811 2234765 1920566 1067511 314107 191969 346543 551701 924319
8447 924319 1009399 562109 -232926 -1075494 -1808363 -2539500 -3215170 -3893099 -4517614 -5083214
8437 -5083214 -5861093 -6596453 -6861817 -6746374 -6778841 -7165766 -7419485 -6984696 -5855125 -4684186
8427 -4684186 -3935652 -3385201 -2810156 -2477111 -2714012 -3522489 -4477084 -4945058 -4901065 -4454659
8417 -4454659 -3930482 -4105716 -5062701 -6408328 -7741870 -8325313 -7660458 -5921645 -4111371
8408 -4111371 -3012007 -2427060 -1804021 -1122205 -923758 -1489371 -2473721 -3207662 -3572359
8399 -3572359 -3604474 -3471200 -3038763 -2176445 -1201000 -300303 519170 1272853 1961263 2374698
8389B374698R7545k43317n25505k88439L88852P06717P5016o95777j072816j112836
8379b95862p52253l91512O5354O48692J095046O23601l71366p45902o80487p19319
8369a524008m71974J37227O55858Q35115Q70320O59807M44395L60057K2016j31821
8359A856992J26221K22719n1088k88850m61248m26085k57647p7893j61843k67283
8349B13995j61638l2680K98511O56157P58308P22077M19814k13153l19792L51796
8339B693395R13186J021676O36523J29748k33936k18634J04331J23738j5785P6433
8329E230675n4566o18519q08092l14676j49209o86644j330592j545956j644320
8320a921899j385824n01907J46955N93103J151022J407134J566253J668427J246518
$$ plain form
8389 2374698 2472243 2228926 1703421 1414982 1803834 2510551 2585567 1889790 816974 -295862
8379 -295862 -1048115 -1439627 -1374273 -725581 369465 993066 621700 -124202 -804689 -1524008
8369 -1524008 -1995982 -1858755 -1202897 -367782 502538 1162345 1606740 1966797 1988813 1856992
8359 1856992 1983213 2205932 2154844 1865994 1404746 978661 721014 643121 481278 213995
8349 213995 52357 19677 318188 974345 1732653 2454730 2874544 2661391 2341599 2693395
8339 2693395 3606581 4628257 5264780 5394528 5160592 4941958 5046289 5170027 5154242 5230675
8329 5230675 5176109 4557590 3749498 3434822 3285613 2598969 1268377 -277579 -1921899
8320 -1921899 -3307723 -3809630 -3662675 -3069572 -1918550 -511416 1054837 2723264 3969782
8311C969782P43685L97849k75325r85192j303829j055500p34771r27504j109937
8302a280742q03484m00071m65693p79774p53539l56965k77362k70991O1325M40488
8292d886808R66342J173565O86778J0808j05230K83549P25060J119750J211183
8283A184997K75217j148496j868855j765914j156690r9017R04224Q34820k25985
8274c065699j009357q32787k88583M5640K35927K52410Q3254n6696k87997o23402
8264e547290m63933O37358J734046J509906L74934m39901k10602P12207J264655
8255d28620Q87227O9412l17317l97260k05216K94787O24222P34424P03401L7939
8245B002999q64139j134522o50497k15278m9627L14497O58194M31062m15155j222669
$$ plain form
8311 3969782 4713467 5111316 4835991 3850799 2546970 1491470 756699 -170805 -1280742
8302 -1280742 -2084226 -2484297 -2949990 -3729764 -4483303 -4840268 -5117630 -5388621 -5327296 -4886808
8292 -4886808 -3920466 -2746901 -2060123 -2049315 -2154545 -1870996 -1145936 -26186 1184997
8283 1184997 1460214 311718 -1557137 -3323051 -4479741 -4578758 -3674534 -2839714 -3065699
8274 -3065699 -4075056 -4907843 -5196426 -5150786 -4914859 -4662449 -4579195 -4635891 -4923888 -5547290
8264 -5547290 -6011223 -5373865 -3639819 -2129913 -1754979 -2194880 -2405482 -1693275 -428620
8255 -428620 458607 528019 210702 -186558 -391774 -96987 527235 1261659 1965060 2002999
8245 2002999 1138860 4338 -646159 -861437 -911064 -596567 61627 492689 77534 -1145135
8235a145135j310231r81795n67911J75694J133759J504970O95409l89806o02904
8226a487950J44746J018316P69740k36002q12582o05393l61427o54089j079106
8217c303747j509562j703757p43675R28749J595714J261244J137101J176708J003840
8208a57385O14655K15485m05845j131744j506069j304244m22099M16036P24019
8199b957191N25271j5834m33433m14557m83872p25785l67686M28422N76811O4787
8189c803067m02633m83204k13264j31119l69816J23831J323660J776822J409288
8180g69502R15409M35407j07065k10539J99849L28957K2193k69288l69153l31031
8170a54763j8797K78072M39994L93283L0856m93484r12244q84969k36810K99214
$$ plain form
8235 -1145135 -2455366 -3437161 -4005072 -3829378 -2695619 -1190649 -495240 -885046 -1487950
8226 -1487950 -1343204 -324888 444852 208850 -603732 -1209125 -1570552 -2224641 -3303747
8217 -3303747 -4813309 -6517066 -7260741 -6331992 -4736278 -3475034 -2337933 -1161225 -157385
8208 -157385 457270 672755 266910 -864834 -2370903 -3675147 -4097246 -3681210 -2957191
8199 -2957191 -2431920 -2447754 -2881187 -3295744 -3779616 -4505401 -4873087 -4444665 -3867854 -3803067
8189 -3803067 -4205700 -4688904 -4902168 -5033287 -5403103 -5279272 -3955612 -2178790 -769502
8180 -769502 145907 581314 474249 263710 463559 792516 814709 545421 176268 -154763
8170 -154763 -173560 104512 544506 937789 968645 475161 -437083 -1322052 -1558862 -1259648
8160a259648J18696m97560r10295r87336p21191k6996O88731P83639L62834K00143
8150b248983L49798K24563j9203o1298l6194J36877N25511O76346N76096O19656
8140G43169M15514J10267L19769P90572J338278J300973O77495l5198q51426j218942
8130C590471j184155j071702j093791j008558p27741n81312l26641j08469k63931
8121b775829k4010N26385P76997O12387K2984m46964m43205o9194M11817Q14372
8111e94260Q01672J87171q24890j588547j671813j051247l05907K21934Q34236
8102c991651J146831J135748O61328J87381N39067J096070J035324N32791M9209
8093B392098M3919K84104L90822J71500m16676o47221j23938O14554J006928R31016
$$ plain form
8160 -1259648 -1140952 -1638512 -2548807 -3536143 -4257334 -4284330 -3595599 -2811960 -2449126 -2248983
8150 -2248983 -1899185 -1674622 -1693825 -1755123 -1791317 -1654440 -1128929 -452583 123513 743169
8140 743169 1158683 1268950 1588719 2379291 3717569 5018542 5696037 5660839 4809413 3590471
8130 3590471 2406316 1334614 240823 -767735 -1495476 -2076788 -2403429 -2511898 -2775829
8121 -2775829 -2799839 -2273454 -1496457 -884070 -861086 -1308050 -1751255 -1820449 -1408632 -594260
8111 -594260 207412 394583 -430307 -2018854 -3690667 -4741914 -5047821 -4825887 -3991651
8102 -3991651 -2844820 -1709072 -1047744 -860363 -321296 774774 1810098 2342889 2392098
8093 2392098 2436017 2720121 3110943 3282443 2865767 2218546 2094608 2709162 3716090 4647106
8083D647106M04800k31472m55498l52919n99376j233402j567786j205667m53923
8074a048137k06371k45199K0799K70387K34040J264m28041p45350q16860r46731
8064c910199j108332j145169p50258K54424J460538J913344J234499J29918o71785
8055b593020r81867p55612j57155M76548P76333N77885k52969r26387q26754l52942
8045e015940L86905J501107K479519K475338J596585M57255k66163n45614p84663
8036B284329j029447j275277j584705j449266o20216M60014J328009J505680R18242
8027E37363j2518l42698n8363K22795L22648J78829j08366l16663m77152o05056
8017f59181o48772o82834n47493j95823J43698M74302Q45944J046870O72961J6781
$$ plain form
8083 4647106 5051906 4820434 4364936 4012017 3412641 2179239 611453 -594214 -1048137
8074 -1048137 -1254508 -1499707 -1478908 -1208521 -974481 -973217 -1401258 -2146608 -2963468 -3910199
8064 -3910199 -5018531 -6163700 -6913958 -6659534 -5198996 -3285652 -2051153 -1921235 -2593020
8055 -2593020 -3574887 -4330499 -4487654 -4011106 -3234773 -2656888 -2909857 -3836244 -4662998 -5015940
8045 -5015940 -4629035 -3127928 -648409 1826929 3423514 3880769 3614606 3068992 2284329
8036 2284329 1254882 -20395 -1605100 -3054366 -3674582 -3214568 -1886559 -380879 537363
8027 537363 524845 182147 123784 346579 669227 848056 739690 423027 -54125 -659181
8017 -659181 -1307953 -1990787 -2538280 -2734103 -2590405 -2116103 -1270159 -223289 449672 466453
8007D66453l07306k38060l89115q06219j070946j252091j037920m93863k58403
7998e387470q4313J52592K83760Q97811J207754N53598J68663M99800P59399L09639
7988f38767m33108p68685m92972l1266O99932J304160J173097O57812J03605n59816
7978A013992q50114n17274q7927p97k29030l07862n19879o95614m24030L9596
7968b578939K97858K66337L91667O81052N58967K51289k98867q60585p47480j72955
7958b211656L93922M43997k79687q47734p64675r17330j305225r64627Q3130Q78419
7948e491466J165984J240397R93623L74765j71194p10861j595665j638841m97628
7939f330886N37618P58411P18568Q29326J134849J334494J013380P03430L96732
$$ plain form
8007 466453 159147 -78913 -468028 -1274247 -2345193 -3597284 -4635204 -5129067 -5387470
7998 -5387470 -5471783 -5319191 -5035431 -4137620 -2929866 -2376268 -2207605 -1707805 -948406 -638767
7988 -638767 -1071875 -1840560 -2333532 -2364798 -1664866 -360706 812391 1470203 1573808 1013992
7978 1013992 163878 -353396 -441323 -442120 -671150 -979012 -1498891 -2194505 -2618535 -2578939
7968 -2578939 -2281081 -2014744 -1623077 -942025 -383058 -131769 -430636 -1291221 -2038701 -2211656
7958 -2211656 -1817734 -1373737 -1653424 -2501158 -3265833 -4183163 -5488388 -6453015 -6369885 -5491466
7948 -5491466 -4325482 -3085085 -2091462 -1716697 -1887891 -2598752 -4194417 -5833258 -6330886
7939 -6330886 -5793268 -5034857 -4316289 -3486963 -2352114 -1017620 -4240 699190 1095922
7930A095922K10280M99887O56031q5745r22632q02570k51904m9896k46208o18177
7920e15012j006309r77862j72401Q00744J241138J076854N02391k9423m09797
7911E10323o87146p43029o50113l19979K4465J15536k96768q70658q53887k70978
7901d042234J47398L76604M17185J776n32257n13810K83296Q06542Q28832J006995
7891a219673J160927Q07967M1275o49217r18647j209180j507211j692654j755662
7882f942075j087891j67692K91607N02173N80792O35185L44066R3493J31738M04374
7872e214230P07165O80693M43009K08660J95427L51907L17610k6099l12204l45517
7862b993579m89018o05757m71100l57190K28275J081669J397539J238512J065431
$$ plain form
7930 1095922 1306202 1806089 2462120 2376375 1453743 651173 399269 349373 103165 -515012
7920 -515012 -1521321 -2499183 -2671584 -1870840 -629702 447152 949543 920120 510323
7911 510323 -176823 -919852 -1569965 -1889944 -1865479 -1749943 -2046711 -2917369 -3771256 -4042234
7901 -4042234 -3894836 -3518232 -3101047 -3099271 -3631528 -4145338 -3862042 -3055500 -2226668 -1219673
7891 -1219673 -58746 749221 790496 141279 -777368 -1986548 -3493759 -5186413 -6942075
7882 -6942075 -8029966 -8197658 -7906051 -7403878 -6823086 -6187901 -5843835 -5750342 -5618604 -5214230
7872 -5214230 -4507065 -3826372 -3383363 -3174703 -2979276 -2627369 -2309759 -2335858 -2648062 -2993579
7862 -2993579 -3482597 -4088354 -4559454 -4916644 -4688369 -3606700 -2209161 -970649 94782
7853I4782N50032k64802p13833m88941o0328L2004k48308n61003p10376p94639
7843c165412o33953j47067M40355Q77230P25280k0854o97899r96154o58953J14433
7833d162994Q05512Q57172J68975l74904l1809K51672k90367n13155r3666O18743
7823b764821J102195Q33245J79398l23616m22071m71164n78915m65660l16627
7814c228036k27905q5919j589P0956J72973K19216K16981J47224p1614l07433
7804c095146k21939J83170N03102K62909l33322n86009k46135K25740J66692j79555
7794c320493L1560O41783Q52707P21315J51437p05084n10850O16472Q21502n8455
7784g58106n81688J5962P91492P73488N27486N01902K81081k52430n82288m91044
$$ plain form
7853 94782 644814 380012 -333821 -822762 -883090 -851086 -1099394 -1660397 -2370773 -3165412
7843 -3165412 -3799365 -3946432 -3506077 -2628847 -1903567 -1924421 -2622320 -3618474 -4277427 -4162994
7833 -4162994 -3357482 -2500310 -2331335 -2706239 -2738048 -2486376 -2776743 -3289898 -3383564 -2764821
7823 -2764821 -1662626 -829381 -649983 -973599 -1395670 -1866834 -2445749 -2911409 -3228036
7814 -3228036 -3455941 -3541860 -3543449 -3472493 -3299520 -3080304 -2863323 -2716099 -2787713 -3095146
7804 -3095146 -3317085 -3133915 -2630813 -2367904 -2701226 -3287235 -3533370 -3307630 -3140938 -3320493
7794 -3320493 -3288933 -2647150 -1794443 -1073128 -921691 -1626775 -2137625 -1521153 -699651 -758106
7784 -758106 -1339794 -1323832 -532340 241148 768634 1270536 1551617 1299187 716899 225855
7774B25855j67622K00757K70279J04273N8450K67182P48033P13662p6172o60671
7764A684026q58854j269633j627778j382937r82630o06039K79079R71907R79118
7755b813741N20472k64887q83274q92318m2034R63937J203067Q16504K25105j12911
7745a280080J36338P43340J502554J652168J038744O94185Q68593P06361M8247
7736F110450n28338j045992j280103j235869j193231r84936m13105J4880J28820
7727d27424q1087n63097j024271j305768j026307l97630L517M32221R25389R48230
7717b516227K01006m46755n55039n31635P8503Q82310J167207J095305N73590
7708e1735j13515k74863j92450j88209l55022l27646o4169K45922N16595N26274
$$ plain form
7774 225855 58233 258990 529269 633542 691992 959174 1707207 2420869 2344697 1684026
7764 1684026 825172 -444461 -2072239 -3455176 -4437806 -5043845 -4764766 -3792859 -2813741
7755 -2813741 -2293269 -2558156 -3441430 -4333748 -4375782 -3411845 -2208778 -1392274 -1167169 -1280080
7745 -1280080 -1143742 -400402 1102152 2754320 3793064 4487249 5355842 6062203 6110450
7736 6110450 5582112 4536120 3256017 2020148 826917 -158019 -571124 -556244 -427424
7727 -427424 -508511 -1071608 -2095879 -3401647 -4427954 -4825584 -4822067 -4389846 -3464457 -2516227
7717 -2516227 -2315221 -2761976 -3317015 -3848650 -3770147 -2887837 -1720630 -625325 -51735
7708 -51735 -165250 -440113 -632563 -820772 -1175794 -1503440 -1567609 -1321687 -805092 -278818
7698b78818J22971l63420m01509o2669L75102P01281R65450O52039m96608j353115
7688a39296j083641j54647M46220L70102j44354m00084k15278O7914L73914J0031
7678h69119p83112r00971m69071k72174m4793N22861O68010N95945M66067j69129
7668a255486q83830m83428O10180R66257M10704k18262l2135K44184n17169j772234
7658b931219k153932j444518m10721J71260K25758N44690J089030J173248J040217
7649b696187R03453Q22436J010245J337078R31718l7343n25708m21903m91287
7640H32502r42946j127925m66392R8922r8433p95958j754981j901049r77749o7005
7630g201014M63970P39606Q49487R44892P07391N6299j77545K27794M70397K57490
$$ plain form
7698 -278818 -155847 -519267 -920776 -983445 -608343 92938 1058388 1710427 1213819 -139296
7688 -139296 -1222937 -1377584 -931364 -561262 -705616 -1105700 -1320978 -1253064 -879150 -869119
7678 -869119 -1652231 -2553202 -3022273 -3294447 -3339240 -2816379 -2148369 -1552424 -1086357 -1255486
7668 -1255486 -2139316 -2622744 -2012564 -1046307 -635603 -853865 -886000 -641816 -1158985 -2931219
7658 -2931219 -5085151 -6529669 -6940390 -6769130 -6543372 -5998682 -4909652 -3736404 -2696187
7649 -2696187 -1792734 -970298 39947 1377025 2308743 2271400 1745692 1323789 832502
7640 832502 -110444 -1238369 -1704761 -1605839 -1704272 -2500230 -4255211 -6156260 -7134009 -7201014
7630 -7201014 -6737044 -5997438 -5147951 -4203059 -3495668 -3439369 -3616914 -3389120 -2918723 -2661233
7620b661233l10833o84678r38528j335527j215729o34973m20664n32879n33802
7611i268846l53220k1348N54974J496064K101786J734816P26565M9464J69913
7602b809832M45943O79566R44189J017598P39667N00711N85880O86625L77939
7593C168286J8422r4679j71331q6076q5384n29219j076939j579040j873934j695957
7583d005851j064389l94803L34769R86275J368990J528867J051177J02276n68940
7574f61629j177984j942743k180497j443599n84775m91555j75367J068853J907927
7565e681369J732226J595217J720608J601335P85002L0785j7217l39744q21849
7556F04994p69772m97178k63187K0335L5894J64034Q54056J448294J196570L49283
$$ plain form
7620 -2661233 -2972066 -3656744 -4595272 -5930799 -7146528 -7781501 -8202165 -8735044 -9268846
7611 -9268846 -9622066 -9643414 -9088440 -7592376 -5490590 -3755774 -3029209 -2979745 -2809832
7602 -2809832 -2363889 -1684323 -740134 277464 1017131 1517842 2103722 2790347 3168286
7593 3168286 3186708 3092029 2920698 2834622 2749238 2220019 1143080 -435960 -2309894 -4005851
7583 -4005851 -5070240 -5465043 -5130274 -4143999 -2775009 -1246142 -194965 -92689 -661629
7574 -661629 -1839613 -3782356 -5962853 -7406452 -7991227 -8482782 -8658149 -7589296 -5681369
7565 -5681369 -3949143 -2353926 -633318 968017 1753019 1783804 1766587 1426843 604994
7556 604994 -164778 -661956 -925143 -904808 -868914 -704880 149176 1597470 2794040 3143323
7546C143323k01930m33378o72542p56269p29872r01142j258378j321728o54406
7537c786322J96388Q50763J313702J160948M26527j84459n16043q18193m48858
7528a805547M90209O77786K23941j79504l78473j89387J87474N83371J018738
7519F28608J186925Q98505N22229K52436k95525p57484p28745l86448j9376q9806
7509A211319n81688r53058r35255l49169K43290L35212N34712J128198J333923
7500A967484O67038k61183o94983l18099K09275q0700r68464j424913j040243
7491a944788o00605l53420P3118N27458P65365O28013K75110k07244n85923n23331
7481a946247k53043l48432o74119o96350n28617m16420l26454j70420L28297J034100
$$ plain form
7546 3143323 2941393 2508015 1835473 1079204 349332 -551810 -1810188 -3131916 -3786322
7537 -3786322 -3589934 -2739171 -1425469 -264521 162006 -22453 -538496 -1356689 -1805547
7528 -1805547 -1315338 -637552 -413611 -593115 -971588 -1160975 -973501 -390130 628608
7519 628608 1815533 2714038 3236267 3488703 3193178 2435694 1706949 1320501 1301125 1211319
7509 1211319 629631 -323427 -1258682 -1607851 -1364561 -1029349 -494637 633561 1967484
7500 1967484 2634522 2373339 1678356 1360257 1569532 1488832 520368 -904545 -1944788
7491 -1944788 -2545393 -2898813 -2825695 -2298237 -1532872 -904859 -629749 -836993 -1422916 -1946247
7481 -1946247 -2199290 -2547722 -3221841 -3918191 -4446808 -4863228 -5189682 -5360102 -5031805 -3997705
7471c997705J007740P45820Q60237J111318J176930J010362P99575M08763J6822
7462C139862N2393J57152J38885k71486j136637j745069j471284m58934N67838
7453a027280R28212O29087M24623N25698Q18106M38388m55104q33340q62753p86662
7443b01025p07499n78376m79205n82270p30098q58998r04934q62288n82381k6180
7433f513254L18431O1921l50727p92455p65186J34247J024471J185716J294326
7424d402510J668168J463765J123736Q59827M32745N800o74396j095300o96624
7415a314789q7778J30199k40462q45540q72283p25300q99932p74393o2375O73104
7405e019549Q32908P64890N65306R1887k53074m54435n61130m07028q5698L8155
$$ plain form
7471 -3997705 -2989965 -2244145 -1383908 -272590 904340 1914702 2714277 3123040 3139862
7462 3139862 3192255 3349407 3488292 3216806 2080169 335100 -1136184 -1595118 -1027280
7453 -1027280 -99068 530019 954642 1480340 2298446 2736834 2281730 1448390 585637 -201025
7443 -201025 -908524 -1486900 -1966105 -2548375 -3278473 -4137471 -5042405 -5904693 -6487074 -6513254
7433 -6513254 -6194823 -6132902 -6483629 -7276084 -8041270 -7907023 -6882552 -5696836 -4402510
7424 -4402510 -2734342 -1270577 -146841 712986 1145731 1151531 477135 -618165 -1314789
7415 -1314789 -1402567 -1272368 -1512830 -2358370 -3230653 -3955953 -4855885 -5630278 -5692653 -5019549
7405 -5019549 -4186641 -3421751 -2856445 -2764558 -3017632 -3472067 -4033197 -4440225 -4525923 -4487768
7395d487768L92547R61727P31332k79684q57417n87824j25748K21470N50038N89095
7385b892232N3052n57044m33190K08904M46109L09078L10299K59208j93l31312
7375b627321o56638p32234l49267L31762P31100N18353R6278j01830p3482J54077
7365b709202N19646O24287J12784j05926L40555P08334Q22775K24280q58341j547438
7355a868246j507846q68607k74464M6211L61872R66499J325509J003187N57650
7346b58235K83596K09712L66439O56503L95747n68191j281891j452361j527224
7337c175905j432516j090985k50908J030257J707956J276414M84345K94726N24078
7328f32538M53249M77970O32475M34826K4093n59422j067360r97096k99069K33645
$$ plain form
7395 -4487768 -4095221 -3133494 -2402162 -2681846 -3539263 -4127087 -4252835 -4031365 -3481327 -2892232
7385 -2892232 -2839180 -3396224 -3829414 -3620510 -3174401 -2865323 -2555024 -2295816 -2296009 -2627321
7375 -2627321 -3283959 -4016193 -4365460 -4033698 -3302598 -2784245 -2687967 -2789797 -2863279 -2709202
7365 -2709202 -2189556 -1565269 -1452485 -1558411 -1217856 -509522 313253 537533 -320808 -1868246
7355 -1868246 -3376092 -4244699 -4519163 -4472952 -4111080 -3144581 -1819072 -815885 -258235
7346 -258235 25361 235073 601512 1258015 1653762 1085571 -196320 -1648681 -3175905
7337 -3175905 -4608421 -5699406 -5950314 -4920057 -3212101 -1935687 -1451342 -1156616 -632538
7328 -632538 -179289 298681 931156 1365982 1390075 830653 -236707 -1233803 -1532872 -1299227
7318a299227L35917M19391Q29446J317223J164094J36594n73881o42776r72355
7309G14426j282382j003305m65940k50092j59940J30591N42327Q65894Q45750
7300f2671N01716P5597j97229K55383J027022J132705L93974l42985p58338r28300
7290A096874n91532k13264p4473l96105r71800j195830j077623q88902p27261
7281e039916l03306J12374L08816L92170K01875J36698M10135N58967L35699J16798
7271b769690K06530L82011M28154L89688K86712M9556l38022q17675q42058j15210
7261c140004O13552N46941K37850J16583l7582o4228P2244N3094l35486q74453
7251b811489r91394l37752O21240J115680R45563N09964O0543l1585l34900j144814
$$ plain form
7318 -1299227 -963310 -543919 285527 1602750 2766844 2903438 2329557 1686781 714426
7309 714426 -567956 -1571261 -2037201 -2287293 -2447233 -2316642 -1774315 -908421 -62671
7300 -62671 439045 514642 317413 572796 1599818 2732523 3126497 2783512 2025174 1096874
7290 1096874 505342 292078 217605 -178500 -1150300 -2346130 -3423753 -4312655 -5039916
7281 -5039916 -5343222 -5230848 -4922032 -4529862 -4327987 -4191289 -3781154 -3222187 -2886488 -2769690
7271 -2769690 -2563160 -2181149 -1752995 -1363307 -1076595 -1027039 -1365061 -2182736 -3024794 -3140004
7261 -3140004 -2526452 -1979511 -1741661 -1625078 -1662660 -1726888 -1654644 -1601550 -1937036 -2811489
7251 -2811489 -3802883 -4140635 -3519395 -2403715 -1458152 -948188 -887645 -919230 -1254130 -2398944
7241b398944j386039r37854o09738o76850q71257p75932l16819J87177O79691
7232g106565J317349J530612J015824L07962j86145k98262K56821Q55388Q12739
$$ plain form
7241 -2398944 -3784983 -4722837 -5332575 -6009425 -6880682 -7656614 -7973433 -7786256 -7106565
7232 -7106565 -5789216 -4258604 -3242780 -2934818 -3120963 -3419225 -3162404 -2307016 -1494277
$$ [...]
##END NTUPLES=NMR SPECTRUM
##END=
