##TITLE=dept_DE-54H_2 CH-,CH3- -up, CH2- -down
 D2O, 2900 sc
 28.12.2024
##JCAMPDX= 6.0         $$ Bruker NMR JCAMP-DX V2.0
##DATA TYPE= NMR SPECTRUM
##DATA CLASS= NTUPLES
##ORIGIN= UXNMR, Bruker Analytische Messtechnik GmbH
##OWNER= root
$$ XWIN-NMR		Version 3.5
$$ Sat Dec 28 16:21:54 2024 Russian Standard Time (UT+4h)  she@DPX200
##.OBSERVE FREQUENCY= 50.327992884445
##.OBSERVE NUCLEUS= ^13C
##.ACQUISITION MODE= SIMULTANEOUS
##.ACQUISITION SCHEME= undefined
##.AVERAGES= 2908
##.DIGITISER RES= 17
##SPECTROMETER/DATA SYSTEM= spect
##.PULSE SEQUENCE= dept135
##.SOLVENT NAME= DMSO
##.SHIFT REFERENCE= (INTERNAL, DMSO, 0, 214.665)
##AUDIT TRAIL= $$ (NUMBER, WHEN, WHO, WHERE, WHAT)
$$ ##TITLE= Audit trail, XWIN-NMR		Version 3.5
$$ ##JCAMPDX= 5.01
$$ ##ORIGIN= Bruker BioSpin GmbH
$$ ##OWNER= she
$$ F:/spectra/data/she/nmr/depta/1/pdata/1/auditp.txt
$$ ##AUDIT TRAIL=  $$ (NUMBER, WHEN, WHO, WHERE, WHAT)
(   1,<2024-12-28 16:20:48.51 +0400>,<she>,<DPX200>,
      <created by zg, POWCHK disabled, PULCHK disabled
       terminated by command 'halt'
       configuration hash MD5:
       00 E9 B6 7A A2 85 ED C7 34 08 36 98 17 FE 4E 26
       data hash MD5: 16K
       32 08 47 AC 47 7A 07 32 6C 33 DB EF 6B EE F7 AE>)
(   2,<2024-12-28 16:20:52.34 +0400>,<she>,<DPX200>,
      <Start of raw data processing
       efp BC_mod = 2 LB = 3.5 FT_mod = 6 PKNL = 1 PHC0 = -5055.333 PHC1 = -1220.2 SI = 16K 
       data hash MD5: 16K
       97 B0 4E 8D C1 37 11 B2 F1 B5 45 BB 9C 4C 57 78>)
(   3,<2024-12-28 16:21:24.84 +0400>,<she>,<DPX200>,
      <pk PHC0 = 62.83138 PHC1 = -67.1999 
       data hash MD5: 16K
       F6 6C 82 1B 0C 8F 8E 96 40 6E 62 34 AF 56 45 42>)
$$ ##END=
$$ 
$$ hash MD5
$$ 5B C6 9D 49 05 F5 4C 53 D5 BD 37 AC 44 1B 3F 09
##$RELAX= 
##$RELAX= 
##$RELAX= 
##$RELAX= 
##$RELAX= 
##$RELAX= 
##$RELAX= 
##$RELAX= 
$$ Bruker specific parameters
$$ --------------------------
##$DU= <F:/spectra>
##$EXPNO= 1
##$NAME= <depta>
##$PROCNO= 1
##$TYPE= <nmr>
##$USER= <she>
##$AMP= (0..31)
100 100 100 100 100 100 100 100 100 100 100 100 100 100 100 100 100 100 
100 100 100 100 100 100 100 100 100 100 100 100 100 100 
##$AQSEQ= 0
##$AQ_mod= 1
##$AUNM= <au_zg>
##$AUTOPOS= <>
##$BF1= 50.322709
##$BF2= 200.13
##$BF3= 200.13
##$BF4= 200.13
##$BF5= 200.13
##$BF6= 200.13
##$BF7= 200.13
##$BF8= 200.13
##$BYTORDA= 1
##$CFDGTYP= 0
##$CFRGTYP= 5
##$CHEMSTR= <none>
##$CNST= (0..31)
1 1 145 1 1 1 1 1 1 1 1 1 1 1 1 1 1 1 1 1 1 1 1 1 1 1 1 1 1 1 1 1 
##$CPDPRG= <>
##$CPDPRG1= <waltz16>
##$CPDPRG2= <waltz16>
##$CPDPRG3= <>
##$CPDPRG4= <mlev>
##$CPDPRG5= <mlev>
##$CPDPRG6= <mlev>
##$CPDPRG7= <mlev>
##$CPDPRG8= <mlev>
##$CPDPRGB= <>
##$CPDPRGT= <>
##$D= (0..31)
0 2 0.003448276 0 0 0 0 0 0 0 0 0 2e-05 0 0 0 0 0 0 0 0 0 0 0 0 0 0 0 
0 0 0 0 
##$DATE= 1735380483
##$DBL= (0..7)
120 120 120 120 120 120 120 120 
##$DBP= (0..7)
150 150 150 150 150 150 150 150 
##$DBP07= 0
##$DBPNAM0= <>
##$DBPNAM1= <>
##$DBPNAM2= <>
##$DBPNAM3= <>
##$DBPNAM4= <>
##$DBPNAM5= <>
##$DBPNAM6= <>
##$DBPNAM7= <>
$$ [...]
##$SUBNAM2= <"">
##$SUBNAM3= <"">
##$SUBNAM4= <"">
##$SUBNAM5= <"">
##$SUBNAM6= <"">
##$SUBNAM7= <"">
##$SUBNAM8= <"">
##$SUBNAM9= <"">
##$SW= 219.3118970423
##$SWIBOX= (0..15)
0 1 3 0 0 0 0 0 0 0 0 0 0 0 0 0 
##$SW_h= 11037.527593819
##$TD= 16384
##$TD0= 1
##$TE= 0
##$TE2= 300
##$TE3= 300
##$TEG= 300
##$TL= (0..7)
120 120 120 120 120 120 120 120 
##$TP= (0..7)
150 150 150 150 150 150 150 150 
##$TP07= 0
##$TPNAME0= <>
##$TPNAME1= <>
##$TPNAME2= <>
##$TPNAME3= <>
##$TPNAME4= <>
##$TPNAME5= <>
##$TPNAME6= <>
##$TPNAME7= <>
##$TPOAL= (0..7)
0.5 0.5 0.5 0.5 0.5 0.5 0.5 0.5 
##$TPOFFS= (0..7)
0 0 0 0 0 0 0 0 
##$TUNHIN= 0
##$TUNHOUT= 0
##$TUNXOUT= 0
##$USERA1= <user>
##$USERA2= <user>
##$USERA3= <user>
##$USERA4= <user>
##$USERA5= <user>
##$V9= 5
##$VALIST= <valist>
##$VCLIST= <CCCCCCCCCCCCCCC>
##$VD= 0
##$VDLIST= <DDDDDDDDDDDDDDD>
##$VPLIST= <PPPPPPPPPPPPPPP>
##$VTLIST= <TTTTTTTTTTTTTTT>
##$WBST= 1024
##$WBSW= 2
##$XGAIN= (0..3)
0 0 0 0 
##$XL= 0
##$YL= 0
##$YMAX_a= 1388842
##$YMIN_a= -961344
##$ZGOPTNS= <>
##$ZL1= 120
##$ZL2= 120
##$ZL3= 120
##$ZL4= 120
##$ABSF1= 0
##$ABSF2= 0
##$ABSG= 0
##$ABSL= 0
##$ALPHA= 0
##$AQORDER= 0
##$ASSFAC= 0
##$ASSFACI= 0
##$ASSFACX= 0
##$ASSWID= 0
##$AUNMP= <proc_1d>
##$AZFE= 0.1
##$AZFW= 0.1
##$BCFW= 0
##$BC_mod= 2
##$BYTORDP= 0
##$COROFFS= 0
##$CY= -3
##$DATMOD= 1
##$DC= 0
##$DFILT= <>
##$DTYPP= 0
##$F1P= 0
##$F2P= 0
##$FCOR= 0.5
##$FTSIZE= 16384
##$FT_mod= 6
##$GAMMA= 0
##$GB= 0
##$INTBC= 1
##$INTSCL= 0
##$ISEN= 128
##$LB= 3.5
##$LEV0= 0
##$LPBIN= 0
##$MAXI= 10000
##$MC2= 0
##$MEAN= 0
##$ME_mod= 0
##$MI= 0.4000791
##$NCOEF= 0
##$NC_proc= -2
##$NLEV= 6
##$NOISF1= 120.0001
##$NOISF2= 80.00006
##$NSP= 0
##$NTH_PI= 0
##$NZP= 0
##$OFFSET= 214.6655
##$PC= 4
##$PHC0= -4992.501
##$PHC1= -1287.4
##$PH_mod= 1
##$PKNL= yes
##$PPARMOD= 0
##$PSCAL= 0
##$PSIGN= 0
##$REVERSE= no
##$SF= 50.3227091
##$SI= 16384
##$SIGF1= 140
##$SIGF2= 120
##$SINO= 80
##$SIOLD= 32768
##$SREGLST= <13C.CDCl3>
##$SSB= 0
##$STSI= 16384
##$STSR= 0
##$SW_p= 11037.527593819
##$SYMM= 0
##$S_DEV= 0
##$TDeff= 16384
##$TDoff= 0
##$TI= <>
##$TILT= no
##$TM1= 0
##$TM2= 0
##$TOPLEV= 0
##$USERP1= <user>
##$USERP2= <user>
##$USERP3= <user>
##$USERP4= <user>
##$USERP5= <user>
##$WDW= 1
##$XDIM= 16384
##$YMAX_p= 292535945
##$YMIN_p= -133983761
$$ End of Bruker specific parameters
$$ ---------------------------------
##NTUPLES= NMR SPECTRUM
##VAR_NAME=  FREQUENCY,     SPECTRUM/REAL,   SPECTRUM/IMAG
##SYMBOL=    X,             R,               I
##VAR_TYPE=  INDEPENDENT,   DEPENDENT,       DEPENDENT
##VAR_FORM=  AFFN,          ASDF,            ASDF
##VAR_DIM=   16384,         16384,           16384
##UNITS=     HZ,            ARBITRARY UNITS, ARBITRARY UNITS
##FACTOR=    0.67371834180669, 1,            1
##FIRST=     10802.5493505904, 0,            0
##LAST=      -234.978243228581, 0,           0
##MIN=       -234.978243228581, -133983761,  0
##MAX=       10802.5493505904, 292535945,    0
$$ Real data points
##PAGE= N=1
##DATA TABLE= (X++(R..R)), XYDATA
$$ [...]
4618f666228m421043l393473j128360J582159K546236K459155L089698L336781
$$ -6666228 -11087271 -14480744 -15609104 -14026945 -11480709 -9021554 -5931856 -2595075
4610b595075K895147K567679K355234K093404J331397M0919j169372j552287j355000
$$ -2595075 300072 2867751 5222985 7316389 8647786 8688705 7519333 5967046 4612046
4601D612046r79534m33474l47793n17130j01285R91226K414998J954258k66016
$$ 4612046 3632512 3199038 2851245 2334115 2232830 3224056 5639054 7593312 7327296
4592G327296j222146N56245K852977L278414K309505J125568K61189k79422o15325
$$ 7327296 6105150 6661395 9514372 12792786 15102291 16227859 16489048 16209626 15594301
4583A5594301j047987k280446l582025l701279k927486k529808l007801k681041
$$ 15594301 14546314 12265868 8683843 4982564 2055078 -474730 -3482531 -6163572
4575f163572q95461J229680J796140J488001K070379K734460K016945P25202N01475
$$ -6163572 -7059033 -5829353 -4033213 -2545212 -474833 2259627 4276572 5001774 5503249
4566E503249J261536J908834J649588N78767m98464q88034j599755k797944k462028
$$ 5503249 6764785 8673619 10323207 10901974 10403510 9515476 7915721 5117777 2655749
4557B655749n03495J626200L044469L247542J963856r27929m185133n265872m061161
$$ 2655749 2152254 3778454 6822923 10070465 12034321 11106392 6921259 1655387 -2405774
4548b405774k615748j154573L22887R48396P46609N12088k40318n32313N81793
$$ -2405774 -5021522 -6176095 -5853208 -4904812 -4158203 -3646115 -3886433 -4418746 -3836953
4539c836953J581182J848506J663607J264154Q16827M23982M53532O36731N50179
$$ -3836953 -2255771 -407265 1256342 2520496 3337323 3761305 4214837 4851568 5401747
4530E401747r3599j029212j517666j949091j729337k24302M69715n41268j363886
$$ 5401747 5308148 4278936 2761270 812179 -917158 -1141460 -671745 -1213013 -2576899
4521b576899j489152k614468m211802m405305k627155k92264N36730R64956K101161
$$ -2576899 -4066051 -6680519 -10892321 -15297626 -17924781 -18217045 -17680315 -16715359 -14614198
4512a4614198L488957M421479K693396l02954n15000J208786J344423r10651l477267
$$ -14614198 -11125241 -6703762 -4010366 -4313320 -4828320 -3619534 -2275111 -3185762 -6663029
4503f663029l847660j518047J636516L322015L465424K293371J187874J316921
$$ -6663029 -10510689 -12028736 -10392220 -7070205 -3604781 -1311410 -123536 1193385
4495A193385J141647K53094l34065n98811l14855M40040J127920J742240J409279
$$ 1193385 2335032 2588126 2254061 1655250 1340395 1780435 2908355 4650595 6059874
4486F059874M80498j019166k407101k110393r27223q31221j393366j087438j158227
$$ 6059874 6540372 5521206 3114105 1003712 76489 -754732 -2148098 -3235536 -4393763
4477d393763j395825j240970j554048k438535j975979K37869J860736J857757
$$ -4393763 -5789588 -7030558 -8584606 -11023141 -12999120 -12761251 -10900515 -9042758
4469i042758O69970O906N81334N43617j65226O01854J206249J25040j23262K82469
$$ -9042758 -8372788 -8365882 -7784548 -7240931 -7406157 -6804303 -5598054 -5473014 -5596276 -5313807
4459e313807M24756J70169N9603J316311J918469N09190j275126j277312O1901
$$ -5313807 -4889051 -4718882 -4659279 -3342968 -1424499 -915309 -2190435 -3467747 -3405846
4450c405846R15441J40705k099119m025521m293118k309865N10361K710939M033791
$$ -3405846 -2490405 -2349700 -4448819 -8474340 -12767458 -15077323 -14566962 -11856023 -7822232
4441g822232L691736K220020J053759J086006J800744K357400K447321K856975
$$ -7822232 -4130496 -1910476 -856717 229289 2030033 4387433 6834754 9691729
4433I691729L014275K459112R27325j485282l691663n057463m437575k777670
$$ 9691729 12706004 15165116 16092441 14607159 10915496 5858033 1420458 -1357212
4425a357212j397903n21518J94165M90210O17410Q58478j09013k269692k667820
$$ -1357212 -2755115 -3276633 -3082468 -2592258 -1974848 -1116370 -1225383 -3495075 -6162895
4416f162895r99234N00814K076310L048841J770429k17151o22973O1029R76087
$$ -6162895 -7162129 -6661315 -4585005 -1536164 234265 17114 -605859 -544830 431257
4407D31257J694262K083505J561762J19061m69717j42443r6344K2668J41400j05105
$$ 431257 2125519 4209024 5770786 5889847 5420130 5277687 5181343 5204011 5345411 5240306
4397E240306p99781j204355j120706j256288j703901k135380k067640j496699
$$ 5240306 4440525 3236170 2115464 859176 -844725 -2980105 -5047745 -6544444
4389f544444j211391j070173n54154J07993M28817M42547O29784J58045j412503
$$ -6544444 -7755835 -8826008 -9380162 -9272169 -8843352 -8400805 -7771021 -7612976 -9025479
4380i025479l049412l328015j093259K142249L958444M421558M468311L579866
$$ -9025479 -12074891 -15402906 -16496165 -14353916 -10395472 -5973914 -1505603 2074263
4372B074263K168475J147208J78563j598837l097243l379998k972400j670063
$$ 2074263 4242738 5389946 5568509 3969672 872429 -2507569 -5479969 -7150032
4364g150032m68521l52979j2794J198982K354104K034995O10422n09401j300127
$$ -7150032 -7618553 -7971532 -7984326 -6785344 -4431240 -2396245 -1785823 -2295224 -3595351
4355c595351j208113n94012l98848K00125J503524K124067K158750K945353L531475
$$ -3595351 -4803464 -5397476 -5796324 -5596199 -4092675 -1968608 190142 3135495 6666970
4346F666970K094919N608O82298J478134j77277k647749k836932p62955J25339
$$ 6666970 8761889 8767497 9449795 10927929 10750652 8102903 5265971 4503016 4628355
4337D628355j31629o65813j709914k230188p70376J170964J407612o8451r11186
$$ 4628355 4496726 3830913 2120999 -109189 -879565 291399 1699011 1630560 719374
4328G19374L58253J577774N32950j470093k445653j406677m853p9410L84553J223002
$$ 719374 1077627 2655401 3188351 1718258 -727395 -2134072 -2138925 -2218335 -1833782 -610780
4318f10780J148684R88673P54761K05178l08395p12931j202966j196041p92192
$$ -610780 537904 1526577 2281338 2486516 2178121 1465190 262224 -933817 -1726009
4309a726009k03273o16038k002941k098083m29873O2172j044541j517612l23494
$$ -1726009 -1929282 -2545320 -4548261 -6646344 -7076217 -7014045 -8058586 -9576198 -9899692
4300i899692J180113J465491R57709J341480K677395L264757K085021O7626j101393
$$ -9899692 -8719579 -7254088 -6296379 -4954899 -2277504 987253 3072274 3139900 2038507
4291B038507q58850l20028j98485l55826m59625o33728j203443j790811j160237
$$ 2038507 1179657 859629 661144 305318 -154307 -788035 -1991478 -3782289 -4942526
4282d942526O39392J599448J085738J012110J221595j30100k077680j931106n64834
$$ -4942526 -4303134 -2703686 -1617948 -605838 615757 485657 -1592023 -3523129 -4087963
4273d087963K42105J340436R90180r36533j669261r53607M48754J702005K443345
$$ -4087963 -3845858 -2505422 -1515242 -2451775 -4121036 -5074643 -4625889 -2923884 -480539
4264d80539K787277K768890L030936L931498M334313K988347K42935j787592k417166
$$ -480539 2306738 5075628 8106564 12038062 16372375 19360722 19603657 17816065 15398899
4255A5398899k632756k642611k415639k345507k817808l071894j834415l52500
$$ 15398899 12766143 10123532 7707893 5362386 2544578 -527316 -2361731 -2714231
4247b714231N24689J329468J688931K05403k021438k369150j227191M38043J490327
$$ -2714231 -2189542 -860074 828857 1034260 -987178 -3356328 -4583519 -4145476 -2655149
4238b655149J882529K434245L007510L245825L312685K206779L2266j837816k900191
$$ -2655149 -772620 1661625 4669135 7914960 11227645 13434424 13466690 11628874 8728683
4229H728683l362329l553028k862563k110754k222757k219573j668454n90862
$$ 8728683 5366354 1813326 -1049237 -3159991 -5382748 -7602321 -9270775 -9861637
4221i861637O18868J066899O16684N1796K63226K355793M200214L928986K583299
$$ -9861637 -9242769 -8175870 -7559186 -7507390 -7244164 -4888371 -688157 3240829 5824128
4212E824128J403460L31359j004170k243079k034232q64259o52176p17533l37761
$$ 5824128 7227588 7558947 6554777 4311698 2277466 1413207 761031 43498 -294263
4203b94263L75022M49294m95484j262171r77042m18581j100956j593251o78779
$$ -294263 80759 530053 34569 -1227602 -2204644 -2623225 -3724181 -5317432 -5996211
4194e996211j05319J04422Q92990J517007J042735j3827o17662r01987q78218
$$ -5996211 -6101530 -5997108 -5104118 -3587111 -2544376 -2558203 -3175865 -4077852 -4956070
4185d956070j94591Q20207M85780K59702J615525K647915K194170J073379j57297
$$ -4956070 -5150661 -4330454 -3844674 -3584972 -1969447 678468 2872638 3946017 3788720
4176C788720l02495J400419K352307J526272M01845k166094n431097o544638m965545
$$ 3788720 3486225 4886644 7238951 8765223 9167068 7000974 1569877 -4974761 -9940306
4167i940306k098664K03132J357786R28970o66414j755883o61438J886754K574596
$$ -9940306 -12038970 -11835838 -10478052 -9549082 -10215496 -11971379 -12632817 -10746063 -8171467
4158h171467J214441J45255J33575N67050J166728R94183P2636l42253k90595
$$ -8171467 -6957026 -6811771 -6678196 -6111146 -4944418 -3950235 -3877599 -4219852 -4510447
4149d510447q2710r297R1301J08416Q58617K237664K004979J76418q51092k13074
$$ -4510447 -4593157 -4602454 -4511153 -4402737 -3544120 -1306456 698523 874941 23849 -189225
4139a89225N31503O05839J284220K184784K212989Q93705p30606k032954k976049
$$ -189225 342278 948117 2232337 4417121 6630110 7523815 6793209 4760255 1784206
4130A784206l040578l024807l215968l445124l116309j758221M52695K771790
$$ 1784206 -1256372 -4281179 -7497147 -10942271 -14058580 -15816801 -15364106 -12592316
4122a2592316L118984J296646O60232K237868L184161K013810l42370k593683
$$ -12592316 -9473332 -8176686 -7516454 -5278586 -2094425 -80615 -422985 -3016668
4114c016668m103079m563051l522531j427495R80398K809763M550529N477019
$$ -3016668 -7119747 -11682798 -15205329 -16632824 -15652426 -12842663 -8292134 -2815115
4106b815115L639435M76858j114752r33358n06870j93152l44959q88532j559403
$$ -2815115 824320 1301178 186426 -746932 -1253802 -1446954 -1791913 -2680445 -4239848
4097d239848j292925k48613J63294O98075J530982K003996K228851K469216K637458
$$ -4239848 -5532773 -5781386 -5618092 -4920017 -3389035 -1385039 843812 3313028 5950486
4088E950486K339419J507056K74992j175748k429197k702201j485911R54318K890032
$$ 5950486 8289905 9796961 10071953 8896205 6467008 3764807 2278896 3233214 6123246
4079F123246K350703J056592J438122L493424N482587N954587N559543M842084
$$ 6123246 8473949 9530541 10968663 14462087 19944674 25899261 31458804 36300888
4071C6300888M347807L365060J136119j528692l119013k865752k049889j903639
$$ 36300888 40648695 44013755 45149874 43621182 40502169 37636417 35586528 33682889
4063C3682889j947978j450271n38261j83702n32072j248023j726019k792550m674098
$$ 33682889 31734911 30284640 29746379 29562677 29030605 27782582 26056563 23264013 18589915
4054A8589915n198436m688077m505158k746551N14418K147299J262758l27639
$$ 18589915 13391479 8703402 4198244 1451693 1966111 4113410 5376168 5048529
4046E048529q95942l44390j05084J9919M74914Q25469P77220L93811Q1132J618389
$$ 5048529 4152587 3808197 3703113 3723032 4197946 5023415 5800635 6194446 6275578 7893967
4036G893967L805465L554087J594570J1031j241555k029479j864677j452660m85407
$$ 7893967 11699432 15253519 16848089 16859120 15617565 13588086 11723409 10270749 9785342
4027I785342N67094N99739L32896M65609J648951L070144K926258J843340P54147
$$ 9785342 10352436 10952175 11285071 11750680 13399631 16469775 19396033 21239373 21993520
4018B1993520J54643M19725Q16931N02383K07479L16602M87109n8416k59621M80191
$$ 21993520 22148163 22567888 23384819 23887202 24094681 24411283 24898392 24839976 24580355 25060546
4008B5060546Q35608j75291k048562l460436l463123k798706j800741M04936K182241
$$ 25060546 25896154 25720863 23672301 20211865 16748742 13950036 12149295 12554231 14736472
3999A4736472K019725R96012l55117j434011j200460K8298O10436J67820r67250
$$ 14736472 16756197 17752209 17397092 15963081 14762621 14790919 15401355 15569175 14601925
3990A4601925j446374o88686j03232P64817J291058M98089r31759j221131n28583
$$ 14601925 13155551 12466865 12363633 13128450 14419508 14917597 13985838 12764707 12236124
3981A2236124N0427R62537K215310K558483J870848R26999q37236k455755k674723
$$ 12236124 12286551 13249088 15464398 18022881 19893729 20820728 19983492 17527737 14853014
3972A4853014j397051Q93519J808104M3165k392013l781674k543218K07361J857772
$$ 14853014 13455963 14349482 16157586 16200751 13808738 10027064 7483846 7691207 9548979
3963I548979J623499k32830k040144k717055k769255k430735j500629o12473j390614
$$ 9548979 11172478 10939648 8899504 6182449 3413194 982459 -518170 -1130643 -2521257
3954b521257l019138k845269j218212J155947K930169L319954L430280K660912
$$ -2521257 -5540395 -8385664 -9603876 -8447929 -5517760 -2197806 1232474 3893386
3946C893386P42814j790123l682294l595904j392439M72286J125163J779490K706952
$$ 3893386 4636200 2846077 -836217 -4432121 -5824560 -5352274 -4227111 -2447621 259331
3937B59331K164238p6239o56272P70663K632117N230935P171339O387713L728160
$$ 259331 2423569 2347330 1691058 2461721 5093838 10324773 17496112 23883825 27611985
3928B7611985J676630N67567n01512j126766j567311j349423l92780O83733J724379
$$ 27611985 29288615 29856182 29354670 28227904 26660593 25311170 24918390 25602123 27326502
3919B7326502J857305J137901k5693j098666n11212M63828K56495j88856J89492
$$ 27326502 29183807 30321708 30296015 29197349 28686137 29149965 29406460 29217604 29407096
3910B9407096M50185k21144r82583j578496k168404k505640j907693j8521J226822
$$ 29407096 29857281 29636137 28653554 27075058 24906654 22401014 20493321 20474800 21701622
3901B1701622n99223k853819l347835k462798q18562N01430J781076K837078K058653
$$ 21701622 21102399 18248580 14900745 12437947 11619385 12120815 13901891 16738969 18797622
3892A8797622J96572o95204j68364M07461j62918k41872K49131k1310m06087j014828
$$ 18797622 18994194 18298990 18130626 18538087 18375169 18133297 18382428 18361118 17955031 16940203
3882A6940203j605690j511854j888294j880486r81586p38759j804103j993969
$$ 16940203 15334513 13822659 11934365 10053879 9072293 8333534 6529431 4535462
3874D535462K35583J724482Q16990J035127K334948K295333L20066k915096l774919
$$ 4535462 4771045 6495527 7312517 8347644 10682592 12977925 13297991 10382895 6607976
3865F607976j176813J289208K95849k122993l065054k813065j855689n3275K346571
$$ 6607976 5431163 6720371 7016220 4893227 1828173 -984892 -2840581 -2893856 -547285
3856e47285L908774K938626j7801k328367k912409k885552k569506j311926L54694
$$ -547285 3361489 6300115 6282314 3953947 1041538 -1844014 -4413520 -5725446 -5370752
3847e370752K86872m80615K10093J710664K760452K135749R31356J034991K578109
$$ -5370752 -5083880 -5564495 -5354402 -3643738 -883286 1252463 2183819 3218810 5796919
3838E796919L652891L341381J897968q75699l249720l337203j682894N88992K119925
$$ 5796919 9449810 12791191 14689159 13813460 10563740 7226537 5543643 6132635 8252560
3829H252560K157529R98187L48943J8692p94690N3223J124378L29200j009698
$$ 8252560 10410089 11408276 11757219 11775911 10981221 11034444 12158822 12488022 11478324
3820A1478324j508062j192740j320510j396010r35569m05759M88816J027493N10615
$$ 11478324 9970262 8777522 7457012 6061002 5125433 4719674 5208490 6235983 6746598
3811F746598j21119q34381j612413j237262M8563M04610o97786k581988l810976
$$ 6746598 6625479 5791098 4178685 2941423 2989986 3394596 2696810 114822 -3696154
3802c696154l486370j650025N29792J689902K569477K639559J533630J077150
$$ -3696154 -7182524 -8832549 -8302757 -6612855 -4043378 -1403819 129811 1206961
3794A206961K628017L667433K402877K051642L507608L745300J962201j79418
$$ 1206961 3834978 7502411 9905288 11956930 15464538 19209838 21172039 20992621
3786B0992621r67962l02273J65882l61920r74147j438391k022725j818566j027745
$$ 20992621 20024659 19722386 19888268 19526348 18552201 17113810 15091085 13272519 12244774
3777A2244774j40030p8721q59829j278997q66160o62651j063613j931616l111373
$$ 12244774 12104744 12026023 11166194 9887197 9021037 8358386 7294773 5363157 2251784
3768B251784l540167k975275q10212J988661K977854K564102K227160J295712
$$ 2251784 -1288383 -4263658 -5073870 -3085209 -107355 2456747 4683907 5979619
3760E979619L5490M51784J839112K156462K651549M586218N260242L184473Q34379
$$ 5979619 6015109 6466893 8306005 10462467 13114016 17700234 22960476 26144949 26979328
3751B6979328l17697j119316j911924j861498j420001j129628j442220k033417
$$ 26979328 26661631 25542315 23630391 21768893 20348892 19219264 17777044 15743627
3743A5743627j338703M83076J823305J681619M14512l50200r77292j142758p11430
$$ 15743627 14404924 14888000 16711305 18392924 18807436 18457236 17479944 16337186 15625756
3734A5625756n15581L8932N39090l59332k509647l921935l529191k076607r82033
$$ 15625756 15110175 15149107 15688197 15328865 12819218 8897283 5368092 3291485 2309452
3725B309452l82310m91118o57128l58429K55019J133084K459735M426891N493963
$$ 2309452 1927142 1436024 778896 420467 675486 1808570 4268305 8695196 14189159
3716A4189159L802013J061429n32916j518032l396648n307369m221723j391259
$$ 14189159 17991172 19052601 18519685 17001653 13605005 8297636 4075913 2684654
3708B684654l73245j477787k543433k442480k161897j968837j283454k78872P1456
$$ 2684654 2311409 833622 -1709811 -4152291 -6314188 -8283025 -9566479 -9845351 -9773895
3699i773895K4183O43141J697789J645927N22487L31077J165138K527486L466594
$$ -9773895 -9749712 -9106571 -7408782 -5762855 -5240368 -4909291 -3744153 -1216667 2249927
3690B249927K939235J460397J68860l04651n44163r39433o43043N1205k5486n9172
$$ 2249927 5189162 6649559 6818419 6513768 5969605 5030172 4387129 4438334 4412848 4353676
3680D353676M15342M13320Q42426J359252J258207J329433J844963J895133L30075
$$ 4353676 4769018 5182338 6024764 7384016 8642223 9971656 11816619 13711752 14041827
3671A4041827o45505j322109k782468l046414j703305m94357N44152J738628J776634
$$ 14041827 13396322 12074213 9291745 6245331 4542026 4047669 4591821 6330449 8107083
3662H107083J03906r45465r6666N07783n45904k309223k460333q60992Q17732
$$ 8107083 8210989 7265524 7168858 7676641 7130737 4821514 2361181 1500189 2317921
3653B317921J292784M42232j055230k010670k070789j947176k038610j741043
$$ 2317921 3610705 4052937 2997707 987037 -1083752 -3030928 -5069538 -6810581
3645f810581m56254O62140J506032L263476N333152N976253M372156J764846n44191
$$ -6810581 -7266835 -6604695 -5098663 -1835187 3497965 9474218 13846374 15611220 15067029
3636A5067029j463400j493148j993451k644829k919521k114614m24449N84962
$$ 15067029 13603629 12110481 10117030 7472201 4552680 2438066 2013617 2598579
3628B598579O07804K24505O64680J265537J583303J279719L0157q68349j148973
$$ 2598579 3206383 3430888 4095568 5361105 6944408 8224127 8254284 7385935 6236962
3619F236962j618531k780654l519461k910492k000719j352283k96497L19651M86671
$$ 6236962 4618431 1837777 -1681684 -4592176 -6592895 -7945178 -8241675 -7922024 -7435353
3610g435353J969663L563841K586962M81462m5386k85620l62477N32178J027932
$$ -7435353 -5465690 -1901849 685113 1166575 1121189 835569 473092 1005270 2033202
3601B033202J174098R85166O8394n54444k66093N34095J312306J670673J054077
$$ 2033202 3207300 4192466 4260860 3706416 3440323 3974418 5286724 6957397 8011474
3592H011474K56863P6987L2890l51948r70992p38031k53050j0719R5363j79006
$$ 8011474 8268337 8345324 8378214 8026266 7055274 6317243 6064193 6053474 6148837 5969831
3582E969831j77220K53594N89344O84571j55666j940519k771311j710284K39839
$$ 5969831 5792611 6046205 6635549 7320120 7164454 5223935 2452624 742340 982179
3573I82179J314019P95036l69303j144595j572417k412955l285140l406971k562861
$$ 982179 2296198 3091234 2721931 1577336 4919 -2408036 -5693176 -9100147 -11663008
3564a1663008j000887J010036L033836M082355L663943K341346R67317R0725p60224
$$ -11663008 -12663895 -11653859 -8620023 -4537668 -873725 1467621 2434938 2525663 1765439
3555A765439j301212j565332j731512n32755J874699M032712M507632K180219
$$ 1765439 464227 -1101105 -2832617 -3365372 -1490673 2542039 7049671 9229890
3547I229890j342068l166048k647027j074054l37964q66365j394320r61340m56286
$$ 9229890 7887822 4721774 2074747 1000693 662729 -203636 -1597956 -2559296 -3015582
3538c015582p1646J65167L68532Q35407J849424L015888K880056J738438L24337
$$ -3015582 -3087228 -2922061 -2553529 -1718122 131302 3147190 6027246 7765684 8090021
3529H090021o67723j256816j684662j745915j725609j595008q55919J109806L455160
$$ 8090021 7422298 6165482 4480820 2734905 1009296 -585712 -1441631 -331825 3123335
3520C123335K938165k64051k483192j453554J395802L108624K436126M54173j176493
$$ 3123335 6061500 5797449 3314257 1860703 3256505 6365129 8801255 9255428 8078935
3511H078935j711402k160137k759871k509161j790560j293817j018561k32020
$$ 8078935 6367533 4207396 1447525 -1061636 -2852196 -4146013 -5164574 -5396594
3503e396594J177611K362548K858681J955487J97626j190035j717448k049079
$$ -5396594 -4218983 -1856435 1002246 2957733 3155359 1965324 247876 -1801203
3495a801203k856537k680945j444847m59801L66446J96964q14450n21185J351658
$$ -1801203 -4657740 -7338685 -8783532 -9243333 -8876887 -8679923 -9494373 -10015558 -8663900
3486h663900L178980M404748M533662K916823O14974p78435j274012r29588K68749
$$ -8663900 -5484920 -1080172 3453490 6370313 6985287 6206852 4932840 4003252 4272001
3477D272001K38277j794104l528795l441263l052892k497752j357359m42079J063675
$$ 4272001 4510278 2716174 -812621 -4253884 -7306776 -9804528 -11161887 -11603966 -10540291
3468a0540291K353415K612599K159910M07337j520664k151165j257935j59309
$$ -10540291 -8186876 -5574277 -3414367 -3007030 -4527694 -6678859 -7936794 -8096103
3460h096103P2972L4819P23837J783652J990852J565182J348729J384486K303592
$$ -8096103 -8023131 -7988312 -7264475 -5480823 -3489971 -1924789 -576060 808426 3112018
3451C112018K293626O67869l48157N12757J824820J557414q35150l128678l793960
$$ 3112018 5405644 6073513 5725356 6238113 8062933 9620347 8785197 5656519 1862559
3442A862559l202748j398648L65267P34389K46369k16270N54196K047874J976775
$$ 1862559 -1340189 -2738837 -2373570 -1639181 -1392812 -1609082 -1054886 992988 2969763
3433B969763J106943M91426M6606j3463N26803R18749Q99989R52162n10430l218105
$$ 2969763 4076706 4568132 4614738 4601275 5128078 6046827 6946816 7898978 7388548 4170443
3423D170443m153655k575746o73773k36408m16169l73883r19998j396495p78444
$$ 4170443 16788 -2558958 -3232731 -3469139 -3885308 -4259191 -5179189 -6575684 -7354128
3414g354128n73588j592507k016234j388629p04777K07261Q39632J731056K349545
$$ -7354128 -7927716 -9520223 -11536457 -12925086 -13629863 -13422602 -12582970 -10851914 -8502369
3405h502369J633587Q40541P22826M23928J75319N10930N24564o26876q73789
$$ -8502369 -6868782 -6028241 -5305415 -4881487 -4706168 -4195238 -3670674 -4297550 -5171339
3396e171339L62274Q20630o84339k788416k871927j059973N13573J425239K632282
$$ -5171339 -4809065 -3988435 -4672774 -7461190 -10333117 -11393090 -10879517 -9454278 -6821996
3387f821996L382156K975058K370769K155065J767112P56490l27210j116185j767539
$$ -6821996 -3439840 -464782 1905987 4061052 5828164 6584654 6257444 5141259 3373720
3378C373720j429501k49896L26413O63302J119367J099789J011228R06278l71484
$$ 3373720 1944219 1694323 2020736 2684038 3803405 4903194 5914422 6820700 6449216
3369F449216k753669l546501k053951n00700O47138J904409K006122M78336o39414
$$ 6449216 3695547 149046 -1904905 -2405605 -1758467 145942 2152064 2630400 1990986
3360A990986J30040J094006R16021R2106q96442j471636q25555L16771Q56400
$$ 1990986 2121026 3215032 4131053 4223159 3326717 1855081 1029526 1346297 2202697
3351B202697R88941J731607K767211K938057K156707O41313J19652O03976R1132
$$ 2202697 3191638 4923245 7690456 10628513 12785220 13426533 13546185 14150161 14241293
3342A4241293o67179l43017J67548p4559j139511j849159j803642j450299j485626
$$ 14241293 13574114 13231097 13398645 13324086 12184575 10335416 8531774 7081475 5595849
3333E595849j893659j877716j759657r04252L33098L86598r91518k088955j642190
$$ 5595849 3702190 1824474 64817 -839435 -506337 -119739 -1111257 -3200212 -4842402
3324d842402j040559j087259j181481j353107r54469O90516J878384K008072K745057
$$ -4842402 -5882961 -6970220 -8151701 -9504808 -10459277 -9768761 -7890377 -5882305 -3137248
3315c137248M007766L954333K970748J674465K87022k31473j211996j720307k88686
$$ -3137248 870518 4824851 7795599 9470064 9757086 9525613 8313617 6593310 6304624
3306F304624K56274j503629l068808k664275j391459j65814P13201J300854J492585
$$ 6304624 6560898 5057269 1988461 -675814 -2067273 -2233087 -1519886 -219032 1273553
3297A273553J080366O78437J145762K297274K756716J294049j270318k590581
$$ 1273553 2353919 3032356 4178118 6475392 9232108 10526157 9255839 6665258
3289F665258j764219J48899R82602N78973k25026j097227j428962j278484j198650
$$ 6665258 4901039 5049938 6032540 6611513 6386487 5289260 3860298 2581814 1383164
3280A383164j658288k015671j514393j459259j164965K76052J875119K648542
$$ 1383164 -275124 -2290795 -3805188 -5264447 -6429412 -6153360 -4278241 -1629699
3272a629699K071156J347234l80777k917793l636539k569174p59359M08474m14806
$$ -1629699 441457 1788691 1407914 -1509879 -5146418 -7715592 -8474951 -8066477 -8481283
3263h481283j909393j839069k00260J009225J379363J410275J138307J285061
$$ -8481283 -10390676 -12229745 -12430005 -11420780 -10041417 -8631142 -7492835 -6207774
3255f207774J502297J596846K934307L913955K417078j36180j491964k022614
$$ -6207774 -4705477 -3108631 -174324 3739631 6156709 6020529 4528565 2505951
3247B505951k700204k283863K58041L239885M325802L231720J985390J833954
$$ 2505951 -194253 -2478116 -2220075 1019810 5345612 8577332 10562722 12396676
3239A2396676K024900J020809o01686j068557n86188k40437k37117q06888j328686
$$ 12396676 14421576 15442385 14840699 13772142 13185954 12945517 12708400 11901512 10572826
3230A0572826l54698M11620j9455L15892J726056J912137l61014l557496n091878
$$ 10572826 10218128 10629748 10610293 10926185 12652241 14564378 14203364 10645868 5553990
3221E553990m250072k371320l19725Q82119L33255N43326K442588L190419J193256
$$ 5553990 1303918 -1067402 -1387127 -505008 -171753 371573 2814161 6004580 7197836
3212G197836j065235k088690k410430k606297j876065k95873O69164J59513j094234
$$ 7197836 6132601 4043911 1633481 -972816 -2848881 -3144754 -2475590 -2316077 -3410311
3203c410311j367400j349175q08108R15754J587475M28510q1703J293921J969169
$$ -3410311 -4777711 -6126886 -6934994 -6019240 -4431765 -4003255 -4084958 -2791037 -821868
3194h21868R47815j08397j249594k069301j485497L10168J341113J292445J218040
$$ -821868 125947 17550 -1232044 -3301345 -4786842 -4476674 -3135561 -1843116 -625076
3185f25076J140096J098288J434330J498965J114524O29572r1224j907597l396743
$$ -625076 515020 1613308 3047638 4546603 5661127 6290699 6199475 4291878 895135
3176H95135l751595l943627l408063k045016q12914j94039J6178P31771K499048
$$ 895135 -2856460 -6800087 -10208150 -12253166 -13066080 -13260119 -13243941 -12512170 -10013122
3167a0013122L881904M026042L080952J316394o20691j568363j360777r37773
$$ -10013122 -6131218 -2105176 975776 2292170 1671479 103116 -1257661 -2195434
3159b195434n31303L50079J547988J622907J62695j261130j684756j198161m56498
$$ -2195434 -2726737 -2376658 -828670 794237 956932 -304198 -1988954 -3187115 -3643613
3150c643613n72295k821436n832570o853828m522576o78793K071344L424832K768287
$$ -3643613 -4215908 -7037344 -12869914 -19723742 -24246318 -24925111 -22853767 -19428935 -16660648
3141a6660648P65407p45985k20055J027051J730709K988105M243497M117350K179717
$$ -16660648 -15895241 -16641226 -16861281 -15834230 -14103521 -11115416 -6871919 -2754569 -574852
3132e74852l64326j526340j468742j038329l58234O72981J714835K302487J305390
$$ -574852 -939178 -2465518 -3934260 -4972589 -5330823 -4657842 -2943007 -640520 664870
3123F64870o71790j924936k248619j639549o01338n26470j576897j877696j90998
$$ 664870 -6920 -1931856 -4180475 -5820024 -6421362 -6947832 -8524729 -10402425 -10593423
3114a0593423J856688J858404P16303k8852R25543K423969K395620J570589j37164
$$ -10593423 -8736735 -6878331 -6162028 -6190880 -5265337 -2841368 -445748 1124841 987677
3105I87677k032259j697893J49843J689377K723426L450214L312440K350775P60394
$$ 987677 -1044582 -2742475 -2592632 -903255 1820171 5270385 8582825 10933600 11693994
3096A1693994q35488j245116k63745N60898j259880m353311n012148k557934p68761
$$ 11693994 10858506 9613390 9349645 9910543 8650663 4297352 -714796 -3272730 -4041491
3087d041491j207765j763104j270102N2301P56684O13596J043324K049080K708289
$$ -4041491 -5249256 -7012360 -8282462 -8230161 -7473477 -6859881 -5816557 -3767477 -1059188
3078a059188K514165J343679n34252k311429l553120m309768n319644p280181
$$ -1059188 1454977 2798656 2264404 -47025 -3600145 -7909913 -13229557 -20509738
3070b0509738r574760j2252208j5716830j8380516j7628730j3663770p051690
$$ -20509738 -30084498 -42336706 -58053536 -76434052 -94062782 -107726552 -114778242
3063a14778242L39781M539638M215550J475074k583401p623871j0354112q039296
$$ -114778242 -114438461 -109898823 -105683273 -104208199 -106791600 -114415471 -124769583 -132808879
3055a32808879j174882P174520J3591444J5889386J4626321J2457534J0937072
$$ -132808879 -133983761 -126809241 -113217797 -97328411 -82702090 -70244556 -59307484
3048e9307484R397433O940639M275895K365533J323438Q63431J161855O93685
$$ -59307484 -49910051 -42969412 -38693517 -36327984 -35004546 -34141115 -32979260 -32285575
3040c2285575m17320j83912J074093J737138J614101K004688K609162K354334
$$ -32285575 -32702895 -32886807 -31812714 -30075576 -28461475 -26456787 -23847625 -21493291
3032b1493291J375650M13320P86809K310076K397118N59332j164839k481787l280613
$$ -21493291 -20117641 -19704321 -18917512 -16607436 -14210318 -13650986 -14815825 -17297612 -20578225
3023b0578225j958076J50537J651358L085851L259455K502768K137152J209376
$$ -20578225 -22536301 -22385764 -20734406 -17648555 -14389100 -11886332 -9749180 -8539804
3015h539804j915l90169j247094j894956r48915Q71100K111027K119863J768871
$$ -8539804 -8541719 -8931888 -10178982 -12073938 -13022853 -12151753 -10040726 -7920863 -6151992
3006f151992J221196N33938n93730j529963j570522l56336J589235K947149K465126
$$ -6151992 -4930796 -4396858 -4990588 -6520551 -8091073 -8447409 -6858174 -3911025 -1445899
2997a445899J105266K24243n61513r69843P5020J775754J965763Q94953K9401
$$ -1445899 -340633 -116390 -677903 -1647746 -1572726 203028 2168791 3063744 3093145
2988C093145K63504J136918J509188O54400j685354l232804k136448l82904M99280
$$ 3093145 3356649 4493567 6002755 6657155 4971801 1738997 -397451 -780355 -281075
2979b81075J94654j072803j560728o79821O72437J989537K405143J989182J395545
$$ -281075 -86421 -1159224 -2719952 -3399773 -2727336 -737799 1667344 3656526 5052071
2970E052071J308469J442596J715186K174320J484847M69371J81443m89017j683781
$$ 5052071 6360540 7803136 9518322 11692642 13177489 13646860 13828303 13339286 11655505
2961A1655505k880565l668222l636007k659952r03493M24796J09534j761300l226388
$$ 11655505 8774940 5106718 1470711 -1189241 -2092734 -1667938 -1558404 -3319704 -6546092
2952f546092k673521j095710L61340J538903J410890K38807m34113R1325J349838
$$ -6546092 -9219613 -10315323 -9953983 -8415080 -7004190 -6765383 -7199496 -7108171 -5758333
2943e758333K488264K190041N74195j471908l307912l612070k084246K27028J470929
$$ -5758333 -3270069 -1080028 -505833 -1977741 -5285653 -8897723 -10981969 -10754941 -9284012
2934i284012J221517O71420N03372P07629J769397K990235L542585K533499J38290
$$ -9284012 -8062495 -7391075 -6887703 -6180074 -4410677 -1420442 2122143 4655642 4793932
2925D793932j163339J70987J957579J220045j488644l556292l462255j974611
$$ 4793932 3630593 3801580 5759159 6979204 5490560 1934268 -1527987 -3502598
2917c502598p59724q36609j140886j098348j674804j834408r54986n05977p460
$$ -3502598 -4262322 -5098931 -6239817 -7338165 -9012969 -10847377 -11802363 -12308340 -12315800
2908a2315800J061067J323407J050429N74379L47903O13563R51531O42739j57170
$$ -12315800 -11254733 -9931326 -8880897 -8306518 -7958615 -7345052 -6393521 -5750782 -5907952
2899e907952n87526r6934J117119J444520K57819j341112k004014j861426j625107
$$ -5907952 -6495478 -6592412 -5475293 -4030773 -3772954 -5114066 -7118080 -8979506 -10604613
2890a0604613j702119j190899J39657R84293N95960p96554j891062j623253o92509
$$ -10604613 -12306732 -13497631 -13357974 -12373681 -11777721 -12574275 -14465337 -16088590 -16781099
2881a6781099L12549J832860L177788K671343Q52540l66801j031935j674572k484942
$$ -16781099 -16468550 -14635690 -11457902 -8786559 -7934019 -8300820 -9332755 -11007327 -13492269
2872a3492269k598296p75987J639043K836442L507154L881986K270978m62348
$$ -13492269 -16090565 -16866552 -15227509 -12391067 -8883913 -5001927 -2730949 -3193297
2864c193297k503805l294040k354808M08897K614351K278679J124659R93346O12372
$$ -3193297 -5697102 -8991142 -11345950 -10937053 -8322702 -6044023 -4919364 -3926018 -3313646
2855c313646p16908j816750j366641p93033j280409j733712r61179J34728J119422
$$ -3313646 -4030554 -5847304 -7213945 -8006978 -9287387 -11021099 -11982278 -11847550 -10728128
2846a0728128J224031P27816O63484J148300J238798K13468j017963j035083j45546
$$ -10728128 -9504097 -8776281 -8112797 -6964497 -5725699 -5512231 -6530194 -7565277 -7710823
2837g710823J9200k0226j60948j233464k040233j062225q864J81915o9579Q55753
$$ -7710823 -7691623 -7711849 -7872797 -9106261 -11146494 -12208719 -12217583 -12035668 -12105247 -11249494
2827a1249494K712237K626666J121880P55076R04062L99050r39051k360217k193159
$$ -11249494 -8537257 -5910591 -4788711 -4033635 -3129573 -2730523 -3669574 -6029791 -8222950
2818h222950k12263J729780K261242Q68966r63612r46790j13275Q0746P3113k94625
$$ -8222950 -8435213 -6705433 -4444191 -3575225 -4538837 -5485627 -5598902 -5518156 -5445043 -5739668
2808e739668j957967l756145l544336j753098m69056j4164R22786J953462J350551
$$ -5739668 -7697635 -11453780 -14998116 -16751214 -17220270 -17234434 -16311648 -14358186 -13007635
2799a3007635O44981J550775J658006K44071q04484q22701n67402q49076K7224
$$ -13007635 -12362654 -10811879 -9153873 -8909802 -9714286 -10536987 -11104389 -11953465 -11926241
2790a1926241L154932M628513L671460K488820J186641q68367j777578r31503
$$ -11926241 -8771309 -4142796 -471336 2017484 3204125 2335758 558180 -373323
2782c73323m09977j61852j96502r92084j408488p59328p8933l55859o54134n88003
$$ -373323 -783300 -945152 -1141654 -2133738 -3542226 -4301554 -4380487 -4736346 -5390480 -5978483
2772e978483o57929p56343J29000P77165M83986M82619J365866J933062R76411
$$ -5978483 -6636412 -7392755 -7263755 -6486590 -6002604 -5519985 -4154119 -2221057 -1244646
2763a244646p82665j463653N1947J577126J232958m26207j983586k633915k063358
$$ -1244646 -2027311 -3490964 -3439017 -1861891 -628933 -1055140 -3038726 -5672641 -7735999
2754g735999j31192J204985M00290j44375R78939J271205l03942j076163j214713
$$ -7735999 -7867191 -6662206 -6261916 -6406291 -5427352 -4156147 -4460089 -5536252 -6750965
2745f750965j926538j433628J55914N99129L31214J97837j068935k126151l31686
$$ -6750965 -8677503 -10111131 -9955217 -9356088 -9024874 -8827037 -9895972 -12022123 -12353809
2736a2353809K873043L760747J947525m48591j253358r40643n33319N17079J005724
$$ -12353809 -9480766 -5720019 -3772494 -4221085 -5474443 -6415086 -6948405 -6431326 -5425602
2727e425602O4341p80156q91522j460714j357823M49975L151916M507817K720319
$$ -5425602 -5361261 -6141417 -7032939 -8493653 -9851476 -9401501 -6249585 -1741768 978551
2718I78551n80441l242905m451407l094899l94225J271588P01975p10329p45699
$$ 978551 398110 -2844795 -7296202 -10391101 -10785326 -9513738 -8811763 -9522092 -10267791
2709a0267791J47678J315157K383135K153918J651917K023534J873355N12931
$$ -10267791 -10120113 -8804956 -6421821 -4267903 -2615986 -592452 1280903 1793834
2701A793834j273741k657741l326675k494428r95473K87785J932567K795815K324054
$$ 1793834 520093 -2137648 -5464323 -7958751 -8954224 -8666439 -6733872 -3938057 -1614003
2692a614003J831825J608188o8114j999634j820445l14612P03044N78564k80441
$$ -1614003 217822 1826010 1757896 -241738 -2062183 -2376795 -1673751 -1095187 -1375628
2683a375628n95203l51631n80673j227081j800384k247137k071411q47740Q9276
$$ -1375628 -1970831 -2322462 -2903135 -4130216 -5930600 -8177737 -10249148 -11096888 -11007612
2674a1007612K72066L17079J73554j33281N27999J919790J829916Q31437N00270
$$ -11007612 -10735546 -10418467 -10244913 -10378194 -9850195 -7930405 -6100489 -5269052 -4768782
2665d768782J67154j8609N3181k70032l40930k27772m97911j004249l70747J234429
$$ -4768782 -4601628 -4620237 -4567056 -4837088 -5178018 -5405790 -5903701 -6907950 -7278697 -6044268
2655f044268J454753N01841L17830J168372J247779J28379r18041j201566q25308
$$ -6044268 -4589515 -4087674 -3769844 -2601472 -1353693 -1225314 -2143355 -3344921 -4170229
2646d170229J26622M24881n38887j846891k161818o54293M63500K43591k36146
$$ -4170229 -4043607 -3618726 -4157613 -6004504 -8166322 -8820615 -8357115 -8113524 -8349670
2637h349670J81068J430880K009593J192730m61549j152547p43698k19267M66169
$$ -8349670 -8168602 -6737722 -4728129 -3535399 -3996948 -5149495 -5893193 -6112460 -5646291
2628e646291J274258P18029j712445k852715p92206J550036J798026J319458J775541
$$ -5646291 -4372033 -3654004 -5366449 -8219164 -9011370 -7461334 -5663308 -4343850 -2568309
2619b568309K268664J410971q3811j058099j625555k198262k262726j611114n93416
$$ -2568309 -299645 1111326 1027515 -30584 -1656139 -3854401 -6117127 -7728241 -8321657
2610h321657j77033m10152k5624J546261K565217J373304q04080j479220m94092
$$ -8321657 -8498690 -8908842 -8934466 -7388205 -4822988 -3449684 -4253764 -5732984 -6227076
2601f227076L87113Q12058Q87075N83076k90371j079690k75810J415458K780550
$$ -6227076 -5839963 -5027905 -4140830 -3557754 -3848125 -4927815 -5203625 -3788167 -1007617
2592a007617L160464J804712L026r48736p96394j27350Q78716J686604R01890
$$ -1007617 2152847 3957559 3960585 3011849 2215455 2088105 2966821 4653425 5555315
2583E555315j229188l057079k974046j543968r98485j823942j706332o53180o24615
$$ 5555315 4326127 1269048 -1704998 -3248966 -4247451 -6071393 -7777725 -8430905 -9055520
2574i055520j694981j921793n30017O30382O89759L17073m86365j250770n49243
$$ -9055520 -10750501 -12672294 -13202311 -12571929 -11882170 -11565097 -12051462 -13302232 -13851475
2565a3851475R00482J001654l23669l87533K017649M518496M500197K287666M64873
$$ -13851475 -12950993 -11949339 -12273008 -12660541 -10642892 -6124396 -1624199 663467 1128340
2556A128340k40726q35934j281358j487895j174908j04533p4400j449957j925837
$$ 1128340 887614 51680 -1229678 -2717573 -3892481 -3997014 -4071414 -5521371 -7447208
2547g447208n80621J346747K096510J517328Q76274Q87586J212387P21469n64937
$$ -7447208 -8027829 -6681082 -4584572 -3067244 -2190970 -1303384 -90997 630472 65535
2538F5535j881444l398522m805975n510442m863683k974150k249845m088807o308718
$$ 65535 -1815909 -5214431 -10020406 -15530848 -20394531 -23368681 -25618526 -29707333 -36016051
2529c6016051o797870n617248l397534j590701j632405l427764m831515l770465
$$ -36016051 -42813921 -48431169 -51828703 -53419404 -55051809 -58479573 -63311088 -67081553
2521f7081553q55192J399700L256758N716331O235788M552455L090698L354146
$$ -67081553 -67936745 -66537045 -63280287 -57563956 -51328168 -46775713 -43685015 -40330869
2513d0330869M041313L307373J576523J38475N82812J893152K028775K369550
$$ -40330869 -36289556 -32982183 -31405660 -31267185 -30684373 -28791221 -26762446 -24392896
2505b4392896L284065L239008K936336L453176L194289J973379M6530j550664
$$ -24392896 -21108831 -17869823 -14933487 -11480311 -8286022 -6312643 -6266113 -7816777
2497g816777j330341k87304o35581j888807k489690j966270k03047K026140K732194
$$ -7816777 -9147118 -9434422 -10070003 -11958810 -14448500 -16414770 -16617817 -14591677 -11859483
2488a1859483L044565L115728J546791l93617j727034k653983l063993k418269
$$ -11859483 -8814918 -5699190 -4152399 -4546016 -6273050 -8927033 -11991026 -14409295
2480a4409295o88463J340596K175898J859940J810499K205898J923821J616591
$$ -14409295 -15097758 -13757162 -11581264 -9721324 -7910825 -5704927 -3781106 -2164515
2472b164515J383364M45401K20150L47032L5625j68421l05689K2850p6493q55836
$$ -2164515 -781151 -335750 -115600 231432 267057 98636 -207053 -184203 -260696 -1116532
2462a116532j353069j037252J9664R10065J110832J022890R37118J36416p11290
$$ -1116532 -2469601 -3506853 -3487189 -2577124 -1466292 -443402 493716 630132 -81158
2453h1158m70149k99280j165903j679416j390192j306550r79774J03293R86739
$$ -81158 -551307 -850587 -2016490 -3695906 -5086098 -6392648 -7372422 -7269129 -6282390
2444f282390J82680j023727k077290k454675k442569k517321k049689j122013
$$ -6282390 -6099710 -7123437 -9200727 -11655402 -14097971 -16615292 -18664981 -19786994
2436a9786994L82423K497749L934092L021238O25434p46031q46311p24654p22448
$$ -19786994 -19404571 -16906822 -12972730 -9951492 -9326058 -10072089 -10918400 -11643054 -12365502
2427a2365502n97463N21238K377441K724852R67909p48804j147113r91874k82178
$$ -12365502 -12962965 -12441727 -10064286 -7339434 -6371525 -7120329 -8267442 -9259316 -9541494
2418i541494P41073J220107P94106L74711l24703j759667k406482j803867P2831
$$ -9541494 -8800421 -7580314 -6786208 -6411497 -6736200 -8495867 -10902349 -12706216 -12633385
2409a2633385J869232K097182J502866J51915k144691m488575m148864j605426
$$ -12633385 -10764153 -8666971 -7164105 -7012190 -9156881 -13645456 -17794320 -19399746
2401a9399746r40777k770051l818239k849438k480705l655038n154174o301595
$$ -19399746 -20340523 -23110574 -26928813 -29778251 -32258956 -35913994 -41068168 -47369763
2393d7369763o435721m986306k974912k056563j087938R19226K428177K780795
$$ -47369763 -53805484 -58791790 -61766702 -63823265 -64911203 -63991977 -61563800 -58783005
2385e8783005K880669K916800K777410K448776K284708K553443L187264L488015
$$ -58783005 -55902336 -52985536 -50208126 -47759350 -45474642 -42921199 -39733935 -36245920
2377c6245920L505418L345993L233688L113641K058043J636939K112550K360366
$$ -36245920 -32740502 -29394509 -26160821 -23047180 -20989137 -19352198 -17239648 -14879282
2369a4879282K373645K421463K528373K017415L12100k307775m606219m537270
$$ -14879282 -12505637 -10084174 -7555801 -5538386 -5226286 -7534061 -12140280 -16677550
2361a6677550k628679j199164p11318L88921K342132L768842L375870K039814
$$ -16677550 -19306229 -20505393 -21216711 -20827790 -18485658 -14716816 -11340946 -9301132
2353i301132J469001J874732K020926L44379k179091k782653k376883j981351
$$ -9301132 -7832131 -5957399 -3936473 -3592094 -5771185 -8553838 -10930721 -12912072
2345a2912072j360206n06955P34254J944097K020556N01322j629249l337387l752073
$$ -12912072 -14272278 -14779233 -14044979 -12100882 -10080326 -9579004 -11208253 -14545640 -18297713
2336a8297713j817591P60205J778640J958049J887297J382632N75059P2858m36485
$$ -18297713 -20115304 -19355099 -17576459 -15618410 -13731113 -12348481 -11773422 -11700564 -12137049
2327a2137049j018392m57380J045308K040300J984323O51880j169384j146036
$$ -12137049 -13155441 -13612821 -12567513 -10527213 -8542890 -7891010 -9060394 -10206430
2319a0206430j3153l71854j610399j872282j049402M15345K288984L470728L090228
$$ -10206430 -10219583 -10591437 -12201836 -14074118 -15123520 -14708175 -12419191 -8948463 -5858235
2310e858235O57479k285242l089257j544104K69761P75429J98556K8539N89582
$$ -5858235 -5200756 -7485998 -10575255 -12119359 -11849598 -11074169 -10875613 -10847074 -10257492
2301a0257492O27724l36826j542835k687971l424658k520398l99731J413583J922652
$$ -10257492 -9629768 -9966594 -11509429 -14197400 -17622058 -20142456 -20542187 -19128604 -17205952
2292a7205952K91085j841113j893062L89661L143257M127056L659731J796470
$$ -17205952 -16914867 -18755980 -20649042 -20259381 -17116124 -12989068 -9329337 -7532867
2284g532867j186211k864257k514317j018058J014942J921065J249681N04823
$$ -7532867 -8719078 -11583335 -14097652 -15115710 -14100768 -12179703 -10930022 -10425199
2276a0425199j01638m50704j69066N39679N58153j12835j99470L91819J589583
$$ -10425199 -10526837 -10977541 -11146607 -10606928 -10048775 -10161610 -10361080 -9969261 -8379678
2267h379678K943077K511673m9896k192183k613327k419897k024687r02330J94437
$$ -8379678 -5436601 -2924928 -2974824 -5167007 -7780334 -10200231 -12224918 -13127248 -12932811
2258a2932811M01726N92372J072245O64137j49854M3576J159554K268193K020523
$$ -12932811 -12531085 -11938713 -10866468 -10202331 -10352185 -10308609 -9149055 -6880862 -4860339
2249d860339Q94152M30853Q47557K401755L354345J260117j145196n15905J351310
$$ -4860339 -3966187 -3535334 -2687777 -286022 3068323 4328440 3183244 2667339 4018649
2240D018649K061355J627213P23360m6159j74056l98901j338372k781095l722880
$$ 4018649 6080004 7707217 8430577 8384418 8210362 7811461 6473089 3691994 -30886
2231c0886l264126k827676m222984o565653o579263l501214o07369O02601P03228
$$ -30886 -3295012 -6122688 -10345672 -16911325 -23490588 -26991802 -27599171 -26996570 -26293342
2222b6293342J488965L583895M619910L472997K224540K244768K790423L362991
$$ -26293342 -24804377 -21220482 -16600572 -13127575 -10903035 -8658267 -5867844 -2504853
2214b504853K724114L89670j675215k680601k823456k306293j161160j65344Q8300
$$ -2504853 219261 608931 -1066284 -3746885 -6570341 -8876634 -10037794 -10203138 -10114838
2205a0114838M46051Q37886J023383J382052J460705L86488k26315N15758J145853
$$ -10114838 -9668787 -8830901 -7807518 -6425466 -4964761 -4578273 -4804588 -4288830 -3142977
2196c142977N40621j130982k691914k498437n18586Q16061M54701L9313J031251
$$ -3142977 -2602356 -3733338 -6425252 -8923689 -9442275 -8626214 -8171513 -8132200 -7100949
2187g100949J852796J956737L420671N691966O966931O611088N242175M675797
$$ -7100949 -5248153 -3291416 129255 5821221 12788152 19399240 24641415 29317212
2179B9317212O081776Q690316J0518030J0188983P518814K343441l149001n807552
$$ 29317212 35398988 44089304 54607334 64796317 72315131 74658572 71509571 65702019
2171F5702019n250171l297150j604764N85537L248152N051710O577195P492689
$$ 65702019 60451848 57154698 55549934 56135471 59383623 64435333 71012528 78505217
2163G8505217N742659J903018j975523o110909r310035j0583161j0801481j0351613
$$ 78505217 84247876 86150894 84175371 78064462 68754427 58171266 47369785 37018172
2155C7018172q080966m044045j761487k439475k927332k420800k583188k633227
$$ 37018172 28937206 24893161 23131674 20692199 17764867 15344067 12760879 10127652
2147A0127652j705630j360076j704253j837363k272392k908126k524973p54290
$$ 10127652 8422022 7061946 5357693 3520330 1247938 -1660188 -4185161 -4939451
2139d939451O07219P49787P90266R13735J77571q25819o71702N97818J378902
$$ -4939451 -4332232 -3582445 -2792179 -1878444 -1700873 -2526692 -3198394 -2600576 -1221674
2130a221674J212613K71374q36180j463895k281047k932812j743868M65130J151672
$$ -1221674 -9061 262313 -573867 -2037762 -4318809 -7251621 -8995489 -8530359 -7378687
2121g378687j74239j802024j313536J48183O92157q8469j512450o94514K935006
$$ -7378687 -7552926 -9354950 -10668486 -10520303 -9828146 -9916615 -11429065 -12123579 -9188573
2112i188573N380692M700836K407952J07207p82362o68617n41375n66630r19643
$$ -9188573 -3807881 892955 3300907 3408114 2625752 1957135 1415760 849130 -70513
2103g0513j207299q94003j303088k672191k855061j379706J58846J47372j087843
$$ -70513 -1277812 -2171815 -3474903 -6147094 -9002155 -10381861 -10223015 -10075643 -11163486
2094a1163486k186781j787291k42131Q23287J288279K281264L932594M527619
$$ -11163486 -13350267 -15137558 -15379689 -14556402 -13268123 -10986859 -7054265 -2526646
2086b526646K246490m84157q15967m68943j07587M96677N77432M93174R55973
$$ -2526646 -280156 -764313 -1580280 -2049223 -2156810 -1660133 -1082701 -589527 366446
2077C66446J847840K573587K456568J841386Q34947n63997j335872j487280j667911
$$ 366446 2214286 4787873 7244441 9085827 9920774 9356777 8020905 6533625 4865714
2068D865714j939984j067240O13255J011007K89139j178702k903553m315211l899046
$$ 4865714 2925730 1858490 2471745 3482752 3771891 2593189 -310364 -4625575 -8524621
2059h524621j036104K272909M085276M496552M527745L914178K553565J447132
$$ -8524621 -9560725 -7287816 -3202540 1294012 5821757 9735935 12289500 13736632
2051A3736632J418379K774106N012252P085236P834917P465574Q474344J1678419
$$ 13736632 15155011 17929117 22941369 30026605 37861522 45327096 53801440 65479859
2043F5479859J6572315K4436750L4385442M2561791M3555633L1132563R031693
$$ 65479859 82052174 106488924 140874366 183436157 226991790 258124353 267156046
2036B67156046j4843077l2701409l7179981l2227467k4523078j6320107q381582
$$ 267156046 252312969 219611560 182431579 150204112 125681034 109360927 100979345
2029A00979345k953038j168112l775319r100469j2174522j1940101j0243809q130742
$$ 100979345 98026307 96858195 93082876 83982407 71807885 59867784 49623975 41493233
2021D1493233o334192m866236k637570n59385q61143l512177n208566m484490
$$ 41493233 35159041 30292805 27655235 27095850 26234707 22722530 17513964 13029474
2013A3029474k716663j619711k223947k936182j461374R11458K364114K268196
$$ 13029474 10312811 8693100 6469153 3532971 2071597 2983055 5347169 7615365
2005G615365K69944j525838j242237M2522P30204J516309K157975R47427o71204
$$ 7615365 7885309 6359471 5117234 5159756 5889960 7406269 9564244 10511671 9840467
1996I840467m07249R81658J203494K33882j226718k482394k542620k839567l998370
$$ 9840467 9433218 10414876 11618370 11852252 10625534 8143140 5600520 2760953 -1237417
1987a237417m501417l004745m1941K932544M045777L215627K240568J304123M17933
$$ -1237417 -5738834 -8743579 -8785520 -5852976 -1807199 1408428 3648996 4953119 5371052
1978E371052l38232r20007j386990j182693K70895K316434L359484K682487J182592
$$ 5371052 5032820 4112813 2725823 1543130 1814025 4130459 7489943 10172430 11355022
1969A1355022n71226j188220q33701r31061j688393k949504l478887k142593j07858
$$ 11355022 10783796 9595576 8761875 7830814 6142421 3192917 -285970 -2428563 -2536421
1960b536421J371224K148045J661488P67832J006126J610611J229266N46643O58482
$$ -2536421 -1165197 982848 2644336 3412168 4418294 6028905 7258171 7804814 8463296
1951H463296O46683o85714k825617l954027l563321k020384o91358j78790l23618
$$ 8463296 9109979 8424265 5598648 1644621 -1918700 -3939084 -4630442 -4809232 -5132850
1942e132850j017361j089823L81952K387226L529089K356376n17778k346878k166359
$$ -5132850 -6150211 -7240034 -6858082 -4470856 -941767 1414609 896831 -1450047 -3616406
1933c616406p01944J144042K394158K117224Q13058l82116n06917J222493L125881
$$ -3616406 -4318350 -3174308 -780150 1337074 2150132 1768016 1261099 2483592 5609473
1924E609473L788960L411532J910984Q5796j079703r72808j019914k103474l457964
$$ 5609473 9398433 12809965 14720949 14806745 13727042 12754234 11734320 9630846 6172882
1915F172882m022692l144173j020179L61413J020500J349863R96516n5065m44249
$$ 6172882 2150190 -993983 -2014162 -1652749 -632249 717614 1714130 1659065 1214816
1906A214816L59579J353766J395319Q01064J176505K271105M195140O580742Q288474
$$ 1214816 1574395 2928161 4323480 5124544 6301049 8572154 12767294 19348036 27636510
1897B7636510J0270896J1375896Q219202J695716l946215o903272p098978m847141
$$ 27636510 37907406 49283302 57502504 59198220 55252005 48348733 41249755 36402614
1889C6402614j971144p03387j100119o36753J105363L238564M958931N408068
$$ 36402614 34431470 33728083 32627964 31991211 33096574 36335138 41294069 46702137
1881D6702137N264646N258677N398685O659679J0671476J7585361K5606769L3602943
$$ 46702137 51966783 57225460 62624145 69283824 79955300 97540661 123147430 156750373
1873A56750373M0346677M3417438L6733881J5287576j4527381l8079307m6041753
$$ 156750373 197097050 240514488 277248369 292535945 278008564 239929257 193887504
1866A93887504m1744918l3725528k6081215j8318351j1643771o723965l698565
$$ 193887504 152142586 118417058 92335843 74017492 62373721 55649756 51951191
1859E1951191k466909l002863m411349m525913l655523k582840k147484k829673
$$ 51951191 49484282 46481419 42070070 37544157 33888634 31305794 29158310 26328637
1851B6328637l893825m394904m324433l295576j932694k038324k999250k526917
$$ 26328637 22434812 18039908 13715475 10419899 8487205 6448881 3449631 922714
1843I22714j087235k11173O57160J596195J712318R54689L22203L43327M02221
$$ 922714 -164521 -375694 281466 1877661 3589979 4544668 4866871 5210198 5612419
1834E612419n61088j447725l67684Q68720R42576j57936k114663l062873k009106
$$ 5612419 5051331 3603606 3235922 4104642 5047218 4889282 2774619 -288254 -2297360
1825b297360j77169K23095l37862O4403M53956n26505j634113j778000q17281
$$ -2297360 -2474529 -2251434 -2589296 -2524893 -2070937 -2597442 -4231555 -6009555 -6826836
1816f826836L12772R53275R95073Q86508J479008J722116Q33834O80351J820452
$$ -6826836 -6514064 -5560789 -4565716 -3679208 -2200200 -478084 355750 1036101 2856553
1807B856553J386869o75676j432357J07473J442248J074422j29990j374602j742185
$$ 2856553 4243422 3567746 2135389 2242862 3685110 4759532 4629542 3254940 1512755
1798A512755o20522O43961P54753R54656J551996J368844P77051M13931R3763
$$ 1512755 892233 1536194 2290947 3245603 4797599 6166443 6943494 7357425 7451188
1789G451188j42287l44126j172967k195863k760768k159058j249888j36624J733949
$$ 7451188 7308901 6964775 5791808 3595945 835177 -1323881 -2573769 -2710393 -976444
1780i76444K952985L010509J546565n53797j916576k701492k847230j868007N5110
$$ -976444 1976541 4987050 6533615 5979818 4063242 1361750 -1485480 -3353487 -3298377
1771c298377K022081L266300K407840n34723l356851l664027j901122p77623p24917
$$ -3298377 -1276296 1990004 4397844 3863121 506270 -3157757 -5058879 -5836502 -6561419
1762f561419l94798N33437J027748J324433J129119r77061l444668l592477j187167
$$ -6561419 -6956217 -6422780 -5395032 -4070599 -2941480 -3918541 -7363209 -10955686 -12142853
1753a2142853J451791K782345K579102K748682L176982J977902K01257k51064
$$ -12142853 -10691062 -7908717 -5329615 -2580933 596049 2573951 2775208 2524144
1745B524144j21017M06061J992818K093597n63857k914409k070735N1957P21024
$$ 2524144 2403127 2809188 4802006 6895603 6331746 3417337 1346602 1398559 2119583
1736B119583L43485M97803N13964k09862m73545k87669l13828J88334M12337o21959
$$ 2119583 2463068 2960871 3474835 3264973 2791428 2503759 2189931 2378265 2790602 2168643
1726B168643j424287j298595j033738q00713l65674k53433l91242N05897K062866
$$ 2168643 744356 -554239 -1587977 -2388690 -2754364 -3007797 -3399039 -2893142 -830276
1717h30276J572280J03925m6021j7776J27345J55741n47488j748239j900033j280941
$$ -830276 742004 845929 799908 782132 909477 1065218 517730 -1230509 -3130542 -4411483
1707d411483r59008o9456J197736J745782J996817J791080M34882j732125k783551
$$ -4411483 -5370491 -5439947 -4242211 -2496429 -499612 1291468 1726350 -5775 -2789326
1698b789326j959473o03933q9802J0120O43250J220369J213324N92641j37346
$$ -2789326 -4748799 -5352732 -5442534 -5432414 -4789164 -3568795 -2355471 -1762830 -1900176
1689a900176m04883k61827L48283J793986L120540L581701K887984N45077k331395
$$ -1900176 -2305059 -2566886 -2218603 -424617 2695923 6277624 9165608 9710685 7379290
1680G379290l735134k360412O4937L01634j825447k248796O23475L866740M761152
$$ 7379290 3644156 1283744 1348681 1650315 -175132 -2423928 -1800453 2066287 6827439
1671F827439L576740J816095M38259l33785j837066l527204l259828j749752r19514
$$ 6827439 10404179 12220274 12658533 12324748 10487682 6960478 3700650 1950898 1031384
1662A031384j073854p74729R817M08333j29263p99285o42108r29394q25395K7024
$$ 1031384 -42470 -817199 -807382 -399049 -528312 -1327597 -1969705 -2899099 -3724494 -3697470
1652c697470P09061N87617L39276O49227J249006K017626K323422K836334K852067
$$ -3697470 -2988409 -2400792 -2061516 -1412289 -163283 1854343 4177765 7014099 9866166
1643I866166J069276j310061k747953l107143l021421l086908l192253j707025
$$ 9866166 10935442 9625381 6877428 3770285 748864 -2338044 -5530297 -7237322
1635g237322R58149K045151O35702j125861q12637O23855J463181J355938l08241
$$ -7237322 -6279173 -4234022 -3598320 -4724181 -5536818 -4912963 -3449782 -2093844 -2402085
1626b402085k370787j859600Q10390K002185J693447J847670J558063J05840j239359
$$ -2402085 -4772872 -6632472 -5822082 -3819897 -2126450 -278780 1279283 1385123 145764
1617A45764j379652k59687Q93610J675508J591436K5995p82835M47037J482411
$$ 145764 -1233888 -1493575 -599965 1075543 2666979 2692974 1910139 2357176 3839587
1608C839587J595820J195398J347693K157581K318609J445403O87742k45284j658080
$$ 3839587 5435407 6630805 7978498 10136079 12454688 13900091 14587833 14342549 12684469
1599A2684469j948325j444922j841602k984361l393532k859317k386023j826489
$$ 12684469 10736144 9291222 7449620 4465259 1071727 -1787590 -4173613 -6000102
1591f000102l82765J346133K518934L016852K877958K381806Q81521j722961l282702
$$ -6000102 -6382867 -5036734 -2517800 499052 3377010 5758816 6640337 4917376 1634674
1582A634674k257576q38877o15225n01845j45359o93682j525139j851099k218644
$$ 1634674 -622902 -1461779 -2077004 -2578849 -2724208 -3417890 -4943029 -6794128 -9012772
1573i012772r24716J711342L359573L129879N77353j813817j195252M85277J511651
$$ -9012772 -9937488 -8226146 -4866573 -1736694 -1159341 -2973158 -4168410 -3683133 -2171482
1564b171482K011092K260841K556510K071909k18944k590656k847940j005706
$$ -2171482 -160390 2100451 4656961 6728870 6509926 3919270 1071330 65624
1556F5624Q41276P65708m05639q52552n07813L09585K093967L110703K220191
$$ 65624 906900 1672608 1266969 414417 -93396 216189 2310156 5420859 7641050
1547G641050K46548j770011k706022k553215j804018j014535n12169o14290j428554
$$ 7641050 7887598 6117587 3411565 858350 -945668 -1960203 -2472372 -3086662 -4515216
1538d515216j764994n16635J308843K026868J367327O9548j154457j290411o45334
$$ -4515216 -6280210 -6796845 -5488002 -3461134 -2093807 -2024259 -3178716 -4469127 -5114461
1529e114461n47211l38264J168339K983331M319081L659962N83664j720504k090438
$$ -5114461 -5661672 -5999936 -4831597 -1848266 2470815 6130777 6714441 4993937 2903499
1520B903499k267389k327570j082444J08242k59263j162776k130292k129179q02502
$$ 2903499 636110 -1691460 -2773904 -2665662 -2924925 -4087701 -6217993 -8347172 -9149674
1511i149674Q55710J628597J226562R16787N19838K55969M20984m66420j268262
$$ -9149674 -8293964 -6665367 -5438805 -4522018 -4002180 -3746211 -3325227 -3791647 -5059909
1502e059909p55185r1645P6544o61282j957805k766612k281922k22144K559183
$$ -5059909 -5815094 -5906739 -5830195 -6491477 -8449282 -11215894 -13497816 -13719960 -11160777
1493a1160777L735081K863458M23132j552341j410680m68228O1496l86259r04334
$$ -11160777 -7425696 -4562238 -4139106 -5691447 -7102127 -7570355 -7508859 -7895118 -8799452
1484h799452q25708o28934j28204P47721J187693J122329J287201J296298J022196
$$ -8799452 -9625160 -10254094 -10382298 -9634577 -8446884 -7324555 -6037354 -4741056 -3718860
1475c718860P08363J42820k33074k40942q27325j667527j957824j277233P59130
$$ -3718860 -3010497 -2867677 -3100751 -3341693 -4169018 -5836545 -7794369 -9071602 -8312472
1466h312472J789251J558352O72928m49305j186044j603018j261912l92744L50537
$$ -8312472 -6523221 -4964869 -4291941 -4741246 -5927290 -7530308 -8792220 -9184964 -8834427
1457h834427J421013J488346M98636K6675j5626J487207L219959L028476J597779
$$ -8834427 -7413414 -5925068 -5426432 -5399757 -5415383 -3928176 -708217 2320259 3918038
1448C918038K13022q81151j952330k116628j180625q03793l95547Q00225J305237
$$ 3918038 4131060 3249909 1297579 -819049 -1999674 -2803467 -3199014 -2398789 -1093552
1439a093552J584042J945481N33408j727943l203101k751443k74402K313636L402114
$$ -1093552 490490 2435971 2969379 1241436 -1961665 -4713108 -4987510 -2673874 728240
1430G28240L007401K297709J137607k36174j077774j658860j852698j554385q86744
$$ 728240 3735641 6033350 7170957 6934783 5857009 4198149 2345451 791066 -95678
1421i5678l45181j117284k857464l873091l547044j198898J590672K238919J491116
$$ -95678 -440859 -1558143 -4415607 -8288698 -11835742 -13034640 -11443968 -9205049 -7713933
1412g713933J284594J745764J179738p61967k944538l641618j818507J374619
$$ -7713933 -6429339 -4683575 -3503837 -4265804 -7210342 -10851960 -12670467 -11295848
1404a1295848K499574J650018J824770K630257J701750j90805j626954k804223
$$ -11295848 -8796274 -7146256 -5321486 -2691229 -989479 -1180284 -2807238 -5611461
1396e611461l343379k143282J012660L400380L060484J55993l618273m582817
$$ -5611461 -8954840 -11098122 -10085462 -6685082 -3624598 -3468605 -7086878 -11669695
1388a1669695k736622k76392J616556K181261K261311J821145J105203R66847
$$ -11669695 -14406317 -14682709 -13066153 -10884892 -8623581 -6802436 -5697233 -4730386
1380d730386J400716J120758j05007j003355r71069q89062r0135J424393K096655
$$ -4730386 -3329670 -2208912 -2313919 -3317274 -4288343 -5177405 -5267540 -3843147 -1746492
1371a746492J575546K84198j98243R44164K712668L567781K693150J172881j185614
$$ -1746492 -170946 113252 -84991 859173 3571841 7139622 9832772 11005653 9820039
1362I820039k597335j503820R037L66611K67362L19184P67949J685355K106024
$$ 9820039 7222704 5718884 5727921 6094532 6361894 6681078 7449027 9134382 11240406
1353A1240406J137455n67142j275967r91704r32979j402401k390529l823488m763351
$$ 11240406 12377861 11810719 10534752 9543048 8610069 7207668 4817139 993651 -3769700
1344c769700l585316q13048R22099J404438J233031J335253J914067K916649L161810
$$ -3769700 -7355016 -8168064 -7245965 -5841527 -4608496 -3273243 -1359176 1557473 4719283
1335D719283K242903J414162L32511j230463k764660l339031k182235k67938J377591
$$ 4719283 6962186 8376348 8708859 7478396 4713736 1374705 -807530 -1075468 302123
1326C02123K258858J520737o63600k616147k815311k652037k602848j766433p69035
$$ 302123 2560981 4081718 3418118 801971 -2013340 -4665377 -7268225 -9034658 -9803693
1317i803693J0806O94292P83444L33560R5764K87633Q37677J503850K106053K502571
$$ -9803693 -9792887 -9098595 -8315151 -7981591 -7885827 -7598194 -6760517 -5256667 -3150614 -648043
1307f48043K974622K075044l47628k085837l081933l530222k351640m6461K120858
$$ -648043 2326579 4401623 4053995 1968158 -1113775 -4643997 -6995637 -7042098 -4921240
1298d921240L248421L281362K775429J683441k42711k408290l124783j675202
$$ -4921240 -1672819 1608543 4383972 6067413 5824702 3416412 291629 -1383573
1290a383573N58978R12048r37927k036943q42285J292953K100973J840890J826692
$$ -1383573 -824595 87453 -850474 -2887417 -3729702 -2436749 -335776 1505114 3331806
1281C331806J408355J95009l32834p2979m18583j503656j426273L8641J739990
$$ 3331806 4740161 4935170 4602336 4529357 4110774 2607118 1180845 1219486 2959476
1272B959476K216239Q46280K77683J751829K783411K490685K174024J212021J65597
$$ 2959476 5175715 6021995 6299678 8051507 10834918 13325603 15499627 16711648 16877245
1263A6877245p21787k715617n165004n709634m221651k524969j794334j802377
$$ 16877245 16155458 13439841 8274837 2565203 -1656448 -4181417 -5975751 -7778128
1255g778128j040047L90234J236680J351609K134545L234946K742257J516366
$$ -7778128 -8818175 -8427941 -7191261 -5839652 -3705107 -470161 2272096 3788462
1247C788462O59393m97872j552865j991767j959059j376790n77374K82794R81510
$$ 3788462 4447855 3949983 2397118 405351 -1553708 -2930498 -3507872 -3225078 -2243568
1238b243568R70106P99950J518814K825074K863431R93849q71071k029268l300827
$$ -2243568 -1273462 -473512 1045302 3870376 6733807 7727656 6856585 4827317 1526490
1229A526490l983187l465820k544366j202249J134442L830691M609155K728406
$$ 1526490 -2456697 -5922517 -8466883 -9669132 -8534690 -4703999 -94844 2633562
1221B633562P07545O941k11171k81713O90779J111909j71453j276592n78112P04167
$$ 2633562 3341107 3348048 3136877 2855164 3545943 4657852 4486399 3209807 2631695 3335862
1211C335862J190124M31488n59250j2228P38439J054300R44915k29061j161803
$$ 3335862 4525986 4957474 4398224 4385996 5124435 6178735 7123650 6894589 5732786
1202E732786j377712k475597l552980l136641k283409j293871l97658N31467J454095
$$ 5732786 4355074 1879477 -1673503 -4810144 -7093553 -8387424 -8785082 -8253615 -6799520
1193f799520J724884J446520P58884N45031N24640r3812j69687K77049j05297
$$ -6799520 -5074636 -3628116 -2869232 -2324201 -1799561 -1893373 -2063060 -1786011 -1891308
1184a891308j476922k064302r78205o79179j045407n71343K00552L79821J177144
$$ -1891308 -3368230 -5432532 -6410737 -7089916 -8135323 -8706666 -8506114 -8126293 -6949149
1175f949149K384834J835658j06237j444046j360796o80870l24483p03987j471487
$$ -6949149 -4564315 -2728657 -2834894 -4278940 -5639736 -6320606 -6645089 -7349076 -8820563
1166h820563o14141J302882J844683J141629l0518p72019m78832Q13583K395443
$$ -8820563 -9434704 -8131822 -6287139 -5145510 -5176028 -5948047 -6426879 -5613296 -3217853
1157c217853L050470K644841K244571J815130O22255l01152k36867J24423l40390
$$ -3217853 -167383 2477458 4722029 6537159 7159414 6858262 6621395 6745818 6405428
1148F405428q06177j075852k206372k416293o49027Q35740p6642k194484k878365
$$ 6405428 5599251 4523399 2317027 -99266 -748293 87447 10805 -2183679 -5062044
1139e062044j922688q39898m48807j000778j953270j877724j015318K35107K035903
$$ -5062044 -6984732 -7824630 -8273437 -9274215 -11227485 -13105209 -14120527 -13885420 -11849517
1130a1849517K673965K053453J363785K64962p38433p08465L84600J370132K093350
$$ -11849517 -9175552 -7122099 -5758314 -5493352 -6231785 -6940250 -6555650 -5185518 -3092168
1121c092168K542452J958289N74346r81087j420805q93359m69210J85177K023370
$$ -3092168 -549716 1408573 1982919 1001832 -418973 -1312332 -1781542 -1596365 427005
1112D27005L923481L507276R63778j150015j451197p76079K55464R35073L39236
$$ 427005 4350486 7857762 8821540 7671525 6220328 5444249 5699713 6634786 6974022
1103F974022j901701m308526n303711m280598j279140J123727J134295m03886
$$ 6974022 5072321 763795 -4539916 -8820514 -10099654 -8975927 -7841632 -8245518
1095h245518k081758k770662k120703q54002J9237L24009L18454P49577K185611
$$ -8245518 -10327276 -13097938 -15218641 -16072643 -16053406 -15729397 -15410943 -14661366 -12475755
1086a2475755L006758K601649K257395K387250K372080K318971K316731J357743
$$ -12475755 -9468997 -6867348 -4609953 -2222703 149377 2468348 4785079 6142822
1078F142822o49693j620814m00163J199940J953144K339975K640663K522968J703061
$$ 6142822 5493129 3872315 3472152 4672092 6625236 8965211 11605874 14128842 15831903
1069A5831903N63491k20523j147493j784724o59099J355359K528025J191085k313591
$$ 15831903 16395394 16174871 15027378 13242654 12583555 13938914 16466939 17658024 15344433
1060A5344433n019471n484117m365086k741314n95155Q34220J60333j034305o89287
$$ 15344433 10324962 4840845 475759 -2265555 -2860710 -2026490 -1866157 -2900462 -3589749
1051c589749J064213K039290J355933j84494j156200r66021k16990M44082R13446
$$ -3589749 -2525536 -486246 869687 685193 -471007 -1437028 -1654018 -1209936 -296490
1042b96490O37430p36482j470425j68174J676219K401360J757737j13783j595168
$$ -296490 340940 -395542 -1865967 -2034141 -357922 2043438 3801175 3687392 2092224
1033B092224j374569m72691K52937L79411m16082j435633r06492J414475K940948
$$ 2092224 717655 244964 497901 877312 461230 -974403 -1880895 -466420 2474528
1024B474528K979768K453862R91954j487532l686094l987412k429414m09973J441849
$$ 2474528 5454296 7908158 8900112 7412580 3726486 -260926 -2690340 -3100313 -1658464
1015a658464K969422L378721K872493K140689J349065L75780o35612j263923j666696
$$ -1658464 1310958 4689679 7562172 9702861 11051926 11427706 10792094 9528171 7861475
1006G861475k670162l581749k976761j347344N26101J832954J246966n61627j223544
$$ 7861475 5191313 1609564 -1367197 -2714541 -2188440 -355486 891480 329853 -893691
997h93691j11577M96227m89478j737076j569417k65720O96714K076042M139581
$$ -893691 -1005268 -509041 -998519 -2735595 -4305012 -4570732 -3874018 -1797976 2341605
988B341605M600505L065775J049485n23118q74002p49776j154979q11421m63138
$$ 2341605 6942110 10007885 11057370 10534252 9660250 8910474 7755495 6944074 6480936
979F480936p57843j049472j045619q76941q70304k63475J609652L067513K276727
$$ 6480936 5723093 4673621 3628002 2751061 1880757 1617282 3226934 6294447 8571174
970H571174m3631j654442j704992q62350r85415j859957j401189m2183R85663
$$ 8571174 8527543 6873101 5168109 4305759 3320344 1460387 59198 17015 1002678
961A002678O99098m25996K30499K667403L959450L852716K810352Q98176n75359
$$ 1002678 1701776 1275780 1506279 4173682 8133132 11985848 14796200 15694376 15119017
952A5119017j121756j786704k190636j676093p79569K1074N47391R63581J165894
$$ 15119017 13997261 12210557 10019921 8343828 7564259 7585333 8132724 9096305 10262199
943A0262199R26576N89933n49236j208404l63382M77745l745j170497k058191
$$ 10262199 11188775 11778708 11229472 10021068 9657686 10135431 10131686 8961189 6902998
934F902998k249451j960930j801940j799843j576423m62952J046782J734623J448485
$$ 6902998 4653547 2692617 890677 -909166 -2485589 -2948541 -1901759 -167136 1281349
925A281349J42651j518168j983125r81358j36229R4047o2582O8768J100471K190860
$$ 1281349 1424000 -94168 -2077293 -3058651 -3194880 -3100833 -3163415 -3094647 -1994176 196684
915A96684K536221J922845J201854K52448n07389K4630J67336o9695R5087r7546
$$ 196684 2732905 4655750 5857604 6110052 5602663 5627293 5794629 5724934 5820021 5722475
905E722475o01760m9517J407912J874818Q75996L51759P75444J461156J746822
$$ 5722475 5120715 5071198 6479110 8353928 9229924 9581683 10357127 11818283 13565105
896A3565105J286084R83537K69737j778184l216767k992384k943521l119674k763618
$$ 13565105 14851189 15834726 16104463 14326279 11109512 8117128 5173607 2053933 -709685
887g09685k369802k546384l222131l379417k533541p40706J955039L562309K940756
$$ -709685 -3079487 -5625871 -8848002 -12227419 -14760960 -15501666 -13546627 -9984318 -7043562
878g043562K146792J722400R55458L87974J128550J623047J446310J777648K136574
$$ -7043562 -4896770 -3174370 -2218912 -1830938 -702388 920659 2366969 4144617 6281191
869F281191Q04002k307562m298473l317438j293399o88951r34374k73973J362977
$$ 6281191 7085193 4777631 479158 -2838280 -4131679 -4820630 -5755004 -6028977 -4666000
860d666000K173611J717175J228412J337201J500820J581210J300299R93722N58678
$$ -4666000 -2492389 -775214 453198 1790399 3291219 4872429 6172728 7166450 7725128
851G725128m11398j100477r55062q57608j118146j530248j987120k821062l002741
$$ 7725128 7313730 6213253 5258191 4400583 3282437 1752189 -234931 -3055993 -6058734
842f058734j707282k27679m61595j822587k748692j912913N06229K663783K518960
$$ -6058734 -7766016 -7993695 -8455290 -10277877 -13026569 -14939482 -14433253 -11769470 -9250510
833i250510N60344p20212m85058L85163J432807J713535K46574j879789k481712
$$ -9250510 -8690166 -9410378 -9895436 -9510273 -8077466 -6363931 -6117357 -7997146 -10478858
824a0478858j254971Q01358K482007K792028J412066O26646J329065K022007K493010
$$ -10478858 -11733829 -10932471 -8450464 -5658436 -4246370 -3619724 -2290659 -268652 2224358
815B224358K542142K436024K354004J427882m93311j521544j363230l31012J012546
$$ 2224358 4766500 7202524 9556528 10984410 10491099 8969555 7606325 7275313 8287859
806H287859J227552o9591j455677k766539l818190l140189j885337j344131n93117
$$ 8287859 9515411 9445820 7990143 5223604 1405414 -1734775 -3620112 -4964243 -5557360
797e557360J254369K550103J881469l93575j782979j602100l88557J688775K517173
$$ -5557360 -4302991 -1752888 128581 -264994 -2047973 -3650073 -4038630 -2349855 167318
788A67318J811418O82849l46358n90170n86308m99052k45288j217655k965029
$$ 167318 1978736 2661585 2315227 1725057 1138749 639697 394409 -823246 -3788275
779c788275l265718k045494l25922P78562R39639J429067K438865K957836J342489
$$ -3788275 -7053993 -9099487 -9425409 -8646847 -7707208 -6278141 -3839276 -881440 461049
770D61049o11940m36438K19434p52139j680042j520671j671829j852591j115061
$$ 461049 -150891 -587329 -367895 -1120034 -2800076 -4320747 -5992576 -7845167 -8960228
761h960228R4703O52767L85397Q3641P86157J640501O44287p33107o48502J57678
$$ -8960228 -8865525 -8212758 -7827361 -7743720 -6957563 -5317062 -4672775 -5405882 -6054384 -5896706
751e896706O75351J079413J189053M33338j581349l892076m510379l275857j481202
$$ -5896706 -5221355 -4141942 -2952889 -2519551 -4100900 -7992976 -12503355 -15779212 -17260414
742a7260414L08910J144172P95655Q48808J544300J760496N75533m10837k91309
$$ -17260414 -16951504 -15807332 -15011677 -14162869 -12618569 -10858073 -10282540 -10693377 -10984686
733a0984686n1745P13777J381433P47874n58942j232496r56319n36991q94955
$$ -10984686 -11036431 -10322654 -8941221 -8193347 -8752289 -9984785 -10941104 -11478095 -12373050
724a2373050j404216p50103J458879L331710L361839K382879Q57695P21312K157840
$$ -12373050 -13777266 -14527369 -13068490 -9736780 -6374941 -3992062 -3134367 -2413055 -255215
715b55215K875059J967692n7208j372249j048670r02082k105502k025322K07421
$$ -255215 2619844 4587536 4530328 3158079 2109409 1207327 -898175 -2923497 -2716076
706b716076K581295L664889K875699J479743J125222R78689J43086M557K94526
$$ -2716076 -134781 3530108 6405807 7885550 9010772 9989461 10132547 10137104 10431630
697A0431630p1244r51325k445873l339330k429435p74205P28827J598194J049959
$$ 10431630 10360386 9409061 6963188 3623858 1194423 420218 1149045 2747239 3797198
688C797198K18489p7258j576473l703990m335961l406188j597142R49429L311217
$$ 3797198 4015687 3938429 2361956 -1342034 -5677995 -9084183 -10681325 -9731896 -6420679
679f420679L568200K204852O28317l16078n27138j1799Q35990L69729j602756
$$ -6420679 -2852479 -647627 -19310 -335388 -862526 -874325 -38335 331394 -1271362
670a271362j898584p28216o01593q08267n81068l97224p52807j560818k007071
$$ -1271362 -3169946 -3898162 -4499755 -5308022 -5889090 -6286314 -7039121 -8599939 -10607010
661a0607010j455925K17148K078231L562954M085501L002471J033051l35238q86877
$$ -10607010 -12062935 -11845787 -9767556 -6204602 -2119101 883370 1916421 1581183 694306
652F94306k321621l343917k130515k9817J002752m12875j691516j086979p19318
$$ 694306 -1627315 -4971232 -7101747 -7131564 -6128812 -6541687 -8233203 -9320182 -10039500
643a0039500j622178k094104j687864j173433M43053J356246N74179k22463m05743
$$ -10039500 -11661678 -13755782 -15443646 -16617079 -16174026 -14817780 -14243601 -14466064 -14871807
634a4871807K76936J319865K597134N091719O279392L713646k30753j964004k11772
$$ -14871807 -14594871 -13275006 -10677872 -5586153 693239 4406885 4176132 2212128 2000356
625B000356K532637K977129J231193j114472l101056m089815l088404k55650J446924
$$ 2000356 4532993 7510122 8741315 7626843 4525787 435972 -2652432 -2908082 -1461158
616a461158P79587j11382n62478q66855l70431N11603J156057J386373R89078
$$ -1461158 -681571 -792953 -1355431 -2222286 -2592717 -2081114 -925057 461316 1450394
607A450394M12871J56357k64668n37862m94473j187934j964955k022989j549616
$$ 1450394 1863265 2019622 1754954 1217092 722619 -465315 -2430270 -4453259 -6002875
598f002875q25983m20306l18365l676N42986N27227p77289k201790j602380M70407
$$ -6002875 -6828858 -7249164 -7567529 -7571205 -7028219 -6500992 -7278281 -9480071 -11082451 -10612044
588a0612044J259675M81639n72279j402254j841881k018358j164248Q56681K183396
$$ -10612044 -9352369 -8870730 -9443009 -10845263 -12687144 -14705502 -15869750 -15013069 -12829673
579a2829673J863463L61444j053836j115914L17018N46421r73589j945053j624525
$$ -12829673 -10966210 -10604766 -11658602 -12774516 -12457498 -11911077 -12884666 -14829719 -16454244
570a6454244k39982J541131K445739J378360P53988J917414L433300L655062K530635
$$ -16454244 -16694226 -15153095 -12707356 -11328996 -10575008 -8657594 -5224294 -1569232 961403
561I61403P96293o15658L43888J686435J311143O05876p5845j963694m152387
$$ 961403 1757696 1142038 1485926 3172361 4483504 5089380 5013535 3049841 -1102546
552a102546l861032r84194R75058J880236K219909J198014m0822q67596j151682
$$ -1102546 -4963578 -5947772 -4972714 -3092478 -872569 325445 284623 -582973 -1734655
543a734655j03147J587449K140937J650051O36630j089126k357839k673370j579060
$$ -1734655 -1837802 -250353 1890584 3540635 4177265 3088139 730300 -1943070 -3522130
534c522130N73047K446640K643837J579019J143738R32856j18320j591659k943727
$$ -3522130 -2949083 -502443 2141394 3720413 4864151 5797007 5678687 4087028 1143301
525A143301l226392j422369J56237q6843o54425j81190N35249Q78005J380513
$$ 1143301 -2083091 -3505460 -3349223 -3436066 -4090491 -4271681 -3736432 -2858427 -1477914
516a477914J246586K57034l7184o42926j778637j326904J99129Q07115J51334
$$ -1477914 -231328 25706 -11478 -654404 -2433041 -3759945 -3560816 -2753701 -2602367
507b602367o30052J55179J635935K102832J670166P38564m68404k390551m403167
$$ -2602367 -3232419 -3077240 -1441305 661527 2331693 3070257 2601853 211302 -4191865
498d191865m784378k807513J25357J767065J497051O72004R57881J851649K346730
$$ -4191865 -8976243 -11783756 -11658399 -9891334 -8394283 -7722279 -6764398 -4912749 -2566019
489b566019J986845J547610J607440J236007N5520r45539r28423p38111j162262
$$ -2566019 -579174 968436 2575876 3811883 3867403 2921864 1993441 1255330 93068
480I3068k330703l250814k203272P68449L781353N150052N261206M130103K198623
$$ 93068 -2237635 -5488449 -7691721 -6923272 -3141919 2008133 7269339 11399442 13598065
471A3598065J59580p12409m22329p79690j714136k373851k315433j804143j450982
$$ 13598065 13757645 13045236 12622907 11843217 10129081 7755230 5439797 3635654 2184672
462B184672j671321j844375j549568j618829j431876m24947M3653j30438L55607
$$ 2184672 513351 -1331024 -2880592 -4499421 -5931297 -6356244 -6312591 -6443029 -6087422
453f087422N24613j205779l201995k791294j490858k30494J295666J684346R51391
$$ -6087422 -5562809 -6768588 -9970583 -12761877 -14252735 -14483229 -13187563 -11503217 -10551826
444a0551826J131826K034886K232040J555502R91162J279265J057476o19505j229661
$$ -10551826 -9420000 -7385114 -5153074 -3597572 -2606410 -1327145 -269669 -889174 -2118835
435b118835m35897j19805l85330j418970j958143j92290K867434M358812L013981
$$ -2118835 -2554732 -2674537 -3059867 -4478837 -6436980 -6629270 -3761836 596976 3610957
426C610957P81667j035227k458935k330770j475110j058376j051428p89253o92302
$$ 3610957 4392624 3357397 898462 -1432308 -2907418 -3965794 -5017222 -5806475 -6498777
417f498777q71107q94914q66791l63587J334883K519760K074337J016779L76687
$$ -6498777 -7369884 -8264798 -9131589 -9495176 -8160293 -5640533 -3566196 -2549417 -2172730
408b172730P57887J855810J829795P98796L38807n72552k272079l325422l355719
$$ -2172730 -1414843 440967 2270762 3069558 3408365 2835813 563734 -2761688 -6117407
399f117407k995997j746168K16843J785433K904478L458647L147563J973004R91833
$$ -6117407 -9113404 -10859572 -10642729 -8857296 -5952818 -2494171 653392 2626396 3618229
390C618229N15163J7916q84506j569532j798850j447180m9577J180052J038328
$$ 3618229 4133392 4151308 3266802 1697270 -101580 -1548760 -1598337 -418285 620043
381F20043K39407j24089l55811r30110j683704j074952M58537J219314J008258
$$ 620043 859450 735361 379550 -550560 -2234264 -3309216 -2850679 -1631365 -623107
372f23107n87225k771590m424014n081360m158163j539210J274628L417587M502610
$$ -623107 -1210332 -3981922 -8405936 -13487296 -17645459 -19184669 -17910041 -14492454 -9989844
363i989844M241154K826224J122373j31892r77862j291848j715141j925812j364995
$$ -9989844 -5748690 -2922466 -1800093 -1931985 -2909847 -4201695 -5916836 -7842648 -9207643
354i207643n41447K0022O59381J382251J544589J508288J993659J756899Q67621
$$ -9207643 -9749090 -9729068 -9069687 -7687436 -6142847 -4634559 -2640900 -884001 -16380
345a6380L71570M72324L77288n33809j598312q46481J452007K122341O84198l69352
$$ -16380 355190 827514 1204802 670993 -927319 -1773800 -321793 1800548 2484746 2115394
335B115394n31746j62993j38190j174582j629391k25226J637280R62052j035642
$$ 2115394 1583648 1420655 1282465 107883 -1521508 -1746734 -109454 852598 -183044
326a83044j536867m15433J329048J724070K49325p59224L64495J702840J492581
$$ -183044 -1719911 -2135344 -806296 917774 1167099 407875 772370 2475210 3967791
317C967791J39266n72400K63883Q37403M92145K97639Q04391J916391K417207
$$ 3967791 4107057 3534657 3798540 4635943 5128088 5425727 6230118 8146509 10563716
308A0563716J106998j068649k595904k354664q75530k35445n32693p49739j841173
$$ 10563716 11670714 10602065 8006161 5651497 4775967 4540522 4007829 3258090 1416917
299A416917k604446j743459j255358j384931L94177K393847J773871L75944M63534
$$ 1416917 -1187529 -2930988 -4186346 -5571277 -5177100 -2783253 -1009382 -633438 -169904
290a69904Q17553N55057Q55362J598187J111457K14243K83004R45797P94062m33894
$$ -169904 647649 1202706 2058068 3656255 4767712 4981955 5264959 6210756 7004818 6570924
280F570924q35427N54431J733756J287379m5406j595120k058658j264021j140969
$$ 6570924 5735497 6289928 8023684 9311063 9265657 7670537 5611879 4347858 3206889
271C206889j787886j192423j31121J98628N22639J329818K144218J478298p4707
$$ 3206889 1419003 226580 95459 294087 816726 2146544 4290762 5769060 5694353
262E694353o33209r83059j013401N6032L48104m9584M51041N97788p71220j995853
$$ 5694353 5061144 4078085 3064684 3120716 3468820 3419236 3870277 4468065 3696845 1700992
252A700992k353409j855341J1259K979225N276281N564462L572027J58797k293642
$$ 1700992 -652417 -2507758 -2496499 482726 5759007 11323469 14895496 15054293 12760651
243A2760651l258040k777253j002394M04802J042288J357045O31277p13667k001510
$$ 12760651 9502611 6725358 5722964 6127766 7170054 8527099 9158376 8444709 6443199
234F443199k870694l507667l238530j930169j484366j813923j307235L3121J202164
$$ 6443199 3572505 64838 -3173692 -5103861 -6588227 -8402150 -9709385 -9676264 -8474100
225h474100K054398K718865K771822J788051O49855L02130p1056q83539j635547
$$ -8474100 -6419702 -3700837 -929015 859036 1508891 1811021 1739965 856426 -779121
216g79121k147702l058771l318153j877264q45J091348N82533m87145K42879K512302
$$ -779121 -2926823 -5985594 -9303747 -11181011 -11181856 -10090508 -9507975 -9995120 -9752241 -7239939
206g239939M267767L720833P85240k154641k579311j860906j245465J1881J030990
$$ -7239939 -2972172 748661 1533901 -620740 -3200051 -5060957 -6306422 -6294541 -5263551
197e263551K50964o37789m81271m91370r61909j275178p15075R62108K106806
$$ -5263551 -5012587 -5650376 -6131647 -6623017 -7584926 -8860104 -9575179 -8613071 -6506265
188f506265J328741n49057j109952J95740J291457J227694N39577j024082l140258
$$ -6506265 -5177524 -5726581 -6836533 -6640793 -5349336 -4121642 -3582065 -4606147 -7746405
179g746405l824632k505196l86115J348154K123107K446312K917323K911107K431525
$$ -7746405 -11571037 -14076233 -14462348 -13114194 -10991087 -8544775 -5627452 -2716345 -284820
170b84820J994423J361090P22343o32567k996455m442716m494915l360953k094282
$$ -284820 1709603 3070693 3793036 3160469 164014 -4278702 -8773617 -12134570 -14228852
161a4228852r06144P29231J946142K695486L574056K643542K254k156536k724461
$$ -14228852 -15134996 -14405765 -12459623 -9764137 -6190081 -3546539 -3544285 -5700821 -8425282
152h425282j768523o5701J187537J506898J511420J427829N99385n35107j395836
$$ -8425282 -10193805 -10259506 -9071969 -7565071 -6053651 -4625822 -4026437 -4561544 -5957380
143e957380j234300o90572P2311K188265L823679L876383K687374J440978P74372
$$ -5957380 -7191680 -7882252 -7809941 -5621676 -1797997 2078386 4765760 6206738 6981110
134F981110J014608Q41381q03459k377665k920165k202575r93920j094236j513954
$$ 6981110 7995718 8837099 8033640 5655975 2735810 533235 -460685 -1554921 -3068875
125c068875r97546o69500k04910J008837J336104R18957O24447k16659j135179
$$ -3068875 -4066421 -4735921 -4940831 -3931994 -2595890 -1676933 -1052486 -1269145 -2404324
116b404324r08681l09992J35303J215291K258759K485484J341548q76123j980548
$$ -2404324 -3313005 -3622997 -3487694 -2272403 -13644 2471840 3813388 2937265 956717
107I56717j552715j315342j224984m86242j23680P7590Q25665J279569J591111
$$ 956717 -595998 -1911340 -3136324 -3622566 -3746246 -3668656 -2842991 -1563422 27689
98B7689K260995K148422O92074j224832k292806k233904k151683k372458k140113
$$ 27689 2288684 4437106 5129180 3904348 1611542 -622362 -2774045 -5146503 -7286616
89g286616r86566J014638K309812J853887N84889k85828M20541J394339J182106
$$ -7286616 -8273182 -7258544 -4948732 -3094845 -2509956 -2795784 -2375243 -980904 201202
80B01202K28828n14663o86802q53969j087188q22524k43966N13034Q21755N87227
$$ 201202 430030 -84633 -771435 -1625404 -2712592 -3535116 -3779082 -3266048 -2444293 -1857066
70a857066L22102j94111r46742j409659j589915j286324p12270k68937r7671L59159
$$ -1857066 -1534964 -1729075 -2675817 -4085476 -5675391 -6961715 -7673985 -7942922 -8040593 -7681434
60g681434P82691L71270p01780p17973K23164p3150j020676j505896j317886J35764
$$ -7681434 -6898743 -6527473 -7229253 -7947226 -7724062 -7797212 -8817888 -10323784 -11641670 -11505906
50a1505906J379035J172620J78053q81868j284375r9417J929250L485828L773230
$$ -11505906 -10126871 -8954251 -8776198 -9658066 -10942441 -11041858 -9112608 -5626780 -1853550
41a853550K739765J249531K32420k68421o31014p39812j63725N81350K94767o94334
$$ -1853550 886215 2135746 2368166 2099745 1468731 728919 565194 1146544 1441311 746977
31G46977j259184r23803p3926L42967J56187K34990Q59314J346643P61846n10424
$$ 746977 -512207 -1436010 -1509936 -1166969 -1010782 -775792 83522 1430165 2192011 1681587
21A681587q26902l49693o79582n69724O96414J431597N54966n23947n17978o3637
$$ 1681587 854685 504992 -174590 -744314 -47900 1383697 1938663 1414716 896738 833101
11H33101k69704o28151j025022j822110k528623k711049j919073K64852K581068
$$ 833101 563397 -64754 -1089776 -2911886 -5440509 -8151558 -10070631 -9805779 -7224711
2g224711K909038J339411
$$ -7224711 -4315673 -2976262
0b976262
$$ -2976262
$$ Imaginary data points
##PAGE= N=2
##DATA TABLE= (X++(I..I)), XYDATA
16383a816806o76504j72347N73364J023155R50488J75615r80924j732458j390982
$$ -1816806 -2493310 -2665657 -2092293 -1069138 -118650 56965 -923959 -2656417 -4047399
16374d047399L30639K077965K628427K509327K457648J978306N71483j069540
$$ -4047399 -3716760 -1638795 989632 3498959 5956607 7934913 8506396 7436856
16366G436856k425371k986791j905213J41563R20585L57289M23587R51916K63607
$$ 7436856 5011485 2024694 119481 261044 1181629 1538918 1962505 2914421 3178028
16357C178028j112898j214741n06329J40558J193396K182266K325371K048158
$$ 3178028 2065130 850389 344060 484618 1678014 3860280 6185651 8233809
16349H233809J531105O43465k41485j355700j732231q04981k27642m76153k33196
$$ 8233809 9764914 10408379 10166894 8811194 7078963 6273982 6046340 5570187 5336991
16340E336991K6109m78009o59975k61940K3917k53290j37732L38545J66833l12061
$$ 5336991 5363100 4885091 4225116 3963176 3987093 3733803 3596071 3934616 4101449 3789388
16330C789388l52853r4161l27844o31677p99499n26727r3427k19104m13056j76548
$$ 3789388 3436535 3342374 3014530 2382853 1583354 1056627 963200 744096 331040 154492
16320A54492M98850R65229R47279M64641o37521j134625l71653J012305J933522
$$ 154492 653342 1618571 2565850 3030491 2392970 1258345 886692 1898997 3832519
16311C832519J435927J1964p86765o89307m27249J23771Q64980J362258J100014
$$ 3832519 5268446 5280410 4493645 3804338 3377089 3500860 4365840 5728098 6828112
16302F828112k60942j787192k064600j567557j009567p74388n84455l46152n25155
$$ 6828112 6567170 4779978 2715378 1147821 138254 -636134 -1220589 -1566741 -2091896
16293b091896r86729q07657L58450J272655J579483J782745J300554M62989n5909
$$ -2091896 -3078625 -3886282 -3527832 -2255177 -675694 1107051 2407605 2870594 2814685
16284B814685l33948k13886q33275k186834k073831o53389N37369N29552k50828
$$ 2814685 2480737 2266851 1433576 -753258 -2827089 -3480478 -2943109 -2413557 -2664385
16275b664385j355762k419890j888495Q52060K823863K152391Q69105O20571P56171
$$ -2664385 -4020147 -6440037 -8328532 -7476472 -4652609 -2500218 -1631113 -1010542 -254371
16266b54371O08146L92067Q34568K005284J949321P61367m44097j504412j405819
$$ -254371 353775 745842 1580410 3585694 5535015 6296382 5852285 4347873 2942054
16257B942054p76445j214136j712840j344834o67743J76557P15664P69948L139
$$ 2942054 2165609 951473 -761367 -2106201 -2773944 -2597387 -1881723 -1111775 -1108636
16248a108636j441236j982586j285802j22558O30073M15579K8708K03856M76908
$$ -1108636 -2549872 -4532458 -5818260 -5940818 -5310745 -4895166 -4866458 -4662602 -4185694
16239d185694N43799N87830J132008J563061J236599R50549R08433M23158j164670
$$ -4185694 -3641895 -3054065 -1922057 -358996 877603 1828152 2736585 3159743 1995073
16230A995073k461628k074952o14845J515789K892663L166866K732361J723970
$$ 1995073 -466555 -2541507 -3156352 -1640563 1252100 4418966 7151327 8875297
16222H875297L29044J84199R82770K14388q65880m89418j10019o77218o84754
$$ 8875297 9204341 9388540 10371310 10585698 9719818 9230400 9120381 8443163 7758409
16213G758409J12774j38165j406426j703719m31326Q01933J500672J091668j00108
$$ 7758409 7871183 7733018 6326592 4622873 4191547 4993480 6494152 7585820 7485712
16204G485712q16757m92744L77108m92710k550760l014892l033651l599921l238540
$$ 7485712 6668955 6176211 6553319 6060609 3509849 494957 -2538694 -6138615 -9377155
16195i377155j433570p46240j546874j534006M83546L276961M065053K884025
$$ -9377155 -10810725 -11556965 -13103839 -14637845 -14154299 -10877338 -6812285 -3928260
16187c928260J786557R78148m41883j761948j773097p84864j51077l75149q93477
$$ -3928260 -2141703 -1163555 -1605438 -3367386 -5140483 -5925347 -6076424 -6451573 -7345050
16178g345050K12673K852383M020842K340613n2377q97280m64818k64032m28113
$$ -7345050 -7132377 -4279994 -259152 2081461 2029084 1131804 666986 402954 -25159
16169b5159n69102j03230J51693n58040j124966n4390Q86607L59504n55979j661333
$$ -25159 -594261 -697491 -545798 -1103838 -2228804 -2283194 -1396587 -1037083 -1593062 -3254395
16159c254395k676629k377670l94705Q80353K79069p50546q40426p40751j447531
$$ -3254395 -5931024 -8308694 -8703399 -7823046 -7543977 -8294523 -9134949 -9875700 -11323231
16150a1323231k145153j769124r57359j87214N54590P41817J428498K226814J369676
$$ -11323231 -13468384 -15237508 -16194867 -16382081 -15827491 -15085674 -13657176 -11430362 -10060686
16141a0060686J69057J05844R27886J637533J634046J519142Q76382j40122k66579
$$ -10060686 -9891629 -9785785 -8857899 -7220366 -5586320 -4067178 -3190796 -3330918 -3597497
16132c597497L28597L06887p31093j927983k650920k088509j53919R77261J217771
$$ -3597497 -3268900 -2962013 -3693106 -5621089 -8272009 -10360518 -10514437 -9537176 -8319405
16123h319405J078862j39362j116029j024838o54915L6782J466932K238683J174862
$$ -8319405 -7240543 -7379905 -8495934 -9520772 -10175687 -10138905 -8671973 -6433290 -5258428
16114e258428m83110k72292J355713K212328K343992K480068K307693J281515
$$ -5258428 -5741538 -6013830 -4658117 -2445789 -101797 2378271 4685964 5967479
16106E967479q7469j633648k842744k993829k188333j215466K3916J357968J660711
$$ 5967479 5880010 4246362 1403618 -1590211 -3778544 -4994010 -4970094 -3612126 -1951415
16097a951415J727337K541181L291059K668559J56286j995115k363282j630098
$$ -1951415 -224078 2317103 5608162 8276721 8433007 6437892 4074610 2444512
16089B444512n29783L53514N93210j9827O43386K855148L502577K773068J843476
$$ 2444512 1914729 2268243 2861453 2841626 3485012 6340160 9842737 12615805 14459281
16080A4459281p3517j712436k349761k825744l204126l417684k950752j942498
$$ 14459281 14385764 12673328 10323567 7497823 4293697 876013 -2074739 -4017237
16072d017237k115056k853207k792261j704662J14173J617203K595138L319378
$$ -4017237 -6132293 -8985500 -11777761 -13482423 -13368250 -11751047 -9155909 -5836531
16064e836531M384936M055219J694498r7511r76408k206185k186755q72132j98113
$$ -5836531 -1451595 2603624 4298122 4200611 3224203 1018018 -1168737 -2040869 -2238982
16055b238982P11J120654K053953J392981J460169K166989K155071J843626R48535
$$ -2238982 -2238271 -1117617 936336 2329317 3789486 5956475 8111546 9955172 10903707
16046A0903707j88855q30550k374167m777071n716069m856751l656756k979470
$$ 10903707 10714852 9884302 7510135 2733064 -2983005 -7839756 -11496512 -14475982
16038a4475982k647313j868373r59177J244235M106857L907078J517410M48505
$$ -14475982 -17123295 -18991668 -19950845 -18706610 -14599753 -10692675 -9175265 -8726760
16030h726760N58275J052062K301521K928932K086127O64228J95282K61678J57173
$$ -8726760 -8168485 -7116423 -4814902 -1885970 200157 864385 1059667 1321345 1478518
16021A478518n5445Q97148K422760J570418L04230N96057O73257J135666K442783
$$ 1478518 1423073 2320221 4742981 6313399 6617629 7213686 7886943 9022609 11465392
16012A1465392J973428m8859j448267j988174j657804n84783r9720q70301k425052
$$ 11465392 13438820 13389961 11941694 9953520 8295716 7710933 7611213 6740912 4315860
16003D315860l121171k368203o36760J707813L102453K131269K9993j140499j708219
$$ 4315860 1194689 -1173514 -1810274 -102461 2999992 5131261 5161254 4020755 2312536
15994B312536k128079j670247L06808K946003L631596K198174P50603j31132j347768
$$ 2312536 184457 -1485790 -1178982 1767021 5398617 7596791 8347394 8216262 6868494
15985F868494k535812k058431O6064J336051J309825J618264K628704L049417
$$ 6868494 4332682 2274251 2340315 3676366 4986191 6604455 9233159 12282576
15977A2282576J638811o07689j369261j345250j864344k071079k065702k646638
$$ 12282576 13921387 13313698 11944437 10599187 8734843 6663764 4598062 1951424
15969A951424l944874l618667k050241j651817r73473J230519L323218L836302
$$ 1951424 -1993450 -5612117 -7662358 -9314175 -10287648 -9057129 -5733911 -1897609
15961a897609K978177K688580L181658L104236K387546N66395j751940k665108
$$ -1897609 1080568 3769148 6950806 10055042 12442588 13008983 11257043 8591935
15953H591935j449896j95662o21491j966262k671381k370577j300856j28993P86428
$$ 8591935 7142039 6946377 6324886 4358624 1687243 -683334 -1984190 -2113183 -1326755
15944a326755K236333K992978K131926Q42786l52317j644307k815671k584872
$$ -1326755 909578 3902556 6034482 6877268 6524951 4880644 2064973 -519899
15936e19899j691199j719309j903931k310822l090704k546381m08695J406678
$$ -519899 -2211098 -3930407 -5834338 -8145160 -11235864 -13782245 -14190940 -12784262
15928a2784262J815319J226397L81875l38612j48449P22099J137432N69994m46938
$$ -12784262 -10968943 -9742546 -9360671 -9699283 -9847732 -9125633 -7988201 -7418207 -7865145
15919g865145j311812j326317L613J313374J483856R25963J173890J979970J464101
$$ -7865145 -9176957 -10503274 -10499661 -9186287 -7702431 -6776468 -5602578 -3622608 -2158507
15910b158507P56420J383078J402821j288291l735968m392065l901169k218041
$$ -2158507 -1402087 -19009 1383812 95521 -3640447 -8032512 -11933681 -14151722
15902a4151722j142529p68338K53146J750195K755697K913124K712837K056626
$$ -14151722 -15294251 -16062589 -15809443 -14059248 -11303551 -8390427 -5677590 -3620964
15894c620964J745442R49095j515070k858028j477424K95680J94990p93566j512306
$$ -3620964 -1875522 -926427 -2441497 -5299525 -6776949 -6481269 -6286279 -7079845 -8592151
15885h592151j179004j56650N48227J293685J702805J292210O48577L62388j55226
$$ -8592151 -9771155 -9927805 -9379578 -8085893 -6383088 -5090878 -4442301 -4079913 -4235139
15876d235139j179569j742810j507269j127069q57999l14448O51207J512409K482285
$$ -4235139 -5414708 -7157518 -8664787 -9791856 -10649855 -10964303 -10313096 -8800687 -6318402
15867f318402M102064N025836L317687O08910p11510j136110j473266r39754P67639
$$ -6318402 -2216338 2809498 6127185 6736095 6024585 4888475 3415209 2475455 3243094
15858C243094K182060K990972L201845J722535j079998k841866k098232o43713
$$ 3243094 5425154 8416126 11617971 13340506 12260508 9418642 7320410 6676697
15850F676697l62252l50500m94857q76143j063238q20999o38072l87670j89428
$$ 6676697 6314445 5963945 5469088 4592945 3529707 2708708 2070636 1682966 1493538
15841A493538j461273k823340k441289j236130l49456L95037J191394J434311
$$ 1493538 32265 -2791075 -5232364 -6468494 -6817950 -6422913 -5231519 -3797208
15833c797208N56051r29840k324156k866256j615465l1222R433o63087j95129
$$ -3797208 -3241157 -4170997 -6495153 -9361409 -10976874 -11008096 -10998663 -11661750 -11856879
$$ [...]
##END NTUPLES=NMR SPECTRUM
##END=
