##TITLE=dept_DE-30_DMSO_TFA CH-,CH3- -up, CH2- -down
 DMSO-d6, 1600 sc
 31.07.2024
##JCAMPDX= 6.0         $$ Bruker NMR JCAMP-DX V2.0
##DATA TYPE= NMR SPECTRUM
##DATA CLASS= NTUPLES
##ORIGIN= UXNMR, Bruker Analytische Messtechnik GmbH
##OWNER= root
$$ XWIN-NMR		Version 3.5
$$ Wed Jul 31 16:20:50 2024 Russian Standard Time (UT+4h)  she@DPX200
##.OBSERVE FREQUENCY= 50.327992884445
##.OBSERVE NUCLEUS= ^13C
##.ACQUISITION MODE= SIMULTANEOUS
##.ACQUISITION SCHEME= undefined
##.AVERAGES= 1603
##.DIGITISER RES= 17
##SPECTROMETER/DATA SYSTEM= spect
##.PULSE SEQUENCE= dept135
##.SOLVENT NAME= CDCl3
##.SHIFT REFERENCE= (INTERNAL, CDCl3, 0, 214.665)
##AUDIT TRAIL= $$ (NUMBER, WHEN, WHO, WHERE, WHAT)
$$ ##TITLE= Audit trail, XWIN-NMR		Version 3.5
$$ ##JCAMPDX= 5.01
$$ ##ORIGIN= Bruker BioSpin GmbH
$$ ##OWNER= she
$$ F:/spectra/data/she/nmr/depta/1/pdata/1/auditp.txt
$$ ##AUDIT TRAIL=  $$ (NUMBER, WHEN, WHO, WHERE, WHAT)
(   1,<2024-07-31 16:20:05.00 +0400>,<she>,<DPX200>,
      <created by zg, POWCHK disabled, PULCHK disabled
       terminated by command 'halt'
       configuration hash MD5:
       00 E9 B6 7A A2 85 ED C7 34 08 36 98 17 FE 4E 26
       data hash MD5: 16K
       2E E8 31 6C 15 CF 92 C8 5D 64 1A 17 1C A2 30 1F>)
(   2,<2024-07-31 16:20:07.62 +0400>,<she>,<DPX200>,
      <Start of raw data processing
       efp BC_mod = 2 LB = 3.5 FT_mod = 6 PKNL = 1 PHC0 = -3819.113 PHC1 = -1734.8 SI = 16K 
       data hash MD5: 16K
       CE E6 C6 B2 25 BF 96 86 7C 94 B1 C2 16 52 FF CE>)
$$ ##END=
$$ 
$$ hash MD5
$$ 83 20 45 1C C4 73 6A 66 D1 A0 DE D7 24 FD 01 75
##$RELAX= 
##$RELAX= 
##$RELAX= 
##$RELAX= 
##$RELAX= 
##$RELAX= 
##$RELAX= 
##$RELAX= 
$$ Bruker specific parameters
$$ --------------------------
##$DU= <F:/spectra>
##$EXPNO= 1
##$NAME= <depta>
##$PROCNO= 1
##$TYPE= <nmr>
##$USER= <she>
##$AMP= (0..31)
100 100 100 100 100 100 100 100 100 100 100 100 100 100 100 100 100 100 
100 100 100 100 100 100 100 100 100 100 100 100 100 100 
##$AQSEQ= 0
##$AQ_mod= 1
##$AUNM= <au_zg>
##$AUTOPOS= <>
##$BF1= 50.322709
##$BF2= 200.13
##$BF3= 200.13
##$BF4= 200.13
##$BF5= 200.13
##$BF6= 200.13
##$BF7= 200.13
##$BF8= 200.13
##$BYTORDA= 1
##$CFDGTYP= 0
##$CFRGTYP= 5
##$CHEMSTR= <none>
##$CNST= (0..31)
1 1 145 1 1 1 1 1 1 1 1 1 1 1 1 1 1 1 1 1 1 1 1 1 1 1 1 1 1 1 1 1 
##$CPDPRG= <>
##$CPDPRG1= <waltz16>
##$CPDPRG2= <waltz16>
##$CPDPRG3= <>
##$CPDPRG4= <mlev>
##$CPDPRG5= <mlev>
##$CPDPRG6= <mlev>
##$CPDPRG7= <mlev>
##$CPDPRG8= <mlev>
##$CPDPRGB= <>
##$CPDPRGT= <>
##$D= (0..31)
0 2 0.003448276 0 0 0 0 0 0 0 0 0 2e-05 0 0 0 0 0 0 0 0 0 0 0 0 0 0 0 
0 0 0 0 
##$DATE= 1722424070
##$DBL= (0..7)
120 120 120 120 120 120 120 120 
##$DBP= (0..7)
150 150 150 150 150 150 150 150 
##$DBP07= 0
##$DBPNAM0= <>
##$DBPNAM1= <>
##$DBPNAM2= <>
##$DBPNAM3= <>
##$DBPNAM4= <>
##$DBPNAM5= <>
##$DBPNAM6= <>
##$DBPNAM7= <>
##$DBPOAL= (0..7)
0.5 0.5 0.5 0.5 0.5 0.5 0.5 0.5 
##$DBPOFFS= (0..7)
0 0 0 0 0 0 0 0 
##$DE= 274.5357
##$DECBNUC= <off>
##$DECIM= 12
##$DECNUC= <off>
##$DECSTAT= 4
$$ [...]
##$SUBNAM1= <"">
##$SUBNAM2= <"">
##$SUBNAM3= <"">
##$SUBNAM4= <"">
##$SUBNAM5= <"">
##$SUBNAM6= <"">
##$SUBNAM7= <"">
##$SUBNAM8= <"">
##$SUBNAM9= <"">
##$SW= 219.3118970423
##$SWIBOX= (0..15)
0 1 3 0 0 0 0 0 0 0 0 0 0 0 0 0 
##$SW_h= 11037.527593819
##$TD= 16384
##$TD0= 1
##$TE= 0
##$TE2= 300
##$TE3= 300
##$TEG= 300
##$TL= (0..7)
120 120 120 120 120 120 120 120 
##$TP= (0..7)
150 150 150 150 150 150 150 150 
##$TP07= 0
##$TPNAME0= <>
##$TPNAME1= <>
##$TPNAME2= <>
##$TPNAME3= <>
##$TPNAME4= <>
##$TPNAME5= <>
##$TPNAME6= <>
##$TPNAME7= <>
##$TPOAL= (0..7)
0.5 0.5 0.5 0.5 0.5 0.5 0.5 0.5 
##$TPOFFS= (0..7)
0 0 0 0 0 0 0 0 
##$TUNHIN= 0
##$TUNHOUT= 0
##$TUNXOUT= 0
##$USERA1= <user>
##$USERA2= <user>
##$USERA3= <user>
##$USERA4= <user>
##$USERA5= <user>
##$V9= 5
##$VALIST= <valist>
##$VCLIST= <CCCCCCCCCCCCCCC>
##$VD= 0
##$VDLIST= <DDDDDDDDDDDDDDD>
##$VPLIST= <PPPPPPPPPPPPPPP>
##$VTLIST= <TTTTTTTTTTTTTTT>
##$WBST= 1024
##$WBSW= 2
##$XGAIN= (0..3)
0 0 0 0 
##$XL= 0
##$YL= 0
##$YMAX_a= 773458
##$YMIN_a= -903642
##$ZGOPTNS= <>
##$ZL1= 120
##$ZL2= 120
##$ZL3= 120
##$ZL4= 120
##$ABSF1= 0
##$ABSF2= 0
##$ABSG= 0
##$ABSL= 0
##$ALPHA= 0
##$AQORDER= 0
##$ASSFAC= 0
##$ASSFACI= 0
##$ASSFACX= 0
##$ASSWID= 0
##$AUNMP= <proc_1d>
##$AZFE= 0.1
##$AZFW= 0.1
##$BCFW= 0
##$BC_mod= 2
##$BYTORDP= 0
##$COROFFS= 0
##$CY= -3
##$DATMOD= 1
##$DC= 0
##$DFILT= <>
##$DTYPP= 0
##$F1P= 0
##$F2P= 0
##$FCOR= 0.5
##$FTSIZE= 16384
##$FT_mod= 6
##$GAMMA= 0
##$GB= 0
##$INTBC= 1
##$INTSCL= 0
##$ISEN= 128
##$LB= 3.5
##$LEV0= 0
##$LPBIN= 0
##$MAXI= 10000
##$MC2= 0
##$MEAN= 0
##$ME_mod= 0
##$MI= 0.4000791
##$NCOEF= 0
##$NC_proc= -3
##$NLEV= 6
##$NOISF1= 120.0001
##$NOISF2= 80.00006
##$NSP= 0
##$NTH_PI= 0
##$NZP= 0
##$OFFSET= 214.6655
##$PC= 4
##$PHC0= -3819.113
##$PHC1= -1734.8
##$PH_mod= 1
##$PKNL= yes
##$PPARMOD= 0
##$PSCAL= 0
##$PSIGN= 0
##$REVERSE= no
##$SF= 50.3227091
##$SI= 16384
##$SIGF1= 140
##$SIGF2= 120
##$SINO= 80
##$SIOLD= 32768
##$SREGLST= <13C.CDCl3>
##$SSB= 0
##$STSI= 16384
##$STSR= 0
##$SW_p= 11037.527593819
##$SYMM= 0
##$S_DEV= 0
##$TDeff= 16384
##$TDoff= 0
##$TI= <>
##$TILT= no
##$TM1= 0
##$TM2= 0
##$TOPLEV= 0
##$USERP1= <user>
##$USERP2= <user>
##$USERP3= <user>
##$USERP4= <user>
##$USERP5= <user>
##$WDW= 1
##$XDIM= 16384
##$YMAX_p= 84567624
##$YMIN_p= -461768054
$$ End of Bruker specific parameters
$$ ---------------------------------
##NTUPLES= NMR SPECTRUM
##VAR_NAME=  FREQUENCY,     SPECTRUM/REAL,   SPECTRUM/IMAG
##SYMBOL=    X,             R,               I
##VAR_TYPE=  INDEPENDENT,   DEPENDENT,       DEPENDENT
##VAR_FORM=  AFFN,          ASDF,            ASDF
##VAR_DIM=   16384,         16384,           16384
##UNITS=     HZ,            ARBITRARY UNITS, ARBITRARY UNITS
##FACTOR=    0.67371834180669, 1,            1
##FIRST=     10802.5493505904, 0,            0
##LAST=      -234.978243228581, 0,           0
##MIN=       -234.978243228581, -461768054,  0
##MAX=       10802.5493505904, 84567624,     0
$$ Real data points
##PAGE= N=1
##DATA TABLE= (X++(R..R)), XYDATA
$$ [...]
14596 -4458000 -3497900 -3064180 -3541188 -2211554 2517597 7957103 11672450 13663627 14184264
14587 14184264 12390518 8654158 5081783 3374999 5155227 9237662 12919295 16374988
14579 16374988 19184503 18923573 13840333 6216990 -718490 -4799421 -2813426 3570861
14571 3570861 7938543 8854988 9364701 11271449 14284499 17284261 19567637 20676818
14563 20676818 19431923 15313571 9301517 4101444 1474034 -76906 -721068 -1091603
14555 -1091603 -3361594 -7112699 -10144329 -10833297 -10019620 -8872522 -6865625 -3130095
14547 -3130095 2645498 9302438 14059117 13835050 9918937 5480887 532532 -4763887
14539 -4763887 -8716053 -8566581 -3447718 3780104 10164135 14952472 17992101 18195301
14531 18195301 15932002 13156726 10001419 6123788 3064744 912334 -1924861 -4940819
14523 -4940819 -5658675 -3348886 556324 3691984 4370201 4270849 4491081 5207535 5798483
14514 5798483 5884821 6225731 6897367 7488169 6473905 3497644 565098 -1952704 -5555879
14505 -5555879 -10373415 -14467390 -15915122 -16802955 -18465720 -18377482 -16752546 -14674746 -10621976
14496 -10621976 -4482480 12605 897102 -305042 -1535969 -1927318 -2165231 -2720983 -4414624
14487 -4414624 -7363858 -10688582 -12587508 -12160938 -10431824 -8296737 -5619933 -2278744
14479 -2278744 1090966 3063961 1361910 -3330216 -8631572 -13784054 -18069779 -19655105
14471 -19655105 -17261085 -12142236 -7321205 -5570242 -9044721 -15386967 -19242107 -18315260
14463 -18315260 -13292787 -6129361 1166520 4796347 3352436 -239644 -3828454 -7711538
14455 -7711538 -12529962 -17638569 -19543689 -16256269 -10117748 -5247973 -4461060 -6846247
14447 -6846247 -8677230 -8440732 -8362605 -9186326 -10200212 -12794760 -16212758 -16747687 -13873739
14438 -13873739 -10179547 -5859381 440080 7634772 12341255 13049783 13119393 14404986
14430 14404986 14301769 11596478 7513502 3721999 1633058 1318750 191424 -3403715
14422 -3403715 -7655841 -11238601 -13764744 -14561335 -13506617 -10999265 -8187404 -5731257
14414 -5731257 -2973227 -28939 2858426 5544972 6814033 6595257 6833904 7820036 7920619
14405 7920619 6737058 6126844 6688632 7509330 8894984 11228409 14323322 17506502 18983190
14396 18983190 17583434 14838826 12372263 9946398 8824459 9294485 8568184 7925909
14388 7925909 10739795 15038032 17767943 18719527 17322479 15385719 15252554 15678838 17019006
14379 17019006 19159573 18556945 14856946 11818281 11044182 10209421 8047072 5428188
14371 5428188 3258868 237933 -4723518 -9987472 -12697265 -11222631 -7495310 -3888439
14363 -3888439 -1725338 48232 3170470 6810164 8818224 8031406 5584058 2543756
14355 2543756 -569337 -3200227 -5671169 -9001706 -13499403 -17603994 -19368463 -18030903
14347 -18030903 -15372671 -12707690 -10113505 -8273681 -7450123 -5529523 -650911 6107772
14339 6107772 12076013 15756172 15756294 10410035 1943356 -5448901 -9461074 -9131412 -5765787
14330 -5765787 -3013580 -2272295 -2244066 -897044 2038403 5114906 7006022 8512212 10338425
14321 10338425 12024868 13440752 14088122 14397704 14249574 12677295 10558478 9744699 10245269
14312 10245269 10711035 10358837 9946301 10245905 9865007 7086915 2701154 445858 1949183
14303 1949183 3819800 3699506 2465082 1581522 1711403 2615300 2111850 -1017471 -4944031
14294 -4944031 -7580752 -8554561 -8135388 -6473875 -2855470 2171774 6227727 8162071
14286 8162071 10184494 14526763 20535229 26829568 31490311 33748205 32997662 28239366
14278 28239366 20581754 12958017 8490287 7788865 9995821 12569484 13609194 13769759
14270 13769759 14032464 14145788 11607442 5806131 -781471 -6912979 -12907004 -19574864
14262 -19574864 -25818708 -28570347 -27046595 -25743495 -28015887 -30372205 -29872842 -27107347
14254 -27107347 -23036676 -17737602 -12036279 -6119628 -1907188 -1777855 -3658262 -4681667
14246 -4681667 -4086622 -3613111 -4412822 -4663633 -3768947 -1774315 1089280 3586541 3574497
14237 3574497 -853795 -6775111 -10377303 -10538063 -6740794 314854 8421600 15232593
14229 15232593 18294801 17233417 14780664 12597017 11465591 10263139 6714659 -94405
14221 -94405 -8838693 -16399427 -20787091 -22386587 -20958181 -16499672 -11680250 -7680887
14213 -7680887 -4598150 -2923133 -2568012 -3811879 -7864902 -13810157 -19152444 -22321000
14205 -22321000 -22067339 -17819961 -10031491 -7335 9494614 16479037 19176409 17076549
14197 17076549 12618497 8704032 7036692 5832678 4436403 3904748 3639741 1453675
14189 1453675 -3131505 -8246587 -11692058 -14317554 -17840836 -21057769 -21675591 -19633989
14181 -19633989 -15711321 -11041346 -8671018 -9000615 -10030049 -12406469 -15661800 -16874756
14173 -16874756 -15369235 -12239744 -9097554 -6676536 -4097110 -793194 2648567 6772355
14165 6772355 11006283 12917564 11634190 9794303 9799092 11417519 12762363 13619448 15956471
14156 15956471 19363737 21746796 21666226 17229429 9918813 4104298 1516853 2458364
14148 2458364 6731181 11932454 16191595 18746200 19648899 19014434 17440043 17187713 18558528
14139 18558528 19376706 18794999 18856430 21489727 23905432 22303346 17523781 12028840 6168673
14130 6168673 -146209 -3800490 -3596991 -2356701 -132592 3218569 3903343 2979664 3858658
14121 3858658 6048440 8192376 9791674 11312794 12596428 11947974 9593098 6854220
14113 6854220 4686597 3475209 2280388 1345477 699877 -1727320 -5813305 -9477735
14105 -9477735 -12007335 -12995792 -11211689 -8255860 -6536173 -5859524 -6498822 -7905689 -8502047
14096 -8502047 -8595151 -7875782 -4283913 1976708 8029838 11510163 10976427 5121305 -2968052
14087 -2968052 -8101304 -7745023 -3110425 2403298 6784888 10293937 13601628 16238934
14079 16238934 17359952 16636473 13846082 9434146 5074404 2978438 4542268 9340329
14071 9340329 14852021 18811062 21724654 24144385 25906039 27344350 27588245 25715415
14063 25715415 22192232 18106690 15948158 17641387 21520081 24785201 27447499 29697873
14055 29697873 30694125 30472905 29174208 26744515 23528326 19448600 14211348 8824509
14047 8824509 4908852 3167229 2669459 1691562 -324769 -2904907 -4436987 -3651131 -1678412
14038 -1678412 -92836 -696400 -3422969 -5684345 -5127197 -1890821 2460597 7018093
14030 7018093 10026189 9849517 8028980 6518126 6126958 6477449 5994263 2187373 -3828636
14021 -3828636 -7890287 -8778176 -7543069 -4084759 130583 2763572 3528268 2820559 961731
14012 961731 -2754863 -9291350 -15711207 -18987459 -20091010 -19130186 -15039053 -9616564
14004 -9616564 -5960025 -4090559 -2435630 -1266740 -784594 -570738 -323018 718573 1578618
13995 1578618 -275885 -5916104 -12641555 -17930799 -20816145 -21047065 -18408192 -11763525
13987 -11763525 -2529853 4616121 7998785 10360946 13567456 16079604 15655359 12800600
13979 12800600 9061745 4473935 274633 -1365407 -731800 -339083 86282 1685711
13971 1685711 3838270 5746552 6193313 3772733 -1940787 -8237918 -11695235 -11675970 -9395546
13962 -9395546 -7210385 -7046151 -9167453 -12060020 -12816239 -10651510 -7675786 -5328859
13954 -5328859 -4313246 -5107497 -8051535 -12045468 -15213261 -17932289 -20507770 -21434544
13946 -21434544 -20557500 -18251325 -12570677 -4820044 424471 1157205 -986186 -3241346
13938 -3241346 -4243145 -3610832 -2621177 -2863129 -4126808 -4789524 -3797565 -2450386 -3388162
13929 -3388162 -7338014 -10762746 -9696054 -3685086 3496584 8031361 8169348 4100975
13921 4100975 -1743717 -5929466 -6062747 -2653049 2865082 9071153 14181797 16225092
13913 16225092 15612348 14785051 13837447 11736186 9651146 9222712 11306334 15986862 20632485
13904 20632485 22031031 20216844 16359987 10859798 5125734 985578 -496679 505405
13896 505405 2550327 3451829 1771485 -1169158 -2717938 -2236372 -1664829 -2348994 -3718257
13887 -3718257 -4871691 -5801455 -7346447 -9057109 -10860970 -11991189 -10292132 -6275100
13879 -6275100 -1915163 -821794 -4726265 -11432089 -17541489 -20471057 -20660235 -20196945
13871 -20196945 -18807907 -16264539 -13055254 -9774194 -7322455 -5907363 -5923817 -7104211
13863 -7104211 -7311956 -4983959 -2433350 -2799775 -4784386 -5040802 -2813732 -748902 -340395
13854 -340395 -712981 -1209899 -1348436 -1500786 -2608409 -4335759 -4240904 -1280675 2869081
13845 2869081 7017836 9204302 8272406 6796297 7639330 9211951 7762356 2767379
13837 2767379 -2441503 -4444445 -3299440 -932029 1463050 3319291 4191146 3926188
13829 3926188 3157605 3037265 3527829 2849281 101001 -4277821 -9372765 -13167831 -14632257
13820 -14632257 -13403262 -10850723 -9015429 -7316218 -4322154 -488258 2052842 2263101
13812 2263101 2215663 2478648 3001282 4124363 4784355 3778701 1300854 -1287054 -2798084
13803 -2798084 -3196910 -2703839 -1709020 164710 2458273 3636004 3315816 2269847 1524857
13794 1524857 883293 790867 2260999 4572195 6147684 6509526 7078752 7303440 5183686
13785 5183686 804208 -3973448 -6914379 -6932303 -3749703 3188253 11713170 17923243
13777 17923243 20107966 18824223 16589129 13528795 7906154 1770214 -1107720 -719809
13769 -719809 110290 -1143167 -4839060 -9036345 -11746488 -12364930 -10269842 -5361598 701160
13760 701160 7294886 12407980 13668725 12155358 10379549 9138909 7010689 3429149
13752 3429149 -117696 -752157 2925427 7910574 9868217 8866541 7881548 7392829 7100033
13743 7100033 7774529 9492320 10959451 11615609 12129154 12276108 11369672 8810964 4512260
13734 4512260 479379 -897529 -866951 -1262189 -2828740 -5953629 -10249213 -13863482 -15765303
13725 -15765303 -17106839 -19302164 -22531700 -24250864 -21515493 -15209784 -8408512 -7035386
13717 -7035386 -13080426 -20176990 -22154064 -20458316 -17978586 -12413990 -4705832 346104
13709 346104 3266050 7337374 12698058 18165761 22159474 24094421 25471556 28234510
13701 28234510 31029931 30967176 28097643 24230821 21620708 21272489 22374699 23754667
13693 23754667 24381444 23076329 19465679 15850965 13044806 9550409 5598240 2097797
13685 2097797 511885 1685043 4385944 6372926 7021865 7583408 7989475 6490713 3143334
13676 3143334 265551 -756407 -785527 -52714 1388656 3094443 5356992 7552411 9231224
13667 9231224 9930360 8236062 3810526 -699229 -3145950 -4637541 -5817275 -5041808
13659 -5041808 -1616380 3746866 10004490 14774443 17216814 17173267 14601759 11388858
13651 11388858 9045880 6897453 3772164 621553 -2140595 -5236295 -8919027 -11772680
13643 -11772680 -12640117 -11695355 -9229973 -5902981 -2721847 15323 2393590 3278193
13635 3278193 1524997 -2037884 -5875081 -8867423 -10021747 -9026719 -6592094 -3167318
13627 -3167318 1228818 4880302 5023153 1573528 -2950145 -5639872 -4559245 -2084169
13619 -2084169 -2377726 -5083923 -7902801 -8710033 -8233825 -8705944 -11046666 -14190529 -17286861
13610 -17286861 -20135720 -21471912 -20722286 -17734829 -12987239 -8009618 -4765691 -2398791
13602 -2398791 243427 1422989 -349682 -4989504 -10989844 -15243199 -16192142 -14235227
13594 -14235227 -9249656 -2515413 3181534 6946927 9164797 10187990 9904689 8443558
13586 8443558 6665796 5482184 4689078 3568085 3759840 7261443 12686701 17425316
13578 17425316 19537405 19126035 18611326 19019941 18609606 15647768 11259839 8938977 10501914
13569 10501914 15077771 20187557 23299439 23056293 21101890 19458339 18196528 17323535
13561 17323535 16900351 16545702 16369437 17232798 18740080 18612837 13949655 4557517 -4790915
13552 -4790915 -10088835 -11273687 -8482881 -2474208 4665782 11212861 16220976 18564638
13544 18564638 19490329 21782467 23965048 22987340 20202145 18360707 17011952 15229747
13536 15229747 14147555 13529699 11098793 5339792 -2120225 -8791367 -14128373 -18357543
13528 -18357543 -20893326 -20999028 -18694489 -15298612 -12909249 -13690862 -16856014 -19546292
13520 -19546292 -20975287 -22113927 -23968218 -25714936 -24846209 -22127247 -19687684 -18985902
13512 -18985902 -21200338 -24587252 -26381876 -24778007 -20530072 -15484677 -10692325 -6656079
13504 -6656079 -4684180 -5526406 -8298290 -10035640 -8708446 -6093125 -5096942 -6929293
13496 -6929293 -11421234 -16723670 -20627570 -23391160 -25083487 -25330027 -24208053 -22317726
13488 -22317726 -21842715 -23949341 -26921179 -28379781 -27175884 -23096773 -17524528 -13321023
13480 -13321023 -11636890 -9812140 -6532813 -4291520 -5462302 -9663826 -13023967 -14032606
13472 -14032606 -14262473 -14782145 -14435846 -11431476 -5933580 637986 6179524 10393782
13464 10393782 13616514 15655683 15079105 8414019 -3901594 -16685686 -25443464 -29803614
13456 -29803614 -31624272 -30673464 -27838284 -25818591 -23275564 -16727281 -8756041 -4130953
13448 -4130953 -2888034 -2987314 -3736549 -4610989 -3211670 435967 2988844 3651946 3503431
13439 3503431 3535050 2873944 -105276 -2823645 -2578293 1143792 7039349 12145340 14976780
13430 14976780 15939695 16284669 15989110 13837059 10208879 5714167 1624109 -1106164
13422 -1106164 -2509865 -3323343 -6230823 -10667139 -14974682 -19972091 -24602049 -26823157
13414 -26823157 -26622572 -24971096 -23247214 -22058871 -20285581 -18486327 -18810521 -20892165
13406 -20892165 -22684284 -22743876 -20224352 -16949704 -15685523 -16089662 -16021448 -14740917 -13015694
13397 -13015694 -12485944 -14386768 -18147126 -19955567 -17649524 -13401192 -9439603 -6566157
13389 -6566157 -5349476 -6715260 -10956806 -16214486 -19239129 -20024987 -19241946 -16640121
13381 -16640121 -14478314 -14581872 -13903605 -10073206 -6987698 -8058093 -11895533 -16276774
13373 -16276774 -19416142 -19959232 -18762803 -17815561 -17105797 -16140595 -15267532 -14432852 -14831140
13364 -14831140 -17735660 -21777012 -24209747 -24342625 -24166458 -24350257 -22498402 -17570021
13356 -17570021 -11038154 -5368164 -2566868 -2618625 -4337174 -5874498 -4854835 -1167953
13348 -1167953 3259993 6960635 8395610 7334094 5003168 2733765 -125185 -5149034
13340 -5149034 -10253207 -10955687 -7598100 -3619881 1031971 7715444 14168925 18118464
13332 18118464 19608866 16719256 9079024 1704941 -2175741 -3620889 -3237208 -1156781
13324 -1156781 -149817 -1396697 -2636139 -1640928 1804291 5411466 7699348 7889728
13316 7889728 6684331 6708524 8299975 10299064 10289206 6341099 24313 -5961175 -10382814
13307 -10382814 -14354598 -18735354 -23035862 -26142021 -28117131 -29438272 -28346346 -23170746
13299 -23170746 -14843529 -7678031 -5003722 -6747987 -10467070 -14242570 -17052979 -18232476
13291 -18232476 -17491803 -15080890 -12519459 -9044100 -4254234 -230819 1622914 2105669
13283 2105669 1105310 -1272272 -2959882 -2854507 -2197523 -4316186 -10532415 -17123945
13275 -17123945 -19479814 -16503337 -10255578 -3833131 -486080 -1072524 -2998055 -3618805
13267 -3618805 -3347153 -3205398 -2044435 -95476 1622304 3753758 6533649 10338141
13259 10338141 13605767 13380856 9818911 6164448 4109329 3359425 3517063 3596565 3219712
13250 3219712 1552103 -2395713 -7217995 -11287365 -13211837 -12231119 -10879395 -12344021
13242 -12344021 -15484950 -16658031 -15016407 -11562782 -7059956 -2499171 -428553 -774681
13234 -774681 -1640967 -1762833 521331 5852042 12444576 16791351 17966222 17995284 17232673
13225 17232673 14477917 10718275 9083464 9927343 12091923 14683155 16652879 17565491
13217 17565491 17562886 16765620 15220780 13266166 11818468 11607164 12778202 14562085 14206797
13208 14206797 10880071 6308764 1782614 -1688856 -1670193 1860673 5101460 6271734
13200 6271734 7213626 8947175 10608115 11316269 11170390 10111689 7117562 3277071 657502
13191 657502 -381613 1123385 4360862 7287456 10238652 12678226 12662544 10961936 8795983
13182 8795983 6202524 4608287 4980157 5275200 4168687 3536855 4966675 6718032 7571826
13173 7571826 8470640 10060508 11558008 11875402 10765100 8932508 7048597 5809296
13165 5809296 6844263 9753516 11750490 11986316 10583426 7886877 4483702 2110785
13157 2110785 2342107 3966315 6212167 9174817 11078246 10037824 6545254 2532634
13149 2532634 -98172 -1044811 -16692 2381253 4769535 5260506 1968352 -3927015
13141 -3927015 -7942345 -7425365 -3694282 -2051387 -6272794 -11911363 -14417842 -14890460
13133 -14890460 -14530631 -13785532 -12162620 -9187149 -6343978 -3295706 763368 3185197
13125 3185197 2931223 2929617 4451470 6245142 5466954 80221 -8135528 -14868288 -17957247
13116 -17957247 -20383536 -23551987 -25349984 -23351293 -17949646 -13356746 -12816667 -14218376
13108 -14218376 -13597735 -10650252 -8134609 -7287952 -6349673 -3534879 1219675 7154626
13100 7154626 12554588 15904917 16514078 14533990 11197071 8229386 9194272 14573281
13092 14573281 19657697 20089867 17891747 15837879 13322189 9634027 4215433 -821882
13084 -821882 -3998595 -7138496 -11705687 -17191351 -21922974 -25087713 -27031275 -27716425
13076 -27716425 -27298141 -26447880 -25205328 -24055355 -25008033 -27830539 -30196036 -31068343 -29892231
13067 -29892231 -26079177 -19950092 -12925081 -7381690 -4500784 -3404964 -1960642 465214
13059 465214 2062677 2439848 3140946 4810391 7844646 10761344 11749678 10848169 7509933
13050 7509933 3333031 906935 166726 -83827 -463251 -1967290 -3670924 -2639093 316680
13041 316680 2107238 2564678 2442062 1781051 1464356 2009214 2028592 1600347 717821 -1021732
13031 -1021732 -1355085 1430351 5078402 6425069 6000458 5700487 5029839 2991360 -490604
13022 -490604 -5709255 -10548304 -11830800 -9565408 -5797041 -2912545 -1149695 1483006
13014 1483006 5037629 7003634 5133622 277274 -4483274 -8207098 -12332391 -16768288
13006 -16768288 -18609303 -17068697 -14751648 -14374135 -15703575 -17479394 -19166705 -20401797
12998 -20401797 -21205872 -20189985 -15935650 -9322429 -3105244 1045579 4550804 7121752
12990 7121752 7671659 7334975 6724334 4857478 2210021 575670 129163 633658 1722214
12981 1722214 1447918 -1794626 -6274896 -8927710 -9036696 -8035043 -8001117 -9382506 -10767120
12972 -10767120 -11105748 -10353951 -9460183 -9871022 -11242778 -12844052 -14606103 -16657955 -18940412
12963 -18940412 -18739262 -14515546 -8621165 -3951664 -1019435 1080372 4354087 8170323
12955 8170323 8933683 5569275 1020161 -358149 2694916 7303658 10585439 11751947
12947 11751947 11015997 10811846 12790623 14377393 13168730 10226209 6699300 1406039
12939 1406039 -4335077 -8193352 -10432610 -12664141 -14582398 -15144290 -15488251 -16071851 -16165951
12930 -16165951 -14904135 -11885640 -8639697 -6665156 -4245244 11934 3804670 5085874
12922 5085874 5070047 6211378 9116136 11320509 11105101 9665886 8934906 9074703 7255207
12913 7255207 4154621 3681128 6303013 8308149 5784656 -1044200 -8379940 -13252981
12905 -13252981 -14904531 -13992259 -11692001 -9950878 -10616067 -12343155 -12708411 -10317208
12897 -10317208 -3914262 3264511 6099082 3616760 -1409022 -5576391 -8229974 -10255627
12889 -10255627 -11328598 -11188672 -11581157 -12310806 -12916112 -15727534 -19899373 -22360501 -22016307
12880 -22016307 -19386200 -15341448 -10560883 -5809338 -2221850 -585107 -1233547 -3918603
12872 -3918603 -6419771 -6851293 -4808853 -606762 3234630 3429491 331749 -1201721
12864 -1201721 3019048 11335875 20131590 26914980 29839449 28819621 25944904 22421885
12856 22421885 17721937 11454557 4723306 -515053 -2148416 95110 3884184 5742670
12848 5742670 4481589 2947501 1876558 -581149 -3263553 -3499043 -1098637 1907469
12840 1907469 4181157 5647849 6597861 7256176 9345630 13596916 18034027 19456491
12832 19456491 16062647 10303896 5722884 1760364 -3605886 -9936153 -15890642 -19850343
12824 -19850343 -19880022 -17785602 -16946190 -18094972 -19731811 -19939115 -17669039 -13312337 -8566497
12815 -8566497 -4278287 -603294 1143866 801478 -398393 -224309 2280642 6478316
12807 6478316 10305671 10842751 9331910 7575436 6435146 7182567 8797612 9613351 10244690
12798 10244690 10542697 9042399 5340486 6402 -4778515 -8499577 -11423241 -11742062
12790 -11742062 -8495554 -2617805 4135446 10734138 15875540 16410449 13000875 8988725
12782 8988725 4573641 282457 -3079200 -5425493 -6209013 -5194394 -4159408 -5843669
12774 -5843669 -9107459 -9739634 -6875917 -3385014 -1949391 -1183955 857512 2262386
12766 2262386 1587134 1430039 4398454 10330954 18612573 26341083 29082899 26769801
12758 26769801 21905684 16050548 10361800 4875832 -331651 -3282568 -3235694 -1856115
12750 -1856115 -1871181 -3393358 -4342460 -4755855 -5654057 -6445910 -7853265 -10536418 -12212062
12741 -12212062 -11448724 -9412298 -7089829 -4839293 -3350831 -956748 4537771 10598337
12733 10598337 13255188 11981929 8602916 4247134 -521347 -4056505 -5963901 -7383395
12725 -7383395 -8322418 -8672933 -9312656 -9384612 -7248386 -4096661 -267543 3543829 4619255
12716 4619255 1794282 -2685134 -4489593 -1294041 2657966 3798861 4638682 7955688
12708 7955688 11827178 13391289 13144730 12300123 10984638 9632299 8303363 7636771 8409576
12699 8409576 9870523 11766766 12969271 13338577 14107380 15263852 15477751 14470286 12431255
12690 12431255 8344421 2595014 -2685826 -7151222 -11753641 -16420141 -19853723 -19354211
12682 -19354211 -13592038 -5025287 2561895 5256340 1015315 -6484524 -12294865 -14229966
12674 -14229966 -11248256 -4930898 -96833 479356 -1771551 -4183086 -4876432 -4484100
12666 -4484100 -3438932 -2551115 -3378712 -5045982 -6096228 -5222054 -1393560 3776894 7731730
12657 7731730 9153959 7457433 3195046 -1082708 -2255132 908751 4703034 5417180
12649 5417180 3206760 -922122 -4780091 -6230207 -6208282 -5383142 -5177526 -8971807 -15547682
12640 -15547682 -19290389 -17209907 -11909556 -9039685 -9932991 -12775501 -15946087 -16976304
12632 -16976304 -14526683 -8836083 -2509623 1480180 4273046 7741798 10896885 10506366
12624 10506366 5382749 -1524443 -7217444 -11166002 -13528988 -13704197 -11421841 -7586562
12616 -7586562 -4339171 -4086198 -5804286 -7139367 -7865078 -9770590 -13942686 -17548910
12608 -17548910 -16602272 -9569062 319577 7510101 8338446 4151691 -844084 -3629115
12600 -3629115 -3871342 -2402973 352381 3274311 5860620 8942913 11817315 12393134
12592 12393134 11325826 10514689 10270090 10709017 12385218 15548569 18601240 21321147
12584 21321147 24436304 27064444 28121127 26867290 25615148 25869820 25153400 21091539
12576 21091539 14737519 9763171 8209428 8042745 7030737 5895493 6172030 7951276
12568 7951276 9620858 10521294 11160607 11359465 10502791 8732586 7118057 6291259 6431308
12559 6431308 7609334 8085081 6798731 6304698 8561424 12040149 13870382 11800699
12551 11800699 6710830 2428435 990604 944557 221291 -2058981 -5073273 -6086584
12543 -6086584 -4513587 -2275000 -1195110 -1203587 -671480 1193084 3629032 5224113 5542621
12534 5542621 4559025 5279229 10299887 17194837 23045726 25633181 22703177 14646627
12526 14646627 5167301 -1473234 -4013223 -3923680 -2929643 -2502389 -2711776 -1560624 1047745
12517 1047745 3830846 6983099 9443404 9467105 8894868 9926192 11753124 13599664 14486368
12508 14486368 12241994 6317108 22547 -2895983 -2634248 -1713570 -1543685 -1222693 279850
12499 279850 2229768 3335550 3261705 2376901 -1333603 -9243961 -18209196 -23867159 -25783796
12490 -25783796 -26657979 -27975806 -28386006 -25469526 -19450148 -12818206 -8333582 -6783422
12482 -6783422 -6332951 -4678962 -1663573 1756384 3352467 2991843 2834944 3643970 3944474
12473 3944474 2685312 154937 -3446023 -7197589 -10455199 -12711448 -13630663 -14272037
12465 -14272037 -13983554 -11994962 -8554390 -3687108 1485999 4314660 4535086 5163812
12457 5163812 7373594 8337516 5356368 -856801 -7706969 -12657687 -15091952 -15460826
12449 -15460826 -14462473 -13651288 -15975785 -21508012 -25731250 -25933188 -22790162 -18590571
12441 -18590571 -15333219 -14315474 -16331952 -19768228 -22287363 -23959251 -24746175 -21055129
12433 -21055129 -14386097 -8642096 -5576646 -6112245 -8779433 -11190748 -11638503 -10126463
12425 -10126463 -8154502 -7071608 -6392978 -3898608 1769537 8368853 12213862 12428347
12417 12428347 10882803 8012577 4267697 1751064 723550 -789140 -3197860 -5500379
12409 -5500379 -6050550 -3672901 -986991 476327 3035673 6518818 8586772 9237970
12401 9237970 9438953 9667877 10439491 11093483 8754259 2809694 -3154163 -5201030 -3183355
12392 -3183355 265162 2808174 2428696 -2690651 -10291973 -15531899 -18031046 -18582946
12384 -18582946 -16678558 -13933094 -12120673 -10526425 -7486907 -2644244 2839570 6220030
12376 6220030 5089302 817272 -3316314 -6684142 -9531484 -10949926 -10116671 -7824545
12368 -7824545 -6881383 -8424571 -10768039 -11256267 -9593696 -8075155 -6838898 -3071974
12360 -3071974 3036539 8020108 10288627 10725171 10254703 8519381 6288345 3305289
12352 3305289 -1877421 -7387739 -10174504 -10025074 -7960273 -4371826 825064 7052744
12344 7052744 12501142 16087872 18250592 18224105 14153070 6187201 -3086181 -11177664
12336 -11177664 -16195832 -18150612 -18776154 -19024533 -18945126 -17763904 -15488142 -14087961 -15726014
12327 -15726014 -19734859 -22980675 -24847898 -27091827 -30007465 -31997476 -31944860 -30445227
12319 -30445227 -27830453 -23645122 -18650490 -14050689 -9109415 -3313390 1720907 4698363
12311 4698363 5708084 5846444 6159929 6687747 6667082 5450216 4016721 1856202 -2656436
12302 -2656436 -8473913 -13168783 -15673437 -16158603 -14647461 -10583258 -5294864 -2884826
12294 -2884826 -4968806 -9862115 -15534071 -18476274 -17361764 -15403354 -14568062 -13832245
12286 -13832245 -11957779 -8522280 -4361811 -890791 -56888 -1839725 -3748195 -4268032
12278 -4268032 -3101533 435889 4853846 7136816 7192654 6211050 6517675 9391749 12346227
12269 12346227 14043348 15667371 18366392 21829345 25831470 29305184 29754034 26740631
12261 26740631 22548595 20539398 21514468 24795974 28326217 30546099 30587140 27785177
12253 27785177 24498454 24007837 26241670 28830466 30412860 30809431 29906891 27656028
12245 27656028 25222779 24170253 24510859 23918413 19950952 14104230 9170019 5298530
12237 5298530 1823789 -1077095 -3045319 -4112915 -5921983 -9525523 -13729483 -16571218
12229 -16571218 -16368872 -14350201 -12790890 -11260582 -7652965 -2256114 3124624 8776910
12221 8776910 16070560 21765602 21668242 16919630 11877020 8463386 6046052 3468545
12213 3468545 1165418 -659565 -1466717 -289608 2965705 7409902 11687798 14487536
12205 14487536 15298508 12224693 4675722 -1507033 -4693583 -8748769 -13935330 -17874307
12197 -17874307 -18576721 -16789691 -16052915 -18067725 -21841752 -25186346 -23985353 -17605243
12189 -17605243 -10124170 -5629296 -5543327 -7327982 -7537310 -7113599 -7467902 -7749885 -7947997
12180 -7947997 -8128556 -8156843 -8547134 -8396963 -6754297 -4584063 -2686279 -2290571 -2846176
12171 -2846176 -3657313 -5443546 -8012958 -9830174 -10253349 -8695488 -5622867 -1964318
12163 -1964318 1395823 3000221 3650644 5035227 6078703 5595837 5572873 8468589 14548947
12154 14548947 19117905 17609420 11946940 6574877 4594025 6423574 8462330 5780747
12146 5780747 -1603689 -9381690 -13949820 -14188153 -11052584 -7542168 -5537508 -6106697
12138 -6106697 -8862187 -11862935 -12759172 -11141227 -9713847 -8956171 -8195595 -8140873 -7799202
12129 -7799202 -5811612 -3959510 -5330024 -7814780 -8029135 -6894093 -4907588 -1857317
12121 -1857317 876624 2085574 1447817 -347050 -1171512 564980 2291970 912691
12113 912691 -2816881 -5935381 -6767464 -5936400 -3402304 146712 2772550 3900782 4605732
12104 4605732 4348527 2869604 1047082 -537239 -1788158 -1888057 86744 2659501 4134868
12095 4134868 4882143 5798161 7594535 10040562 12118161 13422623 14263255 14035647 12445240
12086 12445240 10910921 10211519 9444818 8810811 8249614 6949727 6306106 6681155 8355782
12077 8355782 12268837 17176729 21743764 26366009 29289486 27466517 20747903 11657783
12069 11657783 3404723 -1495312 -2333372 69904 2833934 4996599 7269988 9730300
12061 9730300 11006060 8498429 2110500 -4256234 -7647126 -8754752 -8255588 -8326650 -10374179
12052 -10374179 -11979133 -11902242 -11369740 -12075990 -13768361 -14673175 -15048986 -14014316 -10561779
12043 -10561779 -6424669 -4235932 -5176142 -6914137 -8226204 -9150238 -9378023 -8774913 -7176168
12034 -7176168 -4974250 -2546820 -99729 950008 73111 -566229 506907 3782602
12026 3782602 8281182 11453588 11056913 8777906 9249017 14270914 22436132 29831324
12018 29831324 31445517 26258432 18758535 12818520 9060943 6756189 5755232 5625271
12010 5625271 5180373 3552326 873187 -2489328 -5751639 -6676674 -4798584 18943
12002 18943 6290211 10871254 13584914 15320514 15391315 13818961 10469173 5734286 549480
11993 549480 -3773161 -6220501 -7881766 -9045528 -7870144 -4890013 -2264747 -674147
11985 -674147 -392977 -778692 -110306 1928470 6443853 12464985 16423628 18052327 17850609
11976 17850609 15109140 10140030 5442678 2734723 1088569 -493313 -2574430 -3929168
11968 -3929168 -3753382 -2891155 -2296878 -2076153 -1819307 -1395795 -1242371 -2596186 -4508877
11959 -4508877 -5365110 -5328289 -4949244 -5108132 -6115409 -7358597 -7086790 -3495883 874535
11950 874535 2804635 3581732 6443433 10123686 10702825 7581637 2615441 -709418 149325
11941 149325 2493841 1978338 -1774075 -6467052 -9842990 -11281254 -10608310 -8218079 -5814174
11932 -5814174 -6509791 -10205472 -13183493 -12735190 -10105217 -9132397 -9898087 -10256928 -9930885
11923 -9930885 -8754627 -7002184 -6411695 -6439940 -6233391 -5677624 -5520324 -8389251 -12716563
11914 -12716563 -15234357 -15562741 -15170500 -16386178 -20157045 -24781547 -26739327 -24521200
11906 -24521200 -19172244 -13608269 -8797974 -4638695 -1934629 -277310 613398 -343739
11898 -343739 -2840719 -5281454 -6146574 -4588217 -1599895 1991909 4794411 4564367 2067547
11889 2067547 1158796 3484406 6532287 8832891 10584875 12047518 11792974 8736920
11881 8736920 4975113 2928292 4317327 7218077 8065626 7266544 8300219 11900777
11873 11900777 15220582 16433055 15006331 12303488 8932793 4063148 -1205056 -5821596
11865 -5821596 -9551170 -12018089 -13092830 -12702064 -11578089 -10584256 -10542589 -12391060 -15451918
11856 -15451918 -17381819 -17386664 -15850599 -12365287 -7909690 -5497008 -6756874 -10232365
11848 -10232365 -13596822 -15503065 -14494281 -11536553 -9033763 -7297732 -4215162 621000
11840 621000 5635310 9621631 11545437 11621045 12235674 15072372 18304401 20592710 22213304
11831 22213304 21818125 17195300 10219396 5527293 3643255 1378292 -1328771 -1760655
11823 -1760655 -1314982 -1956213 -2119284 -1156220 407097 3062725 6403972 8913789 11201802
11814 11201802 12982904 11890067 6419824 -2877104 -12764624 -19916679 -23324676 -23008286
11806 -23008286 -20066633 -14833807 -6077534 3519868 10720903 15012536 15373881 11105105
11798 11105105 5055226 -415286 -6598877 -13257088 -18215306 -19057264 -16295595 -13389731
11790 -13389731 -11891524 -10174500 -6929970 -2953339 570581 3229513 4819644 5041829
11782 5041829 3674907 257040 -4876814 -8139866 -6619169 -1277057 4251772 7249900
11774 7249900 8330497 10419948 14872980 20596121 25416923 27749631 27088511 24344268
11766 24344268 22383895 20899520 17176977 11728307 8041090 7520115 7789938 7578746
11758 7578746 9332421 13115472 15407311 15270669 14199666 13544052 13533967 12892424 11014602
11749 11014602 9467660 9869891 10364991 9651910 8375023 6795018 6084488 6258272 5742019
11740 5742019 4227085 2682816 2202386 3002908 3025681 168922 -6164367 -14824580 -22663656
11731 -22663656 -26353975 -25230428 -21247208 -17163885 -14934528 -13861757 -10981368 -5686798
11723 -5686798 -218327 3917393 5967479 4948091 1990138 853166 4133086 10367480
11715 10367480 15917009 18240457 17949145 17419334 17689993 17710058 16906207 15266446 12724328
11706 12724328 9481462 5981362 3459780 3377847 5724953 9181268 10965356 9616446
11698 9616446 6022829 528662 -5227795 -8413469 -9766460 -10828243 -11132791 -11354422
11690 -11354422 -12580794 -15011872 -17013091 -16986665 -14931077 -12071336 -9244218 -5794795
11682 -5794795 -2195877 -423467 -1566400 -4983970 -9067198 -10677339 -7791461 -1669839
11674 -1669839 4366370 7606826 8337071 8375653 7565168 3998422 -1105588 -5664869 -9251424
11665 -9251424 -11582881 -11663155 -9652461 -6538932 -2286845 4084081 11808305 18419815
11657 18419815 23373188 24529466 20491857 13701793 7038466 2809114 2171230 5085434
11649 5085434 10058957 14715443 17280744 17505231 15264959 9646901 2210442 -3414998
11641 -3414998 -6800046 -8704076 -9234947 -9019210 -8201606 -7298142 -6717496 -5528166 -3220761
11632 -3220761 -1607730 -2677159 -6059774 -9897829 -11932995 -11372610 -8230936 -4033351
11624 -4033351 -1226363 -611651 593855 4791274 10175437 14022880 14356433 11524198
11616 11524198 7978230 5893782 6454828 8721767 10260108 10746286 10526949 9954090 9552119
11607 9552119 9071018 8684638 7923034 6049230 3409108 2018847 2336622 2366228 353818
11598 353818 -3164446 -5045580 -2598865 2005743 4343757 1969311 -3782671 -8470943
11590 -8470943 -8007734 -2895066 3635203 9190202 12651293 14307039 14238409 12679909 10709139
11581 10709139 8224087 4328007 49472 -2761529 -3084297 -1108341 1315312 1097673
11573 1097673 -3032010 -8952409 -13239609 -14122941 -11725632 -6210347 739212 6299374
11565 6299374 8114657 6333133 4789115 5169543 6797922 8434087 8417678 6652937 4315195
11556 4315195 1773371 -490238 -1503062 -1599830 -1794240 -3130252 -5332018 -5872888 -3085968
11547 -3085968 889690 4018702 5757270 5700156 3343941 -1699168 -8217317 -13143797
11539 -13143797 -14891653 -13127120 -8278694 -2677614 1589498 3972597 6408416 9745440
11531 9745440 12460881 11934452 8166311 3551542 -138912 -2223226 -2414606 175361
11523 175361 3545627 3279486 -713462 -5294015 -8537141 -11108348 -14946439 -19628496
11515 -19628496 -22174050 -20119156 -13605603 -4754469 1386129 1368553 -1838361 -3910031
11507 -3910031 -3867833 -1855151 1881712 4672305 4900056 4420030 4037665 2793435 877588
11498 877588 -1675269 -5191996 -7924273 -8606902 -9049652 -10424843 -11833829 -12243458 -11284370
11489 -11284370 -9904602 -9120340 -8442305 -6746170 -4905284 -4451395 -3848374 -2007020 -858936
11480 -858936 -3519485 -9226050 -14953086 -18385970 -18655850 -16276866 -11523804 -5638016
11472 -5638016 -1213558 816111 2240313 3879083 4222191 2696972 1331784 2175195
11464 2175195 4045918 5180645 5218042 4358836 3479062 2765244 306409 -3779493 -7147582
11455 -7147582 -9363117 -11474011 -14691837 -18016509 -18822071 -15939367 -11553947 -9473364
11447 -9473364 -10418363 -12231737 -13529971 -13817263 -12710102 -10111433 -6608447 -4211577
11439 -4211577 -3388205 -3845855 -4884874 -4728874 -3257836 -773607 3121940 6839891 8095613
11430 8095613 7078186 6109921 7232596 7926742 6665937 5310021 5506502 7182044 8479400
11421 8479400 9316278 11167663 14823746 18872043 20059900 17861078 15254045 14572421
11413 14572421 15669655 17675097 19900158 21409184 22334145 23530643 23948045 22586586
11405 22586586 20780241 19110275 15875603 10611371 5216897 2078965 1799095 3373297
11397 3373297 5631381 6538629 4394236 158905 -3872754 -4716804 -185095 8261741
11389 8261741 16621345 21456823 21987468 20096350 17029744 14635149 14702194 16259054 16668700
11380 16668700 14466195 10837496 7792280 6731533 7383602 8153588 7717543 5740909
11372 5740909 3567767 1468317 -364678 -2161055 -3522590 -2387771 190792 1568456
11364 1568456 1136196 -375168 -1276565 -686924 719477 2875891 6385364 9437964 9822420
11355 9822420 7900629 3901862 -224023 -1808900 -511727 1636924 1485945 556759
11347 556759 2174373 5072907 6778874 7119339 7735948 8915237 9425613 8808008 7320145
11338 7320145 5378004 3402657 2600033 3914018 6407317 8144265 7806030 5657716
11330 5657716 3102352 908244 -654786 -1105178 -173757 978044 -345508 -3374153
11322 -3374153 -5159852 -4821003 -4569519 -6178174 -7825313 -8850021 -11657210 -16171313
11314 -16171313 -18405944 -16151816 -10821068 -4663641 639842 3304294 2865658 1477038
11306 1477038 1932063 4944650 7911695 10084244 11911610 12330304 12052570 12986995 15784237
11297 15784237 18107919 17473454 15393950 14537866 16255240 20832462 24695725 23480488
11289 23480488 16329865 5976740 -2746155 -7527629 -9803519 -11864707 -13565649 -12410094
11281 -12410094 -8209326 -2879974 2657373 6931761 8568763 6861747 3025259 -1058943
11273 -1058943 -3877950 -4705989 -4061849 -2051959 2079758 7821687 14151540 19095732
11265 19095732 20579729 20473152 19733797 18174087 15971224 13805280 11935080 8559455
11257 8559455 3841193 439054 -1652613 -3704136 -5427287 -4976716 -1776039 2317885
11249 2317885 6180142 10135223 12894444 10942982 4894302 -804091 -3271406 -2721261
11241 -2721261 -1569919 -2657562 -6086763 -9338383 -9607604 -7109442 -4155959 -2524441
11233 -2524441 -2801876 -3134915 -2309874 -554410 3074903 8104548 12391940 13458917 10922812
11224 10922812 7091465 4696775 3690637 3776873 6120441 10602478 16805767 23422963
11216 23422963 27831828 29448089 30253275 31143572 32212994 32645081 31559875 28474340
11208 28474340 22634888 16233022 13022003 13342903 14882438 15194833 11939566 5744247
11200 5744247 -8386 -2991284 -3232517 -3004463 -3482406 -2668768 120492 2549688 1647605
11191 1647605 -2716171 -6198009 -5741255 -2379465 1465323 5326969 9998916 16117948
11183 16117948 22237062 24979231 22868130 18204236 15085528 15209545 16996017 18085384
11175 18085384 17024745 13468619 8656235 4841226 4169960 5865550 7399265 7476510
11167 7476510 6383727 4575559 2696015 1305136 694688 2007582 4765487 7247585
11159 7247585 7732494 6587409 5532530 5019696 5076123 4865936 3601748 1795377 738413
11150 738413 2057892 3796805 3655062 2398429 572628 -1806547 -4440112 -6892192
11142 -6892192 -8217007 -8981123 -10390758 -12197242 -13011377 -11620901 -8021238 -4624772
11134 -4624772 -2310052 177749 3024503 5140956 6580560 9214737 13437989 17288658
11126 17288658 18440953 17638363 17965344 20311880 22943074 23901623 22376677 19201449
11118 19201449 16255477 14855489 15560459 17885953 18690762 17158999 16118522 16380484
11110 16380484 14902757 9911579 4351361 1510994 1216077 2317296 4299151 6347226
11102 6347226 7638342 7915004 7203212 5122582 2501479 2188590 4087891 5448571 5419599
11093 5419599 4893439 4011338 1749403 -3349273 -9634602 -13723509 -14411462 -12920589 -10517218
11084 -10517218 -8158449 -6366321 -5697203 -6812116 -7770353 -6954862 -6581377 -7111175 -6264221
11075 -6264221 -4381115 -2971912 -1351375 1337950 4584044 7814694 10184210 11374642
11067 11374642 12212040 11850308 8895335 4251121 196109 -705559 1967286 5006461
11059 5006461 4986842 2531195 -380677 -2749949 -4199769 -5100699 -5731675 -6279751 -7176215
11050 -7176215 -9028011 -10475907 -9357474 -6751081 -4077487 -1036044 2444140 5125360
11042 5125360 5522546 3363466 -988404 -5613962 -7088727 -4947322 -653655 3522309
11034 3522309 6481159 8717701 10971680 14677625 20202222 25270330 27941612 28811920
11026 28811920 30021184 30661154 27807236 21837656 16107076 12254258 10034268 9125603
11018 9125603 8804142 9550800 9384915 6829005 4477363 2957918 -448642 -5655392 -9603239
11009 -9603239 -10709308 -9761468 -7849356 -6398432 -6917998 -8766290 -10976686 -12361663
11001 -12361663 -12819677 -12733454 -11670534 -8989099 -4415928 155383 3805495 7525182
10993 7525182 13416271 19736063 22249679 20373093 15963409 13319614 16258022 23299861
10985 23299861 28567330 27854016 22203286 15341178 8924063 2769053 -2347070 -5612455
10977 -5612455 -6499789 -6055294 -6197251 -6258271 -5479152 -5492860 -7751037 -12598686 -17735114
10968 -17735114 -19314657 -17680557 -16276647 -15330489 -13782569 -11838341 -8025688 -1157005
10960 -1157005 5889923 10271565 11730769 9569748 4112614 -1362911 -4637926 -5719841
10952 -5719841 -4720931 -2945770 -2815777 -5193904 -8134365 -8913898 -6665359 -3762502 -2273957
10943 -2273957 -2077332 -2545803 -3086481 -2707108 -172732 4021324 8038249 10465026 11179725
10934 11179725 9997401 6413560 1046770 -3007707 -3924871 -3963310 -4607528 -4859492 -4623556
10925 -4623556 -4626058 -4477430 -3235667 -861577 1856746 3805648 5105714 7270877 10587157
10916 10587157 13789816 17039887 19453795 17985128 11840380 3498928 -2078066 -1481785
10908 -1481785 2767770 5854740 7043645 7775212 6494989 2416715 -1383254 -3576323
10900 -3576323 -4473873 -5445630 -7524664 -9708377 -11280874 -9746743 -4636455 -535200
10892 -535200 -203184 -2836782 -6311947 -8233032 -8390745 -8378006 -8126405 -7521558 -8670435
10883 -8670435 -11222286 -12799379 -12312526 -10661361 -8992278 -7454357 -6606952 -6643406 -6767903
10874 -6767903 -6669028 -6173789 -4666990 -2422879 -1211307 -807133 889920 3682315 6241462
10865 6241462 8250465 9715422 9600298 7687630 4007994 1108962 909543 2029316
10857 2029316 3677145 4469141 3041077 93815 -3013754 -5171726 -5103424 -2370445 1450492
10848 1450492 4997706 6702172 5136115 915071 -3480691 -5267196 -4324915 -3576747
10840 -3576747 -5012110 -7817167 -10133266 -10711425 -9534412 -7455225 -5765750 -4769689
10832 -4769689 -3985203 -3365302 -3195311 -3386247 -3539771 -4269909 -5437448 -5147952 -2886821
10823 -2886821 711876 5090576 10396985 17952495 26444948 33377779 38215205 39751416
10815 39751416 38279030 36583958 36274278 37365375 39768248 41553464 40787929 38530098
10807 38530098 36611396 36105662 36170182 35543411 34706021 34803548 34741134 32791125 29329000
10798 29329000 25685980 22634930 20869759 18687173 14425692 10736059 9855282 11233203
10790 11233203 13391834 15099553 15643485 15110443 14609360 13799520 11483383 8995944 7263649
10781 7263649 6984791 9591560 15859623 22794131 26495967 26561403 25303428 24144374 22457788
10772 22457788 19432820 15192857 9947736 4636007 1145739 845364 2928296 6449951
10764 6449951 11100762 15272689 17893169 18641771 18223500 18490112 19223731 18776103 17518657
10755 17518657 17562949 18918284 19853544 20581274 22706943 26947534 32585459 37953728 40348553
10746 40348553 37153369 28343427 16828312 6465561 -554989 -3034999 -1116175 2249289
10738 2249289 3879537 1915878 -2041743 -6252695 -9417980 -9893720 -6987830 -1503700
10730 -1503700 5127993 11782095 17167709 19837979 19321825 15518340 8942541 2432781
10722 2432781 -1431228 -2818633 -1230730 2267980 3675316 1339395 -1927849 -3899405
10714 -3899405 -4938733 -4151200 -749969 3250102 4823157 3266346 362504 -954269
10706 -954269 537523 2683427 4365550 7179515 10814125 12460755 11384300 9349864
10698 9349864 7328327 6121206 5815014 5529740 4794818 4815747 5587623 4732560 3130847
10689 3130847 2973088 4152878 5227937 6704943 9582257 12279461 13522352 12003599
10681 12003599 8220165 5218343 4357667 4717389 5936642 9405558 14865461 19448406
10673 19448406 20095872 17277123 14038155 12258702 13658132 17263032 19916831 20181024
10665 20181024 20059557 21827284 25085756 28647750 31650048 32925804 31653636 28010410
10657 28010410 23339956 18151679 13236282 9147126 4582691 -870886 -6510609 -10735840
10649 -10735840 -11804774 -8835065 -2011281 5581553 10261292 10643556 8981580 7717146
10641 7717146 7136476 5717993 2040169 -2389710 -5594879 -6776300 -6693006 -5998338 -3814231
10632 -3814231 618941 6089026 11361333 16088275 19331481 20202851 18893155 16110761
10624 16110761 14145539 15169019 18084735 21417970 23997102 24881652 24223039 21833528
10616 21833528 17900695 11911926 3775442 -3896519 -8073847 -9044747 -9235529 -11449486
10608 -11449486 -14916906 -16299396 -14568388 -10538270 -5104692 494029 4763058 6497452
10600 6497452 5617616 2581542 -1081350 -2668963 -1605610 25417 927135 1672876 2423457
10591 2423457 3729320 5305965 6255296 6444315 5058852 2228574 -303825 -580517 603892
10582 603892 1354906 862589 -2591768 -7941553 -10908733 -9941579 -7370037 -4348261 -678308
10573 -678308 2211469 4213886 6506945 8898737 10963573 11570681 10302047 9001286
10565 9001286 8020814 7001958 7547900 10029817 12343514 13247827 13653543 14282698 14885905
10556 14885905 15361669 16108292 16463080 16687682 18297418 21528574 23954206 23009308 19707581
10547 19707581 15482925 11216812 9280816 10871663 13475202 14418811 13367639 11288148
10539 11288148 11158299 15107800 20947811 24834553 25396141 23760567 21607931 20034759
10531 20034759 19536034 20111669 20851855 19724839 16385178 12201531 8125137 5852773
10523 5852773 5514129 5140047 5574923 7939072 10276764 11915856 14799795 18593917 21315627
10514 21315627 22914251 23402296 22355991 20390699 17781960 16357775 18397488 23902149
10506 23902149 30847184 35343169 35111373 31608925 27972865 26623647 27096355 27767235
10498 27767235 26897944 23399071 17851278 10948516 2261532 -7858166 -15417023 -16173300
10490 -16173300 -11396947 -5408631 866715 7499616 13282757 18027328 22523546 27025057
10482 27025057 29298825 28734794 29050995 31665770 33903783 32847307 28754439 23364972
10474 23364972 17661565 12407012 9691065 10863050 13682580 14639938 14192194 13950430
10466 13950430 14610389 17165399 20043512 21361612 20880773 19935008 18809774 15385429
10458 15385429 10181809 6372434 5725015 5872568 5540729 5448577 5720096 5590180 5211870
10449 5211870 5937923 6122534 4602486 3329696 3443939 5783337 9669148 12927195 15093140
10440 15093140 16483406 17601227 18845284 19043281 17023076 14044062 11981305 10675736
10432 10675736 8759395 5986208 3477423 2497314 4644853 9179106 13478885 16289399
10424 16289399 16367547 14704884 13050747 12590891 14053994 16048412 17588313 18438026 17628995
10415 17628995 15294844 12239886 8489163 3429315 -974102 -1777038 1859856 8417227
10407 8417227 14602729 18432725 19223796 17441120 15885523 16733647 17938158 16279716
10399 16279716 12697923 10339621 10994791 13081939 13498553 12026044 10403035 9146910
10391 9146910 8243018 8174335 7192625 3908099 321532 -1280613 -1857934 -3638278 -6598475
10382 -6598475 -8830358 -7878864 -2895020 3317727 7525365 8854192 8255594 6237710
10374 6237710 2865095 -1694740 -5723103 -8194501 -11282018 -15350611 -17919795 -18038783
10366 -18038783 -16952345 -14055571 -7987874 -933545 3676074 3904223 1371333 -406647
10358 -406647 -976848 -1215397 -2635326 -6279935 -10696035 -13376682 -12677773 -7469248 -445614
10349 -445614 3708474 4141865 2425795 204190 -834236 -345897 691739 988567 977124
10340 977124 1764215 2490010 2077481 1429399 1781971 3358079 5576655 5492651 2556239
10331 2556239 -806139 -3114613 -3177555 539818 7638183 15105388 20263853 23024159
10323 23024159 24959989 26830370 27921725 28027233 27926710 27166562 25225864 21500299
10315 21500299 16909045 13989917 13836278 16823611 22507027 27471081 28382329 25023097
10307 25023097 19213937 13614777 10361816 8981356 8428411 7745551 7314191 8208194 9871743
10298 9871743 12518133 16704894 21425153 25188097 26719915 25916042 23899094 22016603
10290 22016603 21452563 22377313 23778503 23890106 21427558 17448915 14287152 12297169
10282 12297169 10186582 7306119 5731984 6856367 8322650 8593022 8577043 9008182 10186484
10273 10186484 11738415 14010836 16345395 16462210 14728095 12503079 10403008 9734422
10265 9734422 11344664 13790161 14870217 13823665 11124179 7747780 4029604 753100
10257 753100 -2047750 -4409098 -5159116 -3751334 -91359 4136752 6551860 6963252 6420875
10248 6420875 5183674 2006100 -2781812 -7335985 -11998506 -18484026 -27192211 -36877387
10240 -36877387 -46519051 -57117736 -70237683 -86238646 -104211536 -123776612 -144910638
10233 -144910638 -168931200 -196370773 -225030660 -251752543 -274464127 -294761156 -314315411
10226 -314315411 -332081344 -346859730 -357225372 -359332362 -349154964 -325694933 -290959499
10219 -290959499 -249101763 -205142208 -164365902 -130245433 -104039932 -84775782 -70124065
10212 -70124065 -57970941 -47925070 -41738999 -39626068 -39314375 -38788615 -37951182 -37657204
10204 -37657204 -38219170 -38992987 -40015232 -41456116 -44820764 -51066279 -59244365 -67634368
10196 -67634368 -75138596 -83648834 -96006545 -111633727 -127375418 -142807934 -161027651
10189 -161027651 -183206485 -206677164 -230143945 -254076794 -280754542 -313531586 -351600478
10182 -351600478 -389114487 -419338267 -439850614 -452158752 -459249428 -461768054 -457148035
10175 -457148035 -443436558 -418973921 -381216680 -329921935 -273110269 -222778510 -184154479
10168 -184154479 -153764445 -128506412 -107934778 -90427933 -74780724 -61769912 -53841240
10161 -53841240 -50985811 -48553298 -42828162 -35545836 -30477252 -27700562 -25184485 -21730993
10153 -21730993 -17002006 -12151656 -9301565 -8790904 -9618899 -9951380 -8373676 -6268697
10145 -6268697 -5124579 -4533282 -3582672 -3471636 -3840860 -3416459 -2887992 -3220577 -3977514
10136 -3977514 -3626705 -2585530 -1685129 -409235 2020021 4693140 6003418 4818387
10128 4818387 2418592 728756 1192075 5489361 11315199 14467102 14457856 12851543 10451263
10119 10451263 8453654 7894706 8012121 6843321 2777557 -2257955 -5324397 -4152366
10111 -4152366 2082845 9704777 14436125 15874295 15573642 14249790 11937876 10696329
10103 10696329 10582714 8870799 5056167 1064923 -795271 -297772 2153763 6027260
10095 6027260 9338325 9098336 6641262 6176718 8036245 9896626 11691704 12635962 11362644
10086 11362644 8863295 6428745 4674807 4424284 5218207 6606281 7834612 8064904
10078 8064904 7359444 5216208 677881 -5804848 -10651180 -10562606 -6965617 -3499382 -1462063
10069 -1462063 55124 4451 -3512747 -9494366 -14150366 -14552229 -10976017 -5430349 605408
10060 605408 5913631 9845224 12956707 15135173 15559508 14153445 12687649 12189595 12830189
10051 12830189 14910108 17874148 20820646 23415895 25736914 27684761 27619704 23041821
10043 23041821 15869907 9032735 4011134 1870874 2590357 4885060 7657586 10849349
10035 10849349 13071713 13508027 13425424 15052362 19759166 25557866 28691482 29207720 28558668
10026 28558668 27575100 26923076 26936572 27486809 27535864 25551276 22117411 20602489 22485893
10017 22485893 25711340 29060101 31887570 33191587 31892799 28134331 25315070 25683191
10009 25683191 26844033 27028655 26736033 26720814 28526424 32032715 33938781 32975260 32556792
10000 32556792 34363437 34821599 31744205 26510462 21029097 16149816 11345765 7809384
9992 7809384 7036526 7665861 7178599 5112582 3471355 3952881 4608062 3029693 -534482
9983 -534482 -2824243 -2264619 -760807 1657922 6276211 11675623 15663275 17979965 18884882
9974 18884882 18183264 15959296 12641062 9906712 9066099 10314431 11911965 12936040
9966 12936040 14141303 16127597 19034785 21738117 23896414 26099857 27057995 25199866
9958 25199866 21882093 18351254 14093912 9036872 4926224 3536884 4705134 6496168
9950 6496168 7138643 6145593 5237451 5761750 6540870 6047361 5555307 6701137 8655290
9941 8655290 10522841 12597567 15753538 20482117 24619832 26260502 25825025 25772821 28266934
9932 28266934 31534254 32349863 29780836 25705364 22056939 18058318 12883390 6862388
9924 6862388 1588148 -1257166 -3689025 -7348266 -8874742 -6880583 -4149964 -2160582
9916 -2160582 624968 5720834 10817364 13350264 15333792 19217045 22483099 22344540
9908 22344540 20334451 19124319 17821056 14243582 8874976 4005612 1704949 2061855
9900 2061855 3890864 6514938 8090020 7665337 6874862 6681240 5872713 4386232 5373599
9891 5373599 10113738 15245624 16632287 15007677 14388753 16197692 18775305 21492622
9883 21492622 23959698 24293574 19957804 11884111 5058638 2557175 2751854 4252038
9875 4252038 6494872 7831765 9058099 11507685 13367362 14050505 14574913 15717605 17676182
9866 17676182 18945419 18819932 18078738 17271319 16157938 14392448 11373936 7211231 3039782
9857 3039782 1627303 4424843 8341834 10452515 11986901 15371093 19522671 21545025
9849 21545025 19975873 15385748 9493885 4172040 1484204 900937 -37864 -2082032
9841 -2082032 -3147258 -2094671 -721208 55557 -993183 -4150389 -7066732 -8479483
9833 -8479483 -7605592 -5326825 -2716322 445407 2348370 1829343 1160243 2773240 6687895
9824 6687895 10551452 10808344 7406492 3680680 1861992 3853236 9294943 14144440
9816 14144440 15542393 14687573 13498776 12597782 12210144 11434323 8913992 5215525 1721423
9807 1721423 -160922 -73284 31341 -1609304 -4141893 -5975270 -6644324 -6524061 -6125822
9798 -6125822 -6058140 -5874246 -4163487 -1156958 2075222 4812512 5953785 7114859 10245758
9789 10245758 13789885 17120842 21828734 27705196 32616117 34412438 32359111 28198703
9781 28198703 24533433 21569526 18945614 16430099 14013806 12383216 11972180 12339191
9773 12339191 11620343 9230121 8566470 12819594 20408483 27840599 31351517 29742771
9765 29742771 25821722 22101668 19115006 15829742 11943475 7711808 2907008 -705908
9757 -705908 -3726 4217987 9370021 15041915 20988672 26278719 29846969 31237507 31527832
9748 31527832 31388123 31079382 30088286 27526738 24754251 23333817 22320607 20111157 17367488
9739 17367488 15140478 13613196 12865170 13908382 17370555 20789687 22058248 21509927
9731 21509927 18886219 15352967 14059111 15328821 15671811 13757438 10891942 8987643
9723 8987643 8449086 7432093 5052976 3050111 2822736 3891698 5789667 8789255 12211554
9714 12211554 14545301 13733958 10363609 7554466 6320219 6418975 6676814 6869336 8424338
9705 8424338 10675855 11480253 10856974 10837478 12595038 14801035 16172482 17637362 19691805
9696 19691805 20976624 20978331 19204193 15386870 10844752 7223347 5547859 5776654 6882254
9687 6882254 7951995 9028331 11603228 16484063 19896800 18728783 15141786 11520240
9679 11520240 6594961 969438 -2160798 -1543823 1942833 6618576 10984420 13284371
9671 13284371 12691530 11025916 8809495 6072263 3198084 513639 -1538903 -1643803
9663 -1643803 -196980 81369 -123361 1752551 5865960 9856499 12250956 14364738 17422871
9654 17422871 19860291 19935199 17424490 13097485 8143103 3229359 -1459805 -4673405
9646 -4673405 -6363597 -7772890 -9713919 -12843752 -17765237 -22234964 -22495490 -17659851
9638 -17659851 -9622854 -957846 5177316 6095317 4548810 4861623 6569808 7893419
9630 7893419 8222277 8102609 8108336 7934599 7390128 6916713 6742240 6876912 8365459 10554975
9620 10554975 10795214 8724340 6978113 8107513 12519288 17591939 20758465 21402614
9612 21402614 19792310 15995968 11052623 7032609 5197910 4685691 3884810 3334441 3644658
9603 3644658 4552479 5795802 6913420 8777813 11262517 13233481 14026717 14859770 16488707
9594 16488707 17571244 17221895 16115039 15562800 16326377 17541017 16423580 13495278 11766983
9585 11766983 12803303 14837929 15511711 14594942 12257492 9634704 7720765 6010402
9577 6010402 4713174 3905494 3163785 1889526 -581513 -4169264 -7952774 -11192432 -13996416
9568 -13996416 -16178561 -18598180 -22477070 -26167283 -28262410 -30070105 -31963080 -32611668
9560 -32611668 -31366989 -28249002 -23929208 -19491038 -13818858 -7315788 -4324409 -5781164
9552 -5781164 -7705243 -7418727 -4302973 1979503 7641186 7958903 3913970 35325 -1606645
9543 -1606645 -2271327 -3075856 -3469043 -1951240 2511694 9018322 15361352 19092795 18582707
9534 18582707 14598182 11049495 10566036 11554605 10128058 6147398 3405299 3487156 4860842
9525 4860842 6767078 9752462 12054704 12726759 13341325 14546377 14996306 12764000 7464790
9516 7464790 784870 -5551212 -9907296 -12208916 -12548338 -10395291 -6581444 -3101831
9508 -3101831 -1238865 -823960 -1082117 -912483 801426 4248703 7669536 9110415 7515970
9499 7515970 3829680 1295625 571224 584225 2104777 3783675 4133757 4731057 6706503
9490 6706503 9444153 11569524 12996234 14878449 16906066 18009222 17452946 16269062
9482 16269062 15205256 12928132 8021798 2484554 -1103356 -2951245 -4234975 -4714985
9474 -4714985 -2272331 2408829 5966255 6209966 4466145 4309249 6167571 8315935 10175556
9465 10175556 11855921 13135194 13726441 14366516 15707296 16791574 15504710 11536926
9457 11536926 6321803 1207254 -1709978 -735097 4183537 10850187 16794675 19822506
9449 19822506 19598143 19019667 20681939 23521344 24631715 22343627 16829665 9511259
9441 9511259 3094491 1005309 3868586 7042707 7203919 5449701 2845255 927141
9433 927141 461954 1948299 5573041 10644652 15560987 18898003 20423259 21192607 21056661
9424 21056661 19294275 16393034 12299673 7727546 4604672 3862551 5286986 7771287
9416 7771287 10854661 12854383 12690438 11788858 11536008 12438414 13945975 15280410 16431709
9407 16431709 17336184 16723490 14090031 10236182 7377517 6730786 7778960 9422324 9520436
9398 9520436 7611096 5584477 4404482 3317523 1629722 -1836121 -6622226 -9856919
9390 -9856919 -10554741 -9882734 -8560933 -6995602 -6063593 -5800358 -4186489 -695613 3391565
9381 3391565 7654477 10786588 11249177 9785999 7174263 3676120 85879 -2324128
9373 -2324128 -2406542 -1801486 -3080356 -5698389 -8410096 -10448702 -9946600 -6521327 -2505467
9364 -2505467 -842498 -1126739 -679030 1694065 5124010 6679111 5555468 2053649 -1441321
9355 -1441321 -2565209 -3039102 -2476415 -21448 1544571 46607 -2188274 -2180635 -471812
9346 -471812 1691512 5280687 10427273 14692866 16503756 16103238 13862821 9194057 2697131
9337 2697131 -2800008 -6000638 -6682028 -5163445 -2517155 -1364818 -1694588 -280929 3712697
9328 3712697 8907820 12239444 12817613 12770947 12708333 12974010 13321688 11296891 6905534
9319 6905534 3207448 897425 -1481225 -3329627 -3568370 -3833839 -4788773 -4572346 -2645390
9310 -2645390 -830872 -851369 -2547701 -3526814 -2004319 1033237 4283077 6596308 7055798
9301 7055798 5535609 5818861 8992441 10436960 8910713 8437287 9459664 9119997 8466590
9292 8466590 8922295 8742640 6916724 4814642 3314355 2544857 2188156 2028415 3173739
9283 3173739 5510798 8324558 12073131 15518651 16194089 14102802 11950903 11782823 13379912
9274 13379912 12973531 8393929 1998874 -1312731 244497 4370922 8421844 10899494
9266 10899494 11030548 9302239 6538771 4238321 4025345 5511387 8315497 12547470
9258 12547470 17743245 21869331 22606131 19892259 16623293 16578044 19506143 22711692 24921441
9249 24921441 26067803 25426396 21767366 15938394 11657115 11029260 12845140 15259914
9241 15259914 16326274 16606880 17573012 17970022 15873144 12141532 8486480 5460276 2258398
9232 2258398 -1975507 -5320505 -6605235 -6454369 -4399100 193420 6166254 10782638
9224 10782638 12339324 12433816 12743699 11939553 9778351 8963775 11727054 16035179 17729546
9215 17729546 15740800 14087461 14462697 13086569 6941013 -2308450 -10540584 -15810279
9207 -15810279 -17654455 -17279693 -16212945 -13507690 -9071031 -4914852 -2358370 -1485347
9199 -1485347 -2165955 -4389617 -7146768 -8906659 -8934531 -7936344 -6648646 -4042738 -712865
9190 -712865 2160677 5270674 9099333 13700743 17314593 17930639 17138230 16421196 14769694
9181 14769694 12315154 10068322 9474212 11045303 11917463 10593817 8015948 5693636
9173 5693636 4766694 4969130 6331624 7979429 8362403 7907066 8078507 9930496 12733276
9164 12733276 13900009 12578936 9378387 5356626 1341235 -2214340 -3371307 -2358182
9156 -2358182 29963 3212378 5584682 7451656 7619763 5038598 1705018 -434214
9148 -434214 -457565 1151120 2833200 3447361 4074908 7130147 11693917 13255227 9045697
9139 9045697 2716063 -305237 1349067 5042829 7830989 9523802 10561911 11069782
9131 11069782 10941255 9624845 7552442 6814720 7420594 7883632 8852094 10757605 12513489
9122 12513489 13560827 14246760 14230155 12366117 8306840 4754228 4090761 5784098 8097132
9113 8097132 10704447 13000689 14566732 16285590 18004434 18195873 16361152 12901063
9105 12901063 8003539 3254610 1868451 4263442 6971985 8099380 7390976 6513999
9097 6513999 7812326 11400985 14956407 16250620 14338917 9341569 3824482 511840
9089 511840 -37202 1786434 4387741 7360249 10645204 14024553 15803509 12793593 7785640
9080 7785640 5418543 5735285 7605056 9865296 12317128 14813548 16884258 18651315
9072 18651315 19577169 19695612 20844227 22616895 23141967 21416662 17622519 14410843 13828240
9063 13828240 14234546 13059229 9103033 3017214 -4081327 -9230050 -10533589 -9313421
9055 -9313421 -8211875 -8913557 -11014700 -13043208 -13334215 -10441605 -4412137 3685691 10969388
9046 10969388 15969352 20275147 23979035 25981829 25509644 23184723 20363395 18917242
9038 18917242 19143513 19865319 19006451 14623495 8467289 4202520 3274013 4407477 5510919
9029 5510919 5679203 4778249 3208828 1236925 -920723 -1781394 119289 4861312 10634125
9020 10634125 14629036 16649488 17889422 17780963 14783496 9302457 4646122 3941391
9012 3941391 8509227 16546439 23686354 27127679 25627099 19786519 13467057 10790848
9004 10790848 10441244 9185046 7335252 6238279 6974721 10863489 16627712 20519164
8996 20519164 20492581 16446138 8722818 949198 -3733085 -7076230 -10969111 -14444357
8988 -14444357 -15234814 -12577922 -9142758 -8779696 -10628029 -10291853 -5959858 -67898 3782873
8979 3782873 4453263 3979745 4705985 6423127 9147791 12236787 13987848 15085918 15346626
8970 15346626 13149755 9351665 5554677 2555676 25627 -1823853 -2317230 -1714168
8962 -1714168 -1975287 -3262716 -2866969 523825 3587253 3773031 2658150 1399841 -9631
8953 -9631 -546536 554578 2271831 3488225 3623394 2301435 365400 -184607 2575964
8944 2575964 8431453 16439119 26074979 34906355 38638966 36971486 33916376 31241866
8936 31241866 28864343 27127494 25241520 21415581 17097779 15310746 14730170 12144667
8928 12144667 6929637 2185328 1164429 4667568 10531594 16189766 20362777 22888783
8920 22888783 25231207 27499812 28575808 28612506 28477031 28682088 29666043 30881647 30956445
8911 30956445 29236702 26002949 21365571 16405927 13491156 12785971 11078399 6373098
8903 6373098 1543114 -723982 -1494657 -2678143 -4904279 -8120529 -10614612 -9945945 -7714238
8894 -7714238 -6627596 -7764787 -8673414 -7812548 -6089194 -5418837 -7097576 -9136585 -9230292
8885 -9230292 -8197751 -7253707 -6330960 -5364482 -5234125 -7018985 -9483523 -10241560 -10101491
8876 -10101491 -10393828 -10849518 -10105663 -8268410 -6811858 -5639274 -4684055 -4184319 -4238997
8867 -4238997 -3858545 -1586396 759197 1764392 2454811 2810577 2314464 1438320 1798451
8858 1798451 2871000 2316886 576830 -315965 146569 1482854 3665168 5085504 3757642
8849 3757642 -601944 -6070396 -8331562 -4100739 5031425 12373935 12471275 8486832 6134022
8840 6134022 6087826 6990193 7762362 7189330 4835460 3074044 2424141 67149 -5032372
8831 -5032372 -10928865 -14903874 -15550793 -12833946 -8873047 -5810425 -4793181 -5067917 -5414750
8822 -5414750 -6142028 -6194728 -5370840 -4423469 -2534042 722957 2449655 2022034 3401735
8813 3401735 7439214 10259291 9425111 4874951 -359943 -3593269 -5966576 -8495191
8805 -8495191 -11534797 -15353218 -17845607 -17028065 -14160485 -11074972 -9954372 -12053876
8797 -12053876 -15463895 -17291053 -16163667 -13248505 -11157695 -10423028 -10311023 -10589988 -10584839
8788 -10584839 -9681169 -9538526 -10816081 -10008150 -5425470 221635 3876096 5294282 4928368
8779 4928368 1899028 -1359414 -988402 1713200 2448974 1351159 2317568 4682076 6352358
8770 6352358 6566003 5815918 5699359 6374886 7113058 7860535 8584199 9737328 11290250
8761 11290250 11818112 10091003 7441264 5674714 3011707 -1128603 -4137055 -3933324
8753 -3933324 901944 8855085 15451209 18206710 17591221 15317597 11344703 5184240
8745 5184240 -309317 -2323114 -1768895 -1366867 -2082005 -2593401 -2643878 -3169911 -4312001
8736 -4312001 -3757614 -941865 1702891 3169577 4137744 4712925 5136255 4170448 693343
8727 693343 -1509027 -414378 2189838 3397052 1747854 -1579183 -5385130 -7717942
8719 -7717942 -7348051 -6582362 -7692890 -10575763 -14845443 -18859314 -19642365 -18857490 -20334915
8710 -20334915 -22136633 -20546388 -15177981 -8217560 -3360173 -3669499 -8025468 -12141705
8702 -12141705 -14293890 -15319865 -15527628 -14703953 -12686966 -9656550 -6339081 -2347469
8694 -2347469 797345 150960 -2080925 -2306125 -173918 2830828 5782180 8854560 12362474
8685 12362474 15138389 16072156 14970008 12085687 6865750 -730396 -7353715 -9170027
8677 -9170027 -6061060 -1506084 1643219 3868391 7188967 10238588 10287545 7824459 7533435
8668 7533435 11527570 16935342 20148385 21604260 24352657 28141808 30206172 28880003
8660 28880003 23487983 14150734 4315782 -1421777 -1539230 -93416 -2050243 -6317673
8652 -6317673 -9322585 -9793239 -8604682 -9029469 -10732398 -9149081 -3825072 2341083 6900883
8643 6900883 9239523 11147928 13702461 16070853 16825070 15378880 11339500 5765736
8635 5765736 2029776 823360 -970144 -4980011 -10056162 -14438820 -17391971 -18631614
8627 -18631614 -17524318 -15484244 -13957645 -12480137 -10998068 -9121612 -6818710 -5520350
8619 -5520350 -4523034 -2493903 119566 3867143 8762650 13920525 17157935 17113784 15044582
8610 15044582 12601770 8591277 2888690 -1866584 -5409314 -7549896 -6379234 -2094246
8602 -2094246 2844563 6079716 6147569 3394393 -459745 -2511430 -309538 4538548 8390096
8593 8390096 9795550 9007790 7184237 5393582 3202489 -239602 -5824515 -13095423
8585 -13095423 -19307579 -22442931 -22838349 -22296014 -21102160 -18866476 -15833528 -13161055
8577 -13161055 -11041500 -6636242 438831 7782371 14526073 18629907 18280730 15549410
8569 15549410 12981966 10996839 9671538 8872594 9339972 9861180 8482107 5583513 1736087
8560 1736087 -2127388 -5519352 -8043891 -10634403 -14484023 -18007906 -19596951 -19710206
8552 -19710206 -19416009 -18997178 -17681111 -15323340 -12314286 -8179807 -3101068 1235439
8544 1235439 4988076 8035572 7862309 4767963 1450422 -568750 -324442 1097571 1738886
8535 1738886 1060884 -1025792 -3099035 -3751596 -4361331 -7058535 -10993052 -14178908 -16249514
8526 -16249514 -17593375 -17914836 -17044256 -15999993 -13580632 -8580838 -2733445 2964673
8518 2964673 8176131 13340508 17427903 17090930 11874219 5417111 336834 -1785420
8510 -1785420 -756498 -1051862 -5399182 -11672797 -16253057 -17977472 -17314915 -15296819 -13986035
8501 -13986035 -14397467 -16953588 -21135695 -24083617 -24361632 -23647871 -22633484 -20433350 -16285076
8492 -16285076 -11176073 -8635339 -10386055 -14045575 -17580994 -19689063 -19393990 -18070983
8484 -18070983 -15780931 -11464865 -4635537 2328522 6851118 8548263 7555901 6129965
8476 6129965 7083455 9340223 10371108 10126812 9189823 7259068 4568794 3217713 3877038
8467 3877038 4978360 4682404 4071256 4213663 3641511 468427 -3094772 -3430458 -658990
8458 -658990 3456861 7235777 9215548 8593039 5732452 2427072 1345190 2255675 2993898
8449 2993898 1481450 -3812446 -10243011 -12845588 -10164582 -5163880 359920 7189272
8441 7189272 13801903 17576785 18949777 19511851 19553444 18482035 15558624 12288148 11060749
8432 11060749 11939739 13400759 13073759 11333828 11095468 12963694 15205205 16095485 14869964
8423 14869964 11762458 7572875 3054467 -2359644 -8887886 -13982354 -14991527 -12756746
8415 -12756746 -10034548 -9097918 -9383183 -8425358 -5911342 -4625150 -5421241 -6438837 -8329134
8406 -8329134 -10488082 -9631885 -4485860 2586915 8918284 13427131 15132097 13220378
8398 13220378 8446189 4491982 3778537 3709696 2975140 1695550 -604196 -3256666 -5481995
8389 -5481995 -5921165 -3862074 -674778 2430407 3646032 1605844 -2096843 -4798291
8381 -4798291 -5709524 -5588669 -5549056 -7350138 -10619390 -13571830 -15685247 -17001437 -17805503
8372 -17805503 -17764973 -17271810 -16968416 -17454665 -18923145 -20210806 -20584056 -19225319 -16884454
8363 -16884454 -14681199 -12449762 -9328550 -4801487 -72084 2254736 1854074 892533
8355 892533 788799 2112141 4021212 4720165 4025979 2904848 2305789 2157228 464812
8346 464812 -3476260 -8390434 -12085554 -12841502 -11276294 -10152202 -12102396 -14708280 -15890096
8337 -15890096 -16082289 -15362746 -14098941 -11957708 -9612070 -8496412 -9231459 -9714090 -6290085
8328 -6290085 1476975 9787873 15344962 17191698 15874745 13596320 13280920 14608207
8320 14608207 14426384 11799029 8964528 7493122 7412680 7177166 5268110 2627828 287348
8311 287348 -1922092 -4232608 -5856047 -6132442 -5171476 -4642615 -6030520 -9086403 -11963900
8302 -11963900 -12305642 -10556258 -10028231 -11851687 -14089113 -16026884 -18013725 -19854055
8294 -19854055 -21238417 -21893437 -21290722 -19195275 -16457147 -14630746 -14191630 -13110430 -10783839
8285 -10783839 -8727098 -6686816 -5143023 -5351019 -7545930 -9062800 -7379057 -5079087
8277 -5079087 -4528949 -4741234 -5129198 -6567944 -7661235 -7152087 -7378167 -8981314 -9214395
8268 -9214395 -6970074 -3742558 22534 3369885 4683811 4424019 4124363 3635311 1611976
8259 1611976 -1839236 -5091346 -7696801 -10351477 -11876845 -11300871 -9528218 -6226172
8251 -6226172 -2075925 -192470 -726103 -2039864 -4239063 -6749894 -8922153 -10876703
8243 -10876703 -11711703 -10549496 -9001022 -9253251 -9990415 -9498743 -8581237 -8088039 -7911466
8234 -7911466 -7599290 -7576074 -8002132 -8046877 -7905837 -6963042 -6383174 -8699314 -12809632 -15743415
8224 -15743415 -17334409 -19510652 -21218602 -20604996 -17865744 -13329411 -7769781 -3259019
8216 -3259019 -1317689 -2076516 -4475079 -5859058 -5201361 -3262635 -26075 3452697 6047872
8207 6047872 7225092 5524582 609288 -5601317 -11242342 -15562301 -18842445 -22705688
8199 -22705688 -26760695 -28375489 -27787503 -25780360 -22967433 -22658524 -25551024 -26371259 -21770151
8190 -21770151 -15805350 -13760486 -16474138 -21151874 -23540005 -21829124 -18179838 -14117166
8182 -14117166 -9626498 -5296503 -2291571 -1619405 -3120054 -6191501 -10250438 -13461048
8174 -13461048 -14535418 -12847820 -9212574 -4555590 632206 5668198 9161292 10122280
8166 10122280 8950452 6190928 3070815 1574937 827408 -204434 -1111340 -1178417 -456498
8157 -456498 -1869936 -5650980 -8704268 -8706360 -6857792 -6250007 -8067827 -10824513 -12527528
8148 -12527528 -13029197 -13324288 -13564777 -14518238 -16731412 -19262246 -20180641 -19137725 -17742867
8139 -17742867 -18897718 -23001101 -26228253 -26824374 -25919221 -23311511 -19116664 -14468641
8131 -14468641 -10144157 -5527132 -651491 3896439 8190033 12199282 14833738 16319658
8123 16319658 18086858 17493353 12949446 6983816 2133347 -1210498 -2667566 -2185885
8115 -2185885 -873367 464813 1273846 2280259 4574332 7107869 8098443 8091711 8033807
8106 8033807 7352046 4812422 12273 -5591453 -9932027 -11570606 -11647246 -12005553 -12165909
8097 -12165909 -11550828 -9191772 -5920787 -4103066 -2411027 1612530 7998776 14614342
8089 14614342 19388089 21931244 23103216 24065000 24617608 22502374 17209935 12043096
8081 12043096 9143613 7999020 8095996 10202016 13299719 14910588 15306043 15049911 13939591
8072 13939591 12478480 11399022 10478535 9092907 6465628 3166283 666284 -241086
8064 -241086 -408820 -326575 65497 -302459 -1520340 -875923 2963269 6853976 8388823
8055 8388823 8405203 8032577 7347967 6305246 4350540 1786161 362628 1005164 4169729
8046 4169729 9081844 11396538 7433995 437173 -4900805 -7402208 -8192626 -9916391
8038 -9916391 -12400495 -13814775 -14059643 -13304804 -11044481 -5912561 764111 6412631 10817770
8029 10817770 11851103 8710119 5939995 7023272 9697440 9881469 6439979 570488
8021 570488 -4257548 -4990285 -2632207 274376 751843 -2004302 -5162921 -5881896 -4015927
8012 -4015927 -36615 5443482 9638819 10350467 9178974 9234860 9466858 7301759 3329357
8003 3329357 -1391720 -4345857 -4534223 -2172653 1506809 3935497 5014202 3891329
7995 3891329 677098 -2689579 -4929960 -5427073 -4203903 -1734668 931818 1833939 349579
7986 349579 -2706751 -6621418 -10539308 -12978119 -12067185 -6462715 626566 4928308 6387606
7977 6387606 6428241 6684158 7257322 5807227 2594939 70415 -1183605 -1308121 -1074377
7968 -1074377 -1782659 -3737456 -6942705 -11268365 -15971742 -20892951 -25297467 -27234817
7960 -27234817 -25777372 -21842325 -17338820 -13320361 -8698148 -2232168 4568810 8971149
7952 8971149 9552438 7720609 4645626 -1030223 -8676595 -15802203 -22359639 -28746035
7944 -28746035 -33947471 -35835173 -34206139 -30721561 -26410161 -22696882 -19036745 -13612084
7936 -13612084 -7291208 -2430476 1852886 7069014 11340918 12021329 9573003 5884312
7928 5884312 2513786 -176344 -2260621 -4035421 -6989964 -11640413 -15532583 -16468345
7920 -16468345 -15140147 -12741435 -9453244 -5358095 -371863 4031687 4845046 1590305
7912 1590305 -3510267 -7476199 -6418254 -278764 5931538 8054829 7073545 5423634
7904 5423634 3959158 3955027 4393445 2937784 852254 580351 1606688 2603270 2021077
7895 2021077 -251923 -2715766 -3936999 -3747229 -2862870 -1300275 -276921 -1556088 -5514070
7886 -5514070 -11361575 -18076293 -24339476 -27647504 -28414574 -28148444 -26884302 -24871972 -21097654
7877 -21097654 -15878454 -10259517 -5325892 -2783760 -2119002 -1688559 -991019 124960 2881077
7868 2881077 7793742 13632329 18020518 18752446 17965029 17909657 18738231 20128240 21176935
7859 21176935 20272840 16661633 11389350 6507046 2238021 -2530078 -7568925 -11454112
7851 -11454112 -12341743 -10299637 -7451258 -6296034 -7798826 -10830008 -14058713 -17724419
7843 -17724419 -22167289 -26088103 -29067539 -30172278 -27653896 -22770131 -19030113 -17227503
7835 -17227503 -15388997 -13305884 -13015961 -14808329 -17307811 -19846215 -21560271 -21736707
7827 -21736707 -20166792 -17718711 -15301552 -11698009 -5072459 3359208 12273057 18170968
7819 18170968 18771101 16814167 15116149 12889019 9178591 5195138 2272378 2636254
7811 2636254 6527088 9349304 8869891 7133451 6141029 8096913 13368878 19248422 21635196
7802 21635196 18083045 11869916 7260068 4924928 4070848 4775731 6378758 6477478 4178454
7793 4178454 1811522 1775266 2994608 3816160 4304693 4204700 2187955 -1830065 -6223902
7784 -6223902 -8271100 -8638988 -9769399 -9662149 -6346882 -1536355 3154228 6000490 5760027
7775 5760027 5102631 5858552 7058870 8180963 8031646 5920111 3371116 1623292 941444
7766 941444 555226 -895843 -3701513 -6188395 -7958954 -9904726 -11727876 -12267028 -11450500
7757 -11450500 -10849183 -10562704 -9294285 -7140612 -5608996 -5890378 -7050047 -6582317 -4107529
7748 -4107529 -2110898 -867738 979664 2816093 3486334 1708073 -2291921 -5040199
7740 -5040199 -4492889 -4173903 -7235311 -13317318 -20120750 -24245510 -24554075 -22690165 -20875474
7731 -20875474 -19056311 -16245126 -13174577 -10527552 -6549879 145822 7072285 11436803
7723 11436803 12648450 11473600 8697617 6405531 5325590 5255231 5963596 6835591 9367056
7714 9367056 13080369 14602740 13455286 12118695 11507990 11240881 12978825 17286120 20861073
7705 20861073 22311592 22681106 22173626 19813299 15696985 12078890 10693994 11455920 11567329
7696 11567329 9535505 7338464 7552543 9130139 9339387 8636255 8498565 7908822 5655856
7687 5655856 2790911 -27584 -2875394 -5026143 -6238233 -7717395 -10294565 -13066059
7679 -13066059 -14429206 -14747546 -14591266 -12637313 -9885432 -8798957 -8016411 -5504469 -1191379
7670 -1191379 3588770 6733076 8176628 8800273 7256903 3732795 1231336 103283
7662 103283 -1431380 -1569073 2036207 7699761 11499987 10785131 6774632 2055623 -2225972
7653 -2225972 -5995643 -9362922 -12065550 -13686558 -14193694 -14609272 -14817335 -13471789 -11853155
7644 -11853155 -11505728 -10614570 -8210737 -5451913 -3176502 -2217547 -2797577 -3453921 -3017740
7635 -3017740 -1040988 3629633 8647112 10974658 10434120 9117332 9646086 11933679 14293068
7626 14293068 16641041 18865966 20233052 20887334 20914619 20023355 18770838 16728171 13112675
7617 13112675 9106268 5705311 2608791 826189 -1075569 -5613514 -11348420 -15267054
7609 -15267054 -14464442 -7839320 825690 6345309 7193177 4925680 2274438 1105711
7601 1105711 1369092 2034962 2528440 2850438 1876016 -995359 -2655405 -946531 2666328
7592 2666328 5827624 7101646 6139662 3459267 1344637 1590206 2263215 1316428 -294373
7583 -294373 352673 3173840 5148112 5425956 4795182 3176060 958290 -863895 -1788070
7574 -1788070 -3275885 -6126927 -8468270 -9271288 -8819670 -7547886 -6085118 -4040200 -2118788
7565 -2118788 -2046644 -3527534 -6557887 -10819572 -14117591 -16360912 -17900488 -17984302 -16459741
7556 -16459741 -13598009 -10005667 -5926519 -1391688 3073922 6449363 8450535 9038102
7548 9038102 9443717 9603970 8501966 7930389 7387586 6380694 5603587 4834555 4577328
7539 4577328 6161837 9313238 11626511 12217925 11677374 10507302 9727691 11147924 13895316
7530 13895316 13951716 9857955 3435579 -3337421 -9215835 -14082178 -17523154 -17711571 -15118476
7521 -15118476 -13427675 -13855978 -13984732 -11899345 -10037324 -11969710 -15419505 -15651890 -12791044
7512 -12791044 -11376397 -13014000 -15172129 -15359696 -14241493 -12624814 -9693624 -4958068
7504 -4958068 308293 4503423 5919486 4762286 4524091 6870015 11539966 16815807
7496 16815807 19910760 18626267 13340924 6835668 2126500 894619 2149852 3798753
7488 3798753 3843637 1265327 -1110219 87164 3127137 3966623 1110921 -4756109 -11487723
7479 -11487723 -16448385 -17145437 -13987487 -10747289 -9992602 -8941012 -4417183 941271
7471 941271 3006955 1658047 -1249871 -3663673 -4329693 -4540956 -5104300 -6608841 -9049503
7462 -9049503 -11790812 -14603552 -16282760 -14378703 -7839308 1143286 9724350 15027716
7454 15027716 15008907 11039335 6401828 4435443 5892818 9297687 13007941 16390157
7446 16390157 17604994 14723902 8575945 779020 -7590373 -14198438 -15229007 -10489835
7438 -10489835 -4005629 -96657 1762662 4733157 8604553 11104319 12221083 12300070
7430 12300070 11508645 10190594 8784438 7163210 4617918 2022938 212522 -1617333
7422 -1617333 -2603685 -3592759 -6596022 -10214511 -11724971 -9541785 -4122491 2553205 9121250
7413 9121250 14770994 17627998 16990657 13452136 8265223 2588469 -2059704 -2186231 1784525
7404 1784525 4505357 2090658 -3753377 -8299421 -9608183 -8703869 -6408872 -3752037
7396 -3752037 -2858148 -3380152 -3813811 -2754029 -638213 842953 1501621 1464065 476731
7387 476731 -1947652 -4340506 -3750188 272819 4051854 3610798 -329380 -3552125 -3173692
7378 -3173692 334989 3456688 3985447 3114071 2664894 3091907 4814638 7733090 11152074
7369 11152074 14489900 16268253 16187222 14278745 9586095 3033561 -2348647 -4288339
7361 -4288339 -3674951 -2322647 -1204290 -1466128 -3690363 -6190753 -6002232 -1661305 4962440
7352 4962440 10756669 14519897 18307022 23005491 25792259 24760550 20364054 14818322
7344 14818322 11440148 11946684 15642041 20365873 21590846 18186467 13472580 9926856
7336 9926856 8234107 6876838 4111696 313614 -2016657 -2741717 -3400484 -3888420 -3688838
7327 -3688838 -2880473 -2691377 -3302417 -4682475 -6288094 -5680043 -2842300 181412 2374627
7318 2374627 2475257 806247 -1530100 -4241948 -6801354 -8360472 -8665235 -7450217 -5013545
7309 -5013545 -1906686 1867161 5064500 5989315 4790393 1436737 -3643107 -9025603
7301 -9025603 -13668315 -16844418 -18354712 -18747447 -17879156 -16355632 -15629564 -14765460 -12320092
7292 -12320092 -8478241 -3771952 1710097 6556810 7505392 3773477 -2097958 -7979829
7284 -7979829 -12022146 -13308107 -13724931 -14827294 -15556826 -15078214 -15524214 -17353223 -18487356
7275 -18487356 -17416995 -14510724 -10876635 -7115906 -4445631 -5212636 -9295232 -14115353
7267 -14115353 -16684594 -15455242 -12427893 -10607524 -10317936 -10996307 -13359170 -15091052
7259 -15091052 -13276343 -8906468 -4947376 -3266601 -4099207 -6814881 -10179756 -12889638
7251 -12889638 -15401797 -16845166 -16268371 -15728017 -15804186 -15685330 -15949421 -16950262 -17483309
7242 -17483309 -15955180 -13298244 -10788187 -6987539 -949831 5208033 8516131 9226298
7234 9226298 9573642 9163060 6945651 3649268 117411 -2746708 -3551122 -3075856 -3720744
7225 -3720744 -6415752 -9697428 -11590629 -12307635 -13578425 -13879056 -11261385 -6227405 -1223003
7216 -1223003 1301229 2516953 3537574 3914308 3171255 372688 -4379525 -9030881 -12081978
7207 -12081978 -14038141 -16353949 -18633521 -18061224 -14482854 -10572700 -7677822 -4920822
7199 -4920822 -1365980 3456479 7651948 7464008 2937394 -1650996 -2984112 -764872
7191 -764872 2920816 4856054 3624689 356633 -4099790 -10327613 -16720209 -18999316
7183 -18999316 -14636965 -5884101 2750113 8021058 10602687 12317218 13567139 15264145
7175 15264145 16912254 16985645 15612919 12354986 7190399 2136098 -1788373 -5032073
7167 -5032073 -8586704 -12027759 -14416943 -14472970 -12319663 -8647436 -4277218 -1042878 1125404
7158 1125404 4884631 10715081 15819291 17802276 15584908 11203866 8140882 8329093
7150 8329093 9624157 8305648 4640980 1207946 -1071190 -1661403 -545064 657975
7142 657975 -717412 -5645885 -11382438 -14906299 -14679058 -12427200 -10588627 -7275537 -2029479
7133 -2029479 2369257 4163992 4480050 4863549 6127568 9445547 14160760 19076034 23357772
7124 23357772 26349269 28832770 30005694 28662294 26872240 26919949 27643965 26151581 22129102
7115 22129102 17211971 11850700 6576076 1874727 -2489761 -6784394 -9433781 -9163393
7107 -9163393 -5374346 841885 6396106 8126410 5877990 3299481 2911923 4020548
7099 4020548 5220978 5425736 5032401 6390967 9495592 11171375 9262055 5669783 2920452
7090 2920452 2990105 5571708 6530574 4061647 1044588 341237 2396851 6225908 10464638
7081 10464638 13007896 12649297 10779129 9301517 8759447 7951423 5894154 3845376 2831053
7072 2831053 2116603 1670268 3499074 7128695 10671787 13197284 12918126 10163140 8125247
7063 8125247 9828550 14401877 17818105 16926854 12186309 7179562 4252460 4296007 6975476
7054 6975476 10593623 13477842 14800600 13708367 10642483 8637834 9089154 10647781
7046 10647781 12224011 12166561 9774542 8236129 10559530 15707258 21052312 25445566
7038 25445566 28540513 29919429 29026263 25323223 19158713 12448271 6437855 1268789
7030 1268789 -1821301 -2362733 -2683512 -4228897 -5214230 -3916775 -229216 4656625 9675404
7021 9675404 12753229 12312666 9000003 4631071 1841222 1575181 1892292 1871999 2008320
7012 2008320 2207808 3867940 7351607 10104588 11512472 11000934 7596932 1869709 -4951508
7003 -4951508 -9812899 -10458811 -8154468 -5383576 -2562895 1893607 7188669 10072099
6995 10072099 10327161 9904322 10639854 11571267 9872250 4968451 -1547999 -7945960 -13986514
6986 -13986514 -17780862 -16283273 -10698914 -3705234 4288124 11349830 14986458 15650702
6978 15650702 15053351 14923728 14016181 9898764 4228123 -456463 -3448777 -3988726 -2512337
6969 -2512337 -447953 1041125 2075953 3926447 6100489 7150970 6960704 6019453 4035689
6960 4035689 1361916 -608640 -271642 2694154 6465835 9096727 8146832 3172378 -3143055
6951 -3143055 -9200812 -14666335 -18529118 -20064397 -20653907 -22144648 -23350173 -22117700
6943 -22117700 -18104275 -12619545 -7774718 -3740159 1501448 7524058 11349972 12105475
6935 12105475 11519762 11025496 10892762 10831965 11114136 12231963 13273760 12376364 9553536
6926 9553536 6396365 2990030 -401151 -1729428 -1345591 -2045333 -5432978 -10987306 -16563077
6917 -16563077 -19396111 -18410676 -15012867 -10649473 -5269956 557403 5476839 9752801
6909 9752801 11730837 8378761 1693218 -3701366 -5489174 -3810636 -884614 1017907
6901 1017907 1497025 1115267 -3295 -1561016 -2007289 -1520333 -1788516 -2686747 -2694147 -2124461
6891 -2124461 -2068518 -2077119 -1037991 1305307 4521421 8018608 10352037 10917491 9633366
6882 9633366 7344494 5270203 2872418 53419 -2959692 -7319537 -12216721 -14901020
6874 -14901020 -15281966 -16111783 -18379080 -20664721 -21770170 -20714106 -18116412 -14684788
6866 -14684788 -11824640 -10455734 -8318308 -4368067 -1581957 -2712769 -6381339 -8412783
6858 -8412783 -6019718 -1590375 357396 -515094 400815 3795898 4899720 1380250 -5127499
6849 -5127499 -11485875 -14847854 -14556095 -11920154 -6879772 1029082 8236574 12016280
6841 12016280 12920394 12424237 10721479 7869569 4698799 1173589 -2160353 -3155087 -3512966
6832 -3512966 -5968210 -8757874 -10560771 -12498718 -14214783 -13734781 -11345493 -9738777
6824 -9738777 -9561207 -10135101 -11410631 -13681912 -17098142 -19304162 -18936053 -17982047 -19006375
6815 -19006375 -21318856 -22892532 -22134434 -19114603 -15633521 -12293601 -9554791 -7697019
6807 -7697019 -7235499 -8685468 -9816392 -8402895 -5383694 -3670260 -4384542 -4985657 -3671555
6798 -3671555 -2168268 -2125708 -3989737 -6164950 -5706597 -2893923 567750 3960855 6982838
6789 6982838 10010843 11824295 10942099 8633937 6801565 5350193 4020430 3355857 4067834
6780 4067834 6295661 6940879 5119301 3265532 2320637 2581449 4315118 6071139 6960389
6771 6960389 8221095 10094997 11696762 13687057 17909100 23799658 28357792 30022581
6763 30022581 29913246 28028036 24705952 21680189 19526935 17831167 16971504 18072405
6755 18072405 19018167 15692400 8629520 2589587 -1541812 -6296450 -12173472 -17200530
6747 -17200530 -19404663 -19538256 -20128082 -21193869 -19643316 -14370516 -8028006 -4289507
6739 -4289507 -5000141 -9275945 -14886577 -20378612 -23806974 -23740477 -20680323 -16613047 -13119565
6730 -13119565 -9948765 -6136675 -1897224 664890 308307 -2442653 -6294312 -8105124
6722 -8105124 -6017632 -2275801 -875491 -2213866 -3798393 -4999242 -6387995 -8155517
6714 -8155517 -10569362 -11714623 -9869881 -7922307 -6351451 -2676489 2590718 5551590
6706 5551590 4906792 3099754 2625861 2970306 3500461 5328325 7674328 10142604 11587985
6697 11587985 10377887 8390825 7503416 8687642 10321854 8078434 2833209 -1062782
6689 -1062782 -1795888 267828 2832871 3812460 3809764 4803361 6438540 6997391 6032541
6680 6032541 5173535 5316510 5243671 3519183 -245325 -4234599 -7286742 -8883199 -8241538
6671 -8241538 -5393837 -448130 5218450 9263553 11183049 11498973 11727944 12781393 12965976
6662 12965976 12896774 14600548 15444607 12822517 9286414 8736574 11862156 15278621 16132407
6653 16132407 14929035 12498887 10072567 9283939 10370096 11444299 10691815 8965112
6645 8965112 7725900 7617398 8010998 7380201 5347610 2789360 1716867 3034463 4443480
6636 4443480 3988516 2597030 624115 -604255 282704 2118735 2599476 344105 -3119099
6627 -3119099 -5201651 -5787572 -5909793 -5829702 -4695200 -1900737 1428120 2784885 1315270
6618 1315270 -966915 -2950824 -5125037 -7290118 -8257478 -7049846 -5281507 -5465742 -6310151
6609 -6310151 -4994220 -1385389 2571477 5973206 9780705 13192447 13808820 13072848 13795784
6600 13795784 16124523 18339373 18604229 16305781 12065212 8107505 6933636 6769726
6592 6769726 5294098 3423120 1130755 -1665572 -3801532 -4353625 -3996573 -4389855 -4941693
6583 -4941693 -5186029 -6280597 -8114961 -9274279 -9064617 -7741544 -5339874 -1221103 3524462
6574 3524462 4967704 618104 -5642283 -8646241 -8613351 -9269938 -11764303 -13059992 -12077530
6565 -12077530 -11608618 -13985710 -18781966 -24519210 -28487330 -29183669 -27924252 -25106964
6557 -25106964 -20460716 -16170532 -14525079 -14383728 -13534608 -11848052 -9894677 -7109965
6549 -7109965 -2871242 2645197 6049012 4227614 -1131074 -7655155 -13987692 -18755406
6541 -18755406 -20480705 -20312928 -20656168 -20359208 -17345034 -12027139 -7033184 -5421952 -7649584
6532 -7649584 -11656858 -15363479 -16308269 -13517557 -9053819 -6373522 -5777754 -4739332 -2952979
6523 -2952979 -2740937 -4547018 -5284259 -3572304 -1442089 71029 1720119 3712638 5091025
6514 5091025 5545969 6353606 8466559 11255012 12999832 12997452 11934564 10695954 10324274
6505 10324274 9531608 6479666 3007298 1286443 553514 -50630 26033 921201 1362331
6496 1362331 1768960 2892913 3570958 2920194 3259005 5082612 6103404 4848954 2386689
6487 2386689 -678307 -5251613 -8989302 -9480044 -7350617 -5362043 -5027724 -6117574 -5431901
6478 -5431901 107243 7328302 11617423 13022271 12925161 12868878 13615434 13445677 11190235
6469 11190235 7761611 4771210 3357164 2085149 -258009 -594823 3040177 7721225
6461 7721225 10625233 11105809 8598188 4551284 1759911 772869 -49490 -2638439 -7423929
6452 -7423929 -14471330 -21863043 -26701186 -28684544 -29415377 -29464290 -28252841 -25877282 -23581071
6443 -23581071 -21242966 -18144085 -13429380 -6738633 -1834486 -1995022 -4767869 -6286910
6435 -6286910 -4770638 -1626277 238746 -1138761 -4837991 -8019804 -8543754 -6057134
6427 -6057134 -1858848 2433693 5104789 5961202 7222426 10448893 14167953 17161311
6419 17161311 18624327 19927041 21885026 23251091 23505508 22948571 21363053 19014727
6411 19014727 17652628 16625002 14311353 11703705 9895157 7993620 4878165 2303713
6403 2303713 2032886 2078136 1781673 2716984 5931775 10367073 14425491 16661748 16764144
6394 16764144 15569006 14581544 13872755 13212730 13416763 14335071 14859076 13886110 10696777
6385 10696777 6319507 3112865 2123539 4017877 8346780 12580409 13686963 11364479
6377 11364479 8778784 7643302 7490555 6185153 2562281 -799164 -2148730 -2348405
6369 -2348405 -2929079 -4735982 -6823171 -8602170 -10108605 -10539422 -9738957 -7731984 -4141881
6360 -4141881 -223139 2506887 3779703 3300884 2955266 4418342 7259713 9467352 9589100
6351 9589100 8407590 6106704 3298777 1990760 2537291 4249580 7506281 11954073
6343 11954073 15238950 16703710 17060060 16568428 16209405 16282496 14609463 11773219 11823117
6334 11823117 15620518 19325937 18968656 15888956 14360261 15289547 16016910 15505354 15876548
6325 15876548 17292537 16104109 11199758 6008856 2381688 392560 -722383 -2325130
6317 -2325130 -4303208 -4921322 -4145259 -4164122 -5884326 -7777741 -7690392 -4685786 507407
6308 507407 5120654 6131969 3851449 1127796 -84305 311225 1734122 4004016 6740117
6299 6740117 8208108 7423329 6248268 5903812 5707654 4549923 1921263 -610552 -300788
6290 -300788 3149303 6734138 9613534 12171366 13594614 13380214 11606679 8518362 5946048
6281 5946048 4201500 1240670 -1370943 99211 4986938 9689992 11722289 10752298
6273 10752298 8128348 6141661 5784712 5900853 5555268 3605358 577103 -953609 557032
6264 557032 2193126 1152904 -672271 -1040907 588739 3753139 6488490 7167451 6342938
6255 6342938 4817781 2411593 779880 1851310 4538853 6892410 7810238 7926359 8288727
6246 8288727 7990987 5981521 2665119 -799708 -3992989 -7460660 -10493421 -11644201
6238 -11644201 -11543575 -10470239 -8292694 -6323078 -5212373 -4474783 -3877218 -2972447 -1217954
6229 -1217954 1755522 4406018 5217680 4886210 4287014 3106214 1577161 840281 2098156
6220 2098156 4613213 5836968 5142787 3805193 2846875 2393086 2282964 3415662 5437453
6211 5437453 7170606 9377960 11908923 13364348 13447278 13113967 12717635 11884830 11669719
6202 11669719 13104269 13262204 10945471 8913326 8768485 9564086 8994304 6159011 3529795
6193 3529795 2409360 1006410 -719323 -2442777 -4015861 -4524122 -2664297 816767
6185 816767 3153201 2398569 113279 -1366207 -2459013 -4990862 -8566776 -10678169 -10487734
6176 -10487734 -9329159 -8168577 -6447574 -4432756 -2701708 -2250388 -3945274 -5511790
6168 -5511790 -6046530 -8172331 -12447639 -16026496 -15656513 -11261748 -6973260 -5505782 -4177081
6159 -4177081 -366311 4948180 10045584 12822219 11407573 8465374 7369547 6761093
6151 6761093 5358109 3014731 -929977 -5543043 -8486551 -9502628 -10299923 -11372506
6143 -11372506 -11089213 -7896844 -2509440 3254971 7096923 7639793 4187951 -1910259
6135 -1910259 -8918610 -14689682 -15604426 -12731756 -11343546 -12862023 -16189725 -20794684
6127 -20794684 -24532511 -23945520 -18029925 -10073125 -4358150 -2702154 -3270081 -2386294 710421
6118 710421 3642919 3674252 988449 -1155763 -392452 2167824 3824258 4397517 5140465
6109 5140465 5026064 4149651 2925777 932766 -1062759 -2103848 -2758360 -3442995 -3486984
6100 -3486984 -2345306 -787056 -614158 -1603330 -1431453 860149 3155681 2917317 182693
6091 182693 -4144328 -8613932 -11333929 -11659828 -10903379 -10946631 -12614193 -14076103 -11655403
6082 -11655403 -5487998 1703951 6774969 7927275 5966029 3563330 1109567 -2219124
6074 -2219124 -4787798 -5085263 -2312983 2603647 5942554 5743672 2757963 -464092 -650314
6065 -650314 3691639 10824440 17257870 21510458 24669701 26310070 23721516 16418311
6057 16418311 7236986 -1776699 -9018423 -12977844 -14452791 -14815740 -13313826 -8718687
6049 -8718687 -1317267 8071699 18170020 26707868 31172903 31252161 28057588 22848869
6041 22848869 17874508 14832868 12926206 10958736 9982321 10318021 10599101 12054335 16108490
6032 16108490 21243279 24230272 23546186 20507535 16162977 11189756 6860913 4599861
6024 4599861 3955970 2746354 -750516 -4607098 -6048740 -6208470 -6874936 -6827971 -4214191
6015 -4214191 88812 4910267 9298678 11921799 11603448 9287103 7115575 6428032 7594390
6006 7594390 8520403 7199545 5789763 6830702 8771243 9606753 9991859 10543661 9867575
5997 9867575 8890313 10396855 13304978 14714271 14286028 14095649 15048785 14445243 9693728
5988 9693728 2294543 -2495244 -2581729 50592 3051558 4878446 6203755 7746858 8307671
5979 8307671 7409176 6180956 5226710 5340346 6339272 7352786 7671892 7727368 10230070
5970 10230070 15159987 20534776 24104304 22786205 16746268 9269770 2801419 -1292324
5962 -1292324 -3696601 -5561361 -6039456 -5987356 -7389683 -8712523 -7745813 -5240856 -3254662
5953 -3254662 -1314163 2136334 6531297 10721412 12697982 11692223 10236684 10450539
5945 10450539 12405524 15167116 16843968 14426373 8366902 2652701 732164 3494734
5937 3494734 8623957 12684723 13250151 11767832 10961528 11189449 12593636 15189155 16597766
5928 16597766 15193306 12570256 10884254 8782732 5986050 3549664 1624029 -1283186
5920 -1283186 -5154899 -7479446 -7401063 -4770448 -1294838 953472 1398251 8988 -2383204
5911 -2383204 -3988911 -4532613 -4780325 -4891676 -4313159 -1933441 986680 3663249 6194006
5902 6194006 7841390 7572232 6840593 7924741 10092110 10619942 8042433 1531843 -6824371
5893 -6824371 -12912007 -15992168 -15643810 -12585666 -9425742 -9031368 -12591866 -17757472 -20774930
5884 -20774930 -20115079 -16160396 -10827194 -5886460 -1362473 2425729 4313218 3727050
5876 3727050 2414805 3377451 5926922 7771179 8830399 8663761 6790312 3993889 2587206
5867 2587206 3677088 5353404 6052507 5262496 4300549 3836037 3287103 4142677 8191307
5858 8191307 14186916 19790482 23176537 23668331 23024920 23374160 23571692 21868227 19027345
5849 19027345 17516058 18398908 20298734 21125844 20651974 19282816 17127066 14900602 14458371
5840 14458371 17976521 24015087 28925005 30232835 26861329 20001993 11102084 1000002
5832 1000002 -6928533 -9038393 -6353308 -3375499 -3041580 -4000020 -2296962 2321063 5205441
5823 5205441 5940393 7534506 9281498 10173868 10261632 9861370 10093938 11812210 12763810
5814 12763810 10894098 8719494 8489079 9366326 9807254 9395643 8018379 6163214 5130065
5805 5130065 5101920 4895921 4486298 4869287 5743758 6532406 7003543 5739375 2014658
5796 2014658 -1620254 -3760863 -5147213 -5673959 -5217302 -3803430 -1235229 1984712 5135109
5787 5135109 8509776 12245821 14078809 12823960 9833061 5919846 355555 -7145057
5779 -7145057 -14526581 -17011312 -13221467 -7459914 -4121933 -3033496 -1335965 889559
5771 889559 1709768 1134830 802729 1374120 1962126 1478068 -999642 -3686205 -4353931
5762 -4353931 -4098074 -4508072 -5652734 -7133596 -7705240 -7354966 -7419071 -8197622 -8695979
5753 -8695979 -7300455 -4176222 -1542960 -975828 -1481293 -218625 2293352 2877929 1670761
5744 1670761 557995 41585 -677964 -1449928 -694167 3410493 9936153 14575463 15251545
5735 15251545 13940759 12688197 11165415 8980077 6698406 4059436 1756730 1489228
5727 1489228 2428528 3504167 4094577 6245599 11253881 16405004 18686598 18899975 19745226
5718 19745226 19480377 16243706 10982719 6134892 3448389 3283895 3370797 2081583 1170904
5709 1170904 2654714 5163270 6558144 6261785 2425049 -5344304 -12239761 -15050578
5701 -15050578 -14597175 -11584816 -6605694 -2390756 -472079 711241 2735769 4978580
5693 4978580 8070093 11152011 11588217 9164659 5821832 3579429 2738429 3362337 4214050
5684 4214050 3922173 2723727 923316 -648723 -1531238 -2215776 -3818725 -6126089 -6215767
5675 -6215767 -3548431 27535 2235358 607710 -3913965 -7389146 -8521225 -9679493
5667 -9679493 -12768237 -16107518 -15154286 -10869940 -8230790 -7723445 -7549230 -5734857 -647631
5658 -647631 6098160 10407668 10855757 7396999 1886869 -734932 517369 2795003 3953175
5649 3953175 3473461 2662687 2152602 1387161 332607 441071 1321940 1185765 -84867
5640 -84867 -2051248 -4561796 -8396037 -13071057 -16715946 -18962651 -19301014 -17346795 -14510148
5631 -14510148 -11640095 -8578406 -3739641 3505372 10376540 14046168 13849683 10786135
5623 10786135 4543660 -4038379 -12859629 -19528472 -20462374 -15547051 -9862489 -7084690
$$ [...]
##END NTUPLES=NMR SPECTRUM
##END=
