##TITLE=dept_DE-1_DMSO_TFA CH-,CH3- -up, CH2- -down
 DMSO-d6, 2200 sc
 21.11.2023
##JCAMPDX= 6.0         $$ Bruker NMR JCAMP-DX V2.0
##DATA TYPE= NMR SPECTRUM
##DATA CLASS= NTUPLES
##ORIGIN= UXNMR, Bruker Analytische Messtechnik GmbH
##OWNER= root
$$ XWIN-NMR		Version 3.5
$$ Tue Nov 21 15:26:01 2023 Russian Standard Time (UT+4h)  she@DPX200
##.OBSERVE FREQUENCY= 50.327992884445
##.OBSERVE NUCLEUS= ^13C
##.ACQUISITION MODE= SIMULTANEOUS
##.ACQUISITION SCHEME= undefined
##.AVERAGES= 2201
##.DIGITISER RES= 17
##SPECTROMETER/DATA SYSTEM= spect
##.PULSE SEQUENCE= dept135
##.SOLVENT NAME= CDCl3
##.SHIFT REFERENCE= (INTERNAL, CDCl3, 0, 214.665)
##AUDIT TRAIL= $$ (NUMBER, WHEN, WHO, WHERE, WHAT)
$$ ##TITLE= Audit trail, XWIN-NMR		Version 3.5
$$ ##JCAMPDX= 5.01
$$ ##ORIGIN= Bruker BioSpin GmbH
$$ ##OWNER= she
$$ F:/spectra/data/she/nmr/depta/1/pdata/1/auditp.txt
$$ ##AUDIT TRAIL=  $$ (NUMBER, WHEN, WHO, WHERE, WHAT)
(   1,<2023-11-21 15:24:34.21 +0400>,<she>,<DPX200>,
      <created by zg, POWCHK disabled, PULCHK disabled
       terminated by command 'halt'
       configuration hash MD5:
       00 E9 B6 7A A2 85 ED C7 34 08 36 98 17 FE 4E 26
       data hash MD5: 16K
       EF F5 49 2D B8 0E 02 50 40 FB 69 E3 76 D4 3F EE>)
(   2,<2023-11-21 15:24:42.67 +0400>,<she>,<DPX200>,
      <Start of raw data processing
       efp BC_mod = 2 LB = 3.5 FT_mod = 6 PKNL = 1 PHC0 = -3462.195 PHC1 = -1738.6 SI = 16K 
       data hash MD5: 16K
       C9 50 4F E2 BC 6C AE 91 92 70 CD 53 4E A3 A9 A7>)
(   3,<2023-11-21 15:24:47.59 +0400>,<she>,<DPX200>,
      <abs ABSG = 5 
       data hash MD5: 16K
       0F 2D 13 90 99 64 E7 24 E9 2F 22 8D 77 26 85 51>)
(   4,<2023-11-21 15:25:16.20 +0400>,<she>,<DPX200>,
      <pk PHC0 = -0.7732712 PHC1 = 3.800047 
       data hash MD5: 16K
       FD 59 ED 6E F4 40 DB DC C4 08 91 70 DE D6 D1 A8>)
$$ ##END=
$$ 
$$ hash MD5
$$ 55 48 0F 19 BF C1 06 CA 03 BB C9 46 E8 71 48 BA
##$RELAX= 
##$RELAX= 
##$RELAX= 
##$RELAX= 
##$RELAX= 
##$RELAX= 
##$RELAX= 
##$RELAX= 
$$ Bruker specific parameters
$$ --------------------------
##$DU= <F:/spectra>
##$EXPNO= 1
##$NAME= <depta>
##$PROCNO= 1
##$TYPE= <nmr>
##$USER= <she>
##$AMP= (0..31)
100 100 100 100 100 100 100 100 100 100 100 100 100 100 100 100 100 100 
100 100 100 100 100 100 100 100 100 100 100 100 100 100 
##$AQSEQ= 0
##$AQ_mod= 1
##$AUNM= <au_zg>
##$AUTOPOS= <>
##$BF1= 50.322709
##$BF2= 200.13
##$BF3= 200.13
##$BF4= 200.13
##$BF5= 200.13
##$BF6= 200.13
##$BF7= 200.13
##$BF8= 200.13
##$BYTORDA= 1
##$CFDGTYP= 0
##$CFRGTYP= 5
##$CHEMSTR= <none>
##$CNST= (0..31)
1 1 145 1 1 1 1 1 1 1 1 1 1 1 1 1 1 1 1 1 1 1 1 1 1 1 1 1 1 1 1 1 
##$CPDPRG= <>
##$CPDPRG1= <waltz16>
##$CPDPRG2= <waltz16>
##$CPDPRG3= <>
##$CPDPRG4= <mlev>
##$CPDPRG5= <mlev>
##$CPDPRG6= <mlev>
##$CPDPRG7= <mlev>
##$CPDPRG8= <mlev>
##$CPDPRGB= <>
##$CPDPRGT= <>
##$D= (0..31)
0 2 0.003448276 0 0 0 0 0 0 0 0 0 2e-05 0 0 0 0 0 0 0 0 0 0 0 0 0 0 0 
0 0 0 0 
##$DATE= 1700559948
##$DBL= (0..7)
120 120 120 120 120 120 120 120 
##$DBP= (0..7)
$$ [...]
##$SUBNAM2= <"">
##$SUBNAM3= <"">
##$SUBNAM4= <"">
##$SUBNAM5= <"">
##$SUBNAM6= <"">
##$SUBNAM7= <"">
##$SUBNAM8= <"">
##$SUBNAM9= <"">
##$SW= 219.3118970423
##$SWIBOX= (0..15)
0 1 3 0 0 0 0 0 0 0 0 0 0 0 0 0 
##$SW_h= 11037.527593819
##$TD= 16384
##$TD0= 1
##$TE= 0
##$TE2= 300
##$TE3= 300
##$TEG= 300
##$TL= (0..7)
120 120 120 120 120 120 120 120 
##$TP= (0..7)
150 150 150 150 150 150 150 150 
##$TP07= 0
##$TPNAME0= <>
##$TPNAME1= <>
##$TPNAME2= <>
##$TPNAME3= <>
##$TPNAME4= <>
##$TPNAME5= <>
##$TPNAME6= <>
##$TPNAME7= <>
##$TPOAL= (0..7)
0.5 0.5 0.5 0.5 0.5 0.5 0.5 0.5 
##$TPOFFS= (0..7)
0 0 0 0 0 0 0 0 
##$TUNHIN= 0
##$TUNHOUT= 0
##$TUNXOUT= 0
##$USERA1= <user>
##$USERA2= <user>
##$USERA3= <user>
##$USERA4= <user>
##$USERA5= <user>
##$V9= 5
##$VALIST= <valist>
##$VCLIST= <CCCCCCCCCCCCCCC>
##$VD= 0
##$VDLIST= <DDDDDDDDDDDDDDD>
##$VPLIST= <PPPPPPPPPPPPPPP>
##$VTLIST= <TTTTTTTTTTTTTTT>
##$WBST= 1024
##$WBSW= 2
##$XGAIN= (0..3)
0 0 0 0 
##$XL= 0
##$YL= 0
##$YMAX_a= 2520417
##$YMIN_a= -1846487
##$ZGOPTNS= <>
##$ZL1= 120
##$ZL2= 120
##$ZL3= 120
##$ZL4= 120
##$ABSF1= 214.6655
##$ABSF2= -4.669434
##$ABSG= 5
##$ABSL= 3
##$ALPHA= 0
##$AQORDER= 0
##$ASSFAC= 0
##$ASSFACI= 0
##$ASSFACX= 0
##$ASSWID= 0
##$AUNMP= <proc_1d>
##$AZFE= 0.1
##$AZFW= 0.1
##$BCFW= 0
##$BC_mod= 2
##$BYTORDP= 0
##$COROFFS= 0
##$CY= -3
##$DATMOD= 1
##$DC= 0
##$DFILT= <>
##$DTYPP= 0
##$F1P= 0
##$F2P= 0
##$FCOR= 0.5
##$FTSIZE= 16384
##$FT_mod= 6
##$GAMMA= 0
##$GB= 0
##$INTBC= 1
##$INTSCL= 0
##$ISEN= 128
##$LB= 3.5
##$LEV0= 0
##$LPBIN= 0
##$MAXI= 10000
##$MC2= 0
##$MEAN= 0
##$ME_mod= 0
##$MI= 0.4000791
##$NCOEF= 0
##$NC_proc= -2
##$NLEV= 6
##$NOISF1= 120.0001
##$NOISF2= 80.00006
##$NSP= 0
##$NTH_PI= 0
##$NZP= 0
##$OFFSET= 214.6655
##$PC= 4
##$PHC0= -3462.968
##$PHC1= -1734.8
##$PH_mod= 1
##$PKNL= yes
##$PPARMOD= 0
##$PSCAL= 0
##$PSIGN= 0
##$REVERSE= no
##$SF= 50.3227091
##$SI= 16384
##$SIGF1= 140
##$SIGF2= 120
##$SINO= 80
##$SIOLD= 32768
##$SREGLST= <13C.CDCl3>
##$SSB= 0
##$STSI= 16384
##$STSR= 0
##$SW_p= 11037.527593819
##$SYMM= 0
##$S_DEV= 0
##$TDeff= 16384
##$TDoff= 0
##$TI= <>
##$TILT= no
##$TM1= 0
##$TM2= 0
##$TOPLEV= 0
##$USERP1= <user>
##$USERP2= <user>
##$USERP3= <user>
##$USERP4= <user>
##$USERP5= <user>
##$WDW= 1
##$XDIM= 16384
##$YMAX_p= 457789163
##$YMIN_p= -98021060
$$ End of Bruker specific parameters
$$ ---------------------------------
##NTUPLES= NMR SPECTRUM
##VAR_NAME=  FREQUENCY,     SPECTRUM/REAL,   SPECTRUM/IMAG
##SYMBOL=    X,             R,               I
##VAR_TYPE=  INDEPENDENT,   DEPENDENT,       DEPENDENT
##VAR_FORM=  AFFN,          ASDF,            ASDF
##VAR_DIM=   16384,         16384,           16384
##UNITS=     HZ,            ARBITRARY UNITS, ARBITRARY UNITS
##FACTOR=    0.67371834180669, 1,            1
##FIRST=     10802.5493505904, 0,            0
##LAST=      -234.978243228581, 0,           0
##MIN=       -234.978243228581, -98021060,   0
##MAX=       10802.5493505904, 457789163,    0
$$ Real data points
##PAGE= N=1
##DATA TABLE= (X++(R..R)), XYDATA
$$ [...]
12581G151923L084463J072338r54705j945146j910944j232239p21686j201390
$$ 7151923 10236386 11308724 10354019 8408873 6497929 5265690 4544004 3342614
12573C342614j712824j287382q43476p78933l37245R8005M06536J491145J760835
$$ 3342614 1629790 342408 -501068 -1280001 -1617246 -1519241 -1112705 378440 2139275
12564B139275N5032j892559j906416o41250M98005R67327R07781O25405J18611
$$ 2139275 2194307 301748 -1604668 -2245918 -1747913 -780586 127195 752600 871211
12555H71211m17635p48379j020J728773K543211J544980k7256l68168m21625o21497
$$ 871211 453576 -294803 -295823 1432950 3976161 5521141 5493885 5125717 4704092 4082595
12545D082595M32020K022690K732434K759033K602904J980233M81989j903872
$$ 4082595 4514615 6537305 9269739 12028772 14631676 16611909 17093898 15190026
12537A5190026m136157m958411m404400k583084l13914J404581J952861J461572
$$ 15190026 11053869 6095458 1691058 -892026 -1205940 198641 2151502 3613074
12529C613074J436890J554589N33797o54511n51513j56397l82643l61549k22243
$$ 3613074 5049964 6604553 7138350 6483839 5932326 5775929 5393286 5031737 4809494
12520D809494q95060j986224k836783k963309j460386K72283R88436J239681J157877
$$ 4809494 3914434 1928210 -908573 -3871882 -5332268 -5059985 -4071549 -2831868 -1673991
12511a673991J391558J903181J525954J013450Q45419J131965J650888J347707
$$ -1673991 -282433 1620748 3146702 4160152 5005571 6137536 7788424 9136131
12503I136131j82189j482624j348753p5126J285860J859544K284138K786129K313561
$$ 9136131 8953942 7471318 6122565 6047439 7333299 9192843 11476981 14263110 16576671
12494A6576671M10380j331813k691095l795404m123686l021657j315685n85037
$$ 16576671 16987051 15655238 12964143 9168739 5045053 2023396 707711 122674
12486A22674p87221k10526K15118o25334p89411k70858l11594n50865j050742
$$ 122674 -664547 -875073 -659955 -1285289 -2074700 -2345558 -2657152 -3208017 -4258759
12477d258759k397242k337246q59442p61325j635852j448040l96757N25258J404738
$$ -4258759 -6656001 -8993247 -9852689 -10614014 -12249866 -13697906 -14094663 -13569405 -12164667
12468a2164667K701618L619770L367337K825351K846096L106652L807814L422827
$$ -12164667 -9463049 -5843279 -2475942 349409 3195505 6302157 10109971 13532798
12460A3532798J907782P42883m73695o84521o37935j693397k269426j403382r0572
$$ 13532798 15440580 16183463 15709768 15025247 14387312 12693915 10424489 9021107 8930535
12451H930535N51468J146919J394996R67111M22826J76146k92552j399353j711541
$$ 8930535 9482003 10628922 12023918 12991029 13413855 13590001 13297449 11898096 10186555
12442A0186555j416328k131709k653446j599242q2921O35037k47194j695939j922338
$$ 10186555 8770227 6638518 3985072 2385830 2302909 2937946 2690752 994813 -927525
12433i27525k79922K370121L667435L256965K547509J448275O48388K8873p64347
$$ -927525 -1207447 1162674 4830109 8087074 10634583 12082858 12731246 12760119 11995772
12424A1995772o37955l84716j628904k519867k004955j258659j007780o23927
$$ 11995772 11357817 10973101 9344197 6824330 4819375 3560716 2552936 1929009
12416A929009M12401J696776K159603J948596J811650J720458K065896J902871
$$ 1929009 2341410 4038186 6197789 8146385 9958035 11678493 13744389 15647260
12408A5647260M51688n97182k80874O07903M09258j519360l265626l574635k608861
$$ 15647260 16098948 15501766 15220892 15828795 16238053 14718693 11453067 7878432 5269571
12399E269571j346706n62972j64754R575O62717J114991P72134K51660J25357
$$ 5269571 3922865 3359893 3195139 3204714 3867431 4982422 5754556 6006216 6131573
12390F131573Q7738k03074p27598j009726j223471p76201J007756K128959K346935
$$ 6131573 6219311 6016237 5288639 4278913 3055442 2279241 3286997 5415956 7762891
12381G762891K960835K760548J318049m08512j035796m79182p00756j385478j365868
$$ 7762891 10723726 13484274 14802323 14393811 13358015 12878833 12178077 10792599 9426731
12372I426731p02086J91804J688911K734515J303809j888952m286643m580706
$$ 9426731 8724645 8916449 10605360 13339875 14643684 12754732 8468089 3887383
12364C887383l290964j077920Q95037J482922J765936K412287K710961J832765
$$ 3887383 596419 -481501 413536 1896458 3662394 6074681 8785642 10618407
12356A0618407p22677l194446l444611j894564k34175M48505P9296M49461J538139
$$ 10618407 9895730 6701284 3256673 1362109 1127934 1576439 1655735 2105196 3643335
12347C643335J560629P35579L76870P3406r53237j969908j697489J6482J664596
$$ 3643335 5203964 5939543 6316413 6389819 5436582 3466674 1769185 1785667 3450263
12338C450263J765915J067973M21514J93807K24063o99594k234654k507393j296341
$$ 3450263 5216178 6284151 6705665 6899472 7123535 6423941 4189287 1681894 385553
12329C85553J01897P49746J75189j348769k040111q76831p3141J12805L42280
$$ 385553 487450 1237196 1412385 63616 -1976495 -2853326 -2926467 -2813662 -2471382
12320b471382M12712L49036R4177n64464m19468R05810J501632J114587N31240
$$ -2471382 -2058670 -1709634 -1615457 -2179921 -2599389 -1693579 -191947 922640 1453880
12311A453880m69468j148270l72227R43702J828537K267153J899593L54515j334392
$$ 1453880 984412 -163858 -536085 407617 2236154 4503307 6402900 6757415 5423023
12302E423023j675513n39562P17624P93667j9064j149210j540326r04839k07568
$$ 5423023 3747510 3207948 3925572 4719239 4700175 3550965 2010639 1105800 898232
12293H98232Q7134K23263K33236M24938N86159J89158K92884J271711J798648
$$ 898232 985366 1208629 1441865 1866803 2452962 2642120 2935004 4206715 6005363
12284F005363J433483N49115j50240M7585J118196J629541R57598J9687l87164
$$ 6005363 7438846 7987961 7837721 7885306 9003502 10633043 11590641 11610328 11223164
12275A1223164N975Q06508J066382Q5211j027236j447075j214877K80042K359035
$$ 11223164 11229139 12035647 13102029 13187240 12160004 10712929 9498052 9778094 12137129
12266A2137129K866300J244534j219152l239742l584229k297583p59766j5063
$$ 12137129 15003429 16247963 15028811 11789069 8204840 5907257 5147491 5132428
12258E132428k15816n64975r54454j516357j848306j813042o86710J154862J726467
$$ 5132428 4916612 4351637 3397183 1880826 32520 -1780522 -2467232 -1312370 414097
12249D14097J521221J769458J066717o95111j667288r84370J46462O34286M45429
$$ 414097 1935318 3704776 4771493 4076382 2409094 1424724 1571186 2205472 2650901
12240B650901j2030p46738j602208j751813j57247J579762J780575P28259o06150
$$ 2650901 2638871 1892133 289925 -1461888 -1619135 -39373 1741202 2469461 1863311
12231A863311j498982j768043r64008L51502Q86018N4936r71849j496422j882793
$$ 1863311 364329 -1403714 -2367722 -2016220 -1130202 -1075266 -2047115 -3543537 -5426330
12222e426330j520950p217J529657K030863J777102J714858Q92632o35749j516983
$$ -5426330 -6947280 -6954497 -5424840 -3393977 -1616875 97983 990615 354866 -1162117
12213a162117k133087j777828p34903J55568J070545J857175J027900j060705
$$ -1162117 -3295204 -5073032 -5807935 -5652367 -4581822 -2724647 -1696747 -2757452
12205b757452j764744j111537j099529k536377l430923j950205R70100L115421
$$ -2757452 -4522196 -5633733 -6733262 -9269639 -12700562 -14650767 -13680667 -10565246
12197a0565246K715240P65658m24361k87442J57597l75836j038179o95067Q15883
$$ -10565246 -7850006 -7084348 -7508709 -7796151 -7638554 -8014390 -9052569 -9747636 -8931753
12188h931753K452173L536125L827059L198549K365006K061946J661110L43809
$$ -8931753 -6479580 -2943455 883604 4082153 6447159 8509105 10170215 10514024
12180A0514024j622438k982526k915061j911914p08768l07925o66767n50449O07641
$$ 10514024 8891586 5909060 2993999 1082085 373317 65392 -601375 -1151824 -544183
12171e44183J924653K519079K565673J845030J111479J013161J382114P29436
$$ -544183 1380470 3899549 6465222 8310252 9421731 10434892 11817006 12546442
12163A2546442j235908k601902k043388l23535Q26340K95489k50443L23915L64909
$$ 12546442 11310534 8708632 6665244 6341709 7168049 7463538 7213095 7537010 7901919
12154G901919p50898j497392j178154p2558R83830O43295q19070j820896j087993
$$ 7901919 7151021 5653629 4475475 4402917 5386747 6030042 5210972 3390076 2302083
12145B302083O02949J635643J893629J707205J141204L70805j122573k881678
$$ 2302083 2905032 4540675 6434304 8141509 9282713 9653518 8530945 5649267
12137E649267l187785j834376m63803L46149J101464J499905Q24831n86475j931846
$$ 5649267 2461482 627106 163303 509452 1610916 3110821 3935652 3349177 1417331
12128A417331j713403Q7834J419115J882193J642048Q17730J231980K051750J388041
$$ 1417331 -296072 -208238 1210877 3093070 4735118 5552848 6784828 8836578 10224619
12119A0224619L03660l89040n77305L15171J637487K419272K052234K43146j986115
$$ 10224619 10528279 10139239 9561934 9877105 11514592 13933864 15986098 16229244 14243129
12110A4243129k736326j957374j084986r50657p97102k51593Q9331L26713l60566
$$ 14243129 11506803 9549429 8464443 7513786 6716684 6465091 6554422 6881135 6520569
12101F520569r63060K3774J671760K714158K757394K086360J302624N73484k90029
$$ 6520569 5557509 5581283 7253043 9967201 12724595 14810955 16113579 16687063 16397034
12092A6397034j205436k246325l554148m189909l842618k212253n81850l62098
$$ 16397034 15191598 12945273 9391125 5201216 1358598 -853655 -1435505 -1797603
12084a797603m07859J72705O69430N22325N0721j48797l54073l80783L38071K09361
$$ -1797603 -2205462 -2032757 -1363327 -841002 -790281 -939078 -1293151 -1673934 -1335863 -1126502
12074a126502r49787k013588j963295j375172p41676M87830J602282J457629R90261
$$ -1126502 -2076289 -4089877 -6053172 -7428344 -8170020 -7682190 -6079908 -4622279 -3632018
12065c632018J377425J974753K528623L300805L401021J577714k14492k75818
$$ -3632018 -2254593 -279840 2248783 5549588 8950609 10528323 10313831 10038013
12057A0038013R7627k73049m74375l5535L49512L79027l11639j307866j552994
$$ 10038013 10135640 9862591 9388216 9352681 9702193 10081220 9769581 8461715 6908721
12048F908721j312127j510931k189717k160796j213438N4085P85331K39295m95099
$$ 6908721 5596594 4085663 1895946 -264850 -1478288 -1424203 -638872 -399577 -894676
12039h94676l08330N98080P12320k93489m70829N90100R79285N50640P65262J864163
$$ -894676 -1203006 -604926 107394 -186095 -656924 -66824 912461 1463101 2228363 4092526
12029D092526J672389J74009q67776n77816L57488Q25269M92958R463Q0024j89809
$$ 4092526 5764915 5938924 5071148 4493332 4850820 5676089 6169047 6178510 6258534 6068725
12019F068725o20041p50512r40035j476696k291109j880678k66233N6332j584972
$$ 6068725 5448684 4698172 3758137 2281441 -9668 -1890346 -2156579 -2100247 -3685219
12010c685219k392792q63326N41535J011003J486649J454381P68442O46438J145304
$$ -3685219 -6078011 -6941337 -6399802 -5388799 -3902150 -2447769 -1679327 -1032889 112415
12001A12415N74241n53210r40515j100548l37915J149666K115841L150275L521603
$$ 112415 686656 133446 -807069 -1907617 -2245532 -1095866 1019975 4170250 7691853
11992G691853J877016n1436n2281O61932L48854q87916k198782k817774k394135
$$ 7691853 9568869 9517433 9465152 10127084 10475938 9588022 7389240 4571466 2177331
11983B177331r55277P62615J784329K314256K379747J024705r57893j765464j750934
$$ 2177331 1222054 1984669 3768998 6083254 8463001 9487706 8529813 6764349 5013415
11974E013415j712254j224461p08911m09731J4592n59408j769202j483492K47696
$$ 5013415 3301161 2076700 1367789 958058 972650 413242 -1355960 -2839452 -2591756
11965b591756J992648K383398R93949k83090M57467K298215L227754L435350L300254
$$ -2591756 -599108 1784290 2778239 2495149 2952616 5250831 8478585 11913935 15214189
11956A5214189K564251J525069O56775N15217L00474r12832k553376m195721m583642
$$ 15214189 17778440 19303509 19960284 20475501 20775975 19863143 17309767 13114046 8530404
11947H530404k858097o98132K92920M97599l5295n88607m58200K82299J368629
$$ 8530404 5672307 4974175 5267095 5764694 5729399 5140792 4682592 4964891 6333520
11938F333520K102469J865722J72821j836410j933811n48785P39808J548380J884010
$$ 6333520 8435989 10301711 10474532 8638122 6704311 6155526 6895334 8443714 10327724
11929A0327724J622045Q18608o81576k042603j881500j478969j563800j767049
$$ 10327724 11949769 12768377 12086801 10044198 8162698 6683729 5119929 3352880
11921C352880j798210j770828j981534j897038j082659O96749K308915K068862
$$ 3352880 1554670 -216158 -2197692 -4094730 -5177389 -4480640 -2171725 -102863
11913a02863O37945o76367j447420j094773N63092K308048K784247J561713K23215
$$ -102863 535082 -141285 -1588705 -2683478 -2120386 187662 2971909 4533622 4756837
11904D756837O53422J527294M26284j703144k576171j732406M21363K812114L743001
$$ 4756837 5410259 6937553 7363837 5660693 3084522 1352116 1773479 4585593 8328594
11895H328594K492590j91179k243911k815745k356512j124374M55846J762133
$$ 8328594 10821184 10630005 8386094 5570349 3213837 2089463 2545309 4307442
11887D307442K330019J657800J31669r56850j93678J733151K243288J422593R42255
$$ 4307442 6637461 8295261 8426930 7470080 7276402 9009553 11252841 12675434 13617689
11878A3617689M14391o43872r26798q63354k076855l579690l657308k368160j169849
$$ 13617689 14032080 13388208 12461410 11598056 9521201 5941511 2284203 -83957 -1253806
11869a253806q38648n35059P90944J811616J279694K51229K105O81797J319119
$$ -1253806 -2092454 -2627513 -1836569 -24953 1254741 1505970 1508075 2189872 3508991
11860C508991R63133L053J55051J121130J108834Q09233P73013M35948K16724
$$ 3508991 4472124 4475177 4630228 5751358 6860192 7669425 8442438 8878386 9095110
11851I095110k30381j209132j855505j785487m51168J219278Q90522l48688r49492
$$ 9095110 8864729 7655597 5800092 4014605 3563437 4782715 5673237 5324549 4375057
11842D375057r77481l0701J233450J819282J536768N15803p80909o91630P06224
$$ 4375057 3397576 3366875 4600325 6419607 7956375 8472178 7691269 6999639 7705863
11833G705863J180063Q04740O23724Q53300J013033N24031m59138k004719l040090
$$ 7705863 8885926 9690666 10314390 11167690 12180723 12704754 12245616 10240897 7200807
11824G200807k206713k11216J205667J293601K66510p54938r35794l95901n3239
$$ 7200807 4994094 4782878 5988545 7282146 7548656 6793718 5857924 5462023 5408784
11815E408784l02022k37580M40945J325562J605270Q32552m29938j219182j354554
$$ 5408784 5106762 4869182 5310127 6635689 8240959 9073511 8643573 7424391 6069837
11806F069837j135903p69186p13317n6613J448719L261409L906756K353974j79636
$$ 6069837 4933934 4164748 3451431 3394818 4843537 8104946 12011702 14365676 14186040
11797A4186040j825221k559276k322418o92684J67220r38375j731837q30663N73134
$$ 14186040 12360819 9801543 7479125 6786441 6953661 6015286 4283449 3452786 4025920
11788D025920R29392J31842r78172k084245k566044k509411k555649k443008j650605
$$ 4025920 4955312 5087154 4108982 2024737 -541307 -3050718 -5606367 -8049375 -9699980
11779i699980j44857J279568J688127J887608K705215K841303J395386P69136
$$ -9699980 -9844837 -8565269 -6877142 -4989534 -2284319 556984 1952370 2721506
11771B721506J059168M70034k66189k38039L89682L91066l70801q97702r16236
$$ 2721506 3780674 4250708 3984519 3746480 4136162 4527228 4156427 3258725 2342489
11762B342489q32499n75134K23351Q84161J474114J839720J037451j657502m097822
$$ 2342489 1509990 934856 1158207 2042368 3516482 5356202 6393653 4736151 638329
11753F38329l490237q83228J459425L189713L392500K433923J264704l28840j798695
$$ 638329 -2851908 -3735136 -2275711 914002 4306502 6740425 8005129 7676289 5877594
11744E877594k048476j592714j011715q20773j326897j283434n45036o1080j51183
$$ 5877594 3829118 2236404 1224689 403916 -922981 -2206415 -2751451 -2812531 -2963714
11735b963714N7436J074699K683951L971501L542809J303644j220984j502160
$$ -2963714 -2906278 -1831579 852372 4823873 8366682 9670326 8449342 6947182
11727F947182j77189K61620l10359l26346J004462J749821P77353j00067j087321
$$ 6947182 6769993 7031613 6721254 6394908 7399370 9149191 9926544 9826477 8739156
11718H739156k499257l050449j984823J55646J255388N53014l05272n18259j166081
$$ 8739156 6239899 3189450 1204627 1360273 2615661 3168675 2863403 2345144 1179063
11709A179063k426627k787814j926023j297032j280204j220398l32229R42649
$$ 1179063 -1247564 -4035378 -5961401 -7258433 -8538637 -9759035 -10091264 -9148615
11701i148615J683789J804632J444885J229524K089777L251250K905466R53420
$$ -9148615 -7464826 -5660194 -4215309 -2985785 -896008 2355242 5260708 6214128
11693F214128j061604k474467l065320j873256L82891J118433L86195J63949Q51865
$$ 6214128 5152524 2678057 -387263 -2260519 -1877628 -759195 -373000 -209051 642814
11684F42814P08923n06974j482237j063660j89920O9451M6479Q1142P79151J663907
$$ 642814 1351737 844763 -637474 -1701134 -1891054 -1821603 -1775124 -1693982 -914831 749076
11674G49076J565258O39089p97134j845103j420674l47543M14839M29120R0065
$$ 749076 2314334 2953423 2156289 311186 -1109488 -1457031 -1042192 -613072 -523007
11665e23007J3762l29l60636j77047R15583J424836O53475o67119j289411j140300
$$ -523007 -509245 -509574 -870210 -1047257 -131674 1293162 1946637 1279518 -9893 -1150193
11655a150193j093128q59605p75115j023276j10004J541039J497831K76931r77405
$$ -1150193 -2243321 -3102926 -3878041 -4901317 -5011321 -3470282 -1972451 -1695520 -2672925
11646b672925j362954m95590L72490R30447Q68660j50840j395201j923863j400033
$$ -2672925 -4035879 -4531469 -4158979 -3228532 -2359872 -2510712 -3905913 -5829776 -7229809
11637g229809o90025j02948K69579N03666P32433N14336O88301J472141J859321
$$ -7229809 -7919834 -8022782 -7753203 -7249537 -6517104 -6002768 -5314467 -3842326 -1983005
11628a983005J400536R6733l61889J28414J84412m83973j095555o65001m103k16643
$$ -1983005 -582469 -485736 -847625 -719211 -534799 -1018772 -2114327 -2779328 -2783431 -3000074
11618c000074n91393O14585J528154J779309K589897K239161N53569p07971r54372
$$ -3000074 -3591467 -2976882 -1448728 330581 2920478 5159639 5713208 5005237 4050865
11609D050865j983806l654985l743106k306693p66312J65412R68027K029049K690937
$$ 4050865 2067059 -1587926 -5331032 -7637725 -8404037 -8238625 -7270598 -5241549 -2550612
11600b550612K193015J034443j28033j128284j800238j757728n73003J378383
$$ -2550612 -357597 676846 548813 -579471 -2379709 -4137437 -4710440 -3332057
11592c332057K242906J034897j347247k905968k599382j109535O73911J059521
$$ -3332057 -1089151 -54254 -1401501 -4307469 -6906851 -8016386 -7342475 -6282954
11584f282954k4071o83336p32753m74239o81153j620813k291542j731216p3223
$$ -6282954 -6307025 -6990361 -7723114 -8197353 -8878506 -10499319 -12790861 -14522077 -14595300
11575a4595300J963747L227938K604918R06420M07657J045235J195062J40807
$$ -14595300 -12631553 -9403615 -6798697 -5892277 -5484620 -4439385 -3244323 -3103516
11567c103516q74513k40976J103487J873881K660284L442264L185984J559385
$$ -3103516 -3978029 -4219005 -3115518 -1241637 1418647 4860911 8046895 9606280
11559I606280M2269l41935p27969j395116j024065k07000j21574n54920r59601
$$ 9606280 9648549 9306614 8578645 7183529 6159464 5952464 5830890 5275970 4316369
11550D316369r34911r60452o21471O07654J839809J461017l85728k198438k898694
$$ 4316369 3381458 2421006 1799535 2407189 4246998 5708015 5322287 3123849 225155
11541B25155k341323j203495K0344P45455J287534K068044K560056N51376l330755
$$ 225155 -2116168 -3319663 -3299319 -2553864 -1266330 801714 3361770 3913146 582391
11532E82391n367683l743470J78525L272927L428283N79042k335496l092832j837473
$$ 582391 -4785292 -8528762 -8350237 -5077310 -1649027 -1069985 -3405481 -6498313 -8335786
11523h335786J96471J412786J070424R15034J512477J067514m73077j213071q78422
$$ -8335786 -8139315 -6726529 -5656105 -4741071 -3228594 -2161080 -2634157 -3847228 -4725650
11514d725650K59555J832182K617618K374740J269545m43557j713349k009020
$$ -4725650 -4466095 -2633913 -16295 2358445 3627990 3184433 1471084 -537936
11506e37936j188011L73292J549339J362635M92472r86108k743239l470487k324560
$$ -537936 -1725947 -1352655 196684 1559319 2051791 1065683 -1677556 -5148043 -7472603
11497g472603m17946K86255N3164j51630k9613K01372J036776K498137L258307
$$ -7472603 -7890549 -7604294 -7551130 -7702760 -7732373 -7531001 -6494225 -3996088 -737781
11488g37781K607826J776639J046505M09811K93906M14046L72466m02955q54535
$$ -737781 1870045 3646684 4693189 5103000 5396906 5810952 6183418 5780463 4925928
11479D925928o43267l92501j96705n41240k31012R85818J396600R59079N21944
$$ 4925928 4282661 3890160 3693455 3152215 2921203 3907021 5303621 6262700 6784644
11470F784644J01270n91967j340759j405053q58534m02319j19813L64126J35717
$$ 6784644 6885914 6293947 4953188 3548135 2689601 2287282 2167469 2531595 2667312
11461B667312o97875n72517j19356k42251n83668r35861j921051k398891j839128
$$ 2667312 1969437 1396920 1277564 1035313 451645 -484216 -2405267 -4804158 -6643286
11452f643286j390863j231519j271105j360771j453015j599451j325690l48318
$$ -6643286 -8034149 -9265668 -10536773 -11897544 -13350559 -14950010 -16275700 -16624018
11444a6624018L37079m11705j372041l55092K391736M311872L968043K475687
$$ -16624018 -16286939 -16698644 -18070685 -18425777 -16034041 -11722169 -7754126 -5278439
11436e278439J308051J248015J722520J429794J091051J050753N10409k58946
$$ -5278439 -3970388 -2722373 -999853 429941 1520992 2571745 3082154 2823208
11428B823208l33243j60171j005962j269742j89283J36802j82282J10549L22923
$$ 2823208 2489965 2329794 1323832 54090 -135193 1609 -180673 -70124 252799
11419B52799j2215o10054j224442o77420L93285N01057j81180r26078j115845
$$ 252799 240584 -369470 -1593912 -2271332 -1878047 -1376990 -1558170 -2484248 -3600093
11410c600093r63440m24128N1004l60210p40886m06730l4301j43692l25234K14098
$$ -3600093 -4563533 -4987661 -4936657 -5296867 -6037753 -6444483 -6478784 -6622476 -6947710 -6733612
11400f733612J487487K807472K322181O29635l85592j48539J056307J943562J871938
$$ -6733612 -5246125 -2438653 -116472 513163 127571 -20968 1035339 2978901 4850839
11391D850839J160923K70553N1627M55845R3657m69707l95058n26064j325085
$$ 4850839 6011762 6282315 6333942 6789787 6883444 6413737 6018679 5492615 4167530
11382D167530k086945j798772l17627R07943M10954l51718M00808J279163R49511
$$ 4167530 2080585 281813 -35814 872129 1283083 931365 1332173 2611336 3560847
11373C560847q7766j128327j734175j581002o44421K53469P95121L48113m36048
$$ 3560847 3473081 2344754 610579 -970423 -1614844 -1361375 -566254 -218141 -654189
11364f54189o46487j11288J175978J957790J274940m38328j377116o18806R74591
$$ -654189 -1300676 -1411964 -235986 1721804 2996744 2558416 1181300 562494 1537085
11355A537085K091314K124339J235342n04073k121469k228271j015698j69984
$$ 1537085 3628399 5752738 6988080 6484007 4362538 2134267 1118569 948585
11347I48585o90781j233206j141106j193609j063709Q7349R35716O29549O89790
$$ 948585 257804 -975402 -2116508 -3310117 -4373826 -4286477 -3350761 -2721212 -2031422
11338b031422J248341O12590q28469j257257l29431Q64273J282798K126343L284448
$$ -2031422 -783081 -170491 -998960 -2256217 -2585648 -1721375 -438577 1687766 4972214
11329D972214K396766J95336n2398J236365J388493K80532j145546j767504j339081
$$ 4972214 7368980 7564316 7511918 8748283 10136776 10417308 9271762 7504258 6165177
11320F165177o83709l68754q66463j664224j602386n48083O53592J429956J587700
$$ 6165177 5481468 5112714 4246251 2582027 979641 431558 1085150 2515106 4102806
11311D102806J129555Q06127N57762M39992J35602r28354j600155j946492l318140
$$ 4102806 5232361 6038488 6596250 7036242 7171844 6243490 4643335 2696843 -621297
11302f21297m656926l695574p58182K440595L886663L492526K171356O24239q9133
$$ -621297 -5278223 -8973797 -9731979 -7291384 -3404721 87805 2259161 2883400 2794267
11293B794267J60613J67371j114322k415768k184811j032204m445K52589L41522
$$ 2794267 2954880 3122251 2007929 -407839 -2592650 -3624854 -3629299 -3376710 -3035188
11284c035188N73297J159087J978648J717455O93938K0762K9082n7159k27314
$$ -3035188 -2461891 -1302804 675844 2393299 3087237 3107999 3137081 3079922 2852608
11275B852608n51748p25549q66841o88567m67361m99812k75100l20160p52695
$$ 2852608 2300860 1575311 708470 19903 -447458 -947270 -1222370 -1542530 -2295225
11266b295225j121055j188800l31867J403687K821939L592707L617261K688620
$$ -2295225 -3416280 -4605080 -4936947 -3533260 -711321 2881386 6498647 9187267
11258I187267O52920j874281l409544l597595l039921j123321J612983K277687
$$ 9187267 9840187 7965906 4556362 958767 -2081154 -3204475 -1591492 686195
11250F86195K28425j300325m16396J090703J389340Q45417J31324j15773L85130
$$ 686195 914620 -385705 -802101 288602 1677942 2523359 2654683 2538910 2924040
11241B924040N69737K09424N65371J336782J335804J156085J142707J87998j223076
$$ 2924040 3493777 3703201 4268572 5605354 6941158 8097243 9239950 9427948 8204872
11232H204872k043212k948658l076836j260924P33672J309963J414172O66956
$$ 8204872 6161660 3213002 136166 -1124758 -391086 918877 2333049 3000005
11224C000005j186373k566089k668392k093972q50083M57126K50546q96612j314682
$$ 3000005 1813632 -752457 -3420849 -5514821 -6364904 -5907778 -5657232 -6553844 -7868526
11215g868526m38930J014886J797740J051237n90144j109931N74462K496289K314925
$$ -7868526 -8307456 -7292570 -5494830 -4443593 -5033737 -6143668 -5569206 -3072917 -757992
11206g57992P73921j085135k492294k018013N01382K366452J114194p99450j314718
$$ -757992 15929 -1069206 -3561500 -5579513 -5078131 -2711679 -1597485 -2396935 -3711653
11197c711653o51581j09298N64656J133232P86706J4616m19907M54703K031647
$$ -3711653 -4363234 -4472532 -3907876 -2774644 -1987938 -1973322 -2393229 -1938526 93121
11188I3121K470802J940406J141989N110n29916l2140J74847p8856k49024l75803
$$ 93121 2563923 4504329 5646318 5651428 5121512 5089372 5264219 5185363 4936339 4560536
11178D560536l06256M16774J801882K051835K06572j827638k616611k184229n01432
$$ 4560536 4254280 4671054 6472936 8524771 8731343 6903705 4287094 2102865 1601433
11169A601433J088146J375351Q40861P06673J017542Q74168o4777j406330k681940
$$ 1601433 2689579 4064930 4905791 5612464 6630006 7504174 7439397 6033067 3351127
11160C351127k809255j284588q8076p06613j473601q84370L80047J205318J321238
$$ 3351127 541872 -742716 -830792 -1537405 -3011006 -3895376 -3515329 -2310011 -988773
11151i88773Q02421J61492L31393P50787J017450J117440P99933l27896j315562
$$ -988773 -186352 -24860 306533 1057320 2074770 3192210 3992143 3664247 2348685
11142B348685k15914J958377L015764K891370J677586k03392q22202p75620r76300
$$ 2348685 2132771 4091148 7106912 9998282 11675868 11472476 10650274 9874654 8898354
11133H898354j223759j174256j021107j185479j175809k89407L95802j72792j031001
$$ 8898354 7674595 6500339 5479232 4293753 3117944 2828537 3224339 3051547 2020546
11124B020546j471682j738839j401327o65534J25419J298386J889362J376015
$$ 2020546 548864 -1189975 -2591302 -3256836 -3131417 -1833031 56331 1432346
11116A432346J01282q54200r65218j363162k137438k715341k114512m25478J201794
$$ 1432346 1533628 679428 -285790 -1648952 -3786390 -6501731 -8616243 -9041721 -7839927
11107g839927J739219J264787O89578N77911Q69399Q10638k85938j390779j666439
$$ -7839927 -6100708 -4835921 -4146343 -3568432 -2699033 -1888395 -2174333 -3565112 -5231551
11098e231551j405193j313076j490500j258267k40313M80612Q28722R35270O52591
$$ -5231551 -6636744 -7949820 -9440320 -10698587 -10938900 -10458288 -9629566 -8694296 -8041705
11089h041705K59793k08704q82846j075014R708J168118J264178R08169R57618
$$ -8041705 -7781912 -7990616 -8873462 -9948476 -9938768 -8770650 -7506472 -6598303 -5640685
11080e640685Q21730j20942j423279j446186O7805J589822J620353N38283p12414
$$ -5640685 -4818955 -4939897 -6363176 -7809362 -7741557 -6151735 -4531382 -3993099 -4705513
11071d705513j509291j118944K36762J087527J479593J876548K001734Q67831
$$ -4705513 -6214804 -7333748 -7096986 -6009459 -4529866 -2653318 -651584 216247
11063B16247j211589j583036m05804K70411m5412q66428j064671j639749j964537
$$ 216247 -995342 -2578378 -2984182 -2713771 -2759183 -3625611 -4690282 -6330031 -8294568
11054h294568j074897k10727M06807J600253K625438K244437J414237R35682Q58777
$$ -8294568 -9369465 -9580192 -9173385 -7573132 -4947694 -2703257 -1289020 -353338 505439
11045E05439O37974K61064j41491n86895m87512j12334l77181j320711j574122
$$ 505439 1143413 1404477 1262986 676091 188579 76245 -300936 -1621647 -3195769
11036c195769r13148l78082o1931O14288P00352j06194m35816j0802N36486J034748
$$ -3195769 -4108917 -4486999 -4548930 -3934642 -3234290 -3340484 -3776300 -3787102 -3250616 -2215868
11026b215868J098711J58691o33457K4939R29280O36775O6902L79572Q05850J075328
$$ -2215868 -1117157 -958466 -1591923 -1566984 -637704 -929 65973 445545 1251395 2326723
11016B326723N65041o82428j492507j843805j886528j478168n74112j5845k7497
$$ 2326723 2891764 2209336 716829 -1126976 -3013504 -4491672 -5065784 -5081629 -5109126
11007e109126j62231N9432J248492J919779J017915N06687R71540O1115j987447
$$ -5109126 -5271357 -5211925 -3963433 -2043654 -1025739 -519052 452488 513603 -1473844
10998a473844l019383k974227k419643j371581m31456k60849l31769K18572J034555
$$ -1473844 -4493227 -7467454 -9887097 -11258678 -11690134 -11950983 -12282752 -12064180 -11029625
10989a1029625J264015N31438n33261j209511j281079o72407J37238P48657M53936
$$ -11029625 -9765610 -9234172 -9767433 -10976944 -12258023 -12930430 -12793192 -12044535 -11590599
10980a1590599j72646P66488K607722L036681J768003K31166j84231N00320J197080
$$ -11590599 -11763245 -10996757 -8389035 -5352354 -3584351 -3353185 -3537416 -3037096 -1840016
10971a840016J239519Q66296Q95423J966968K447445P55751j559307j434644n71056
$$ -1840016 -600497 265799 1161222 3128190 5575635 6331386 4772079 3337435 2766379
10962B766379Q4754J416375J453333p78156l060965l168562j758907j24709J158099
$$ 2766379 2851133 4267508 5720841 4942685 1881720 -1286842 -3045749 -3170458 -2012359
10953b012359J963073K252794J604612J41007p94858r20810j296668j445764j366619
$$ -2012359 -49286 2203508 3808120 3949127 3154269 2233459 936791 -508973 -1875592
10944a875592j536237j138053j052237q77823L33304J239291J432502J662917
$$ -1875592 -3411829 -4549882 -5602119 -6479942 -6146638 -4907347 -3474845 -1811928
10936a811928J762641J198115O71066P33276Q75858P74604O74995J32865l95338
$$ -1811928 -49287 1148828 1819894 2553170 3429028 4203632 4878627 5011492 4616154
10927D616154P4700R61904R17034o15825k317067k423611j373703j344575k060970
$$ 4616154 4690854 5652758 6569792 5953967 3636900 1213289 -160414 -1504989 -3565959
10918c565959j323480N04705J363698O90452m89824r14057k27572J475191L220319
$$ -3565959 -4889439 -4384734 -3021036 -2330584 -2820408 -3734465 -3962037 -2486846 733473
10909G33473L006171P56192j652335k678809k748449k755494k568282j451664
$$ 733473 3739644 4495836 2843501 164692 -2583757 -5339251 -7907533 -9359197
10901i359197J169666M221424O023894N299156K503925m08283j952929j933839
$$ -9359197 -8189531 -3968107 2055787 7354943 9858868 9450585 7497656 5563817
10893E563817p18382K39928p71823k859363l995315l801988k814173j092942J118665
$$ 5563817 4845435 5085363 4313540 1454177 -2541138 -6343126 -9157299 -10250241 -9131576
10884i131576K036442J213586k05256j462012j792962n81029R20084N14770q12735
$$ -9131576 -7095134 -5881548 -6086804 -7548816 -9341778 -9922807 -9002723 -8487953 -9300688
10875i300688l36008J316162K543993K861946K236719J655076J209586P06673
$$ -9300688 -9636696 -8320534 -5776541 -2914595 -677876 977200 2186786 2893459
10867B893459k21623k045209k712999j234018K717J63559K99510O26366M33344
$$ 2893459 2671836 626627 -2086372 -3320390 -3317673 -3154114 -2854604 -2228238 -1794894
10858a794894K95329Q78792M73026j231573j978750j093679L77746J102596K17469
$$ -1794894 -1499565 -620773 -147747 -1379320 -3358070 -4451749 -4074003 -2971407 -2753938
10849b753938j07623Q76635J248863N94185n93032j614901j974948j916553j324411
$$ -2753938 -2861561 -1984926 -736063 -141878 -734910 -2349811 -4324759 -6241312 -7565723
10840g565723j05584R46335J678581J009564p41814j580196p43445M70172N37560
$$ -7565723 -7671307 -6724972 -5046391 -4036827 -4778641 -6358837 -7102282 -6632110 -6094550
10831f094550L65428K03774o1992K07250O93510J99482m15335o1630L08634O84843
$$ -6094550 -5729122 -5525348 -5587340 -5380090 -4686580 -4487098 -4902433 -4964063 -4655429 -3970586
10821c970586J53956j027118p07819J461718L160428L896472L804167J920946
$$ -3970586 -3816630 -4843748 -5551567 -4089849 -929421 2967051 6771218 8692164
10813H692164o59440k331792k972722k817513k065925j378800j316038j596671
$$ 8692164 8032724 5700932 2728210 -89303 -2155228 -3534028 -4850066 -6446737
10805f446737k009778k280698k197317j962414j013707j92522n68010n84996P30967
$$ -6446737 -8456515 -10737213 -12934530 -14896944 -15910651 -16103173 -16671183 -17256179 -16525212
10796a6525212K205593K622003K232809J514956P46698N06477M17152j93997o80770
$$ -16525212 -14319619 -11697616 -9464807 -7949851 -7203153 -6696676 -6279524 -6473521 -7154291
10787g154291r44609j715734k369108k123882j119803P9630L48559R72129K896729
$$ -7154291 -8098900 -9814634 -12183742 -14307624 -15427427 -15347797 -14999238 -14027109 -11130380
10778a1130380L348941K519048K118407J673562P76584o59789k362613k940628
$$ -11130380 -7781439 -5262391 -3143984 -1470422 -693838 -1353627 -3716240 -6656868
10770f656868j637623L54029K041359K514311J977385J075504o15936j757410
$$ -6656868 -8294491 -7940462 -5899103 -3384792 -1407407 -331903 -947839 -2705249
10762b705249j473644n96913k69375q64554j119510J78234J541979J321542O74342
$$ -2705249 -4178893 -4775806 -5045181 -5909735 -7029245 -6851011 -5309032 -3987490 -3313148
10753c313148J201831K058483K158461J942428J841599J379367N14396p98571
$$ -3313148 -2111317 -52834 2105627 4048055 5889654 7269021 7783417 6984846
10745F984846j690792j542234o95454N75055Q68292k20789j517953k266059k179897
$$ 6984846 5294054 3751820 3056366 3631421 4499713 4278924 2760971 494912 -1684985
10736a684985j672360q06667J40813L44970l80087j005448p38974J51250P04944
$$ -1684985 -3357345 -4164012 -4023199 -3678229 -4058316 -5063764 -5802738 -5651488 -4946544
10727d946544J510635L034636L817375K598227N33704q24479j737102k365489
$$ -4946544 -3435909 -401273 3416102 6014329 6548033 5723554 3986452 1620963
10719A620963j776964l27301M37583L43611K45706K64128o32886k453049l655786
$$ 1620963 -156001 -483302 -45719 297892 543598 807726 174840 -2278209 -5933995
10710e933995k894880p81133J866769M104247L898738J701060P40857P35215k51090
$$ -5933995 -8828875 -9610008 -7743239 -3638992 259746 1960806 2701663 3436878 3185788
10701C185788k201396l347198k959286j560258P8280J160470K128776L113351
$$ 3185788 984392 -2362806 -5322092 -6882350 -6804070 -5643600 -3514824 -401473
10693d01473K482893R14915K71586k35267j138348j687537j323842k49654Q94963
$$ -401473 2081420 2996335 3267921 3032654 1894306 206769 -1117073 -1366727 -471764
10684d71764R17214k69739j380479j631173j334700q03481L22181N99950j39426
$$ -471764 445450 175711 -1204768 -2835941 -4170641 -4974122 -4651941 -4051991 -4191417
10675d191417m94089m28805n2162j35268n46221p92424r77819n05767K81580L98313
$$ -4191417 -4685506 -5114311 -5166473 -5301741 -5847962 -6640386 -7618205 -8123972 -7842392 -7444079
10665g444079J83728L96400N60866m84830k323889l155808k476845n89689J086620
$$ -7444079 -7260351 -6863951 -6303085 -6787915 -9111804 -12267612 -14744457 -15334146 -14247526
10656a4247526J526449J599633J986567L170795L438736J700115M95100J81140
$$ -14247526 -12721077 -11121444 -9134877 -5964082 -2525346 -825231 -330131 -148991
10648a48991m91357p55873j171830j588613j277020j46264J081055R92185o38934
$$ -148991 -640348 -1396221 -2568051 -4156664 -5433684 -5579948 -4498893 -3506708 -4145642
10639d145642k059657j879023j099479j2367K12785k94313j41959N19624J200220
$$ -4145642 -6205299 -8084322 -9183801 -9196168 -8983383 -9277696 -9419655 -8900031 -7699811
10630g699811J017550K50148n19378p50222K7484O89164L11822r67312j859448
$$ -7699811 -6682261 -6432113 -6951491 -7701713 -7674229 -6985065 -6673243 -7640555 -9500003
10621i500003j387824j85478R80233J344541N19285o81833j303254q24928M08776
$$ -9500003 -10887827 -11073305 -10093072 -8748531 -8229246 -8911079 -10214333 -11039261 -10630485
10612a0630485J354976J249372R26146J134294R61435N94430R94794J426622J037752
$$ -10630485 -9275509 -8026137 -7099991 -5965697 -5004262 -4409832 -3415038 -1988416 -950664
10603i50664k09139j463433j493096k23881J434504K229900J350689n9963o16997
$$ -950664 -1159803 -2623236 -4116332 -4340213 -2905709 -675809 674880 614917 -2080
10594b080K14983K103589K808324J477804l11977j117904j203638m01248O45194
$$ -2080 212903 2316492 5124816 6602620 6290643 5172739 3969101 3567853 4213047
10585D213047O21545n63379j901297k191227j750130q98701m43362m95549m53272
$$ 4213047 4834592 4271213 2369916 178689 -1571441 -2470142 -2913504 -3409053 -3862325
10576c862325J04472N51522L90955k66010l30982K70253N2651m44313p64327o34123
$$ -3862325 -3757853 -3206331 -2815376 -3081386 -3412368 -3142115 -3089464 -3533777 -4298104 -4932227
10566d932227L11128J202000J171078j06940j807651l066965l623382k627672
$$ -4932227 -4621099 -3419099 -2248021 -2354961 -4162612 -7229577 -10852959 -13480631
10558a3480631n59974J188852J799881J342346M84494j11017j33526l42168j630389
$$ -13480631 -14040605 -12851753 -11051872 -9709526 -9225032 -9336049 -9469575 -9811743 -11442132
10549a1442132k617263j947250K40528K358891K856989K403184K590195K804534
$$ -11442132 -14059395 -16006645 -15766117 -13407226 -10550237 -8147053 -5556858 -2752324
10541b752324K462655J981706J030459q27982k883306l910376l600484j867169
$$ -2752324 -289669 1692037 2722496 1894514 -988792 -4899168 -8499652 -10366821
10533a0366821J061119L330518L641001K626362R75661p27569k297224k780128
$$ -10366821 -9305702 -5975184 -2334183 292179 1267840 540271 -1756953 -4537081
10525d537081j961092j259575j013916p04075o09892l62076k76466n35661l28656
$$ -4537081 -6498173 -7757748 -8771664 -9475739 -10085631 -10447707 -10724173 -11259834 -11588490
10516a1588490q8090j35036N50765J304395Q10256n98002j095787o41579p9239
$$ -11588490 -11676580 -11811616 -11260851 -9956456 -9146200 -9744202 -10839989 -11481568 -11560807
10507a1560807K2567q47761j696851j385854o05727K5290J74844P7852j50821
$$ -11560807 -11538240 -12386001 -14082852 -15468706 -16074433 -16049143 -15874299 -15796447 -15947268
10498a5947268o90935l65997N27906J170492J306321J729025K156196J840286
$$ -15947268 -16638203 -17004200 -16476294 -15305802 -13999481 -12270456 -10114260 -8273974
10490h273974J316860P60334Q27684M30755k68403k9445L91924L47762j68369
$$ -8273974 -6957114 -6196780 -5369096 -4938341 -5206744 -5236189 -4844265 -4496503 -4664872
10481d664872o91619j351446j405028j59570J347723J687755O01623l63289j52597
$$ -4664872 -5356491 -6707937 -8112965 -8272535 -6924812 -5237057 -4635434 -4998723 -5151320
10472e151320k57678q54828j86529J711060K576290K369439J472396M12439P74691
$$ -5151320 -5408998 -6263826 -6450355 -4739295 -2163005 206434 1678830 2091269 2865960
10463B865960K035407K487238J616704L22847q29006k171124l807498m556890
$$ 2865960 4901367 7388605 9005309 9328156 8499150 6328026 2520528 -2036362
10455b036362l514670j342998O79505R99274O2172r55568j258620l10667R03775
$$ -2036362 -5551032 -6894030 -6214525 -5215251 -5153079 -6108647 -7367267 -7677934 -6774159
10446f774159P89898n27440r10888p6199L96194J759392L314085K071712r45416
$$ -6774159 -5984261 -6511701 -7422589 -7498788 -7102594 -5343202 -2029117 42595 -902821
10437i02821l441530m452898m347722l922113l319309j715463R69944K945723
$$ -902821 -4344351 -8797249 -13144971 -17067084 -20386393 -22101856 -21131912 -18186189
10429a8186189L516495K974564J859061J035209Q24631J536719K146759R99666
$$ -18186189 -14669694 -11695130 -9836069 -8800860 -7976229 -6439510 -4292751 -3293085
10421c293085j068871j973329r99576R51801J678367O01153q56243j396039j92388
$$ -3293085 -4361956 -6335285 -7334861 -6383060 -4704693 -4103540 -4959783 -6355822 -6548210
10412f548210J635894K062476J558567J023316o70142k868551l429050k733201
$$ -6548210 -4912316 -2849840 -1291273 -267957 -938099 -3806650 -7235700 -9968901
10404i968901j891308p74106J252545K794247J610651q72607j936941r53679P49362
$$ -9968901 -11860209 -12634315 -11381770 -8587523 -6976872 -7849479 -9786420 -10740099 -9990737
10395i990737J969012J550959R11338J516487J598175J007691R41727R58046M18993
$$ -9990737 -8021725 -6470766 -5559428 -4042941 -2444766 -1437075 -495348 462698 881691
10386H81691l72789r38928r00684q32067j254869j037172o415Q53859Q70052L16339
$$ 881691 508902 -430026 -1330710 -2162777 -3417646 -4454818 -4461233 -3607374 -2737322 -2420983
10376b420983N79031J053309M33903j230248k839843l259442k178183m958J072969
$$ -2420983 -1841952 -788643 -354740 -1584988 -4424831 -7684273 -9862456 -9867414 -8794445
10367h794445J46301o23879n82528o61337n84385L00939J143363P70182j195477
$$ -8794445 -8648144 -9272023 -9854551 -10515888 -11100273 -10799334 -9655971 -8885789 -10081266
10358a0081266k894930k602410j399004N7276J625676K522557K358437J812532
$$ -10081266 -12976196 -15578606 -16977610 -16920334 -15294658 -12772101 -10413664 -8601132
10350h601132J861852J592240P28607k25650j201093j559795j224568k37512R67704
$$ -8601132 -6739280 -5147040 -4418433 -4644083 -5845176 -7404971 -8629539 -8867051 -7899347
10341g899347J302902O67319K14553K81373K34877l61744j621657k293803j338170
$$ -7899347 -6596445 -5929126 -5714573 -5433200 -5198323 -5560067 -7181724 -9475527 -10813697
10332a0813697M53791J491747J557997R23477k90632j707484k188887r48711J081920
$$ -10813697 -10359906 -8868159 -7310162 -6386685 -6677317 -8384801 -10573688 -11522399 -10440479
10323a0440479J994309J520814J250726J508389J604116J356327O88989Q89795
$$ -10440479 -8446170 -6925356 -5674630 -4166241 -2562125 -1205798 -516809 372986
10315C72986J700850J627110P26163n24681j784194k644442k880914j781050j42313
$$ 372986 2073836 3700946 4427109 3902428 2118234 -526208 -3407122 -5188172 -5330485
10306e330485M77708O37270L45694Q489L14493j13596j113866j722465j427620
$$ -5330485 -4852777 -4215507 -3869813 -3861324 -3546831 -3660427 -4774293 -6496758 -7924378
10297g924378m48706J24869O0112M98170J412590P65307n41974r85765q29355
$$ -7924378 -8373084 -8248215 -8188103 -7689933 -6277343 -5512036 -6054010 -7039775 -7869130
10288g869130q0409J225553K165775K218267J579691Q40105o4776q94698j065773
$$ -7869130 -7949539 -6723986 -4558211 -2339944 -760253 79852 15076 -879622 -1945395
10279a945395j247197j262260o21633j62114l12234o70737k63410Q54928J018255
$$ -1945395 -3192592 -4454852 -5076485 -5238599 -5550833 -6221570 -6484980 -5630052 -4611797
10270d611797m38179j346995j8191J825627K152536Q90282l61809j439833l132609
$$ -4611797 -5049976 -6396971 -6415162 -4589535 -2436999 -1546717 -1908526 -3348359 -6480968
10261f480968l142331q43239Q82438J143598J314356P72893J27251R98948J635669
$$ -6480968 -9623299 -10466538 -9584100 -8440502 -7126146 -6353253 -6226002 -5227054 -3591385
10252c591385J093326O52687P08463J47572j205391k158757j564570m57699m98161
$$ -3591385 -2498059 -1845372 -1136909 -989337 -2194728 -4353485 -5918055 -6375754 -6873915
10243f873915o96449P4764Q51106N22452k20076m98067l2240K49316j62260l11370
$$ -6873915 -7570364 -7495600 -6644494 -6122042 -6342118 -6840185 -6872425 -6623109 -6785369 -7096739
10233g096739l5498L16185J09612J51335P77309N11093j83471l06469L40149P02184
$$ -7096739 -7132237 -6816052 -6706440 -6555105 -5777796 -5266703 -5450174 -5756643 -5416494 -4714310
10223d714310r8225r03197q82558o2025O71174k01184j526756j338777P73394
$$ -4714310 -4812535 -5715732 -6598290 -6660315 -5989141 -6190325 -7717081 -9055858 -8282464
10214h282464K610424K260907N07046j040451k110892k512940j635108k3623R20182
$$ -8282464 -5672040 -3411133 -2904087 -3944538 -6055430 -8568370 -10203478 -10227101 -9306919
10205i306919J607631L033179L734653K703195J263813J25090j257549k352813
$$ -9306919 -7699288 -4666109 -931456 1771739 3035552 3160642 1903093 -449720
10197d49720k306150j860124j826537j482331J7231J523131K226352K005844J260900
$$ -449720 -2755870 -4615994 -6442531 -7924862 -7907631 -6384500 -4158148 -2152304 -891404
10188h91404O5070j424925j877726r38106k25049n60220j319607j394049q10845
$$ -891404 -826334 -2251259 -4128985 -5067091 -5292140 -5852360 -7171967 -8566016 -9376861
10179i376861p92662j081673j092377p52781r7876N07607Q12001J032297P05766
$$ -9376861 -10169523 -11251196 -12343573 -13096354 -13194230 -12686623 -11874622 -10842325 -10136559
10170a0136559K09818O9627n35868j483965j510466p09794M21565P12369L78332
$$ -10136559 -9926741 -9857114 -10392982 -11876947 -13387413 -14097207 -13675642 -12963273 -12584941
10161a2584941J140284K940360L249341J872939K66093n09521J40386M47187j65593
$$ -12584941 -11444657 -8504297 -5254956 -3382017 -3115924 -3625445 -3485059 -3037872 -3203465
10152c203465n11259J36261J196640J241081m8904j331951j023820k48451K01237
$$ -3203465 -3714724 -3578463 -2381823 -1140742 -1189646 -2521597 -3545417 -3793868 -3592631
10143c592631R3482M9457L83299R33474J915572K383427R68630n40010k37556
$$ -3592631 -3499149 -3449692 -3066393 -2132919 -217347 2166080 3134710 2594700 2357144
10134B357144Q3819j254052l178291l964590l699642k099730M73503K389734K636478
$$ 2357144 2440963 1186911 -1991380 -5955970 -9655612 -11755342 -11281839 -8892105 -6255627
10125f255627K126185J703001N74013j536434k733787j941795j046208k77544
$$ -6255627 -4129442 -2426441 -1852428 -3388862 -6122649 -8064444 -9110652 -9388196
10117i388196O52145L66785q11494q00926K21715N80488K67437J9241k92414J21016
$$ -9388196 -8736051 -8369266 -9180760 -9981686 -9759971 -9179483 -8912046 -8892805 -9185219 -9064203
10107i064203J348172J510379L23839l41785M41038J436053P21133j156069j938578
$$ -9064203 -7716031 -6205652 -5881813 -6223598 -5782560 -4346507 -3625374 -4781443 -6720021
10098f720021j103193N53535K324262K098455k00041j649245o97897J361368K181455
$$ -6720021 -7823214 -7269679 -4945417 -2846962 -3047003 -4696248 -5394145 -4032777 -1851322
10089a851322J848486O58835o19180q61899p746Q13447J343565O55944j206724
$$ -1851322 -2836 655999 36819 -825080 -832826 -19379 1324186 1980130 773406
10080G73406k430518k408049j294848l80489n73272p49571m43757j7640P20101
$$ 773406 -1657112 -4065161 -5360009 -5740498 -6313770 -7063341 -7507098 -7524738 -6804637
10071f804637J488140J363903Q43493K19017m54903n95830M13126J345044K010288
$$ -6804637 -5316497 -3952594 -3109101 -2890084 -3344987 -3940817 -3527691 -2182647 -172359
10062a72359K830231K505774J017403m46134q81123p81178k10512O02967P95814
$$ -172359 2657872 5163646 6181049 5734915 4853792 4072614 3862102 4465069 5260883
10053E260883K52707j117434k752584l216598k224439p19843M23068J024979J544993
$$ 5260883 5513590 4396156 1643572 -1573026 -3797465 -4517308 -4094240 -3069261 -1524268
10044a524268K443880K880161K615139J673286M26361J0520M04025R61985R08200
$$ -1524268 919612 3799773 6414912 8088198 8514559 8525079 8929104 9891089 10799289
10035A0799289O72765O65273O80390J25722j196004j754022j339593j242416j153069
$$ 10799289 11472054 12137327 12817717 12943439 11747435 9993413 8653820 7411404 6258335
10026F258335o01650N26437J839421K592107K355567J886954J787260Q52075M2952
$$ 6258335 5656685 6183122 8022543 10614650 12970217 14857171 16644431 17496506 17539458
10017A7539458Q53664J962812K232218K680408M347354N927589O673580P510532
$$ 17539458 18393122 20355934 22588152 25268560 29615914 35543503 42217083 49727615
10009D9727615Q797137J0847831J3596549J5818344J6785021J7785210K1080912
$$ 49727615 58524752 69372583 82969132 98787476 115572497 133357707 154438619
10002A54438619K6577813L3194385M0406277M9520367N9183082N9109999L5358621
$$ 154438619 181016432 214210817 254617094 304137461 363320543 422430542 457789163
9995D57789163p293371m0226650n2184668n3569195m9393073m1640516l4211405
$$ 457789163 450495792 410269142 358084474 304515279 255122206 213481690 179270285
9988A79270285k8599015k3699606j8817151j4107116r788560o024866l918532
$$ 179270285 150671270 126971664 108154513 94047397 84258837 78233971 74315439
9981G4315439m234088n646773n662536l225934o43805N63049J329143K064369
$$ 74315439 70081351 64434578 58772042 55546108 54902303 55465352 56794495 58858864
9973E8858864J877570Q87610M21452J289632L636171N977628O551570O498302
$$ 58858864 60736434 61624044 62045496 63335128 66971299 72948927 79500497 85998799
9965H5998799P296756Q672918J1169587J5046117J9465227K4288745K9577405
$$ 85998799 93295555 101968473 113138060 128184177 147649404 171938149 201515554
9958B01515554L5527478M0749248M1494703L5932949K8291905K4777460K4098596
$$ 201515554 237043032 277792280 319286983 355219932 383511837 408289297 432387893
9951D32387893J7466394p79181k5230646m4509169n2529450n1553730m5190395
$$ 432387893 449854287 449075106 423844460 379335291 326805841 275252111 230061716
9944B30061716l6814794k8837889k2639544j9306789j7383671j5222830j2460947
$$ 230061716 193246922 164409033 141769489 122462700 105079029 89856199 77395252
9937G7395252r927648q194844o380444m091131k763596k956221l821420m218798
$$ 77395252 67467604 59272760 52892316 48801185 46037589 43081368 39259948 35041150
9929C5041150l358292j705675j377334k803037l450701k654307j951456j781039
$$ 35041150 31682858 29977183 28599849 25796812 22346111 19691804 17740348 15959309
9921A5959309j112031L49115Q00749p61124k499626k215544q95136K49592J547083
$$ 15959309 14847278 15196393 15997142 15236018 12736392 10520848 9625712 9875304 11422387
9912A1422387K252333J106723q02024j782346k023054j691066j423385j633896
$$ 11422387 13674720 14781443 13979419 12197073 10174019 8482953 7059568 5425672
9904E425672j559895j342144j474489j144804k77806O599N9175R3732K35614M47282
$$ 5425672 3865777 2523633 1049144 -95660 -373466 -366867 -307692 -213960 21654 468936
9894D68936M51663M83937K16703o53185j396475j395490j029250l64390J070609
$$ 468936 920599 1404536 1621239 968054 -428421 -1823911 -2853161 -3217551 -2146942
9885b146942L027085K784273J44283k326429l043840k405733j310815l39205M79942
$$ -2146942 880143 3664416 3808699 1482270 -1561570 -3967303 -5278118 -5617323 -5137381
9876e137381J514497K657240K401065R4771j686430k39171K589750L347401J843460
$$ -5137381 -3622884 -965644 1435421 1530192 -156238 -395409 2194341 5541742 7385202
9867G385202q6155r01226o81288q35250j682829j535726l89854p9735p66828l06263
$$ 7385202 7299047 6397821 5716533 4881283 3198454 1662728 1272874 1193139 426311 120048
9857A20048Q99778R93340Q817j413183k984331l858302l120134j530491p16450
$$ 120048 1019826 2013166 2021983 608800 -2375531 -6233833 -9353967 -10884458 -11600908
9848a1600908p07072n409J174724K107865K116462J477974J612357K043336J512693
$$ -11600908 -12307980 -12313389 -11138665 -9030800 -6914338 -5436364 -3824007 -1780671 -267978
9839b67978k4454j275658j140289J07009J068676J376262J321198J042342O89915
$$ -267978 -292432 -1568090 -2708379 -2601370 -1532694 -156432 1164766 2207108 2897023
9830B897023K97431K06069O61134J527997K723814K764607Q04492j727758l025755
$$ 2897023 3194454 3400523 4061657 5589654 8313468 11078075 11882567 10154809 7129054
9821G129054k609386j692206o90035J40390O78785Q78728O92423Q2863n11793
$$ 7129054 4519668 2827462 2137427 2277817 2956602 3835330 4527753 4610616 4098823
9812D098823p13964j28722O4210r74900j366802p73801n48282q19206p01319J62027
$$ 4098823 3384859 3256137 3320347 2345447 978645 204844 -343438 -1162644 -1863963 -1701936
9802a701936M15422k74408j012392p99442p3251m36585j449973k023979j913443
$$ -1701936 -1286514 -1560922 -2573314 -3372756 -3446007 -3882592 -5332565 -7356544 -9269987
9793i269987j623284p60724O50248J827659K563616K379137J508607R80647O39247
$$ -9269987 -10893271 -11653995 -11003747 -9176088 -6612472 -4233335 -2724728 -1744081 -1104834
9784a104834K82380k73324p10908k47881K60417q02044k077624k861493l810061
$$ -1104834 -822454 -1095778 -1806686 -2054567 -1794150 -2596194 -4673818 -7535311 -11345372
9775a1345372m413673l967330j307127J924030L662657L373060K176352J667140
$$ -11345372 -15759045 -19726375 -21033502 -19109472 -15446815 -12073755 -9897403 -8230263
9767h230263J520105J007562K19274k25755l41472n31839n75905m24284m10750
$$ -8230263 -6710158 -5702596 -5483322 -5709077 -6050549 -6582388 -7158293 -7582577 -7993327
9758g993327p93888j40405R95761R65390M01957J70339L78366N86108R51028J913026
$$ -7993327 -8787215 -8927620 -7931859 -6966469 -6564512 -6394173 -6015807 -5429699 -4478671 -2565645
9748b565645J752792L73433j052301k284213k440038j932590j260758n19472O3972
$$ -2565645 -812853 -439420 -1491721 -3775934 -6215972 -8148562 -9409320 -9928792 -9864820
9739i864820O35759J447174K420453L350090L237904J828683M36831l66579j006186
$$ -9864820 -9229061 -7781887 -5361434 -2011344 1226560 3055243 3492074 3125495 2119309
9730B119309j486961j803007j887706j079075R36237K410606K416502K103619
$$ 2119309 632348 -1170659 -3058365 -4137440 -3201203 -790597 1625905 3729524
9722C729524J067949m79974j812730k999544l338645k607066j291433q3537P63430
$$ 3729524 4797473 4317499 2504769 -494775 -3833420 -6440486 -7731919 -7815456 -7052026
9713g052026R14499L82658l00854p37790n56088m49110r18057q38683K37587J510305
$$ -7052026 -6137527 -5754869 -6055723 -6793513 -7349601 -7798711 -8716768 -9555451 -9317864 -7807559
9703g807559J325246J3186l47059Q47603J383263L60566n48025m15228k08843
$$ -7807559 -6482313 -6469127 -6816186 -5968583 -4585320 -4224754 -4772779 -5188007 -5396850
9694e396850l50146n52276q19203n68245p8234j45075J93430O92309J260811K110530
$$ -5396850 -5746996 -6299272 -7118475 -7686720 -7764954 -7910029 -7716599 -7024290 -5763479 -3652949
9684c652949K077668M51073j820635k793119j941067j032773j013185j259648
$$ -3652949 -1575281 -1124208 -2944843 -5737962 -7679029 -8711802 -9724987 -10984635
9676a0984635j070739K23856J538228J871678K298046K379704J074284j380982
$$ -10984635 -12055374 -11831518 -10293290 -8421612 -6123566 -3743862 -2669578 -4050560
9668d050560m067600m965716l049758n38416N21604J03867n19595J22883P81708
$$ -4050560 -8118160 -13083876 -16133634 -16672050 -16150446 -16046579 -16566174 -16443291 -15661583
9659a5661583P75853O79864J27082j026311k182555k171656j496598j132639j47069
$$ -15661583 -14885730 -14205866 -14078784 -15105095 -17287650 -19459306 -20955904 -22088543 -22235612
9650b2235612J125269J495992J289164R49140Q41352J064551Q20442n10974k011177
$$ -22235612 -21110343 -19614351 -18325187 -17376047 -16534695 -15470144 -14649702 -15160676 -17171853
9641a7171853r32024J586935K520202J492635j64999q94354l20355K80195L62472
$$ -17171853 -18103877 -16516942 -13996740 -12504105 -12669104 -13563458 -13883813 -13603618 -13241146
9632a3241146O45035N52820l65224n80819R8054Q05694J143380J409345J132272
$$ -13241146 -12596111 -12043291 -12408515 -12989334 -12891280 -12085586 -10942206 -9532861 -8400589
9623h400589J35550l45700n25969j362359j941703j495759o67304L0778O74555
$$ -8400589 -8265039 -8610739 -9136708 -10499067 -12440770 -13936529 -14603833 -14573055 -13898500
9614a3898500J016719Q49557N77192P19703N87298R7141l0870j182715k561243
$$ -13898500 -12881781 -12032224 -11455032 -10735329 -10148031 -10050890 -10081760 -11264475 -13825718
9605a3825718j695790P67144K057953J339787j26925q18080k43995P12621Q58639
$$ -13825718 -15521508 -14754364 -12696411 -11356624 -11483549 -12301629 -12545624 -11833003 -10974364
9596a0974364N25182J288795K578294L057830K027376L32405j517995k235816
$$ -10974364 -10449182 -9160387 -6582093 -3524263 -1496887 -1164482 -2682477 -4918293
9588d918293n97670J459495J090985r34314k155118k669779k805688j541920J02919
$$ -4918293 -5515963 -4056468 -2965483 -3899797 -6054915 -8724694 -11530382 -13072302 -12969383
9579a2969383P55672O60084L42911O7361q809L94628J382594K043343J185776
$$ -12969383 -12213711 -11553627 -11210716 -11143355 -11152164 -10757536 -9374942 -7331599 -6145823
9570f145823R2690n50600j252936j100910O9455M52873N4046j196231k319112
$$ -6145823 -6053133 -6603733 -7856669 -8957579 -8888124 -8435251 -8381205 -9577436 -11896548
9561a1896548j904293q93689N29481K523835L300365K619253J678894Q66457M35507
$$ -11896548 -13800841 -14694530 -14165049 -11641214 -8340849 -5721596 -4042702 -3176245 -2740738
9552b740738N55793M91255J07091N37844J449527J871756J247413k36690j987370
$$ -2740738 -2184945 -1693690 -1586599 -1048755 400772 2272528 3519941 3283251 1295881
9543A295881k485299j807376j801354k715308l386412k877790j309745L65609
$$ 1295881 -1189418 -2996794 -4798148 -7513456 -10899868 -13777658 -15087403 -14721794
9535a4721794J196724J698740K392141L146737L480507L454543L214567J852095
$$ -14721794 -13525070 -11826330 -9434189 -6287452 -2806945 647598 3862165 5714260
9527E714260k14589j858128l342832m684020m793427l019803j048586J69243R26870
$$ 5714260 5499671 3641543 298711 -4385309 -9178736 -12198539 -13247125 -13077882 -12151012
9518a2151012J312312J781318J999105J485364J46967j686803k663845k044957
$$ -12151012 -10838700 -9057382 -7058277 -5572913 -5425946 -7112749 -9776594 -11821551
9510a1821551r06162l18138j07271P36244K253127L589605M193583L805892L171144
$$ -11821551 -12727713 -13045851 -13153122 -12416878 -10163751 -6574146 -2380563 1425329 4596473
9501D596473K958534K250398J01804k706547l642594k202476j134438j511766
$$ 4596473 7555007 9805405 9907209 7200662 3558068 1355592 221154 -1290612
9493a290612k122982k393989k351494k251816k661890k552739o53173J698160
$$ -1290612 -3413594 -5807583 -8159077 -10410893 -13072783 -15625522 -16278695 -14580535
9485a4580535J757535J02162q80971p17503r5155j39954j036215j576907j304859
$$ -14580535 -12823000 -12720838 -13601809 -14319312 -14414467 -14554421 -15590636 -17167543 -18472402
9476a8472402K514J974676K996294K292122N76990q72553j373123j284871j283249
$$ -18472402 -18469888 -16495212 -13498918 -11206796 -10629806 -11502359 -12875482 -14160353 -15443602
9467a5443602p55694P9473L44134K08389k41249l66729o5992Q31067K090649J793540
$$ -15443602 -16199296 -16119823 -15775689 -15567300 -15808549 -16175278 -16241270 -15410203 -13319554 -11526014
9457a1526014m7196n87331J471739L302075K969999K111687J461873Q63294K24967
$$ -11526014 -11573210 -12160541 -10688802 -7386727 -4416728 -2305041 -843168 20126 245093
9448B45093o17486j353494j148437Q24951K821185K346979O2321j540341j598432
$$ 245093 -372393 -1725887 -2874324 -2049373 771812 3118791 3181112 1640771 42339
9439D2339j146638j307804k288725k779627j854848o89252n82062j386450j803932
$$ 42339 -1104299 -2412103 -4700828 -7480455 -9335303 -10024555 -10606617 -11993067 -13796999
9430a3796999j256356m89428q32058r67451K59928J342607J976584K673839K483165
$$ -13796999 -15053355 -15542783 -16374841 -17342292 -17082364 -15739757 -13763173 -11089334 -8606169
9421h606169J688113J376579J337985J386212J267333P40037l31434j589326j704879
$$ -8606169 -6918056 -5541477 -4203492 -2817280 -1549947 -809910 -1141344 -2730670 -4435549
9412d435549l93219K33311o33849j913691k589254j028161J274726K537587K730960
$$ -4435549 -4828768 -4595457 -5229306 -7142997 -9732251 -10760412 -9485686 -6948099 -4217139
9403d217139J821926P81649L39284M12056K77118l8559q04035k012095k630079
$$ -4217139 -2395213 -1613564 -1274280 -862224 -585106 -623665 -1427700 -3439795 -6069874
9394f069874k498268j756472j28698J756676K794803K453739O56120j332528j992754
$$ -6069874 -8568142 -10324614 -10453312 -8696636 -5901833 -3448094 -2791974 -4124502 -6117256
9385f117256j362705l57480J25538M62827J287077K223461K370937J911557P76608
$$ -6117256 -7479961 -7837441 -7711903 -7249076 -5961999 -3738538 -1367601 543956 1320564
9376A320564q17305j930781j993758r30877m4222n27911j829607k279842j834044
$$ 1320564 503259 -1427522 -3421280 -4352157 -4396379 -4924290 -6753897 -9033739 -10867783
9367a0867783j633681j483543n45946R74226J878237J639426Q89254M57858K9554
$$ -10867783 -12501464 -13985007 -14530953 -13556727 -11678490 -10039064 -9149810 -8691952 -8662398
9358h662398m16211J0010O02609K99505o12845j370224j250483j06998J015551
$$ -8662398 -9078609 -9068599 -8465990 -8166485 -8779330 -10149554 -11400037 -11507035 -10491484
9349a0491484J004535P58918P58276L10039j10692J41993K17000j45100N03147
$$ -10491484 -9486949 -8728031 -7969755 -7659716 -7770408 -7628415 -7411415 -7556515 -7053368
9340g053368J720352J935715J338505L8199r62769j015783j364365k022971k310109
$$ -7053368 -5333016 -3397301 -2058796 -2020597 -2983366 -3999149 -5363514 -7386485 -9696594
9331i696594j750402p69207j62671R10705K816427L616463K255351K9630j434006
$$ -9696594 -11446996 -12216203 -12378874 -11468169 -8651742 -5035279 -2779928 -2750298 -4184304
9322d184304j362777m35831M39922J254471K238519K467892N64080j268944j176943
$$ -4184304 -5547081 -5982912 -5542990 -4288519 -2050000 417892 981972 -286972 -1463915
9313a463915k44489L6501O6346K02783M31118J432660J858965R65096j72844p19606
$$ -1463915 -1708404 -1671903 -1605557 -1402774 -971656 461004 2319969 3285065 3112221 2392615
9303B392615j291168k326496k568681j269925M44109J004964K23626j258207k297835
$$ 2392615 1101447 -1225049 -3793730 -5063655 -4619546 -3614582 -3390956 -4649163 -6946998
9294f946998j681276o6523J404551K181280J950146J002171k31319o02556J31125
$$ -6946998 -8628274 -8694797 -7290246 -5108966 -3158820 -2156649 -2387968 -2990524 -2859399
9285b859399N19079q33040k792507l472479l166207k915488l115595k561001n57296
$$ -2859399 -2340320 -3173360 -5965867 -9438346 -12604553 -15520041 -18635636 -21196637 -21753933
9276b1753933R11419Q43131R55166J668179K043865J567921k04092j269256m72390
$$ -21753933 -20842514 -19999383 -19044217 -17376038 -15332173 -13764252 -13968344 -15237600 -15709990
9267a5709990R20106J643202R97937R9867o4561p34240k209205l353842l341100
$$ -15709990 -14789884 -13146682 -12148745 -12048878 -12113439 -12847679 -15056884 -18410726 -21751826
9258b1751826j773387K25983J484060J384949j17374j561027j534014j37133K043236
$$ -21751826 -23525213 -23299230 -21815170 -20430221 -20547595 -22108622 -23642636 -23779769 -21736533
9249b1736533M096518M743607M062865K926531J558772L87357m20150p98503p43098
$$ -21736533 -17640015 -12896408 -8833543 -5907012 -4348240 -3960883 -4381033 -5179536 -5922634
9240e922634k66704J85452L4787k55499p99662j565040j482108j17415J072669
$$ -5922634 -6189338 -6003886 -5969099 -6224598 -7024260 -8589300 -10071408 -10188823 -9116154
9231i116154J739196K595026L403481L585551K441988k04013k548097k785862
$$ -9116154 -7376958 -4781932 -1378451 2207100 4649088 4445075 1896978 -888884
9223h88884j459537n12720o68278k58463Q60944K63991j909497l028346k613630
$$ -888884 -2348421 -2861141 -3529419 -3787882 -2926938 -2662947 -4572444 -7600790 -10214420
9214a0214420p20602J127113J465366J094265R86729J116812Q04173N73023K15237
$$ -10214420 -10935022 -9807909 -8342543 -7248278 -6261549 -5144737 -4340564 -3767541 -3552304
9205c552304j374669k816625k680280j571687l32632O03994J309991K161781L011731
$$ -3552304 -4926973 -7743598 -10423878 -11995565 -12328197 -11724203 -10414212 -8252431 -5240700
9196e240700K651387J533411J233450J692559K103810R06193j412500k337691
$$ -5240700 -2589313 -1055902 177548 1870107 3973917 4880110 3467610 1129919
9188A129919j832765j555196j387072J65458K683490L565612K276843J20463j716914
$$ 1129919 -702846 -2258042 -3645114 -3479656 -796166 2769446 5046289 5166752 3449838
9179C449838j906442j522396k080584k098952j238519K21536J925435J801826
$$ 3449838 1543396 21000 -2059584 -4158536 -5397055 -5175519 -3250084 -1448258
9171a448258K05115m46553J78653J164408J356210N79623M04899J417765J585705
$$ -1448258 -1243143 -1689696 -1511043 -346635 1009575 1589198 1994097 3411862 4997567
9162D997567j04408j845006k231045j920997j247489j61738J22036p01381j342041
$$ 4997567 4893159 3048153 817108 -1103889 -2351378 -2513116 -2391080 -3092461 -4434502
9153d434502m98129J610702L169736K840559J309046l28843j851849k810855k804117
$$ -4434502 -4932631 -3321929 -152193 2688366 3997412 3668569 1816720 -994135 -3798252
9144c798252k143733j635391j194987o50834j78554J082515K127464J496190N65651
$$ -3798252 -5941985 -7577376 -8772363 -9423197 -9601751 -8519236 -6391772 -4895582 -4329931
9135d329931Q45629J296681R12937M01358J25437K37093J00785r77830j695183
$$ -4329931 -3484302 -2187621 -1274684 -873326 -747889 -510796 -410011 -1387841 -3083024
9126c083024j026492K04806Q09068P2382j448389k486180k693780k055104p91325
$$ -3083024 -4109516 -3904710 -3095642 -3023260 -4471649 -6957829 -9651609 -11706713 -12498038
9117a2498038J051616K085677K319804L116669K640361J630016J639095R39882
$$ -12498038 -11446422 -9360745 -7040941 -3924272 -1283911 346105 1985200 2925082
9109B925082n95672j007940p15284j26288N56270P64562J21190j070172k063341
$$ 2925082 2329410 1321470 606186 479898 1036168 1800730 1921920 851748 -1211593
9100a211593k190489j641048r65172J56456R87893O73939p24864j747108q60951
$$ -1211593 -3402082 -5043130 -6008302 -5851846 -4863953 -4190014 -4914878 -6661986 -7522937
9091g522937J170076K432523K924684K646480J623708M94359q3898n09683r51373
$$ -7522937 -6352861 -3920338 -995654 1650826 3274534 3768893 3684995 3175312 2223939
9082B223939o70118j59870o21448j607981k012663j506139n8995J466795J565785
$$ 2223939 1553821 1393951 772503 -835478 -2848141 -4354280 -4413275 -2946480 -1380695
9073a380695P11415K47055m87036j506169j453167j651948j941920r87739N41609
$$ -1380695 -669280 -422225 -909261 -2415430 -3868597 -5520545 -7462465 -8450204 -7908595
9064g908595J762128J764412O75697l152K35922O49619J026042J779383K534931
$$ -7908595 -6146467 -4382055 -3706358 -3709510 -3473588 -2823969 -1797927 -18544 2516387
9055B516387K488639K283938R46614j687411l061924k564268j391777j106612
$$ 2516387 5005026 7288964 8235578 6548167 3486243 921975 -469802 -1576414
9047a576414j810273k465945k307623j001297M09883J103457Q08587O30312J219207
$$ -1576414 -3386687 -5852632 -8160255 -9161552 -8751669 -7648212 -6839625 -6209313 -4990106
9038d990106J740783J354458j67228j175937j147767r25842o95902p97975o37074
$$ -4990106 -3249323 -1894865 -2062093 -3238030 -4385797 -5311639 -6007541 -6805516 -7442590
9029g442590N80586J864607K032997P11944q50424j154646o08991K36160K49936
$$ -7442590 -6862004 -4997397 -2964400 -2252456 -3102880 -4257526 -4866517 -4630357 -4380421
9020d380421r80015j161441R09693K916385L027461J533283j60895j274405j674350
$$ -4380421 -5360436 -6521877 -5612184 -2695799 331662 1864945 1704050 429645 -1244705
9011a244705o50169P30899J542930J478776M29340q99990k051035k559966j830098
$$ -1244705 -1894874 -1163975 378955 1857731 2287071 1387081 -663954 -3223920 -5054018
9002e054018j119943o18208P91361K752158L783754L893957L215509J685699o22196
$$ -5054018 -6173961 -6792169 -6000808 -3248650 535104 4429061 7644570 9330269 8708073
8993H708073k477462k529046j921452j536474j294047j487883j864148j118570
$$ 8708073 6230611 3701565 1780113 243639 -1050408 -2538291 -4402439 -5521009
8985e521009K04868J559882K168824J096163k62647j083254j616477k350274k600034
$$ -5521009 -5316141 -3756259 -1587435 -491272 -753919 -1837173 -3453650 -5803924 -8403958
8976h403958j537497Q4826J080037J090226Q96662R35162J762285K917312K441297
$$ -8403958 -9941455 -9856629 -8776592 -7686366 -6789704 -5854542 -4092257 -1174945 1266352
8967A266352M24744n37805J43111Q54077J083506R40762j36829j651231k172409
$$ 1266352 1691096 1153291 1296402 2150479 3233985 4174747 4037918 2386687 214278
8958B14278j895053k009675k408781j392172K41609R64122J557165K132001K088351
$$ 214278 -1680775 -3690450 -6099231 -7491403 -7249794 -6285672 -4728507 -2596506 -508155
8949e08155J877223J886620Q75159q93851j431619l78310P75810J076909L34549
$$ -508155 1369068 3255688 4130847 3236996 1805377 1427067 2202877 3279786 3614335
8940C614335l90127n20620K0878L42220M23801O09169L95294j57732r51182j688640
$$ 3614335 3224208 2703588 2724466 3066686 3490487 4099656 4494950 4337218 3386036 1697396
8930A697396k068098j619496j42199Q52724J031475M83034r6281N59358J471079
$$ 1697396 -370702 -1990198 -2132397 -1279673 -248198 234836 138555 697913 2168992
8921B168992J031344K86405k99049j363403k025554j019277P17823J557571O23148
$$ 2168992 3200336 3486741 3187692 1824289 -201265 -1220542 -502719 1054852 1678000
8912A678000j235781k338772k830239k293242j268880q20952n59866q4476O63627
$$ 1678000 442219 -1896553 -4726792 -7020034 -8288914 -9109866 -9669732 -9754208 -9090581
8903i090581J277976J456158K040383K851845L019542K653018J797637L53910
$$ -9090581 -7812605 -6356447 -4316064 -1464219 1555323 4208341 6005978 6359888
8895F359888p71908n03884J046469J791358M2310k563995k855892p93820O59413
$$ 6359888 5587980 5084096 6130565 7921923 7964233 5400238 2544346 1750526 2409939
8886B409939Q5848j459864k403008j917932q74068J268J95054m2341O56211K192063
$$ 2409939 2495787 1035923 -1367085 -3285017 -4159085 -4157817 -3962763 -4005104 -3348893 -1156830
8876a156830K755924J713834M52977n98581j958800j444982R25015K059198J818643
$$ -1156830 1599094 3312928 3765905 3167324 1208524 -236458 688557 2747755 4566398
8867D566398J308659P27874J27269L23512M7909j243933k074726k083648o50529
$$ 4566398 5875057 6602931 6730200 7053712 7101621 5857688 3782962 1699314 1048785
8858A048785Q35875J190509J394338J218643J43075j085508q68180M85529M58698
$$ 1048785 1884660 3075169 4469507 5688150 5831225 4745717 3877537 4363066 4821764
8849D821764j078790k394499j878738j29594O62407N92031J044452J826630J190813
$$ 4821764 3742974 1348475 -530263 -659857 2550 594581 1639033 3465663 4656476
8840D656476l69894j308789j535066j041101n93964o41301Q7336J626658K542968
$$ 4656476 4286582 2977793 1442727 401626 -192338 -833639 -746303 880355 3423323
8831C423323J633313l34583q89274L07692J077443O99364n07573k327845l923869
$$ 3423323 5056636 4722053 3832779 4140471 5217914 5917278 5409705 3081860 -842009
8822h42009l646210j606618N98839K866331L226022J018480q49568j108808j014857
$$ -842009 -4488219 -6094837 -5495998 -2629667 596355 1614835 765267 -343541 -1358398
8813a358398j274212j372499m85993K61762M57187Q56113J246663J909727K220408
$$ -1358398 -2632610 -4005109 -4491102 -4229340 -3772153 -2916040 -1669377 240350 2460758
8804B460758J205955j53464j49483N77566L55266K402o0323m2413K18376l23634
$$ 2460758 3666713 3513249 3363766 3941332 4296598 4299000 4238677 4196264 4414640 4091006
8794D091006j177737j181707p55014j26461K72329r0505j025000j570045j700149
$$ 4091006 2913269 1731562 976548 850087 1122416 1031911 6911 -1563134 -3263283
8785c263283j911477j587806m04975J351184K214103J795269J387134J164417
$$ -3263283 -5174760 -6762566 -7167541 -5816357 -3602254 -1806985 -419851 744566
8777G44566P70332M07904Q06706J174396P32250J65145K48516P1007k25764L09229
$$ 744566 1514898 1922802 2729508 3903904 4636154 4801299 5049815 5120822 4895058 5204287
8767E204287J224011J253802N9270j847043l259934l107998k631864k730423k399690
$$ 5204287 6428298 7682100 7741370 5894327 2634393 -473605 -3105469 -5835892 -8235582
8758h235582j900174j928977j321429J95216J118260J813172L032884L245066
$$ -8235582 -10135756 -12064733 -13386162 -13190946 -12072686 -10259514 -7226630 -3981564
8750c981564K265970J693579J325416P61885M56055J522825L132790K563531L25104
$$ -3981564 -1715594 -22015 1303401 2065286 2521341 4044166 7176956 9740487 10065591
8741A0065591j817284l137266l357820k600292j507581l60771J031315K144024
$$ 10065591 8248307 5111041 1753221 -847071 -2354652 -2715423 -1684108 459916
8733D59916J455653o7146r02238j048577l14901J239785K020455J661193M74313
$$ 459916 1915569 1848423 946185 -102392 -417293 822492 2842947 4504140 4978453
8724D978453q25010j157098p26415l19494J29737L75098l92278j429739j490828
$$ 4978453 4153443 2996345 2269930 1950436 2080173 2455271 2062993 633254 -857574
8715h57574p40781j79255m73772q63478n66007m6160P02616J242606L06159l69197
$$ -857574 -1598355 -1777610 -2251382 -3114860 -3680867 -3727027 -3024411 -1781805 -1475646 -1844843
8705a844843O20762J676073K571965L239936L059861J484292j370838l527638
$$ -1844843 -1224081 451992 3023957 6263893 9323754 10808046 9437208 5909570
8697E909570l965263k738860n37207J322322J741699J073732J047504J145964
$$ 5909570 1944307 -794553 -1331760 -9438 1732261 2805993 3853497 4999461
8689D999461M75223l25097q83061p59046m79963l53645m44705o40625p62470r19395
$$ 4999461 5474684 5149587 4266526 3507480 3027517 2673872 2229167 1588542 826072 -93323
8679i3323j449415j157240j38514L08094K24865L25893M16955J83098K44108N41977
$$ -93323 -1542738 -2699978 -2838492 -2530398 -2305533 -1979640 -1562685 -1379587 -1135479 -593502
8669e93502N09167M4434M6906J169092K004203J202474k49768n98245O7230M70428
$$ -593502 -84335 -39901 7005 1176097 3180300 4382774 4133006 3534761 3601991 4072419
8659D072419R99816J649952J178701m83053j283562j035933l54431J11348m78558
$$ 4072419 5072235 6722187 7900888 7417835 6134273 5098340 4743909 4855257 4376699
8650D376699j252152j028568j62680O9327j15763J8728M09030N30055N10401O67207
$$ 4376699 3124547 2095979 1933299 2002626 1886863 1905591 2314621 2844676 3355077 4022284
8640D022284Q04156J797692L371475L092698Q60702j245054j924694p18297R92525
$$ 4022284 4826440 6624132 9995607 13088305 13949007 12703953 10779259 10060962 11053487
8631A1053487J538556N45507n02562o44853j364301k930869l976186m659484m500903
$$ 11053487 12592043 13137550 12634988 11990135 10625834 7694965 3718779 -940705 -5441608
8622e441608k339439Q2660J267193K023707K515818K605795J740013k77590j714572
$$ -5441608 -7781047 -7698387 -6431194 -4407487 -1891669 714126 2454139 2176549 461977
8613D61977j360208M4086J419119J763935J496591K029791K295382J462169J73763
$$ 461977 -898231 -854145 564974 2328909 3825500 5855291 8150673 9612842 9786605
8604I786605j837797l411206l566271k613293j226169p16752k78018O74122R21798
$$ 9786605 7948808 4537602 971331 -1641962 -2868131 -3584883 -3862901 -3188779 -2266981
8595b266981M37453Q9073J53562o77914k509283l078116j239138J760418L931026
$$ -2266981 -1829528 -1740455 -1586893 -2264807 -4774090 -7852206 -9091344 -7330926 -3399900
8586c399900L955882K477910Q67502k98849j038066r42416r7539P52954R31875
$$ -3399900 555982 3033892 3901394 3602545 2564479 1622063 1524524 2277478 3209353
8577C209353L26678o78746o86115k6927R6212J95884M5445R5744M00751j48105
$$ 3209353 3536031 2857285 2171170 2144243 2240455 2436339 2481784 2577528 2978279 2830174
8567B830174j049502r71197l50281j8135j56616p04611o76761k29411n13149j135454
$$ 2830174 1780672 809475 459194 441059 284443 -420168 -1096929 -1326340 -1839489 -2974943
8557b974943j576888k088892k450663j224781Q52452J422865M67900R7127J122762
$$ -2974943 -4551831 -6640723 -9091386 -10316167 -9463715 -8040850 -7572950 -7475823 -6353061
8548f353061K415244L150772K650969R93548p09107r12394j12420L80437m53858
$$ -6353061 -3937817 -787045 1863924 2857472 2148365 1235971 1123551 1503988 1050130
8539A050130j918360j628382K47771J275088J282771J198250R55594L75347o54202
$$ 1050130 -868230 -2496612 -2248841 -973753 309018 1507268 2462862 2838209 2184007
8530B184007j558819j384852J39862J509885J753754K145337K975786L268454
$$ 2184007 625188 -759664 -619802 890083 2643837 4789174 7764960 11033414
8522A1033414J684546j016270k403538j656341r59666o96044L44638Q48152l75746
$$ 11033414 12717960 11701690 9298152 7641811 6682145 5986101 6330739 7178891 6803145
8513F803145j313385k49766Q58066R53021L77828O8332L96440N78450L55393J93229
$$ 6803145 5489760 5239994 6098060 7051081 7428909 7497241 7893681 8472131 8827524 9020753
8503I020753K56387M05127k83779n00540K08782J129326P63172j272309k438026
$$ 9020753 9277140 9682267 9398488 8897948 9106730 10236056 10999228 9726919 7288893
8494G288893j725264p39996k93784l0425L26744p0269k54434R02911J062292j85480
$$ 7288893 5563629 4823633 4529849 4499424 4826168 4755899 4501465 5404376 6466668 6281188
8484F281188j028304j360174j281096r30727o50573n98428r86407j114358p82576
$$ 6281188 5252884 3892710 2611614 1680887 1030314 431886 -554521 -1668879 -2451455
8475b451455m30873l91389m18975M37895J291674J374010J626115K262261K776612
$$ -2451455 -2882328 -3273717 -3692692 -3254797 -1963123 -589113 1037002 3299263 6075875
8466F075875K602282R98335j129259k086294k358905k371348q19667J727003L189525
$$ 6075875 8678157 9676492 8547233 6460939 4102034 1730686 911019 2638022 5827547
8457E827547K957876J591007k48468j545768j248810m26768p07577j483838k298909
$$ 5827547 8785423 10376430 10127962 8582194 7333384 6906616 6199039 4715201 2416292
8448B416292k448635j387674p9968Q47386R74522R88719J384614Q70379j51268
$$ 2416292 -32343 -1420017 -1499985 -652599 321923 1310642 2695256 3565635 3414367
8439C414367j19969N54451K78566j426366k732703k599719j057583M95520J790720
$$ 3414367 3294398 3848849 4127415 2701049 -31654 -2631373 -3688956 -3193436 -1402716
8430a402716K724204K430985K307631K729216K684488J056635j286344k611157
$$ -1402716 1321488 3752473 6060104 8789320 11473808 12530443 11244099 8632942
8422H632942l309566l096257j419950M80866J329033J288750L06609o51639n09353
$$ 8632942 5323376 2227119 807169 1288035 2617068 3905818 4212427 3560788 3051435
8413C051435L56642K90238r86869k382057k579719r06448O34657Q72487R74607
$$ 3051435 3408077 3698315 2711446 329389 -2250330 -3156778 -2522121 -1649634 -675027
8404f75027J352931P45992m15739m93457k96786o42909q58874m95771K24739L75683
$$ -675027 677904 1423896 1008157 514700 217914 -424995 -1283869 -1779640 -1554901 -1179218
8394a179218n9829m00378k85629m6240K9676j34610J62753P39917J407550K093864
$$ -1179218 -1239047 -1639425 -1925054 -1971294 -1941618 -2076228 -1913475 -1173558 233992 2327856
8384B327856J547597J22217j710906k447794j662247p54030m57634j243848k400625
$$ 2327856 3875453 3997670 2286764 -161030 -1823277 -2577307 -3034941 -4278789 -6679414
8375f679414j775711N32067K308750K678226K320173J470505L70933m88510n68151
$$ -6679414 -8455125 -7923058 -5614308 -2936082 -615909 854596 1225529 737019 168868
8366A68868j7926K60993m24035j236684j226169Q4263K242113K879149K383820
$$ 168868 150942 411935 -12100 -1248784 -2474953 -2390690 -148577 2730572 5114392
8357E114392K260503J743836K13088k022394l703520l910527k919004j558816
$$ 5114392 7374895 9118731 9331819 7309425 3605905 -304622 -3223626 -4782442
8349d782442j53441J087286J224236J94740m77835l83473n91428j72022J333293
$$ -4782442 -4935883 -3848597 -2624361 -2429621 -2907456 -3290929 -3882357 -4054379 -2721086
8340b721086K361956K195821J282055Q1456j323749k105281j134614P21304J383254
$$ -2721086 -359130 1836691 3118746 3200202 1876453 -228828 -1363442 -642138 741116
8331G41116j34876j694921j043331O23718K357203L850325L902060K451428L96600
$$ 741116 606240 -1088681 -2132012 -1508294 848909 4699234 8601294 11052722 11449322
8322A1449322q84787r34021p23766l45317J00093M36670N90918L81501m5977q32831
$$ 11449322 10564535 9630514 8906748 8561431 8661524 9098194 9689112 10070613 10024636 9191805
8312I191805j857005k603392k817042k805374k079544j015239n70371j228384
$$ 9191805 7334800 4731408 1914366 -891008 -2970552 -3985791 -4556162 -5784546
8304e784546k155562j702128j90887J094171K065667K689988K645540J976027
$$ -5784546 -7940108 -9642236 -9833123 -8738952 -6673285 -3983297 -1337757 638270
8296F38270J076681P61016J090118J117998J225414M73357j498751k551752j511603
$$ 638270 1714951 2475967 3566085 4684083 5909497 6382854 4884103 2332351 820748
8287H20748N37789K055652K430455R54321j381944k708311k850396k064196j112383
$$ 820748 1358537 3414189 5844644 6798965 5417021 2708710 -141686 -2205882 -3318265
8278c318265n24551K26030L66613l10520o97607n41558k02533K93211L50322K95563
$$ -3318265 -3842816 -3616786 -3250173 -3560693 -4258300 -4799858 -5002391 -4709180 -4358858 -4063295
8268d063295J034751J413447J202759J258726J470654J431729Q67243J88511r72302
$$ -4063295 -3028544 -1615097 -412338 846388 2317042 3748771 4616014 4804525 3832223
8259C832223k097378j743097J81734J946169J388000J42387J70769O58931J060919
$$ 3832223 1734845 -8252 173482 2119651 3507651 3650038 3820807 4479738 5540657
8250E540657J637129J789266P97931j052690k492986k434704j419091n95543m69423
$$ 5540657 7177786 8967052 9764983 8712293 6219307 3784603 2365512 1769969 1300546
8241A300546l61805L02935O49673m48302j879963j685470m76057L75436Q27433
$$ 1300546 938741 1241676 1891349 1443047 -436916 -2122386 -2598443 -2223007 -1395574
8232a395574J330449K003450K022254J104240N16577O30732J26884m80208O4262
$$ -1395574 -65125 1938325 3960579 5064819 5581396 6212128 6339012 5858804 5923066
8223E923066R69626R19848k76273j563926j673177r76272o09094p95404k37855
$$ 5923066 6892692 7812540 7536267 5972341 4299164 3322892 2713798 1918394 1680539
8214A680539P55789Q77087r103j479058j727785j162218j743194k158987j234093
$$ 1680539 2436328 3313415 3304312 1825254 97469 -1064749 -2807943 -4966930 -6201023
8205f201023m09346M4680P94610R98936K12124n67340l52833N68239J411212K128695
$$ -6201023 -6610369 -6565689 -5771079 -4772143 -4560019 -5127359 -5480192 -4911953 -3500741 -1372046
8195a372046K409932J721195M14701K14123J67688j157566j333570M72384J708260
$$ -1372046 1037886 2759081 3173782 3387905 3555593 2398027 1064457 1536841 3245101
8186C245101J932296J415259K07653j094069j586267j001000k04496M43494J307904
$$ 3245101 5177397 6592656 6800309 5706240 4119973 3118973 2914477 3357971 4665875
8177D665875J791548J084050r4061j090841r39694M26942P33022k64357q10174
$$ 4665875 6457423 7541473 7447412 6356571 5416877 5843819 6576841 6312484 5502310
8168E502310o69898m16002k44672L153k18232q22725j106705m52402O02943J433059
$$ 5502310 4832412 4416410 4171738 4174891 3956659 3133934 2027229 1574827 2177770 3610829
8158C610829J252591j09279j248275j344544q12826k96962m91714q71885o13876
$$ 3610829 4863420 4754141 3505866 2161322 1348496 1051534 559820 -312065 -925941
8149i25941o86442j196984p92092N12255J089666J34745j194677j106563J19556
$$ -925941 -1612383 -2809367 -3601459 -3089204 -1999538 -1864793 -3059470 -4166033 -4046477
8140d046477P92969K61672J48480M12022j0697k20602M01816N97298m47560j119060
$$ -4046477 -3253508 -2991836 -2843356 -2431334 -2442031 -2662633 -2260817 -1663519 -2111079 -3230139
8130c230139j022134j006997j122485q29720N5774R33350O27765k20622J8349
$$ -3230139 -4252273 -5259270 -6381755 -7211475 -7155701 -6222351 -5594586 -5815208 -5796859
8121e796859J280857K324351K496126K068459J490296J153139R64847N51811k24050
$$ -5796859 -4516002 -2191651 304475 2372934 3863230 5016369 5981216 6533027 6308977
8112F308977j074370j981723j850882r10735j165069j594854q48349J89946J062834
$$ 6308977 5234607 3252884 1402002 491267 -673802 -2268656 -3117005 -2927059 -1864225
8103a864225J392712J316077J196311Q95680P62730Q75050Q46361m2224j773805
$$ -1864225 -471513 844564 2040875 2936555 3699285 4574335 5420696 5378472 3604667
8094C604667j827102M21451K185719K047057Q22938n08580j454781j617881j045750
$$ 3604667 1777565 2199016 4384735 6431792 7254730 6746150 5291369 3673488 2627738
8085B627738j62875L30921L25744M72697J620075L204893L573188K050740K27436
$$ 2627738 2464863 2795784 3121528 3594225 5214300 8419193 11992381 14043121 14270557
8076A4270557m00586m47863j355562k236698k254179j704940p66558j22921O2977
$$ 14270557 13869971 13422108 12066546 9829848 7575669 5870729 5104171 4981250 5044227
8067E044227Q3112k04570k88995j05752n95663p99674o5663K79547n15795j748857
$$ 5044227 5127339 4922769 4633774 4528022 3932359 3132685 3067022 3346569 2830774 1081917
8057A081917k600848k169554m44662J089401J229299P60570O58039J405635K214719
$$ 1081917 -1518931 -3688485 -4133147 -3043746 -1814447 -1053877 -395838 1009797 3224516
8048C224516J295768k53996o00358J30175P91196N99873O4313q3440k25056j011610
$$ 3224516 4520284 4266288 3665930 3796105 4587301 5187174 5251487 5168047 4942991 3931381
8038C931381j845149j309613L54406J297022J418515Q81279q68309k018569q03908
$$ 3931381 2086232 776619 1131025 2428047 3846562 4727841 3859532 1840963 1037055
8029A037055J320243K168449J447267N83691J09337j022702k904724m090595l819622
$$ 1037055 2357298 4525747 5973014 6556705 6666042 5643340 2738616 -1351979 -5171601
8020e171601k587969r33710Q86918J847710J841391K743171M101327L720958J543470
$$ -5171601 -7759570 -8693280 -7806362 -5958652 -4117261 -1374090 2727237 6448195 7991665
8011G991665j580325m057055m127992k281920j58300J699122K022603L87794r02973
$$ 7991665 6411340 2354285 -1773707 -4055627 -4213927 -2514805 -492202 -104408 -1007381
8002a007381q98248p19495r37038j210002j363650j287781n21023N42688J523385
$$ -1007381 -1905629 -2625124 -3562162 -4772164 -6135814 -7423595 -7944618 -7401930 -5878545
7993e878545J963715J934773K287139K312571L10090k571162l653555k427566
$$ -5878545 -3914830 -1980057 307082 2619653 2929743 358581 -3294974 -5722540
7985e722540r6083K108475L190285K774526J760751J498668J795656J658889M21501
$$ -5722540 -5818623 -3710148 -519863 2254663 4015414 5514082 7309738 8968627 9390128
7976I390128q24837o21802o48269j600461k362048j956537p09718P3367L60055
$$ 9390128 8565291 7943489 7295220 5694759 3332711 1376174 666456 739823 1099878
7967A099878r2502j550306k364432j644935n77701K41547J132317K248735L211747
$$ 1099878 1007376 -542930 -2907362 -4552297 -5129998 -4888451 -3756134 -1507399 1704348
7958A704348L300138K939884K242815R95258L25608M1837l23860j3582O03224
$$ 1704348 5004486 7944370 10187185 11182443 11508051 11549888 11226028 11212446 11815670
7949A1815670O51947L85163j21545j185218k348024k642251k276445k520641k563454
$$ 11815670 12467617 12852780 12731235 11546017 9197993 6555742 4279297 1758656 -804798
7940h04798j475709k03776N87828R97707J456428J906260J400202Q35988J046501
$$ -804798 -2280507 -2484283 -1896455 -898748 557680 2463940 3864142 4700130 5746631
7931E746631J077164Q10191O53018L20771k17658j029597j734348j113310j37167
$$ 5746631 6823795 7633986 8287004 8607775 8390117 7360520 5626172 4512862 4375695
7922D375695l33442k25467R56583J685868J699560J570465J198182P26721N48224
$$ 4375695 4042253 3816786 4773369 6459237 8158797 9729262 10927444 11654165 12202389
7913A2202389J69982m49387J1824J012692N92592j024530j191627M95923K129179
$$ 12202389 12372371 11922984 11934808 12947500 13540092 12515562 11323935 11819858 13949037
7904A3949037K048532l25553k233501k617254k664364k704574k610221j868206
$$ 13949037 15997569 15672016 13438515 10821261 8156897 5452323 2842102 973896
7896I73896r26721r13956k189495k670740r06153Q74826J591254K083949K375103
$$ 973896 47175 -866781 -3056276 -5727016 -6633169 -5758343 -4167089 -2083140 291963
7887B91963J550490J97027m29724n72389m88645j45154k05034q85174r43109o40771
$$ 291963 1842453 2039480 1609756 1037367 548722 403568 198534 -686640 -1629749 -2270520
7877b270520j006358j164548o24519k48418n51901q19871m74698J326713L326835
$$ -2270520 -3276878 -4441426 -5065945 -5314363 -5866264 -6686135 -7160833 -5834120 -2507285
7868b507285L406190K562305K880057M072984L830186K178911N89389o43432j632845
$$ -2507285 898905 3461210 6341267 10414251 14244437 16423348 17012737 16369305 14736460
7859A4736460j965717j527657n73664P4563n42287j768391k550954k100823o10116
$$ 14736460 12770743 11243086 10669422 10743985 10201698 8433307 5882353 3781530 3171414
7850C171414J27139j51842m85969q43350j294003j288332j530983j559976M47941
$$ 3171414 3298553 3146711 2660742 1817392 523389 -764943 -2295926 -3855902 -3407961
7841c407961L710862N143849L723540J017745r54395j056720o16978q78042j274320
$$ -3407961 302901 5446750 9170290 10188035 9233640 8176920 7559942 6681900 5407580
7832E407580p32817R55605J729949Q90407l24213j047399n6883J525640J481676
$$ 5407580 4674763 5630368 7360317 8250724 7926511 6879112 6822229 8347869 9829545
7823I829545Q23433L21822n94269j213160r42935n83331m1055Q86814K52833q56326
$$ 9829545 10652978 10974800 10380531 9167371 8224436 7641105 7600050 8486864 8739697 7883371
7813G883371l71387P75822J324485J094343L48369n78812j295342k066100k334661
$$ 7883371 7511984 8287806 9612291 10706634 11055003 10476191 9180849 7114749 4780088
7804D780088j570989o32705j59499j46022o06725m97679N05674J037026M40040
$$ 4780088 3209099 2576394 2416895 2270873 1664148 1166469 1672143 2709169 3149209
7795C149209o31934j316562j154455q25849k04013J058974J583759J559883J321309
$$ 3149209 2517275 1200713 46258 -779591 -983604 75370 1659129 3219012 4540321
7786D540321O87464J92252n52694j386801j754628j630527j972083l045527l167745
$$ 4540321 5227785 5420037 4867343 3480542 1725914 95387 -1876696 -4922223 -8089968
7777h089968j711077M17754K322311L026501K049934M22861L54841J687732J987386
$$ -8089968 -9801045 -9383291 -7060980 -4034479 -1984545 -1561684 -1206843 480889 2468275
7768B468275Q73375n80319j645588j906213k001458k430751j858674K40591J303849
$$ 2468275 3341650 2761331 1115743 -790470 -2791928 -5222679 -7081353 -6840762 -5536913
7759e536913R5317l66177K57868Q22749J543384J264761M12524Q26756J681713
$$ -5536913 -5441596 -5807773 -5549905 -4727156 -3183772 -1919011 -1506487 -679731 1001982
7750A001982K695308L607744K532123j18743k241949k972283k167627n85286N37927
$$ 1001982 3697290 7305034 9837157 9718414 7476465 4504182 2336555 1751269 2289196
7741B289196J364688K267341K674606K223108J478123M60457l45935m15691j69019
$$ 2289196 3653884 5921225 8595831 10818939 12297062 12757519 12411584 11995893 11826874
7732A1826874M38256K08472j094370j605633r05213K05247J023906Q10549M25987
$$ 11826874 12265130 12473602 11379232 9773599 8868386 9073633 10097539 10908088 11334075
7723A1334075r8237j482894k544401k821564k991421l238122k873671j863712
$$ 11334075 11235838 9752944 7208543 4386979 1395558 -1842564 -4716235 -6579947
7715f579947l38789J814078L355317L547864L119537K846761K212782J305471
$$ -6579947 -6918736 -5104658 -1749341 1798523 4918060 7764821 9977603 11283074
7707A1283074J299966K115058J871799L81095q45319j809252l170546l087180
$$ 11283074 12583040 14698098 16569897 16950992 16105673 14296421 11125875 8038695
7699H038695o25992J584262J299148r03864k437449k291606j357719n31685K67744
$$ 8038695 7412703 8996965 10296113 9392249 6954800 4663194 3305475 2773790 3041534
7690C041534J778668L558520L970827L186251J685730o60751k468505l000555
$$ 3041534 4820202 8378722 12349549 15535800 17221530 16560779 14092274 11091719
7682A1091719k934542k332656j431949j08126J313848J469199L32263l78510N45242
$$ 11091719 8157177 5824521 4392572 4284446 5598294 7067493 7399756 7021246 7566488
7673G566488J780523J651652R61875K65050n47129j081383j743082k876197l444199
$$ 7566488 9347011 10998663 11960538 12225588 11678459 10597076 8853994 5977797 2533598
7664B533598l459920k955743j072403J055531J296216P68111N55918J13516m96297
$$ 2533598 -926322 -3882065 -4954468 -3898937 -2602721 -1834610 -1278692 -1165176 -1661473
7655a661473q22589l09810K57677j34221n51083m50613K19895R36449P85176P40792
$$ -1661473 -2484062 -2793872 -2536195 -2670416 -3221499 -3672112 -3452217 -2515768 -1730592 -989800
7645i89800Q60203l00584j905715j609221J3112Q96489R49954J87216p26590k82194
$$ -989800 -129597 -430181 -2335896 -3945117 -3932005 -3035516 -2085562 -1898346 -2624936 -2907130
7635b907130L67100p0930l46068O12837J761402K412930K919895K706209J713105
$$ -2907130 -2540030 -2610960 -2957028 -2344191 -582789 1830141 4750036 7456245 9169350
7626I169350J400796J541350J121098M34840m09121j349419k073543j513364P49679
$$ 9169350 10570146 12111496 13232594 13667434 13258313 11908894 9835351 8321987 9071666
7617I071666J913040R97618M7796j42204L06064J50203j342320k470886k763204
$$ 9071666 10984706 11982324 12030120 11887916 12193980 12344183 11001863 8530977 5767773
7608E767773l176897k748101n98906J362896J868367J542236N86093p82068j549174
$$ 5767773 2590876 -157225 -756131 606765 2475132 4017368 4603461 3821393 2272219
7599B272219j328220o58471K02901N93796K5309N56352K245624K793742K128803
$$ 2272219 943999 285528 488429 1082225 1107534 1663886 3909510 6703252 8832055
7590H832055J342600O88111J51993j05873L39558J47235p10341o27368j9549M51384
$$ 8832055 10174655 10862766 11014759 10908886 11248444 11395679 10685338 10057970 10038421 10489805
7580A0489805K89041l78928j036890j731552k271576k247518j581327m51986R86178
$$ 10489805 10778846 10399918 9363028 7631476 5359900 3112382 1531055 1079069 2065247
7571B065247K624790L494819K120405k15232p78871K69635L88887j973202m089842
$$ 2065247 4690037 8184856 10305261 10090029 9311158 9580793 9969680 7996478 3906636
7562C906636l770420k307164n18307P60237N08242J24621J364332K353240J537174
$$ 3906636 136216 -2170948 -2689255 -1929018 -1420776 -1296155 68177 2421417 3958591
7553C958591J19198j081563r41811R78602K496490K394642J713308J199875O24569
$$ 3958591 4077789 2996226 2054415 3033017 5529507 7924149 9637457 10837332 11461901
7544A1461901l92036j663798k340324j738932r70139n24499k78004j251802k755503
$$ 11461901 11069865 9406067 7065743 5326811 4356672 3832173 3554169 2302367 -453136
7535d53136k653614j109332Q35431J886312J196076p41053j773910j126563p6073
$$ -453136 -3106750 -4216082 -3380651 -1494339 -298263 -1039316 -2813226 -3939789 -4015862
7526d015862P85013r6840j952289j870706m57090p3583n30853p51623j45306J277403
$$ -4015862 -3230849 -3327689 -5279978 -7150684 -7607774 -7681357 -8212210 -8963833 -9109139 -7831736
7516g831736K621627K944035J849674O25924M18761J029141J475365J227953J178102
$$ -7831736 -5210109 -2266074 -416400 209524 628285 1657426 3132791 4360744 5538846
7507E538846J240739L17493m45435k97921o37482j882235k153418r53331K0781
$$ 5538846 6779585 7097078 6651643 6353722 5716240 3834005 1680587 727256 748037
7498G48037M3776p72527q73959L57358J606609K823632L085958K228159R18118
$$ 748037 791813 19286 -854673 -497315 1109294 3932926 7018884 9247043 10165161
7489A0165161j134359k436462j913322k55495J393542J992557J403964K40206
$$ 10165161 9030802 6594340 4681018 4425523 5819065 7811622 9215586 9455792
7481I455792M58248J332847N93290n33832r22888j256468j541090j492837j190200
$$ 9455792 9914040 11246887 11840177 11306345 10383457 9126989 7585899 6093062 4902862
7472D902862p96428Q1428Q61595J057194J510428K171038K730455K145162P49948
$$ 4902862 4106434 4187862 5049457 6106651 7617079 9788117 12518572 14663734 15413682
7463A5413682j46600Q7221o9424j189709j768054j584778p13632L91368M56471
$$ 15413682 15267082 15354303 15284879 14095170 12327116 10742338 10028706 10420074 10876545
7454A0876545l23797r23728j456763j689090j198189j38938J135262K469705L240201
$$ 10876545 10552748 9629020 8172257 6483167 5284978 5146040 6281302 8751007 11991208
7445A1991208K963591J935992R57621j02838j100060j197396j448284k028812
$$ 11991208 14954799 16890791 17848412 17745574 16645514 15448118 13999834 11971022
7437A1971022j811079p43691J02623p01615j999709j640138K84053K048117K143068
$$ 11971022 10159943 9416252 9518875 8817260 6817551 5177413 5461466 7509583 9652651
7428I652651J051285k42429j350018j520675j060810j031128j235385j054717
$$ 9652651 10703936 10461507 9111489 7590814 6530004 5498876 4263491 3208774
7420C208774j104769j830919j976853j031497Q63661K193120J194011j491757
$$ 3208774 2104005 273086 -1703767 -2735264 -1871603 321517 1515528 23771
7412B3771l050270j835147J000581K785414K256882l8876j248343n37974L54923
$$ 23771 -3026499 -4861646 -3861065 -1075651 1181231 1142355 -105988 -643962 -289039
7403b89039J614671K820163K530758Q47783j056880k029847j979631j294128m83667
$$ -289039 1325632 4145795 6676553 7524336 6467456 4437609 2457978 1163850 680183
7394F80183N31163J656794J824002J815025J056132j63834n65362l82679k24823
$$ 680183 1211346 2868140 4692142 6507167 7563299 7399465 6834103 6451424 6226601
7385F226601J0385Q04984K539398L542171K362748Q5727j491758j614182j256659
$$ 6226601 6236986 7041970 9581368 13123539 15486287 15572014 14080256 12466074 11209415
7376A1209415j168339j713792k097822j450129J29459J463448K273927K643134
$$ 11209415 10041076 8327284 6229462 4779333 4908792 6372240 8646167 11289301
$$ [...]
##END NTUPLES=NMR SPECTRUM
##END=
