##TITLE=dept_DE-14sh-TFA CH-,CH3- -up, CH2- -down
 CDCl3, 760 sc
 6.10.2023
##JCAMPDX= 6.0         $$ Bruker NMR JCAMP-DX V2.0
##DATA TYPE= NMR SPECTRUM
##DATA CLASS= NTUPLES
##ORIGIN= UXNMR, Bruker Analytische Messtechnik GmbH
##OWNER= root
$$ XWIN-NMR		Version 3.5
$$ Fri Oct  6 15:41:22 2023 Russian Standard Time (UT+4h)  she@DPX200
##.OBSERVE FREQUENCY= 50.327992884445
##.OBSERVE NUCLEUS= ^13C
##.ACQUISITION MODE= SIMULTANEOUS
##.ACQUISITION SCHEME= undefined
##.AVERAGES= 763
##.DIGITISER RES= 17
##SPECTROMETER/DATA SYSTEM= spect
##.PULSE SEQUENCE= dept135
##.SOLVENT NAME= CDCl3
##.SHIFT REFERENCE= (INTERNAL, CDCl3, 0, 214.665)
##AUDIT TRAIL= $$ (NUMBER, WHEN, WHO, WHERE, WHAT)
$$ ##TITLE= Audit trail, XWIN-NMR		Version 3.5
$$ ##JCAMPDX= 5.01
$$ ##ORIGIN= Bruker BioSpin GmbH
$$ ##OWNER= she
$$ F:/spectra/data/she/nmr/depta/1/pdata/1/auditp.txt
$$ ##AUDIT TRAIL=  $$ (NUMBER, WHEN, WHO, WHERE, WHAT)
(   1,<2023-10-06 15:39:01.09 +0400>,<she>,<DPX200>,
      <created by zg, POWCHK disabled, PULCHK disabled
       terminated by command 'halt'
       configuration hash MD5:
       00 E9 B6 7A A2 85 ED C7 34 08 36 98 17 FE 4E 26
       data hash MD5: 16K
       31 BD 8D 62 BF 55 A9 49 88 F0 3A 31 52 D4 41 21>)
(   2,<2023-10-06 15:39:18.89 +0400>,<she>,<DPX200>,
      <Start of raw data processing
       efp BC_mod = 2 LB = 3.5 FT_mod = 6 PKNL = 1 PHC0 = -3730.016 PHC1 = -1049.4 SI = 16K 
       data hash MD5: 16K
       46 33 B1 87 F7 D1 1F AC C3 CA 4D 6D 80 CD 72 B7>)
(   3,<2023-10-06 15:40:48.01 +0400>,<she>,<DPX200>,
      <pk PHC0 = 10.8015 PHC1 = -10.2 
       data hash MD5: 16K
       26 32 BA FD 1C FB 33 B4 9A 7C A2 D7 B2 EF 0E A7>)
(   4,<2023-10-06 15:40:51.82 +0400>,<she>,<DPX200>,
      <abs ABSG = 5 
       data hash MD5: 16K
       83 55 FB B9 FC 55 2F FD 1B E3 6A 00 8B CC 8B 61>)
$$ ##END=
$$ 
$$ hash MD5
$$ CF CA 14 42 AA 49 97 7D D7 80 CE 17 FB 22 78 29
##$RELAX= 
##$RELAX= 
##$RELAX= 
##$RELAX= 
##$RELAX= 
##$RELAX= 
##$RELAX= 
##$RELAX= 
$$ Bruker specific parameters
$$ --------------------------
##$DU= <F:/spectra>
##$EXPNO= 1
##$NAME= <depta>
##$PROCNO= 1
##$TYPE= <nmr>
##$USER= <she>
##$AMP= (0..31)
100 100 100 100 100 100 100 100 100 100 100 100 100 100 100 100 100 100 
100 100 100 100 100 100 100 100 100 100 100 100 100 100 
##$AQSEQ= 0
##$AQ_mod= 1
##$AUNM= <au_zg>
##$AUTOPOS= <>
##$BF1= 50.322709
##$BF2= 200.13
##$BF3= 200.13
##$BF4= 200.13
##$BF5= 200.13
##$BF6= 200.13
##$BF7= 200.13
##$BF8= 200.13
##$BYTORDA= 1
##$CFDGTYP= 0
##$CFRGTYP= 5
##$CHEMSTR= <none>
##$CNST= (0..31)
1 1 145 1 1 1 1 1 1 1 1 1 1 1 1 1 1 1 1 1 1 1 1 1 1 1 1 1 1 1 1 1 
##$CPDPRG= <>
##$CPDPRG1= <waltz16>
##$CPDPRG2= <waltz16>
##$CPDPRG3= <>
##$CPDPRG4= <mlev>
##$CPDPRG5= <mlev>
##$CPDPRG6= <mlev>
##$CPDPRG7= <mlev>
##$CPDPRG8= <mlev>
##$CPDPRGB= <>
##$CPDPRGT= <>
##$D= (0..31)
0 2 0.003448276 0 0 0 0 0 0 0 0 0 2e-05 0 0 0 0 0 0 0 0 0 0 0 0 0 0 0 
0 0 0 0 
##$DATE= 1696590276
##$DBL= (0..7)
120 120 120 120 120 120 120 120 
##$DBP= (0..7)
$$ [...]
##$SUBNAM2= <"">
##$SUBNAM3= <"">
##$SUBNAM4= <"">
##$SUBNAM5= <"">
##$SUBNAM6= <"">
##$SUBNAM7= <"">
##$SUBNAM8= <"">
##$SUBNAM9= <"">
##$SW= 219.3118970423
##$SWIBOX= (0..15)
0 1 3 0 0 0 0 0 0 0 0 0 0 0 0 0 
##$SW_h= 11037.527593819
##$TD= 16384
##$TD0= 1
##$TE= 0
##$TE2= 300
##$TE3= 300
##$TEG= 300
##$TL= (0..7)
120 120 120 120 120 120 120 120 
##$TP= (0..7)
150 150 150 150 150 150 150 150 
##$TP07= 0
##$TPNAME0= <>
##$TPNAME1= <>
##$TPNAME2= <>
##$TPNAME3= <>
##$TPNAME4= <>
##$TPNAME5= <>
##$TPNAME6= <>
##$TPNAME7= <>
##$TPOAL= (0..7)
0.5 0.5 0.5 0.5 0.5 0.5 0.5 0.5 
##$TPOFFS= (0..7)
0 0 0 0 0 0 0 0 
##$TUNHIN= 0
##$TUNHOUT= 0
##$TUNXOUT= 0
##$USERA1= <user>
##$USERA2= <user>
##$USERA3= <user>
##$USERA4= <user>
##$USERA5= <user>
##$V9= 5
##$VALIST= <valist>
##$VCLIST= <CCCCCCCCCCCCCCC>
##$VD= 0
##$VDLIST= <DDDDDDDDDDDDDDD>
##$VPLIST= <PPPPPPPPPPPPPPP>
##$VTLIST= <TTTTTTTTTTTTTTT>
##$WBST= 1024
##$WBSW= 2
##$XGAIN= (0..3)
0 0 0 0 
##$XL= 0
##$YL= 0
##$YMAX_a= 1073656
##$YMIN_a= -1150188
##$ZGOPTNS= <>
##$ZL1= 120
##$ZL2= 120
##$ZL3= 120
##$ZL4= 120
##$ABSF1= 214.6655
##$ABSF2= -4.669434
##$ABSG= 5
##$ABSL= 3
##$ALPHA= 0
##$AQORDER= 0
##$ASSFAC= 0
##$ASSFACI= 0
##$ASSFACX= 0
##$ASSWID= 0
##$AUNMP= <proc_1d>
##$AZFE= 0.1
##$AZFW= 0.1
##$BCFW= 0
##$BC_mod= 2
##$BYTORDP= 0
##$COROFFS= 0
##$CY= -3
##$DATMOD= 1
##$DC= 0
##$DFILT= <>
##$DTYPP= 0
##$F1P= 0
##$F2P= 0
##$FCOR= 0.5
##$FTSIZE= 16384
##$FT_mod= 6
##$GAMMA= 0
##$GB= 0
##$INTBC= 1
##$INTSCL= 0
##$ISEN= 128
##$LB= 3.5
##$LEV0= 0
##$LPBIN= 0
##$MAXI= 10000
##$MC2= 0
##$MEAN= 0
##$ME_mod= 0
##$MI= 0.4000791
##$NCOEF= 0
##$NC_proc= -3
##$NLEV= 6
##$NOISF1= 120.0001
##$NOISF2= 80.00006
##$NSP= 0
##$NTH_PI= 0
##$NZP= 0
##$OFFSET= 214.6655
##$PC= 4
##$PHC0= -3719.215
##$PHC1= -1059.6
##$PH_mod= 1
##$PKNL= yes
##$PPARMOD= 0
##$PSCAL= 0
##$PSIGN= 0
##$REVERSE= no
##$SF= 50.3227091
##$SI= 16384
##$SIGF1= 140
##$SIGF2= 120
##$SINO= 80
##$SIOLD= 32768
##$SREGLST= <13C.CDCl3>
##$SSB= 0
##$STSI= 16384
##$STSR= 0
##$SW_p= 11037.527593819
##$SYMM= 0
##$S_DEV= 0
##$TDeff= 16384
##$TDoff= 0
##$TI= <>
##$TILT= no
##$TM1= 0
##$TM2= 0
##$TOPLEV= 0
##$USERP1= <user>
##$USERP2= <user>
##$USERP3= <user>
##$USERP4= <user>
##$USERP5= <user>
##$WDW= 1
##$XDIM= 16384
##$YMAX_p= 382779134
##$YMIN_p= -289355927
$$ End of Bruker specific parameters
$$ ---------------------------------
##NTUPLES= NMR SPECTRUM
##VAR_NAME=  FREQUENCY,     SPECTRUM/REAL,   SPECTRUM/IMAG
##SYMBOL=    X,             R,               I
##VAR_TYPE=  INDEPENDENT,   DEPENDENT,       DEPENDENT
##VAR_FORM=  AFFN,          ASDF,            ASDF
##VAR_DIM=   16384,         16384,           16384
##UNITS=     HZ,            ARBITRARY UNITS, ARBITRARY UNITS
##FACTOR=    0.67371834180669, 1,            1
##FIRST=     10802.5493505904, 0,            0
##LAST=      -234.978243228581, 0,           0
##MIN=       -234.978243228581, -289355927,  0
##MAX=       10802.5493505904, 382779134,    0
$$ Real data points
##PAGE= N=1
##DATA TABLE= (X++(R..R)), XYDATA
$$ [...]
5968 10552060 8558988 7796671 9464438 13325805 17351660 18355637 15831393 11616948
5960 11616948 7218590 3199940 556985 -105694 -342531 -1220623 -1581173 52935 3175929
5951 3175929 6243607 8636714 10403244 10655927 8719249 6098797 5267818 7007917 10002294
5942 10002294 12283830 13554899 14418092 15476984 17091922 17685299 16284815 14283244
5934 14283244 13483551 13173230 11736848 9674970 7919383 6803178 6383571 6994009 8496330
5925 8496330 9089377 7535991 5288687 5000119 6235491 7152491 8417630 10405550 11488361
5916 11488361 10959227 9547497 8051802 7584922 9228587 11483008 11273310 8448108 5522781
5907 5522781 3385576 1768413 877955 631167 -3721 -1037333 -1016143 -24688 1560326
5898 1560326 3485418 3866763 1615702 -2061121 -5691664 -7766883 -7942163 -7524799 -7598161
5889 -7598161 -8202221 -8303301 -7988639 -8462985 -9447412 -10310910 -10505541 -9006140 -5156659
5880 -5156659 295293 4523162 6118206 5683696 4225250 2775089 1767360 1874411 2937978
5871 2937978 3651088 2950533 1726101 1265595 1579356 1919879 1957891 2211222 3132564 4100954
5861 4100954 4146361 3467638 3307358 3875259 4844190 6074342 7436722 8317100 7622696
5852 7622696 5889170 4198283 1832948 -1110796 -3254246 -4205184 -5746564 -8814324
5844 -8814324 -11347431 -11661890 -10270483 -7620697 -4494392 -2028176 -704041 -35540 356008
5835 356008 -410286 -1565867 -2313472 -3193820 -4060909 -3704104 -2795727 -2855622 -3782034 -4808103
5825 -4808103 -5469674 -5536789 -5017422 -4183183 -3195996 -2363155 -1740803 -737591 489138
5816 489138 946544 613393 268155 447331 910126 1440621 2180602 2777355 3027640 4136950
5806 4136950 6004254 6535974 6459607 8203612 11444590 13422716 12917125 11180514 9848424
5797 9848424 9356352 9564304 10134889 10618964 10566922 9893363 9067036 8194949 7426042 7304991
5787 7304991 8024167 9307657 10442696 10378730 8291184 5029609 1930441 -773314 -2784522
5778 -2784522 -4398997 -5692142 -5428788 -2786084 1334010 4609588 6520782 8151355
5770 8151355 9518775 10342530 10870046 10294767 8562137 6875314 6098978 6551237 7764766
5761 7764766 8793202 8114393 5416840 2404174 826390 340306 211610 600792 2404425
5752 2404425 6141054 10227022 12173133 11994853 11508566 11019455 9148005 6465279 4143875
5743 4143875 2835982 3038007 3862537 3774923 2184811 -472074 -3198808 -5178436 -6314454
5734 -6314454 -6843365 -7923423 -9658732 -10424264 -9912165 -8595244 -7135302 -6281581 -5695704
5725 -5695704 -4475125 -2966476 -2441797 -3268119 -5037537 -7339620 -10085207 -12478144 -13566688
5716 -13566688 -12919467 -11090338 -9430672 -7527910 -4073389 -439644 1173034 -160728
5708 -160728 -3180112 -6461431 -9330227 -11597333 -12785958 -11610747 -7709073 -3295950
5700 -3295950 -170666 2330749 5711041 9983644 12852397 12525716 9675879 5341288
5692 5341288 323821 -3805762 -6604067 -9155714 -11293025 -12242986 -12480048 -11931315 -10197632
5683 -10197632 -8036753 -5917247 -3044289 2957 1304903 1056835 1847597 3823323
5675 3823323 5342017 6197185 6810704 7197043 7639527 8139719 7666393 5456134 1936687
5666 1936687 -642218 -1931652 -3198665 -3674416 -2591052 -855802 391853 1274501 2245209
5657 2245209 3312031 4473736 5294777 4043880 1129273 -1739962 -3800249 -4087612 -3054414
5648 -3054414 -2095589 -1533163 -1046111 -283468 1200377 3464910 5725498 6516684 4879580
5639 4879580 2323797 1018581 859640 791389 850141 1718395 3757980 6239340 7987888
5630 7987888 8118640 5609522 556943 -4938283 -9135096 -11365019 -11101545 -8819818 -6344112
5621 -6344112 -4781890 -3838888 -3347223 -2652006 -469943 2588457 4378032 3802861 2253099
5612 2253099 1324118 1379442 2525654 4855808 7890826 11293479 15054628 18720141 20539596
5603 20539596 19725057 16792556 12604981 9008065 7250228 7968541 9726161 10880396
5595 10880396 10724039 9466174 8889857 9601257 10052976 8857441 6332417 4217513 3514053
5586 3514053 3956305 4749299 5537490 6118634 5932054 4713991 3231296 2672741 2499551
5577 2499551 2695026 3467990 3439104 1977645 -257204 -973866 817793 2900142 3189114
5568 3189114 1950927 1100417 1801943 3708119 5686971 6616762 5679188 3020020 -372912
5559 -372912 -3130474 -4595041 -4428599 -2169990 1617947 5966785 10241423 13716153 15500511
5550 15500511 16153028 16423999 16324146 15139831 12145385 7715407 3353288 -157694 -3176680
5541 -3176680 -5363536 -5845854 -4563318 -2086550 1281110 4691692 7116358 8829602
5533 8829602 10789413 12829423 13571510 12383173 9868709 6398811 3052961 1758193
5525 1758193 2034347 1728642 -33752 -2380037 -3121682 -992903 2642120 5170560 5122382
5516 5122382 3123702 530460 -1190581 -1220698 -206585 200614 -65871 835824 4035754
5507 4035754 8687048 11569505 11343978 10674133 11899601 14158244 15215105 14390220 12878104
5498 12878104 12050354 11875355 11478348 10442694 8941429 7877614 8570018 11175491 14368491
5489 14368491 16825831 18232949 18294925 17140879 15223870 12860894 10704047 8808970
5481 8808970 7426893 6196471 4570098 3852468 5303102 9241869 14513521 18441641
5473 18441641 19626477 18053528 15558101 14706460 15489258 15397435 13224100 10356978 8486355
5464 8486355 6944833 4552611 1904557 498241 1267676 2776208 3548304 4046567 4758486
5455 4758486 5277306 5140619 4435946 4262886 4847596 4831258 3450431 1717406 756648
5446 756648 295592 629710 2499357 5630877 8482308 9878190 9798131 8537357 7265727
5437 7265727 7251220 7861144 7817592 7264500 6862763 6169356 4851596 3983182 4370989 5229018
5427 5229018 5121796 4533893 4633072 4658298 3494475 2026314 1642992 1989369 2523334 3302249
5417 3302249 3784630 4275861 6126665 8798303 11219383 13471280 15175002 15965789 15524113
5408 15524113 13095192 9076322 5352147 2941725 1173272 106592 489382 1877521
5400 1877521 3351708 4338957 3319766 42935 -3866186 -6789662 -8087609 -6927581
5392 -6927581 -2664125 2627758 6111435 7228580 6756821 5620727 4931415 5203454 7080304
5383 7080304 10234168 13232164 14619316 13857829 12061271 9950541 6899754 3219434
5375 3219434 -121098 -2306645 -3605713 -4499558 -5100470 -5547349 -5079198 -3386552 -1304404
5366 -1304404 -322650 -946917 -2371003 -3440385 -3512884 -3399764 -3303122 -2574862 -1234145
5357 -1234145 22720 1416808 2853324 4205308 6155394 7901805 7947359 6120025 2730474
5348 2730474 -1126688 -3775940 -4244098 -2667858 -989731 -1462767 -3753535 -5137516 -5533957
5339 -5533957 -6950238 -8681217 -9069763 -7679294 -4982417 -2413269 -1123543 -384186 158543
5330 158543 -130739 -695830 -7807 1762438 1872637 -1234940 -5041880 -6841423 -6943989
5321 -6943989 -5823856 -4216300 -3312278 -3145191 -2445711 -262149 3161498 6535453 8706675
5312 8706675 9621125 9662754 8900825 7215338 5240886 4020854 3093377 1645808 -376242
5303 -376242 -2256407 -2753975 -2176983 -1194507 124740 1914268 3045328 2697122 1843132
5294 1843132 1207027 1229672 1424827 900858 186381 432979 1666421 2923597 3579589
5285 3579589 4860706 7244940 9321457 9598119 8437979 7048671 5601248 4337010
5277 4337010 3125002 1332151 -733555 -2483133 -4166519 -5449316 -5479902 -4002416 -2537254
5268 -2537254 -1780401 -562248 813043 1585506 2005371 2362156 2199831 1779447 2087696
5259 2087696 3338894 5861356 8795052 10761075 11578406 11637814 11693858 12221136 13598730
5250 13598730 15709699 17072505 16441125 14637435 13186873 12425643 12082415 11761573 10749370
5241 10749370 9053892 7374416 6225953 6068780 7008478 7440792 6003366 3312420 823893
5232 823893 -1342252 -3401653 -4383911 -3939141 -2185132 258745 1712932 1693115 576780
5223 576780 -1171374 -2998722 -4327590 -5173418 -5782871 -5953859 -5543865 -4780701 -4077506
5214 -4077506 -2633701 -321 2496535 4589859 6590212 8231404 8824385 8533749 8865338
5205 8865338 10858829 13327014 14458813 13101884 9660728 6137974 3806122 3444594
5197 3444594 4421880 5539983 6030240 5821455 5645201 6371202 7332215 7331616 4841018 -56868
5187 -56868 -5399627 -10208188 -13677051 -15570249 -16409881 -17089681 -17797842 -18509103 -20389330
5178 -20389330 -24341357 -30606113 -38620037 -46960900 -54793674 -63710766 -76375302 -93382046
5170 -93382046 -111563496 -125633854 -129874589 -122354359 -107966122 -93383559 -82314455
5163 -82314455 -75326594 -71221657 -68746965 -66945593 -65504979 -63685887 -59223311 -51450021
5155 -51450021 -42279665 -33784083 -27306188 -23945499 -24700008 -28965783 -34482781 -38899134
5147 -38899134 -41157941 -41609739 -40564221 -38190788 -35744538 -34458125 -33838975 -32553659
5139 -32553659 -31566532 -32242238 -33768420 -34807026 -34328696 -32517911 -30324020 -28542778 -28137654
5130 -28137654 -29705265 -32236346 -34981526 -38291209 -42063140 -46683100 -53419379 -62916682
5122 -62916682 -76169816 -93759700 -115072998 -139715496 -165704839 -186156952 -193200853
5115 -193200853 -185343857 -167371731 -147210542 -130657597 -118619753 -110036737 -103228938
5108 -103228938 -96898342 -90453718 -83645040 -76541097 -69522159 -63671078 -60924947 -62463314
5100 -62463314 -66902984 -72627072 -79232526 -85545625 -89342138 -89610924 -88974433 -91945353
5092 -91945353 -101164629 -117046806 -139603500 -168398144 -201511959 -235762704 -267563206
5085 -267563206 -289355927 -288429754 -259548806 -213780874 -167330472 -129390522 -101270997
5078 -101270997 -80768487 -65339042 -52595804 -42467713 -36629354 -34406571 -33164454
5071 -33164454 -30878481 -29008495 -29562128 -31720345 -34270565 -36978549 -40236623 -44388910
5063 -44388910 -50433120 -57032015 -59702055 -56718533 -50082260 -41853242 -33915325 -27083002
5055 -27083002 -20771910 -14945043 -10345092 -7602387 -6118822 -4651400 -2763677 -1054971
5047 -1054971 540882 2205130 3604145 4479014 4796493 5184892 5646320 6002202 6563728
5038 6563728 7401469 8705778 10382440 11449245 11006042 9194946 6658728 4801786 4449619
5029 4449619 5001941 5794226 7225382 10015860 13138129 14972691 15649399 16093210 16346092
5020 16346092 16273292 15518876 14320229 14192871 15371336 15842414 14501210 12766818 12118229
5011 12118229 11366756 8827792 4867861 935615 -1158122 -500221 1947794 3920817
5003 3920817 4458890 4237939 3870794 2995664 1236761 -621854 -1440045 -1349628 -1623334
4994 -1623334 -2142807 -1573018 -184327 845612 1569160 2372890 3010492 2961352 2058182
4985 2058182 619968 -1371611 -3940267 -5854402 -5911621 -4647477 -3545174 -3144902 -3138779
4976 -3138779 -2420205 -516134 2018103 3678534 3276057 1817410 768454 768363 559479
4967 559479 -1168665 -3472017 -6186009 -9970040 -13176344 -13548709 -11110581 -7754111 -5127116
4958 -5127116 -3721335 -3226077 -3525053 -4238525 -4548831 -4501357 -3407096 -1022088 188996
4949 188996 -1034430 -2911108 -3574703 -3278826 -1962536 311775 1996628 3010548 4241106
4940 4241106 5612335 6971775 8778268 10661375 10662584 8150359 5335567 3067338 1377040
4931 1377040 659362 59120 -698878 -799933 156354 1804617 3537005 4874811 5394749
4922 5394749 4750928 3476637 2776439 3063088 3775539 3996065 2977645 1432279 698509
4913 698509 385440 -80272 -515256 -243658 1099136 2608955 2795177 635049 -2600336
4904 -2600336 -4573419 -4383982 -3285976 -2466980 -1251100 203987 932638 1348318 1952187
4895 1952187 2536315 3166180 3610186 3618565 3765140 4159544 4299600 4197827 3428450 1940488
4885 1940488 577756 -831792 -2709425 -4264766 -5405771 -6176801 -5485908 -3172765 -769766
4876 -769766 1496814 4233085 6756209 8207322 8740370 9124867 9844340 10332611 9484087
4867 9484087 7191194 3940993 761912 -1294373 -2176362 -2137382 -1009436 547882 1488429
4858 1488429 1980438 3310014 6036773 9200063 10578206 9790869 8532473 6936602 3898845
4849 3898845 -311952 -3954608 -6050479 -7398503 -8821392 -9735157 -9693969 -9046672 -8377385
4840 -8377385 -7558975 -6520484 -5386757 -2562936 2166159 6535823 9348299 10025655 8674967
4831 8674967 6173527 3213271 1120414 868979 1481482 1418687 675212 566847 1706420
4822 1706420 3830955 6363343 8280934 8783858 7911238 5979132 3569429 2024060 1121784
4813 1121784 407433 317389 698796 1361849 3355718 7733427 13567710 18391311 20777044
4804 20777044 20729550 18865526 16536195 14015731 11549405 9998288 8736872 6330802
4796 6330802 2431578 -1896679 -5709239 -7683292 -7737532 -7005578 -6622672 -6664750 -6617109
4787 -6617109 -6104514 -4113079 -1066817 1689774 3406187 3928851 3989099 4643858 6414832
4778 6414832 8844658 10483983 10684477 10460906 11020013 12261586 13421249 14142515 14918708
4769 14918708 15666139 15805788 14441663 11088363 6894848 3190664 1267085 2143631 4511526
4760 4511526 6758073 8438606 9038395 8117208 7006781 7059820 7483873 6940555 6739166
4751 6739166 8027306 8967827 8786075 8091748 6892031 5034686 2917123 846016 -450764
4742 -450764 -257949 656905 911160 195182 -263805 847779 3710097 7389169 9706243
4733 9706243 10047232 9152420 7776778 7106987 7359253 8313848 10280596 12852370 14445572
4724 14445572 14502500 13530684 10991005 7485972 5181142 4861219 5784485 7616362 9246167
4715 9246167 9005978 6726289 4037914 2942152 2815254 1513629 -792097 -1419333 236401
4706 236401 1936568 1994205 811927 605652 1333613 1043364 -1135279 -3848508 -4488398
4697 -4488398 -2674835 -517663 583947 671643 28590 -101348 558278 519795 -1073910
4688 -1073910 -3184539 -4778950 -5739826 -5890179 -5345643 -5043735 -5478085 -5684636 -4974522
4679 -4974522 -4347869 -5435141 -8198241 -10458434 -10800005 -10672837 -11977913 -12960843 -11022893
4670 -11022893 -6595681 -1616260 2576478 4661335 4461289 3311194 2881759 3513842 4119424
4661 4119424 4394706 4994376 6446519 9120544 12006712 13385506 12722684 10320154 7648700
4652 7648700 6143405 6370024 8080311 10028700 10513085 8295348 4921364 2915332 3486553
4643 3486553 5704666 7356153 7361006 6549740 6470369 6906787 6711425 6004304 5431614 5004578
4633 5004578 4349306 3200413 1583561 -119269 -1178031 -1028609 -130716 815199 1280858
4624 1280858 978883 926682 1790092 3604349 5788692 7226230 7406446 7432683 8114630
4615 8114630 8957924 10237412 12635634 15474143 17180915 17081665 16473596 16200261 16067983
4606 16067983 15928135 14729075 11755939 7878267 4663141 2522192 636664 -1528977
4598 -1528977 -3071888 -3097765 -2225861 -834104 498032 592754 -812012 -2424125 -3134955
4589 -3134955 -3020002 -2723180 -2319231 -1400500 -158906 1215674 2567990 3690715 4207877
4580 4207877 3557783 2017307 292683 -1253264 -2467113 -3255801 -2976124 -2013687 -1097570
4571 -1097570 -152077 990529 2021739 2989725 3869772 3661827 2417920 1758259 2471948
4562 2471948 4001915 5120487 4786358 3170111 984071 -1183057 -2739484 -2725303 -332298
4553 -332298 3618617 6749849 8261378 8903196 8950461 8388317 7622438 6450593 3883865
4544 3883865 179433 -2788263 -4777334 -6843952 -8129935 -6820505 -3689872 -1329359
4536 -1329359 -530676 73455 1578549 3446561 4300109 3770525 2923448 2988863 3948744
4527 3948744 5338472 7302982 9650202 10529795 9006573 6653696 4256191 2432590
4519 2432590 2305240 3371748 4630631 5116507 5037368 5652285 6662897 6093085 3863098
4510 3863098 1758498 55454 -1045431 -460951 1142044 2387821 2520453 1849910 1936366
4501 1936366 2900750 3045615 1951987 739847 849983 2023781 2393439 1467224 -331542
4492 -331542 -2193219 -3126958 -2830078 -2336459 -2298615 -2384474 -1905180 -1178031 -909456 -1298191
4482 -1298191 -2058709 -1602150 588857 3643776 6307168 7631349 8173566 8245686 6974588
4473 6974588 4104562 1533157 505196 801419 2248232 4609654 6786874 8023805
4465 8023805 9581132 12462364 14812084 14226657 11717088 9388431 7520539 6331579
4457 6331579 5588193 5168830 4687816 4038822 4409296 5672868 6755590 7374793 7279786
4448 7279786 6800822 6632616 6761173 7212314 7975417 8362043 8100269 8022956 9033700 9934719
4438 9934719 9903761 9119094 8026554 6578966 4634832 3063275 1677787 392319 860103
4429 860103 2902079 4024332 3143756 702035 -1413686 -2760235 -4003172 -4470749 -3677551
4420 -3677551 -2265492 -844027 146084 634421 1610617 3370825 5313219 7169373 9253439
4411 9253439 11867578 13571435 13317725 12117693 10637612 9248573 8815021 9015810 8720422
4402 8720422 7261682 5045426 3740167 3316947 1837669 -970987 -3157545 -3468379 -2835417
4393 -2835417 -2523414 -2058473 -498109 1826777 4906738 8759693 12213797 13699746 13065067
4384 13065067 11828375 11487093 12866496 15479523 16980109 14941132 9681016 4130119
4376 4130119 823427 170677 405976 -325573 -1805358 -2760805 -2143931 -105038 2040749
4367 2040749 3446997 4429196 4209077 2237472 -107653 -2174344 -3793140 -5288907 -7354688
4358 -7354688 -9961421 -11346986 -9632832 -5859874 -2151077 -1124 299871 -217304 -1030815
4349 -1030815 -1930202 -3431218 -5573789 -7499279 -8256698 -8065893 -7938824 -8131910 -8170686
4340 -8170686 -7446409 -5656632 -3861895 -3822021 -5346249 -6272192 -5296824 -2769077 -611334
4331 -611334 505821 1388278 2007388 2570242 2997797 3550066 4047850 4280704 4524183 4785670
4321 4785670 5113624 5391664 5557765 5477366 5081315 5141303 5404596 3828462 441153 -2135796
4311 -2135796 -3505367 -4722245 -4986939 -3387623 -1189528 -810700 -3008175 -5866464 -7242441
4302 -7242441 -7432808 -7278006 -6123587 -2990196 1550871 5282155 6896815 7004766 6666283
4293 6666283 5570137 3155742 498820 -107256 1814180 4413924 6655185 8871600
4285 8871600 11188128 13674463 16076183 17236564 16979627 15366280 11979175 7236556
4277 7236556 3030274 1332184 2111342 3739352 4310333 3242917 1030140 -1136783 -2073827
4268 -2073827 -2896672 -5667199 -9706738 -12798553 -13754455 -11874575 -7656806 -2547911 1812046
4259 1812046 3569482 3064562 2065591 1292437 1094112 1996790 3045994 1983752 -1203930
4250 -1203930 -3975031 -4742444 -4173591 -3006199 -2220840 -2679619 -4057902 -5276093 -5055593
4241 -5055593 -3002810 319022 3230214 5098056 6375697 7447318 8791340 10504184
4233 10504184 12459726 13726624 13320091 11402976 9283943 8036141 7705451 8140906 9504421
4224 9504421 12422223 15923493 17023725 14707323 10764126 7203201 5333306 5644610
4216 5644610 7105838 7626901 6478247 4980924 4483304 4960793 5800015 6629036 7649523
4207 7649523 9063940 10108517 10148378 9647126 8359989 6443019 5383699 5381731 4162919
4198 4162919 616272 -2731611 -3614129 -2467317 -702165 646302 1279584 1060033 -399016
4189 -399016 -2349624 -3513157 -3660457 -2617415 -487066 490264 -481912 -1628665 -2367904
4180 -2367904 -3342376 -4836252 -5705480 -4557236 -2013564 -522157 -545747 89860 1828173
4171 1828173 3661090 5045907 5819080 6070361 6319090 6426286 6086662 6149790 7192904
4162 7192904 8707867 9961459 10340162 10473450 11635560 13175506 12842668 9735931 5830014
4153 5830014 3050529 1231940 -213325 -665554 1388086 5943117 11444858 16831292
4145 16831292 21369415 24587851 26113558 25951649 24759476 22713898 19547030 16424796
4137 16424796 14223046 12628268 11047575 9593753 7992833 5682203 3357685 1826859
4129 1826859 1174164 699582 1055125 3225932 6369143 8503343 8119772 6385027 6489351
4120 6489351 9180125 11823162 12729279 12407919 10401612 7027776 4508966 4230754 6309331
4111 6309331 10039704 13685997 16229032 19006827 22845065 26052213 27600564 27901766
4103 27901766 26592668 23382255 19600726 16860650 15285583 14297232 13090972 11550536
4095 11550536 9973434 8225548 6775465 6879267 8467988 10971979 13848913 16028546
4087 16028546 17044938 17084563 17209400 18824965 21772991 24786065 27152734 28946038 30437345
4078 30437345 30833272 29344330 26832733 25001734 24337085 24078596 23049210 20503474 16657504
4069 16657504 12115757 8394027 7191245 7720597 7643674 5913055 3182183 160273 -1870271
4060 -1870271 -2321794 -2575162 -3975223 -5944570 -6721080 -5404960 -3027525 -761068 1104751
4051 1104751 2290925 2971261 3854094 5191504 7004644 8613353 9577627 10592889 12271415
4042 12271415 14217567 15688102 15639476 14317545 12832281 10702324 8221329 5943953
4034 5943953 3371300 -246274 -4308216 -6704824 -6379927 -5028788 -4274183 -3814960 -3498028
4025 -3498028 -4957700 -8453009 -11369483 -11454598 -9045850 -6010443 -3865568 -2435980 -638562
4016 -638562 1533618 2620080 2433216 2704960 4164255 5513842 5587963 5472868 7294100
4007 7294100 10371061 12603114 13326167 12686432 11940348 11659336 11445263 11654234 12399845
3998 12399845 13385722 14360199 15382373 16665561 18414130 20947659 23048749 23139811 21860748
3989 21860748 20715430 20489149 20411168 18950058 15840607 11365525 6213222 2959919 2837398
3980 2837398 4271036 5779351 6235757 6154236 6743585 7171487 6956327 8024540 10217670
3971 10217670 11110786 10581148 10323524 10368481 10878237 13485047 17566295 21371280 23708798
3962 23708798 23894565 23032113 23169114 24392730 25093584 24583652 24414328 25421765 26471584
3953 26471584 27017025 26534506 24857289 23492060 22899390 22685073 23191661 23730756 23368114
3944 23368114 22198672 20495035 18156892 15572269 13583642 13060047 14491085 17373686
3936 17373686 20226899 21937874 22631757 22489423 21211551 19716583 19783469 21582875 23281085
3927 23281085 24180694 25491040 27325398 28114012 27031876 24343525 20753513 17244099
3919 17244099 14217532 11660988 10144922 10528545 11597744 11570389 10089098 7286823 3612404
3910 3612404 34518 -2516175 -4172745 -5810366 -7727252 -9123645 -9651467 -9340239 -8879027
3901 -8879027 -8920090 -8644756 -6849169 -3204168 869727 3899856 6248688 8863709 11252458
3892 11252458 12284539 12615863 13770542 15592878 17066146 16905478 14597386 11841629
3884 11841629 10544066 10601568 11698909 12856993 12156562 9542543 6472351 3955611 1721432
3875 1721432 -327535 -1426005 -852995 1266003 3433855 4068656 3144905 1635610 254242
3866 254242 -899550 -1615354 -1970750 -1620046 -295280 1901719 4109227 4888454 4572433
3857 4572433 4876018 5781848 5161713 2694774 -66785 -1724638 -2712683 -3944588 -4471911
3848 -4471911 -2839851 926221 5038667 7621854 8678191 8720729 8454253 8590947 9576896
3839 9576896 10377197 9963424 9051267 7787150 5674000 2800079 241750 -1525288 -2074420
3830 -2074420 -1036547 220717 468565 794459 2765767 5734383 7677477 7791168 6223995
3821 6223995 3037720 -1408650 -4772522 -4409326 -926329 2076937 1643680 -1004506 -2843520
3812 -2843520 -2705954 -678943 2579843 5858003 7443300 6390700 4082434 2202474
3804 2202474 148852 -2423851 -4624691 -6075808 -6806306 -7134553 -7287390 -8283011 -11064229
3795 -11064229 -13846314 -14673883 -14029670 -12843834 -11318877 -10189868 -9937031 -9891631 -9820109
3786 -9820109 -8935340 -6658288 -4193159 -2485157 -1939097 -1956053 -1270346 97642 943239
3777 943239 233562 -924984 -1535153 -2457369 -4082510 -5920755 -7374920 -7596851 -6533978
3768 -6533978 -4879275 -3393884 -3379342 -5125164 -6378130 -5566860 -4283344 -3737680 -3424436
3759 -3424436 -3608255 -4308360 -5186746 -6381915 -7611965 -8269268 -8064780 -6906800 -4465913
3750 -4465913 -1171087 1027943 1364620 1349496 1107736 -594883 -2964165 -4274892 -4944885
3741 -4944885 -5575849 -6745764 -9347936 -11548432 -10754182 -7469415 -3995915 -1735254 -1018577
3732 -1018577 -1546696 -2410005 -3464603 -4504747 -4640218 -3999300 -3640850 -3869295 -3382104
3723 -3382104 -1454891 610852 964170 -889963 -4261453 -7895994 -10732499 -11751938
3715 -11751938 -10897381 -8485114 -4783598 -1272794 680637 852212 909348 1534747 1468145
3706 1468145 -102776 -2408951 -3744314 -3032428 -950643 1514483 3566883 3738256 2018446
3697 2018446 -390686 -2829062 -4910910 -5931975 -5199593 -3161524 -1512788 -1482251 -2936473
3688 -2936473 -5177095 -7050258 -7372910 -7370385 -8948019 -10944007 -10961243 -9353161 -7880528
3679 -7880528 -6928136 -5700316 -4047028 -3242040 -2919037 -2017375 -906823 182346 1593760
3670 1593760 3280032 3915300 2862574 689171 -2136609 -5623453 -9633913 -12353459
3662 -12353459 -12069421 -9794147 -7263270 -5175261 -4290960 -4585009 -4662468 -4227242 -3876526
3653 -3876526 -3585450 -3781999 -4733037 -6059459 -7733663 -9838465 -11038566 -10690799 -9717729
3644 -9717729 -9401851 -10991578 -14947314 -19284514 -21600609 -21359201 -19491934 -17910860 -17681288
3635 -17681288 -18869590 -21571916 -25023869 -27684045 -28630369 -27510505 -24431201 -20452540
3627 -20452540 -17042864 -15162485 -14977104 -16679501 -18589044 -18737144 -18559097 -19853448 -23344573
3618 -23344573 -28041427 -32085204 -35516950 -39132727 -42420169 -45090603 -46907254 -46722452
3610 -46722452 -45135951 -45104239 -48236408 -55098896 -65815960 -78498478 -89007869 -94266767
3602 -94266767 -94945388 -93310642 -90567206 -86288956 -81597846 -79243362 -79879870 -81855543
3594 -81855543 -82875791 -81861133 -79461981 -78088025 -79822016 -85109892 -91948199 -97775364
3586 -97775364 -100801180 -99298618 -93418795 -86341357 -80485449 -74946290 -69099120 -63843142
3578 -63843142 -60096393 -57606366 -55801410 -54172398 -52360824 -50412261 -48004887 -44958979
3570 -44958979 -41437714 -37960562 -35518925 -35161446 -36176211 -36139270 -34541792 -32254192 -29832117
3561 -29832117 -27892800 -26818742 -26463455 -25772005 -25127839 -26184172 -28235397 -29715970 -30153653
3552 -30153653 -29963859 -29768278 -29174621 -27127081 -23400325 -19376995 -16700037 -15277665 -14276688
3543 -14276688 -13680554 -13582279 -13549824 -12659962 -10039351 -7314433 -6154023 -5625958 -4242055
3534 -4242055 -1509542 1737068 4294147 5347337 4785363 3560956 2542897 1715838 672170
3525 672170 -252162 -663388 -1154229 -1558432 -1176298 -92330 1752422 4628958 7382480
3516 7382480 7743124 5169517 2355224 1985819 2905134 2618958 712073 -1113166 -2042273
3507 -2042273 -3208553 -5302657 -7126081 -7689382 -7907109 -8647131 -8762865 -7283008 -4640531
3498 -4640531 -1648290 448072 1005680 473465 -686258 -1738771 -1785355 -339528 2326410
3489 2326410 4529384 5573634 5838294 5508793 3938820 987015 -2862342 -6959490 -10245134
3480 -10245134 -12019143 -12207761 -11366686 -10926754 -11020075 -9790847 -6236986 -2600563 -1574472
3471 -1574472 -2758683 -4674640 -6324807 -7423472 -8108388 -7743775 -6046042 -4137243 -3512620
3462 -3512620 -3640199 -3203886 -2489276 -1391703 -141966 418039 524411 1582667 3945876
3453 3945876 6265382 7250690 6885630 5389134 4086328 3877591 2958399 386246 -2367111
3444 -2367111 -3870289 -4442787 -5305684 -6711554 -6959481 -4902962 -1804559 80741 68080
3435 68080 -8822 1320213 3867917 6078268 6656512 5753712 3619026 70492 -4202193
3426 -4202193 -8013345 -11076313 -13847578 -16129963 -15955074 -12870558 -9481785 -7129256
3418 -7129256 -5256073 -3488706 -1397097 777290 2507150 3918028 4530230 4621149 4891293
3409 4891293 4504130 3047353 2370264 3591399 5420392 6925284 8150443 9277673 9995464
3400 9995464 10536894 11355224 11586909 9703691 6229002 2449692 -797519 -2651761 -3118137
3391 -3118137 -2555068 -1674460 -1116863 -769898 -250256 127380 -678483 -2224480 -2316134 106816
3381 106816 3507049 5469587 5603933 4482034 2372631 -173787 -2908574 -4396130 -3421115
3372 -3421115 -1829636 -2471043 -5303050 -8164535 -10082782 -10622285 -9043091 -5804206 -2317247
3363 -2317247 112027 769589 -148665 -1280109 -1592636 -606441 819894 1724195 1857956
3354 1857956 1337735 832292 485196 95732 -360518 -862135 -1850849 -3639455 -6177281
3345 -6177281 -8997527 -10392130 -9609088 -8400563 -8247866 -8585823 -8238420 -7653608 -7731741
3336 -7731741 -8047463 -7227787 -5672651 -4497557 -3933150 -4391774 -5901656 -7831582 -9510819
3327 -9510819 -10461238 -10516270 -9986070 -9808615 -9425057 -7319946 -4717193 -4520682 -6479374
3318 -6479374 -7972465 -7197045 -4108769 157102 4460107 8134145 10241090 10470104 9026046
3309 9026046 7337947 7550547 9436250 11328114 12988547 15274990 18170875 20458998
3301 20458998 20989885 19778005 17689896 14872897 11622748 9335831 8262336 7753661
3293 7753661 6687799 5041485 4034981 3587760 3028761 2381113 1889970 1995452 2390558
3284 2390558 3165908 4459936 4892059 3991268 3162392 2727782 2094222 1423467 126710
3275 126710 -1884979 -2591398 -852530 1797645 2396701 -719722 -5256583 -7645508 -7355449
3266 -7355449 -5615984 -4089270 -3568406 -3380414 -3303155 -3609587 -4293193 -4633187 -4308703
3257 -4308703 -4580522 -6436318 -8195868 -8158851 -6722160 -5652129 -5885346 -6957690 -8291073
3248 -8291073 -9264964 -9127984 -7181397 -4162573 -1942943 -1332820 -1309621 -1552934 -1979170
3239 -1979170 -1522684 443881 3090917 5583292 7510710 8135297 8041018 8562157 9259917
3230 9259917 8796223 7804299 8138699 10370327 12718680 12741717 10250421 6511843 3300632
3221 3300632 2220748 3464144 5308286 5748476 4990029 4135423 3531648 3408981 3258923
3212 3258923 2290124 700706 -887459 -1505859 -945880 323474 1779599 3330860 5223947
3203 5223947 6812626 7847440 8321778 7636193 6586908 6261493 6058946 5820772 6158602
3194 6158602 6666947 7183019 7768416 8910036 11751667 15676323 19086136 21354026 23757654
3185 23757654 27390293 31322026 33893159 34353500 33686834 33551019 34652643 37027380 40687026
3176 40687026 44853708 49147798 53806316 59006441 65083959 72347730 80669356 88712455
3168 88712455 96112602 104114846 112411451 119468044 123527358 123101276 118957113 113350111
3160 113350111 108623240 105727803 104316647 102006097 95220637 83925834 70596057 57190641
3152 57190641 44882348 34791603 27884491 23571671 19856651 15527758 10172174 4531437
3144 4531437 -519852 -5123652 -8838709 -10084701 -8372814 -5868706 -5017678 -5582755 -6839916
3135 -6839916 -8839116 -9894342 -9017763 -7494091 -7006193 -8303499 -9916245 -10647243 -11025840
3126 -11025840 -11350025 -11419940 -10900309 -9407489 -7858435 -7172187 -7029740 -6952844 -7105202
3117 -7105202 -8027136 -8898801 -8648407 -7479391 -5164419 -1555306 1339817 1601917 -464139
3108 -464139 -3333227 -5821708 -7419963 -8409230 -9626293 -11532174 -13999900 -16974342 -19994784
3099 -19994784 -21664456 -21588085 -21047792 -21351015 -22923486 -25196878 -27493034 -29103349 -29711315
3090 -29711315 -30711040 -32713989 -35617959 -40126248 -47008516 -56004933 -66283251 -77201924
3082 -77201924 -86331936 -90742535 -90285231 -86550140 -80584977 -73185319 -65701366 -60271002
3074 -60271002 -57744360 -57318197 -58766938 -61057751 -61512539 -59352466 -55474153 -51778773
3066 -51778773 -50816816 -51992944 -53294042 -54904766 -57955413 -61968405 -65530269 -68140381
3058 -68140381 -70084469 -72353270 -74757399 -75446943 -72829285 -67159980 -60542438 -54649071
3050 -54649071 -49729269 -45638960 -42231954 -40147803 -40927290 -44823461 -50736770 -57815532
3042 -57815532 -65957666 -76165027 -87677720 -98168349 -105043891 -105932238 -99822196 -88573699
3034 -88573699 -75782734 -63971966 -53721087 -43854448 -34165352 -25865919 -19428305 -14621176
3026 -14621176 -10993335 -7725427 -4249640 -1192168 517398 1091375 736198 -1089138
3018 -1089138 -4227982 -6718077 -6616848 -4299522 -1710936 -544016 -1570958 -4009091
3010 -4009091 -6510629 -8029536 -8413128 -9027470 -10985904 -13850657 -16645340 -18576521 -19615860
3001 -19615860 -20028346 -20052948 -19694733 -18970186 -17424955 -15503517 -14057922 -13229264 -12644128
2992 -12644128 -12215543 -11987830 -11440012 -10644520 -9801672 -8883979 -8230733 -8371910 -8687199
2983 -8687199 -7825198 -5420020 -2367415 -392601 -1012185 -3644664 -5989522 -5990440 -4430413
2974 -4430413 -3541277 -3953225 -4837804 -5340010 -5247169 -4821542 -4417566 -4253502 -4411576 -4828102
2964 -4828102 -5256392 -5119269 -3564164 -822718 1793660 3203749 3393470 2862735 2623104
2955 2623104 3096106 3089976 2322631 713176 -1655629 -4063164 -6570217 -8746050 -9718660
2946 -9718660 -9387871 -8060693 -6529379 -5645101 -6013966 -7711655 -9852396 -11712765 -12667886
2937 -12667886 -11254606 -7601924 -3836224 -1454148 -849907 -1626297 -2417369 -2276951 -1179975
2928 -1179975 102250 181296 -1289504 -3151332 -4782468 -6621118 -8245535 -9131141 -9615203
2919 -9615203 -9450075 -8331477 -6454992 -4081697 -1725818 -1170677 -2800255 -5211441 -7517564
2910 -7517564 -9079857 -9916233 -9492733 -7856970 -5725214 -4540250 -4361582 -3487234 -2278328
2901 -2278328 -1466904 -1077426 -2212641 -5108233 -7789612 -8130666 -6558359 -5493032 -5337722
2892 -5337722 -5224296 -5930753 -8043608 -10474605 -12317616 -13399830 -14122163 -14232889 -13091496
2883 -13091496 -11479118 -10062674 -7701561 -5054943 -4116801 -4071247 -3621584 -3221730 -3070307
2874 -3070307 -3702299 -6029152 -8561548 -8911278 -7100969 -4927245 -3404372 -1821972 698836
2865 698836 3391597 5146883 5932019 5772888 4687104 2308521 -828137 -2963374 -4108652
2856 -4108652 -5378643 -6410331 -6250139 -6010415 -6848792 -7448062 -6018502 -3323016 -2124604
2847 -2124604 -3835982 -6902053 -9422195 -10707422 -11102514 -11585199 -11557041 -9713022 -6635765
2838 -6635765 -4454452 -4260401 -4090321 -1843580 698011 960514 207626 1201517 4162366
2829 4162366 8088234 11054555 11092682 8845331 6872724 6463632 7054756 7803812 7310317
2820 7310317 5493681 4094664 4710311 6044530 5663945 3224673 -538901 -4496098 -8119765
2811 -8119765 -11112841 -12795532 -13971416 -14952503 -14598879 -12613948 -10171588 -8999075 -9329958
2802 -9329958 -10267173 -11220786 -11963952 -12684848 -14016185 -15873970 -16436939 -13742898 -9050274
2793 -9050274 -6774187 -8324867 -10890217 -12707745 -13224740 -12209651 -10318561 -8435145
2785 -8435145 -7704396 -7900050 -7374222 -5441852 -3569982 -3670831 -6000940 -8423608 -8928596
2776 -8928596 -8267609 -8450455 -9693791 -10954795 -12149032 -13591743 -14702330 -14551208 -13718696
2767 -13718696 -12586495 -11268303 -10714906 -11132955 -11754606 -12402070 -14124863 -16897822 -19923031
2758 -19923031 -22285115 -22786464 -21764518 -20283798 -18698920 -17018188 -15510237 -14135611
2750 -14135611 -12896177 -11641023 -10501844 -9950348 -10222903 -11156209 -11374566 -9882386 -7990578
2741 -7990578 -6996740 -6952608 -8203703 -9554874 -8945273 -6756357 -4859542 -3909034 -3541371
2732 -3541371 -3260300 -3985040 -6286286 -8468375 -8965512 -7732773 -6053831 -4582342 -3759863
2723 -3759863 -3673756 -3408435 -2789769 -2506721 -2783481 -2714168 -2205164 -2509424 -3862199 -5237407
2713 -5237407 -5566205 -4640666 -3009649 -1457366 -846977 -1009095 -724701 -877968 -2940122
2704 -2940122 -6079156 -9095563 -11728855 -13444282 -13693757 -12545389 -10287235 -7151396
2696 -7151396 -3444927 -80479 1766508 1237208 -1263072 -4444004 -7442822 -9732907
2688 -9732907 -11375723 -12346652 -12150759 -11212901 -10665785 -11016762 -12204120 -13871039 -14505943
2679 -14505943 -13240709 -11857944 -11704872 -12396555 -12812287 -11760025 -9763756 -8785117 -9028034
2670 -9028034 -9246098 -8845409 -8266656 -8250274 -8239312 -6383542 -3409721 -1870086 -1473475
2661 -1473475 -1304677 -1617409 -1162692 786973 2700138 4078063 4432566 2850278 -724440
2652 -724440 -4842843 -7371549 -8625894 -10526469 -12733579 -13193689 -11723323 -9944168 -8970647
2643 -8970647 -9183692 -10315172 -12146784 -13614030 -13876675 -13341727 -12576211 -11721739 -11039971
2634 -11039971 -10842634 -9950292 -7877201 -4863019 -1471744 380607 -776365 -3701696
2626 -3701696 -6279386 -7582093 -7944631 -8321847 -8940108 -9498673 -9090666 -6924254 -3991452
2617 -3991452 -1737812 -933367 -1947404 -4361968 -7568044 -10284932 -11385901 -11430474 -10699429
2608 -10699429 -8428313 -5678529 -4063306 -3820041 -4770035 -6830926 -9774866 -12739040
2600 -12739040 -14239128 -14177433 -14125925 -14378561 -14085714 -13997000 -15122455 -17041981 -18153584
2591 -18153584 -16423837 -12268160 -8659699 -7621395 -7518731 -6852946 -6193074 -6462296 -7387487
2582 -7387487 -8535750 -10610319 -13610307 -16312829 -17957256 -18466112 -17635028 -15423882 -13016155
2573 -13016155 -11618795 -11159533 -11138122 -11184359 -11379293 -11679453 -11829709 -11123485 -9249572
2564 -9249572 -7668387 -7918655 -9570947 -10801006 -10383226 -8088498 -5014096 -2940089 -2145418
2555 -2145418 -2585697 -4203866 -6600555 -9510051 -11733649 -12333585 -12238565 -12619647 -13461101
2546 -13461101 -14223453 -14939904 -15857533 -16425530 -15999389 -15571464 -15424175 -14860546 -13204898
2537 -13204898 -10331525 -8062751 -8050000 -9335008 -10111486 -9604347 -8550891 -7961775 -7813758
2528 -7813758 -7629530 -7574954 -8216672 -9731336 -12040869 -14564729 -16084462 -17033114 -19158693
2519 -19158693 -23054403 -27653185 -31948669 -35848403 -39370400 -42770503 -46562969 -51623417
2511 -51623417 -57649685 -62456354 -63906428 -61800855 -57487874 -52962027 -48834188 -45256511
2503 -45256511 -42806974 -41538963 -41017331 -40726226 -40431781 -39625343 -37287599 -33426311 -28522302
2494 -28522302 -23383717 -20363149 -20311463 -21381899 -22554888 -23905420 -24455979 -22801944 -20163003
2485 -20163003 -18605895 -17308354 -15648153 -14825021 -15054889 -15619293 -16637509 -17983545 -18583492
2476 -18583492 -17642705 -14645682 -10400472 -7597725 -7419353 -8946522 -11243680 -14250629
2468 -14250629 -18845715 -25111296 -31655476 -36475970 -38331260 -36888287 -32441925 -26148554
2460 -26148554 -20371998 -16736775 -15176293 -15721263 -18007810 -20587664 -21966548 -21416215
2452 -21416215 -19493651 -18348591 -19277532 -20795141 -20173395 -16193427 -10356477 -5284812
2444 -5284812 -3186694 -4090055 -6270270 -7923221 -8581188 -9215379 -10392192 -12543832 -14952741
2435 -14952741 -16142076 -15271771 -12374725 -8769814 -5556016 -3151208 -2861279 -4836906
2427 -4836906 -6709347 -6820575 -5759164 -4930333 -5519401 -7378399 -9222681 -10576096 -12156023
2418 -12156023 -14914500 -18251777 -20372066 -20552031 -18926093 -16528531 -15017528 -14498802
2410 -14498802 -13824710 -13041598 -12930253 -12794217 -11080111 -8324617 -6817089 -7347242 -8581495
2401 -8581495 -10180655 -12622008 -15828342 -19271671 -22493084 -26193078 -30014763 -32584014
2393 -32584014 -34502150 -35899060 -36623124 -37816408 -40255888 -44494233 -49457380 -53268642
2385 -53268642 -55740603 -57222394 -57328422 -56153375 -54654977 -53301437 -50894095 -46884456
2377 -46884456 -42014133 -37563592 -34909982 -33521210 -31975080 -30274802 -28516910 -26515123
2369 -26515123 -24257275 -21234970 -17614018 -14528593 -12017650 -9920807 -9899125 -12752984
2361 -12752984 -16326365 -19105518 -21166208 -21437587 -19755545 -17623283 -15815404 -14165056
2353 -14165056 -12850637 -12016296 -11258412 -10903118 -11345320 -11612086 -10985114 -10500685 -11253147
2344 -11253147 -13139742 -14872546 -15941738 -17324766 -19660187 -22861496 -25971664 -28032628
2336 -28032628 -28965792 -28828676 -27435735 -24777578 -21707889 -18723167 -16198882 -14294140
2328 -14294140 -12273270 -9858452 -8234857 -7763332 -6662125 -4591989 -2792339 -1720895
2320 -1720895 -1198579 -1283039 -2319882 -4256304 -6509478 -7798513 -7166707 -4641567 -420564
2311 -420564 5326527 11839429 18631912 26342471 35388595 46545222 61709158 80067308
2303 80067308 99730551 121220782 144598135 168327855 191065163 210467505 220580461
2296 220580461 213513071 187308709 150183993 112843544 81511759 58108484 42435121
2289 42435121 31796621 22781930 13905792 5857304 -679820 -5622775 -9452647 -12412038
2281 -12412038 -14078532 -14138724 -13029656 -11159439 -8322947 -4863521 -1626287 463987
2273 463987 1610861 2419860 3223842 4234779 5069695 4864286 3194634 856494 -1415114
2264 -1415114 -4214402 -7196501 -8950019 -9536132 -10301253 -11949320 -14231584 -16602726 -18645676
2255 -18645676 -19914620 -19373731 -17020011 -14234144 -11027034 -6603117 -1843952 1943189
2247 1943189 4088104 3892122 1343185 -2344501 -6105527 -8475733 -8634716 -7404844 -5463326
2238 -5463326 -2699752 -435794 -301593 -1554615 -2448481 -2995256 -4549835 -6692514 -7582874
2229 -7582874 -7159435 -6577481 -5706027 -4020361 -1710485 636113 2308887 3320381 3888115
2220 3888115 3359333 1063276 -2313539 -5183298 -6052337 -4442179 -533059 4505296 9529413
2211 9529413 14592114 20085755 26579678 34334574 41985984 46942045 50197180 55005811
2203 55005811 63103982 74402801 86637404 95043363 94879650 86224326 74318093 64463000
2195 64463000 58788570 55411742 51680242 47540547 44564284 43784162 45468279 49496188
2187 49496188 55020604 62366341 72487485 84876736 96662123 103327189 102152134 95331742
2179 95331742 86769388 77780756 68930555 60706284 52845812 44934350 37724562 31643362
2171 31643362 25628681 18894979 12544193 8165358 5608056 3661549 1639014 724651
2163 724651 2062993 5185029 8387949 10212014 11312529 12922517 15436582 17728469
2155 17728469 17456568 13992286 9771370 6687767 4365265 2622632 2209233 3360136
2147 3360136 5299173 7129030 8191893 7690039 6368068 4925135 3837317 4067783 5634195
2138 5634195 7384357 7301883 5597651 4127012 3594331 3196217 2200602 1679280 2552779
2129 2552779 4020123 4365259 3448679 3221142 4712041 7113145 9251901 11279443 13318496
2120 13318496 14557905 15168723 15947850 17026166 18533752 20369716 22639271 26289804
2112 26289804 31609371 37526320 41838047 43822439 45666069 49241115 53758444 57249219
2104 57249219 59803235 63638012 71349912 84105147 101470661 123030529 147650478 173622165
2096 173622165 202234573 235760297 273047576 306014079 321421675 312512547 282980263
2089 282980263 240146804 191938370 147248297 111732456 84643360 63926080 48876024
2082 48876024 37944668 30101613 25393354 22412087 19224893 15817861 13874493 14068083
2074 14068083 15176986 16857738 19467819 21252128 21070586 20495583 20362135 19831322 17890340
2065 17890340 14714740 11485483 9096277 7559627 5942038 4992910 5409953 6266132 8295999
2056 8295999 12461621 18172908 24061828 29451703 33743134 37095131 40712064 44782568
2048 44782568 49356160 54904398 60212684 63748683 66524846 70990587 78748832 89534343
2040 89534343 101268059 110803100 116793246 120920062 124936621 128933084 133587480 140353789
2032 140353789 150541516 166177333 188623156 213131837 229461226 232538658 227489622
2025 227489622 220094905 209066919 189396574 160471590 129299412 102894010 82930265
2018 82930265 68376927 57985300 49961876 43638874 39572046 37804493 37251527 37137086
2010 37137086 37774786 39735793 42811891 46430015 50842148 57016695 66461866 79709321
2002 79709321 96106373 115587077 138650707 163907885 187481191 207390971 226076083
1995 226076083 245685667 263307201 272825071 270132260 253964217 228199082 199755415
1988 199755415 173841448 152971895 135440801 118306550 101093376 84631314 69844838
1981 69844838 57219825 46998321 39198081 33523078 29662382 27018606 24996322 23548971
1973 23548971 22391972 20420602 16546279 11001390 5560167 2627295 2733718 4327981
1965 4327981 5861946 6961606 7637479 7356888 6419913 5309823 4599816 5671347 8378344
1956 8378344 11649178 14440984 16496565 18059438 18432141 17262214 14672936 10864738
1948 10864738 6161002 1682180 -1636819 -3630472 -4636693 -4910863 -4473702 -3252153
1940 -3252153 -1158651 1089351 3025588 4405238 5385285 6106342 6949521 9106331 12515929
1931 12515929 16150476 19229012 22147944 25149745 27324606 28168884 28625442 29440955 30262276
1922 30262276 31025388 32235826 34445137 37783154 41447885 45662918 51488192 60413077
1914 60413077 72341395 85026319 95181759 101565167 107984741 120118701 140586897
1907 140586897 168696319 200599623 227381250 236789117 224980195 202701492 183133055
1900 183133055 171416645 166439802 163661633 155232269 136668241 111877800 87095486
1893 87095486 64985356 47027415 33943446 24477270 16846931 10966995 7675067 6111511
1885 6111511 4456269 2561740 2737018 4928841 7033223 8301734 9292246 10775948 11791384
1876 11791384 10929542 7518694 2286135 -2958060 -6975206 -9491076 -10970617 -11723814
1868 -11723814 -12048944 -13318129 -15603662 -17571057 -18821781 -18953972 -18050155 -17346118 -16912287
1859 -16912287 -15533764 -13748659 -13236110 -13965346 -14269685 -12940561 -10289034 -6950681 -4121634
1850 -4121634 -2856048 -2537618 -1690223 -884738 -1225578 -2635697 -4351671 -5256715 -5512669
1841 -5512669 -5924264 -6483121 -6933525 -7212081 -7038338 -6382917 -5247865 -4080520 -3826560
1832 -3826560 -4167626 -4885727 -6730319 -9566849 -12584898 -15071829 -16562582 -17141606 -16778676
1823 -16778676 -15496945 -13829077 -11940785 -10586405 -10920279 -11982077 -11461224 -9399755
1815 -9399755 -8652228 -9718161 -9944379 -8700990 -7134318 -4848881 -1557169 933736 1583290
1806 1583290 1222492 538446 397286 1284782 2193308 2625078 2703908 2330159 873873 -458746
1796 -458746 -179493 1292109 2996524 3661708 2475905 110065 -1797756 -3463794 -5292595
1787 -5292595 -6887207 -8039690 -9480887 -11008878 -11203110 -9575415 -6836537 -4684864
1779 -4684864 -3348210 -1599619 643975 3112174 5766328 7947940 8597142 7812784 6002515
1770 6002515 3422404 369235 -2426326 -4619338 -7310584 -11140036 -14708623 -16274372
1762 -16274372 -15978584 -14674146 -12982579 -10863359 -8696089 -6951369 -4780785 -1201367
1754 -1201367 3388213 6657452 6553724 4644332 3487652 3823480 4457417 4086630 3918331
1745 3918331 4347281 4553226 5269277 6891065 8273955 8294094 6793833 4329913 2721653
1736 2721653 3371608 5704833 8125390 8725789 6956545 3724110 124131 -3311107 -6637476
1727 -6637476 -8624966 -7900152 -6129145 -5928155 -7535956 -9281626 -10234756 -10477767 -9451029
1718 -9451029 -6669743 -3399707 -1176329 -138983 371682 1256818 3014535 5417398 7950458
1709 7950458 9652370 9214239 7689405 6918925 6180840 4812127 4242458 4797750 5236182
1700 5236182 4814028 4231997 4477847 5778375 6576194 5832969 4685980 3410362 1608296
1691 1608296 -149215 -828593 -580696 -145160 506234 1137929 1392922 2056987 4094814
1682 4094814 6926123 9247446 10060807 9704195 8829520 6628210 4177966 3822178 5129358
1673 5129358 6277282 6029140 4145570 1947131 663378 171987 -575910 -1301770 -1310025
1664 -1310025 -951604 -594083 -188109 -1074506 -3995819 -6994592 -8102617 -7710349 -7010321
1655 -7010321 -6042715 -4442083 -2941162 -3464317 -5630435 -7430969 -8088414 -7700643 -6872579
1646 -6872579 -6808541 -8129103 -10404833 -12453340 -13681599 -14018468 -13249048 -11571594 -9515936
1637 -9515936 -6496359 -2556868 863697 4012296 6757821 7132318 4015004 -1237005
1629 -1237005 -5634246 -7353676 -7149518 -5856057 -3554254 -1009566 777222 2013731
1621 2013731 2865042 2523307 974855 -976110 -3116171 -5702061 -8750038 -11078267 -11567777
1612 -11567777 -10509936 -8894428 -7838631 -7501955 -6602579 -4647443 -2949966 -2635423 -4006133
1603 -4006133 -6673952 -10161618 -12041891 -9892232 -5219993 -1603774 -212317 -263783 -513669
1594 -513669 257053 2968695 7447382 11691015 13648062 13135980 11597814 10815418 10951143
1585 10951143 11578606 13545162 17208566 21342725 24262290 25567880 26069380 26188072 25292057
1576 25292057 23852166 23142136 23736032 25390407 26793096 27411901 27119903 26048159 25043397
1567 25043397 24163822 21968115 18531218 15857380 14357098 12456273 9201044 5255685
1559 5255685 1564855 -55919 889535 2479539 3502689 4324690 4790197 3890690 1542439
1550 1542439 -1100744 -3105356 -3845405 -3016001 -674726 2740762 6243855 8550704 8537951
1541 8537951 6473092 4362106 3356971 2360969 877715 -484790 -1239518 -1209212 -1152203
1532 -1152203 -1869589 -3909696 -6647629 -8721494 -9422786 -8953514 -7794440 -6053229 -3574399
1523 -3574399 -851125 1287924 1381025 -966336 -4554485 -8619245 -12208731 -14021571 -14020511
1514 -14020511 -13629516 -13439259 -13651397 -14575660 -14369552 -11908201 -8920736 -7105186 -6581495
1505 -6581495 -6098227 -5310091 -5356796 -5821204 -5025512 -2839165 -160043 1949445 2718446
1496 2718446 2698275 2146882 708321 -1450173 -3778518 -6151108 -7672875 -8038161 -8091179
1487 -8091179 -7101815 -4807961 -2036987 -160200 1192206 2485302 1984395 232017 -339036
1478 -339036 397297 253465 -1687170 -4670011 -7338542 -8471622 -7875541 -6192349 -4222599
1469 -4222599 -2763860 -2508780 -3603083 -5153204 -5796040 -5941331 -6029481 -4574875 -1271390
1460 -1271390 2298919 4724082 5579053 4286861 1332692 -541061 -128715 1149201 2149144
1451 2149144 3269933 5534900 8784233 10963525 9970576 6256690 3604733 4761855
1443 4761855 8958568 13821338 18021758 21507937 24708952 28351654 33613025 39726632
1435 39726632 45486538 51639359 58969020 68109277 79622431 94822715 114744333 138025391
1427 138025391 160071567 177313088 191696687 206478875 221803311 233094851 237699973
1420 237699973 240196194 246705666 260175177 278734910 294290401 293925143 267735070 221768427
1412 221768427 174096666 136217395 109137804 91073299 80023873 72262992 64013338
1405 64013338 54354321 45577148 40343554 39403330 41689920 45432597 49553308 55290620
1397 55290620 64797497 78659514 97209832 121497238 151795836 185461012 218879558
1390 218879558 251844492 287321051 327791692 366627892 382779134 357315312 297642983
1383 297642983 230009023 173758115 133248054 104171703 81473683 62355636 46552149
1376 46552149 35372827 29581602 27482728 26012879 23112858 19321235 17321321 17168769
1368 17168769 16581562 14792385 12802728 11046631 8829501 6211462 3996682 3159775
1360 3159775 3316055 2474953 269801 -1568105 -1722825 182788 3235293 5691408 6940798
1351 6940798 7358863 7192488 6401564 4112623 -34544 -4276662 -7251662 -8637072 -8138111
1342 -8138111 -6261861 -4063218 -1958412 114400 1903916 2834802 2464051 645009 -2635209
1333 -2635209 -6482376 -9012823 -9733523 -9858668 -10050693 -10574449 -11755860 -12458303 -11385827
1324 -11385827 -9575122 -8887217 -10188060 -12338336 -13911170 -14994011 -15638066 -15643597 -15874771
1315 -15874771 -15863963 -13943785 -10439308 -6736112 -4023973 -3504749 -5708354 -8759189 -10830999
1306 -10830999 -11444892 -10290918 -8106577 -5370057 -2413658 -820321 -1545013 -3058652
1298 -3058652 -3404007 -2775300 -2110039 -2220455 -3594000 -5048957 -5535247 -6279467 -8011303
1289 -8011303 -9642992 -9944442 -9089308 -7516473 -4851144 -1144828 2276599 4690567 6838198
1280 6838198 8666338 9412886 8701881 6391088 3565458 972062 -920665 -1900674 -2765463
1271 -2765463 -3706213 -4289308 -4768862 -5875830 -7583960 -9454778 -10772685 -10777903 -9293301
1262 -9293301 -7489825 -6681744 -6239557 -4769933 -2570124 -1308905 -1257956 -1501442 -2148579
1253 -2148579 -3804478 -5794863 -7086986 -7453199 -7460498 -7013937 -5828264 -4195228 -2499336
1244 -2499336 -873661 291600 860885 903516 -449616 -3052681 -6213610 -8433723 -8698342
1235 -8698342 -8531753 -9917733 -11787293 -12298812 -10326243 -6734128 -4666485 -4815858 -4764019
1226 -4764019 -3563730 -2246780 -1281637 -196594 1257880 2232871 1564621 -493395 -2360955
1217 -2360955 -3494620 -3083270 -704212 1643147 2080284 977677 -434835 -1696441 -2882682
1208 -2882682 -3965518 -4287725 -3480999 -2183643 -513700 1501898 2666352 2824524 3600239
1199 3600239 5053024 5832204 6110290 6941248 8949985 10998159 11003127 8671464 5092484
1190 5092484 1209881 -2773686 -6346422 -8390452 -8651679 -7904569 -6949959 -6416054 -6355193
1181 -6355193 -7120647 -8290040 -8755428 -8383870 -7693102 -6695360 -5075073 -3687989 -3332404
1172 -3332404 -3097083 -1571429 1354442 3812498 4733787 5588064 6130019 4263875 340066
1163 340066 -2510174 -2298223 -116261 1760188 2953152 3571984 3575827 4284943 5077913
1154 5077913 4247785 3239856 3942001 5302993 6766130 8364940 9021001 8307335 6134940
1145 6134940 2899831 -578525 -3374929 -4633867 -4272599 -3815551 -4475878 -5538619 -5830962
1136 -5830962 -5077901 -3348464 -1297777 600333 2261934 2983657 2268669 571847 -772243
1127 -772243 -1170391 -944031 -623671 -814165 -2079075 -3866269 -5719847 -7718756 -8436597
1118 -8436597 -7120986 -5754244 -5887632 -6536346 -6485047 -5952900 -5214671 -4976306 -6337919
1109 -6337919 -8747427 -10774734 -11996970 -12963789 -12986028 -11143579 -7890540 -4338078 -1253871
1100 -1253871 723205 1783063 2989668 4832375 6547247 6489850 5278328 4629069 4958784
1091 4958784 6101037 7289341 8472433 8848397 7579890 5868243 4829116 5000020 5504160
1082 5504160 4986504 3736181 1946878 -823681 -4301446 -8015908 -10672529 -11620634 -11315197
1073 -11315197 -9706618 -6597783 -3253348 -1221689 -780337 -1705967 -3560053 -5481313
1065 -5481313 -6399140 -5742954 -4213285 -3280279 -3936206 -5960377 -7530855 -6461234 -2241877
1056 -2241877 2844288 5823999 7195314 8755017 10256901 9838297 6832758 2531476
1048 2531476 -969575 -2904172 -3910803 -5142429 -6822586 -7207905 -5736548 -3634115
1040 -3634115 -2320802 -2136884 -2032633 -1486663 -1243756 -1559191 -2471625 -3902492 -5005971
1031 -5005971 -5126818 -4306587 -2259814 1211763 5099833 7250129 6898438 4805549 2653526
1022 2653526 1309387 583577 343527 71452 -520289 -1824186 -4376173 -8052761 -11659545
1013 -11659545 -13677906 -13246262 -10587161 -7253674 -4607321 -2517212 -953911 -415847
1005 -415847 -1051320 -2193502 -2492147 -2371288 -2837611 -4219360 -6578476 -8029838 -6386107
996 -6386107 -2625280 994493 3223208 3658228 3228315 3371624 3901416 3668894 2214823
987 2214823 -33099 -2741285 -5681277 -7730288 -8575907 -9149501 -10567366 -12130959 -11813376
978 -11813376 -9877360 -8052398 -6938518 -6728918 -7481332 -8272077 -8566042 -9153861 -9862764
969 -9862764 -9666829 -9378786 -9766219 -9483261 -7796416 -5052207 -1207367 3128448 6512051
960 6512051 7224329 4892293 1949381 291536 -215104 244411 723296 856944 1740954
951 1740954 3772120 6353271 8686598 10800287 12658359 13324946 12482735 11293440 10559454
942 10559454 9317792 7016285 4543039 2689772 2507557 3873842 5211746 6237502
934 6237502 7454075 8486489 8022638 5767253 2802537 428011 -472819 -363756 -268985
925 -268985 -423315 280384 2448266 5331416 7854443 8886846 7909091 5744533 3278343
916 3278343 1222260 118157 -824098 -2123441 -2339650 -414074 2605645 4784475 5979588
907 5979588 7019320 7860202 7872797 7165070 7344317 8869827 10384183 9606788 6454348
898 6454348 2893342 686465 660545 1697735 1917974 1054447 936032 2113911 2994664
889 2994664 2402831 1080978 -136059 -913490 -373040 1895882 3431227 1998830 -196095
880 -196095 -453736 1154855 2907491 3839772 4300308 3695956 1965357 298239 -916124
871 -916124 -2190675 -4270087 -6717664 -7973449 -7416920 -4872489 -1108797 3046688 6740237
862 6740237 8552674 7910466 6181219 4926515 4114019 3805073 3437258 1845754 -574837
853 -574837 -2026017 -2377698 -3157447 -4500696 -5198356 -5338566 -5571541 -5606817 -4922246 -2959477
843 -2959477 -10550 2753006 5043320 6378061 6491902 6579847 7702009 9731538 12101147
834 12101147 14148814 15477167 15813279 14432587 11180952 7311129 3886058 1998516
826 1998516 1189277 333236 -797717 -2369917 -4076048 -5201757 -4280038 -1243425 1396510
817 1396510 1779139 403117 -1488175 -4007275 -7169671 -9323644 -9521056 -8288101 -5672228
808 -5672228 -2787074 -743185 450257 578536 -234638 -833240 -720332 -204975 704529
799 704529 1738161 2341536 2460938 2551531 2321569 2630440 4495695 6482588 7192185 7303031
789 7303031 7400390 7278029 6745331 6290043 6596787 7392324 7641191 6941796 6165726 6060016
779 6060016 6721211 7606448 7973579 7722484 7386880 7196731 6413814 5368213 4827943 4165674
769 4165674 2483899 949307 936006 1299618 1012611 1560375 4275840 7643673 9198090
760 9198090 8746527 7285459 4715672 337974 -4998916 -9409172 -12196075 -13790916 -15235506
751 -15235506 -15862692 -13514803 -9403295 -7027512 -5870446 -3317245 -170623 1282206
743 1282206 187416 -2812597 -5664430 -7239644 -8166820 -8494726 -8225494 -8137350 -7975858
734 -7975858 -6439890 -2957892 1687748 6800934 10649880 11790153 11307189 10650727 10701535
725 10701535 11453305 11589196 10148960 7918132 5642044 2826247 -956568 -4778003 -6749855
716 -6749855 -5740299 -3029731 -467003 798231 604670 -1085343 -3242177 -4450046 -4555252
707 -4555252 -3306268 -1058773 1168298 2995339 5138563 7584972 8576678 8021567 7686638
698 7686638 8307953 9476943 9846379 8425722 6066163 3729450 1514851 1191335 3433311
689 3433311 6047104 6361678 4143941 1718846 404121 -286554 7004 1846355 4983044
680 4983044 8215003 8699541 6629264 4758825 4103100 3322059 2304536 2507188 3641667
671 3641667 4536331 4867961 4595115 3459168 1618329 490063 719414 1240693 910090
662 910090 19882 283768 2583145 5826371 8412571 9614096 9174938 7775497 6831091
653 6831091 6301881 4629519 1217453 -3270973 -7249775 -10022091 -11590983 -11699065 -10551107
644 -10551107 -7928611 -4340316 -1376723 110736 615195 511531 -145998 -689775 -238361
635 -238361 465809 544255 796624 2348489 4954066 6560530 5482275 2389456 -838467
626 -838467 -2827451 -3123359 -1834357 -7085 1508903 2230284 990392 -2237235 -5704156
617 -5704156 -7800706 -8083211 -6951880 -5293219 -4185051 -3774421 -2819072 -1151670 -311710
608 -311710 -2037185 -5601328 -8200304 -8976079 -9044132 -8601287 -7210888 -4401651 474361
599 474361 6227161 10516862 12232646 11604906 9207401 5746621 1771672 -2699798 -6699423
590 -6699423 -8989576 -9686851 -9143204 -7762196 -6411625 -4456617 -1736301 867310 3241479
581 3241479 5943825 8508266 9491631 8966029 9120670 10409547 11260734 10549474 8907578
572 8907578 7943609 7816981 8291979 8822347 7995482 5636600 3152013 2651861 4885034
563 4885034 8223409 10523702 11861114 12893207 12766903 11410761 10165397 9911097 10780117
554 10780117 11966206 12167865 10458312 6412896 979094 -4288874 -7470272 -7405351 -5662478
545 -5662478 -4145595 -2840201 -1953036 -2674812 -4899003 -7201611 -8159088 -7110198 -4473048
536 -4473048 -1442528 491245 959615 735102 760668 1732000 2980433 2852462 1188662
527 1188662 -853576 -1867168 -1281400 -67757 400861 -487834 -1878706 -3123726 -4053988
518 -4053988 -4894643 -6131617 -6911376 -6084176 -3113000 848662 3293745 3590463 3818636
509 3818636 5417618 7056964 6699476 4405490 1820058 340661 375817 1335536 3170829
500 3170829 5375021 6190438 5394563 4330446 4239565 5106996 5947250 6408079 6334545 5535202
490 5535202 4887699 4833817 4504977 2962443 1068652 -226134 -792865 -577407 -30220
481 -30220 1181941 3290700 5280617 6734858 7938066 9551634 11544127 13197774 14036137
472 14036137 13580744 11510923 8147650 4673416 2585449 2520837 3745981 4661810 4896546
463 4896546 4965237 5414025 6198843 6332105 5267678 3850635 3155386 2935638 2430322 2344703
453 2344703 3531026 4918332 5379465 5131341 5886732 9168934 14027501 18568406 21057249
444 21057249 20828096 18844795 17039340 16848152 17948826 18595454 18575079 18424951 18116637
435 18116637 18095704 18076321 16561702 12730716 7964358 4742081 3687905 3849270 5068014
426 5068014 7660405 10727390 12610604 13145090 12694746 12323472 12799824 13239375 12814358
417 12814358 12162198 12455449 13774741 14912270 14707176 13531873 12059811 10011876 6778113
408 6778113 3523096 1920547 348009 -2110911 -4446671 -6269009 -7735342 -7998840 -5862456
399 -5862456 -1790641 3176139 8098713 11164067 12138259 12792456 14316765 16420837 18512715
390 18512715 19936192 19939446 17944632 15057737 13097170 12429184 12745133 12196830 9396346
381 9396346 6020083 3357226 1079837 -781924 -1180143 195438 2655987 5656901 7559679
372 7559679 7101020 5390858 4641806 5711169 7752198 9533486 10606206 11135408 11739716
363 11739716 12333362 12367436 11942998 11258689 10791108 10656960 11730732 14200120 15836104
354 15836104 15133637 14701960 15803338 15740525 12731327 7777363 2747231 -1365133 -3755838
345 -3755838 -4076557 -3351043 -2370436 -965915 430781 1117217 793602 84396 -147116
336 -147116 403683 1487636 2375486 2949678 3737870 4562457 4801465 4731274 5164802 6511254
326 6511254 8754151 11464466 13172013 12656778 10131221 7290213 6062959 6756677 7793082
317 7793082 8287455 8655447 8554069 7644733 5870710 3337932 1079469 -147173 -792708
308 -792708 -1174386 -1316643 -786792 691385 2613355 4542283 5560729 5450827 5090868
299 5090868 4540810 3816648 3135163 3132449 3277619 2705429 1878771 1045736 419612 1013260
289 1013260 2695578 4952095 7680651 9686087 9545897 7748676 6089120 5430987 5814276
280 5814276 5893478 4569354 3242994 2909684 2502714 1363599 897394 2176108 5510447
271 5510447 10109368 14327697 17541387 19831135 20867358 20314822 18773289 16977074 15375228
262 15375228 13590057 11833177 11738626 13174840 13861422 12529693 9730702 6946964 5555138
253 5555138 5565880 6475324 8013765 10375158 13056492 15121230 17348030 19870107 21231268
244 21231268 20685115 19681959 19556141 18883886 16555429 13502620 10790739 7762248 3788840
235 3788840 -349668 -3405569 -5127030 -5301025 -4106927 -2745384 -1156675 1312026 3952732
226 3952732 5196766 5190953 5088152 5183381 5116544 4123248 2274653 1004476 787279 1353698
216 1353698 1690545 461800 -1767497 -3060776 -2906724 -2225684 -1045731 453457 1067730
207 1067730 99234 -1612026 -2555556 -3198218 -3616167 -2208568 826350 3535489 5348309
198 5348309 6158032 5459071 4433006 3950431 3444074 3207518 4063874 5697935 7169414
189 7169414 7990312 9586903 12463197 14587905 15274012 16360972 19035831 21747166 22080951
180 22080951 20229387 18141848 16630105 15524133 15103955 15547407 16382144 16337284 14499557
171 14499557 11712025 9226355 8197309 9149845 11036600 12238202 11980285 10385488 8135393
162 8135393 6047779 4439763 2406537 1458572 3542677 6841984 9197230 10501268 11007117
153 11007117 11159484 11670898 12458698 13193909 14059551 15065508 15175174 13663103 10626691
144 10626691 6779032 3008068 710150 586831 841728 322711 12585 834674 1894859
135 1894859 2062177 1749230 1201206 174437 -492033 45821 1070117 1324718 288450
126 288450 -1167520 -1363141 183250 3283077 7229048 10454896 11495324 10343228 8684507
117 8684507 7732935 7370595 7351546 7066409 6837589 6879655 6618479 6947994 8622231 10073915
107 10073915 9916701 8655882 7293705 6848110 8114522 10455743 12179694 12796452 12973530
98 12973530 13375269 14367979 14846179 13843722 12180300 10557437 8375132 5469811 2757883
89 2757883 1126891 972925 2232243 4732082 7569441 9286737 8808822 6767279 4530051
80 4530051 2905954 2835193 4768975 7380148 8897037 9453225 10623935 12143353 12486337
71 12486337 11047611 9124225 8881710 10509868 12404369 13216851 12369031 10432802 8517315
62 8517315 7657230 8045640 8773296 9229194 9543930 9940475 10066031 8944247 7078001 5604477
52 5604477 4342926 2882906 1369522 236107 553334 2705782 5347237 6852105 6550125
43 6550125 5549067 4971795 4600194 4576233 5226499 6178698 6651962 6599656 7116815 8448277
33 8448277 9362713 9676423 10113081 10313695 9104585 6439908 4612363 5465686 8086323
24 8086323 10639926 11809900 10816155 8656820 7054844 6371664 5942349 5386893 5166844
15 5166844 5114808 4607621 3670542 2865602 3125104 4681978 6654752 8452079 9956826
6 9956826 11241470 12789205 14214750 14109815 12103951 9736551
0 9736551
$$ Imaginary data points
##PAGE= N=2
##DATA TABLE= (X++(I..I)), XYDATA
16383 -3872106 -6025288 -8330939 -10136681 -10577079 -9708200 -7872682 -5567658 -3352687
16375 -3352687 -1628472 -1285660 -2354562 -3418032 -3300904 -2094409 -478507 1347355
16367 1347355 3669218 6178492 8039056 9259990 10152562 10243299 8668002 6052600 4170244
16358 4170244 3508862 3376383 3094238 2687354 2679931 3551212 4801801 5737505 6347602 7254918
16348 7254918 8563623 9289967 8992420 8194769 7153498 5877602 4699311 4124225 3748904
16339 3748904 3031438 2324455 1744725 1048635 31716 -1169636 -2782353 -4222325 -4227876
16330 -4227876 -2675228 -776068 217007 795411 1939858 3779822 5360557 5550909 4435986
16321 4435986 2710796 975652 -114088 -223190 -653100 -2566192 -5574181 -8864777
16313 -8864777 -11959486 -14242568 -14301655 -11668610 -7310285 -2611649 1133543 3302687
16305 3302687 3675614 2291393 426486 -1064620 -1815673 -1651715 -1332843 -1422904 -1712401
16296 -1712401 -1428802 -696245 119471 1379864 3087560 4121777 4221313 4326657 4319132
16287 4319132 3658525 2573201 1425013 1108667 2487802 5287973 7653267 7922546 6049684
16278 6049684 3913056 3242203 3358143 3126267 2655805 2484277 2478082 1354152 -1163314
16269 -1163314 -3768435 -5954895 -7425723 -7577427 -6499202 -5166334 -4214863 -3465929 -3096383
16260 -3096383 -2664678 -1228795 1090338 3531755 5195988 5376511 4441419 3080723 1300644
16251 1300644 -813367 -3030519 -5301063 -7301382 -7934660 -6740693 -4220657 -932227
16243 -932227 2345957 5079243 6827339 7724113 8063576 8381366 9148188 9264517 7696892
16234 7696892 5180631 2963326 1816390 1904598 2642588 3460378 3690105 3113799 2115163
16225 2115163 1517280 1567161 1616842 796687 -149016 1512150 5183652 6833158 5021056
16216 5021056 1782995 -305279 -40561 1881261 3663834 3787547 2487244 1034444
16208 1034444 -114819 -1360999 -2913341 -4188389 -4677898 -4034604 -2418990 -411749
16200 -411749 1847360 4149307 5912418 7027322 7506491 7095632 6351329 5892599 5526748
16191 5526748 4379529 2758383 2711459 4288406 5522069 5568487 4404255 2269600 379536
16182 379536 -607623 -906596 -1155649 -1830906 -3086004 -4594089 -5881908 -6905107 -8021162
16173 -8021162 -8855958 -8716169 -7053735 -4370709 -2452352 -1998200 -2538771 -3340635 -4032166
16164 -4032166 -4583402 -4923703 -4812414 -4294887 -3690638 -2668809 -922541 296968 622478
16155 622478 1390322 2222107 1557661 -930986 -4046871 -6700713 -8621427 -9809981 -10089067
16146 -10089067 -9192048 -7051871 -4131222 -1463783 350775 641948 447677 1060836 1557593
16137 1557593 1830926 2692739 3472428 2744107 819688 -904811 -1470048 52960 3531063
16128 3531063 6914256 8296718 7821363 6759768 5597974 4784770 4206413 3325180 2415010
16119 2415010 2188204 2324752 961218 -1912089 -4311055 -4747888 -3346612 -1498095 -451588
16110 -451588 -104593 -82151 -327164 -409284 -820560 -1836918 -2487831 -3713464 -6335738
16101 -6335738 -9471176 -12023223 -12844840 -11396591 -8140052 -4011855 930051 6165582
16093 6165582 9159362 8541417 5667930 2802377 1740947 3404181 6936070 10045161
16085 10045161 12227086 14629809 17151078 19002135 20617359 22178016 22714740 21314094
16077 21314094 18365885 15062575 12316579 10204723 8370712 6400780 4658887 3646825
16069 3646825 3156660 2869730 2500636 2082404 2148078 3545006 5674257 8050822 11070121
16060 11070121 14205760 15967790 15673268 14545803 13547447 11927878 10310437 10431534
16052 10431534 11617606 12179956 12401083 13709365 15143695 14880621 12551598 8943440
16044 8943440 5382030 2330460 652281 815192 2200877 3539024 4332580 5397299
16036 5397299 6589459 6475764 4314474 1684860 -127561 -1918792 -4020245 -5637020
16028 -5637020 -6050959 -5091952 -3303680 -1008294 611257 -47780 -1796545 -2409904 -1341159
16019 -1341159 582493 1818333 2321938 2796073 2745489 1583218 546297 878621 1529026
16010 1529026 2392595 4624195 7397845 8809205 8996011 8988324 8190587 5240768 235619
16001 235619 -4880313 -7340325 -6747858 -5257607 -3946676 -3085629 -3099358 -3877351 -4814201
15992 -4814201 -4113165 -1090205 2615777 5457340 6618285 6895285 7119207 6942936 5924195
15983 5924195 4465762 2767032 456482 -1743780 -2765583 -4046191 -6802231 -9132855
15975 -9132855 -9877490 -9689348 -8906174 -7508847 -6294865 -6175101 -7154128 -8571117 -9075709
15966 -9075709 -8754813 -9290806 -10727891 -11416977 -10956582 -9860569 -8548628 -7748408 -7125451
15957 -7125451 -6234492 -5768940 -5464490 -4187820 -1874373 1104873 4874302 8253237 9747108
15948 9747108 9164352 6705660 3193925 -354756 -2626638 -2583664 -1037243 981549 2797099
15939 2797099 3410757 3176929 3574386 4641960 6097487 6769450 5671645 4739211 5042907
15930 5042907 5506874 5102215 4463604 4836015 5618083 5928116 6517150 7373954 7976524
15921 7976524 8628430 8248866 5904594 2388048 -80344 108013 2453423 5656396 8556004
15912 8556004 11084352 13128697 12911061 10005990 6554472 3707399 1417842 -204797
15904 -204797 -818808 -997750 -1489343 -1446016 -7239 1460937 542648 -3204630 -7833483
15895 -7833483 -10730520 -10618019 -8394555 -6079311 -5242644 -5381119 -4657541 -2815578 -869130
15886 -869130 265227 918009 1731924 2967863 4960378 6651166 6991407 5614405 2732926
15877 2732926 -31265 -994226 502922 3166263 4587227 3866918 1963387 227730
15869 227730 -898774 -1250998 -1465648 -1093181 337090 1187457 1569633 3398617 6550827
15860 6550827 8863298 9192942 7505722 4351757 780428 -2995413 -6301708 -8005083
15852 -8005083 -8179268 -7794356 -7797274 -7981592 -7836745 -7733096 -7593986 -7043270 -6534894 -5958013
15842 -5958013 -5112811 -4306751 -3583492 -3707990 -5604154 -7718473 -8571856 -8886793 -9309319
15833 -9309319 -9333707 -8270010 -6782164 -5453382 -4627305 -4853515 -5951032 -7064104 -7145014
15824 -7145014 -4938198 -1116616 2451516 5572930 8086199 9432092 9136293 7452563
15816 7452563 5866441 4590284 2783148 1093518 617136 1061620 989411 -473157 -1930362
15807 -1930362 -2727012 -2558331 -879286 557093 88668 -1026044 -1130693 -656403 8414
15798 8414 1008345 2218191 3749957 5668653 7829218 9596276 10400518 10155253 8584033
15789 8584033 5742954 2511291 -51152 -989221 -895835 -1400063 -2290696 -2323894 -995635
15780 -995635 782460 2227380 3506951 5029581 7172856 9105958 9476476 7949546
15772 7949546 4948847 2414272 2182411 4690672 7752822 8943125 8778818 8110184 6850496
15763 6850496 5369005 4203940 3233692 1937847 415990 -815211 -2664301 -5994863
15755 -5994863 -9684475 -11490804 -10224369 -6760093 -3936503 -3217829 -3607543 -4014445 -3672865
15746 -3672865 -2934636 -2486155 -2598681 -3524592 -5797670 -9353238 -11850834 -11519767 -9245016
15737 -9245016 -6599120 -4691221 -3409097 -1969917 641152 4039962 5560240 4585833
15729 4585833 3029421 1770667 1076448 1655902 3115628 3748536 3717151 4541540 5998383
15720 5998383 5968993 3968231 1298361 -1099870 -2743524 -2974626 -1914930 -1181917 -2222956
15711 -2222956 -4934605 -7855638 -9425326 -9132128 -7451370 -5118084 -1906695 2000598
15703 2000598 4904430 6520114 7303312 6746934 5236382 3821303 2982544 2532873 2096613
15694 2096613 2178387 2561843 2174381 937227 -706975 -2601987 -3962853 -4183368 -3616554
15685 -3616554 -3121203 -2861492 -2458352 -1994182 -1821267 -2569010 -5067015 -9082159 -13016279
15676 -13016279 -15273042 -15666656 -15131377 -14472702 -12933889 -10606465 -9254239 -8527467 -7644233
15667 -7644233 -7025480 -5800831 -2864826 1180156 5246852 8333795 10391729 11237304
15659 11237304 9800113 6355623 3106120 1058946 -18527 -323302 60395 993877
15651 993877 2048413 3057901 2831396 1084923 -591089 -1418648 -1454564 -840977 102996
15642 102996 1609247 3077936 3585531 4144153 5442971 6567084 5700894 2532779 -497226
15633 -497226 -2339418 -3007120 -2311614 -1839144 -2821011 -4422148 -5847179 -6403800 -6486022
15624 -6486022 -6851300 -7258728 -7266344 -7228180 -7393423 -7633274 -7643394 -7251472 -5780041 -3046100
15614 -3046100 -593892 199135 -53151 -283732 -829726 -1035311 -500518 687595 1683180
15605 1683180 1000215 -1236995 -3865904 -6258367 -7854632 -7404335 -5172322 -2453273
15597 -2453273 347903 3041890 6058348 10064368 14129549 16257817 15633313 12888210
15589 12888210 9165640 5246669 1954646 637648 1879317 4000428 5091703 5067905
15581 5067905 4531370 3387670 2016536 971015 219539 -159115 142977 874809 1493670
15572 1493670 2126204 2793074 3113295 3068546 3165948 4109958 5831554 7499079 8292493
15563 8292493 7533029 4633193 250924 -3885639 -6682220 -7947624 -7609602 -5775667
15555 -5775667 -3637748 -2598219 -2249585 -1019599 560109 932985 -250356 -2674163
15547 -2674163 -5942803 -9396411 -11535660 -10730759 -6967771 -2415646 -91796 -1246250
15539 -1246250 -4379636 -7542127 -10334328 -12411166 -13266029 -13969698 -15197622 -15483599 -13524183
15530 -13524183 -10144952 -7020452 -5219050 -4281932 -3090153 -1974880 -1339398 -1195044
15522 -1195044 -2171141 -4135955 -6409404 -8653318 -9911277 -10538069 -11539448 -12546957
15514 -12546957 -12749682 -11143822 -8011944 -5299682 -4222235 -5311672 -8247365 -10784951
15506 -10784951 -11023517 -8929572 -5260476 -1979062 -425707 204001 567323 642753 391118
15497 391118 -680470 -2774227 -4734139 -5372233 -5147525 -4098959 -1942246 532529 2440063
15488 2440063 3131095 2144213 -111885 -1292917 -293497 2087452 4811536 6706970 6806693
15479 6806693 4952851 2157036 -660408 -2562906 -2188662 899960 5136654 8413538
15471 8413538 9539107 8578763 6367990 4425740 2935066 1059144 -1458547 -4838643
15463 -4838643 -8296701 -10649879 -11616349 -11334931 -9081606 -5166879 -1334435 1511418
15455 1511418 3907032 6107382 7020260 5244379 1708742 -884778 -804046 1710133 4411720
15446 4411720 5651431 6106295 6922270 8774500 11020407 11715046 10834020 10089704 9607270
15437 9607270 8285797 5926133 3835578 3348065 4061315 4734003 4582785 4089196 3876846
15428 3876846 3365894 2051080 1160635 1736167 2706474 3474164 4550294 5816146 7376403
15419 7376403 8946238 9767968 9104569 6617783 3463155 1167717 363926 440641 1712839
15410 1712839 4548591 7682736 9528691 9262914 6669367 3268400 748862 -670907
15402 -670907 -1256081 -1601636 -2472164 -3921523 -4601727 -3084237 -86576 3150710 6567645
15393 6567645 9781539 12301653 13431822 12600578 11724610 12566600 13938488 13813902 11647082
15384 11647082 8818775 6870057 6052814 6016661 5501864 3856351 2582523 1629222 216209
15375 216209 -252159 1333998 2976553 3042298 1981256 374675 -1377176 -2703152 -3608867
15366 -3608867 -3782215 -2860311 -1532896 -811756 -1695913 -4442733 -8571136 -12693312 -14883177
15357 -14883177 -14548949 -11964229 -8001798 -4646998 -3243225 -3813531 -5174138 -6094905
15349 -6094905 -6419872 -6649110 -6352914 -4675854 -1499464 2216510 4514449 4512297 3093442
15340 3093442 1624094 270047 -1680916 -3810435 -4887247 -4912759 -5136617 -6775445 -9260646
15331 -9260646 -10735550 -9737644 -5667510 -714947 1585092 1257232 135586 -1163948
15323 -1163948 -2320148 -3240378 -3638586 -3017203 -1598248 -605321 -1072611 -2305682 -3005920
15314 -3005920 -2491713 -755362 1231367 2635689 4028788 6252785 8904634 10281125
15306 10281125 9537064 8116802 7616470 8419430 9265441 8438453 6223937 4324203 3525395
15297 3525395 2735368 1975418 2517052 3587650 2986765 534338 -2039846 -3309817 -3087765
15288 -3087765 -1877381 -122290 1724879 2736440 2469439 1206820 -170339 -1099809
15280 -1099809 -1500470 -996628 421986 2030328 3194631 3310874 1458530 -1159408 -2623422
15271 -2623422 -3018931 -3430663 -4549560 -5297507 -4769114 -4159223 -3607099 -1955745 543261
15262 543261 2927307 4625890 5668710 6470250 7452137 8090401 7652190 6755844 5621423
15253 5621423 4690418 4659157 4825980 4002295 2733556 2571936 3135796 2449725 560122
15244 560122 -327582 875254 2466593 2709407 1901223 454077 -1673501 -4005058 -7133325
15235 -7133325 -10607778 -12965530 -14258684 -14793150 -14736333 -14061729 -12323054 -9494635 -5616812
15226 -5616812 -1447650 1133676 2066950 2146463 2023684 2024656 1482972 -1138750 -5380290
15217 -5380290 -8904453 -11069720 -12433148 -12508504 -11646520 -10814889 -9975960 -9000716 -7515260
15208 -7515260 -5361209 -2740685 -763934 -337452 -1126696 -2548813 -4412845 -6052948
15200 -6052948 -7053710 -6580733 -4184844 -1338159 341226 482348 -873790 -2806395
15192 -2806395 -3590426 -1888569 1311340 3987922 5817811 7402042 8362618 7932813 6635110
15183 6635110 5764718 4969579 2430046 -1718188 -5932125 -8790282 -9957608 -9536664 -7539018
15174 -7539018 -5041115 -3473287 -3025839 -2830272 -3169623 -5223915 -8463993 -10699889 -10240907
15165 -10240907 -7361136 -4124543 -2505706 -2100063 -730668 1076031 1025492 -724511
15157 -724511 -2224555 -1812598 393402 2193554 1275526 -1930083 -5148613 -6635151 -5914462
15148 -5914462 -3378591 -247905 1627195 2127891 3819130 6515752 7114150 5051861
15140 5051861 2431455 -85843 -2134506 -2865796 -3254333 -4413029 -6101105 -7419932
15132 -7419932 -7449823 -5872756 -3646849 -1874292 -1269172 -1540270 -1689887 -1418443 -599817
15123 -599817 636467 1477369 1192182 29698 -1290349 -2664387 -3934010 -4259124 -3962575
15114 -3962575 -4081673 -4189274 -3187531 -1720692 -1250334 -1988336 -2990710 -3489122 -3091839
15105 -3091839 -2105244 -107202 2848648 5443209 6390736 5535953 4617130 5124696 6723219
15096 6723219 8074760 8788418 9383200 9832040 9466413 8933579 8736347 8035037 6190324
15087 6190324 3425254 982547 94147 1139022 3430357 5681858 7480250 9400543
15079 9400543 11254031 11561232 9207499 5074943 1070128 -1358433 -2288595 -3126464 -3624237
15070 -3624237 -3376128 -3486262 -4486521 -5887683 -7064373 -7572744 -7962565 -8769015 -9449231
15061 -9449231 -9421897 -8548886 -6547936 -3091045 783837 3025047 3404747 3107296 2743563
15052 2743563 2394633 1832111 728327 -220715 -241327 829683 3187536 6239912 8318268
15043 8318268 8207185 6385495 4498302 2838398 1340483 1299077 2733228 3931009 4632906
15034 4632906 5234831 5814676 6404545 6412974 4834171 1888289 -1086820 -2933355 -3049460
15025 -3049460 -1835378 -79574 1613210 2967449 3409983 3131400 2275088 1173129 720216
15016 720216 1314021 2208972 2063658 832832 -126529 -397157 -832646 -912385 170850
15007 170850 1754061 2536905 1658221 238259 -338315 -88404 489579 611044 -40146
14998 -40146 -666057 -195506 746401 1284766 1201247 308771 -708538 -790390 106368 1458013
14988 1458013 2938789 3549778 2825410 1042828 -1990301 -6465011 -11420341 -15463579
14980 -15463579 -17500655 -16651052 -14209020 -12631549 -11979920 -10653167 -8809855 -7617533
14972 -7617533 -6881066 -6738635 -7142174 -6763993 -5267877 -2433085 1390559 4349224 5274321
14963 5274321 4124146 1577085 -1551926 -4490528 -5952567 -5144670 -3003995 -1047181
14955 -1047181 52271 356150 608829 1277221 1637836 908361 -498133 -1657180 -2697383
14946 -2697383 -3849264 -4238465 -2805072 -310403 2456978 5042908 6445071 5391094
14938 5391094 2568615 401919 -357982 -592744 -1474177 -3473046 -6111657 -8771203 -10678245
14929 -10678245 -10641542 -8421869 -5842513 -4149848 -2895819 -3234442 -5641332 -8175770
14921 -8175770 -9570603 -10123581 -10018402 -9214838 -7717728 -5662793 -4350419 -5124425 -7316156
14912 -7316156 -9264990 -9879701 -8822968 -7171268 -6624614 -6778161 -6436869 -5776708 -5562245
14903 -5562245 -5804153 -6144564 -6250432 -6533549 -7766972 -9613170 -10440198 -9757438 -8380953
14894 -8380953 -6564523 -4651992 -3040124 -1548657 289770 1772969 2363265 2633750
14886 2633750 3421092 4881078 6135408 6350047 5922355 5194129 3992479 2517770 1122467
14877 1122467 744350 1621182 2367702 2143336 1048816 248860 1000459 2775104 3980154
14868 3980154 3373345 1940010 1725326 2874097 3282713 1685398 -505399 -1692509 -1849219
14859 -1849219 -1159146 509782 2809636 4693220 5294602 4112386 1330202 -1531267
14851 -1531267 -2487925 -1151907 961736 3231327 5613886 6533495 4709077 1894677
14843 1894677 -451130 -2884835 -4999854 -5345432 -4505438 -4552128 -5414161 -5469047 -4388358
14834 -4388358 -3176383 -2156581 -943533 331938 1290868 1390194 -234822 -3278922 -6878377
14825 -6878377 -10451352 -13211676 -14873332 -15479878 -14972413 -14335777 -14850664 -16526723 -18082703
14816 -18082703 -18237865 -17238962 -15572701 -12618238 -8183725 -4473836 -2742604 -2123910
14808 -2123910 -1349084 389190 2266214 3207074 3157215 3616292 5524723 7886058 9153674
14799 9153674 8777059 6757462 2850133 -2169272 -6246105 -7938800 -7802470 -6836086 -5729370
14790 -5729370 -4455163 -2658721 -679139 1325673 3277819 5051283 6844076 8934530
14782 8934530 11143329 12297016 11802385 10612381 9673978 8574008 6138581 2509944
14774 2509944 -1449819 -4805514 -6347067 -5549041 -4320785 -5256763 -7479199 -8586806
14766 -8586806 -8166912 -7067364 -5957924 -5254305 -5517270 -6333394 -7062254 -7636748 -8057050
14757 -8057050 -7871482 -6397638 -3443659 -382356 1010302 1567346 2342904 2074698 -324691
14748 -324691 -3738273 -6219275 -7125872 -7294678 -7266950 -6722552 -5873386 -6092061 -8160595
14739 -8160595 -10343139 -10013812 -6822567 -2323105 1886659 4327330 4653277 4128702 3329023
14730 3329023 2557444 2193337 1586962 64722 -2005349 -4297512 -6202449 -6361358 -4755887
14721 -4755887 -2207234 480189 2591814 3815246 4135583 4437779 5665541 7076529
14713 7076529 7211268 5631294 3038152 -82785 -3111187 -4492244 -3010018 -386253
14705 -386253 -117772 -1906285 -3804368 -5129967 -5842830 -5074686 -3116979 -1626893 -1421006
14696 -1421006 -3118495 -6095302 -8718205 -9405819 -7813411 -4600639 -847532 2227638
14688 2227638 3775421 3574867 2054052 204161 -1871431 -4392255 -6710125 -7415311
14680 -7415311 -5944885 -3423632 -1775505 -2393054 -4419290 -5568767 -5069702 -5056544 -7354886
14671 -7354886 -10497894 -12229602 -11993653 -10280336 -8536064 -7549477 -6257986 -3485129
14663 -3485129 927574 5597795 8521527 8848303 7173301 5564679 4715676 4205245 4274006
14654 4274006 4459707 3978201 3076597 2956451 3969729 5453866 7295610 9164503 9845760
14645 9845760 8595263 5741203 2265059 -564770 -1951174 -1877719 -942652 354216 2017710
14636 2017710 3677232 4629045 5397977 5816883 4621223 1973694 -289136 -743456 54136
14627 54136 908845 1345831 1542528 1908484 2136893 1885516 1071144 172412 642744 1966370
14617 1966370 2155832 1507020 1959307 3742550 5328337 6124428 6505450 6282860 5527437
14608 5527437 4810047 4123503 2697788 333331 -2671482 -5226717 -6072857 -5573646 -4538830
14599 -4538830 -3456857 -3139914 -3183679 -2876693 -1731198 -9996 1402642 1654220 -175058
14590 -175058 -3967882 -7935041 -10846391 -12674218 -14095618 -15732199 -16680702 -15893878 -13951002
14581 -13951002 -12246455 -11797464 -12278237 -12898520 -13718108 -13378407 -10892068 -8919618 -8873865
14572 -8873865 -9315676 -8634526 -6425723 -3364851 -477871 1505068 2244870 1438170 -821948
14563 -821948 -4080601 -7364521 -9443985 -9686562 -9318460 -8583042 -7148123 -5923687 -5458994
14554 -5458994 -5344528 -5629893 -6398252 -8098698 -10839304 -13592908 -15083323 -14492038 -11826750
14545 -11826750 -7911771 -4921564 -3047701 -985966 1247671 2720951 2851213 2040352
14537 2040352 521618 -1596517 -3067355 -3508986 -4087635 -5220662 -6384619 -6639679 -4820095
14528 -4820095 -578263 4066670 6885735 7935327 7531773 5009587 1113106 -2856605
14520 -2856605 -6519225 -8946323 -8800157 -7363136 -6124564 -4446447 -1682100 2166336
14512 2166336 5027588 4826353 2517631 773636 197568 -974723 -2990460 -4991250
14504 -4991250 -6557096 -7937913 -8638628 -8110135 -7180311 -6903219 -7945100 -9791994 -10298558
14495 -10298558 -8934896 -7203079 -5557546 -3655757 -1290409 1101310 3243473 5173152
14487 5173152 5608707 4363994 2545915 1362862 1593304 2498078 3013898 3222542 3570812
14478 3570812 3424342 2004565 -241788 -2366440 -3500546 -3296736 -2335602 -1514180 -815475
14469 -815475 343305 1653160 2730955 3605814 3418982 1307998 -1258824 -2186097 -770913
14460 -770913 1763536 3714738 4849587 6264507 8209588 9966718 10778668 10184469 8278650
14451 8278650 5843435 3887611 2802537 1707765 653767 279186 491662 1118738 1352071
14442 1352071 293677 -1500734 -2862807 -2699826 -167962 3453308 5626776 5225990
14434 5225990 3099346 380913 -1862119 -2105323 453152 4452576 7639673 8705432
14426 8705432 7284154 4355785 1649796 -832956 -3439415 -5733103 -7434651 -8835610
14418 -8835610 -10126962 -10608689 -9567865 -7577135 -5639012 -3349411 -372573 2745853
14410 2745853 5278754 7168650 8752350 9947821 10631409 10802620 10449703 9914363 9388084
14401 9388084 8675646 7309316 5552472 4104828 3675944 4003729 3548053 2903271 3547220
14392 3547220 4168010 3547041 2573133 2125241 2213447 3140271 4397157 4746726 4352055
14383 4352055 3641389 3149381 3356876 3193386 1386978 -1423729 -4066986 -5922389 -6729904
14374 -6729904 -6157659 -3732873 306754 3616705 4469675 4587554 5851626 7584063 7590347
14365 7590347 6140465 4887820 4554474 4894074 5116457 4917534 3747820 1691442 541683
14356 541683 2101247 6396589 10857945 12863081 13102049 12807793 11597934 10252709 9559454
14347 9559454 8947689 7872597 6469828 4942108 3729908 3048831 2298493 1612995 1448939
14338 1448939 1325005 205705 -2000155 -4161701 -5143136 -4426084 -2893352 -1712527 -1855337
14329 -1855337 -4042298 -6756942 -7754297 -7085573 -6630347 -7349398 -7972222 -7046539 -5552941
14320 -5552941 -4758069 -4305327 -2971070 -1391586 -894775 -1892142 -3600147 -4254034 -4203584
14311 -4203584 -4418728 -4024751 -2342124 459063 3293121 5038106 5439713 5473145 6280926
14302 6280926 7702178 8107819 7171907 6080346 4968097 3338768 1541801 714935 1511956
14293 1511956 2802702 3445390 2812181 1186275 -1679141 -5143911 -6857944 -6271315 -4633699
14284 -4633699 -4130065 -5789047 -8664718 -10511452 -10140142 -8730398 -7325063 -5634458
14276 -5634458 -4200149 -2908030 128100 4701075 8521347 10258931 9570408 7032617
14268 7032617 4597289 4444524 7163490 10886167 13087654 12813572 11094446 10003383
14260 10003383 9915989 9210838 6941028 3387720 -1156778 -6210118 -10381216 -12722658
14252 -12722658 -15112849 -18148652 -19570972 -18534359 -16621818 -14977669 -12563306 -9316788
14244 -9316788 -7397334 -7166963 -7430344 -7156366 -5825676 -4323973 -3385439 -2487352 -2267866
14235 -2267866 -2858696 -2674941 -1656355 -449593 803417 1938364 2594326 2120143 216366
14226 216366 -1921205 -2615929 -1741061 52601 1618903 1576035 -276601 -3099881 -5693899
14217 -5693899 -7453247 -9495177 -12938754 -16955817 -18493849 -16084961 -11393839 -6398474
14209 -6398474 -2839360 -486301 1793944 3874796 6170056 9018005 11632686 13356187
14201 13356187 14155408 13873389 11976416 8371546 3740014 -349912 -2682144 -3215500
14193 -3215500 -2499353 -1274212 -682170 -1383661 -2404497 -3108861 -3828138 -4363725 -4364622 -4005993
14183 -4005993 -3402575 -2512012 -1041904 624789 1615665 2038668 2675747 3742902 4656790
14174 4656790 4481127 3733456 3812806 4464114 4199456 2327099 -49880 -2211402 -4223092
14165 -4223092 -5674539 -5793087 -4617890 -2658217 223563 3220844 4890225 4122452
14157 4122452 900221 -2571103 -4605469 -4509080 -3361005 -3427333 -4479888 -4771543 -4445586
14148 -4445586 -4200128 -4045501 -4388815 -6029153 -8599403 -10379663 -10119487 -8061583 -5964675
14139 -5964675 -5524216 -5525255 -3709944 -177785 3103258 4779757 4864277 4357347 3637285
14130 3637285 2671513 2476775 3139218 4961131 8371010 12354275 14884889 14653047 12813157
14121 12813157 10842839 8860850 6109505 2318238 -883977 -2176366 -2157807 -2185479 -2758547
14112 -2758547 -3648670 -4871956 -6310536 -6905507 -5822190 -3473400 -908168 1418452
14104 1418452 3228750 4356241 4807114 5415831 6861264 8596228 9946179 9713206 7541694
14095 7541694 5177104 5061508 7780743 11372808 13714096 14514992 13920770 12630250 11737625
14086 11737625 10628441 8172568 5214969 3478768 3068691 2705922 1405688 -611535
14078 -611535 -1697440 -745037 462179 856599 1340254 2406801 4683270 7241731 8025769
14069 8025769 7692087 7796511 7220229 5091812 2613390 1203109 712804 483228 1775453
14060 1775453 5047812 8185837 9462435 9294228 8265971 6462526 4161198 2489385
14052 2489385 2775606 4052413 3531178 238758 -3664182 -6087753 -6809684 -6584385 -6214462
14043 -6214462 -5594231 -4533754 -4030444 -4550212 -5357495 -5943459 -5845150 -5371775 -4797992
14034 -4797992 -3503279 -2053010 -2120971 -4535863 -7725169 -10263888 -12838793 -15280548
14026 -15280548 -15477416 -12674011 -8236732 -4205164 -1614083 122761 721773 245090
14018 245090 462335 2903266 5949054 6681322 5282676 3706996 2756615 2308199 2290505
14009 2290505 2302549 2015726 939299 -641895 -1380500 -1018724 -78561 1176878 2572557
14000 2572557 3923435 5064461 5842825 6698568 7066237 5835677 3788050 2020041 1129530
13991 1129530 2039702 4128225 5457416 5325019 4620883 4733008 5275400 5833056 6433244
13982 6433244 7174976 8344001 9440233 9717577 8444621 5989717 3985353 3064056 2917349
13973 2917349 3872297 5031524 5059849 4413790 3008023 1252644 200252 -489484 -1419020
13964 -1419020 -2537721 -2657373 -2020661 -2304852 -3679312 -5458699 -6270582 -5541133 -4919721
13955 -4919721 -5044774 -4897050 -3786271 -2088663 300208 3571987 6180223 6936855 6467250
13946 6467250 5599348 4849943 4690404 5195564 5619052 4871720 2889416 382424 -1681332
13937 -1681332 -2347201 -1814915 -791392 -5496 212129 467251 571924 222789 -307562
13928 -307562 -879549 -1533300 -2089291 -2432114 -2014177 -729778 1235341 3369720 4688421
13919 4688421 4407732 2661383 685588 -1120285 -2639926 -2608391 -1142662 216736 1016943
13910 1016943 2220322 4016978 5199296 5718755 5762521 4645381 1777082 -1590153 -3959710
13901 -3959710 -5043306 -5545973 -5999243 -6226108 -5897981 -5034488 -4766468 -6007669 -8005812
13892 -8005812 -9584391 -9600282 -7972262 -5399870 -2739065 -1313698 -700189 -204124 -717800
13883 -717800 -2520442 -5681398 -10107859 -14345467 -16113784 -14410524 -10115231 -5296242
13875 -5296242 -2142589 -1228625 -1554377 -2416419 -3131807 -2656694 -1373495 344813 2755537
13866 2755537 5147104 6094752 5682325 5152005 4694335 4103599 3470276 2640995 661124
13857 661124 -2514455 -5033073 -5179442 -3112674 -343681 1559685 1395985 -992476 -3580218
13848 -3580218 -4880688 -5050850 -5012603 -6206978 -8800853 -12114387 -16013222 -20540310 -24529142
13839 -24529142 -26070875 -25192795 -23318960 -20655860 -17385070 -14589412 -12366497 -10562291
13831 -10562291 -9590875 -9075185 -8556647 -7633740 -6025728 -4483009 -3726958 -3774331 -3732086
13822 -3732086 -3311737 -3394370 -4405650 -5172573 -4615233 -3417785 -2683564 -2604003 -2409535
13813 -2409535 -2119606 -1611482 -1071292 -1475798 -3218285 -5511892 -7508425 -7204733 -3591085
13804 -3591085 -140788 821214 817166 1322650 1985512 2545312 3281181 3809569 3335322 1156893
13794 1156893 -1749402 -3929860 -5841083 -8814018 -12581389 -15721854 -17146100 -16941833
13786 -16941833 -15893545 -14461370 -13048213 -12189805 -11634518 -10161962 -6769095 -2421457
13778 -2421457 491938 574948 -1357486 -3177718 -4101237 -4406622 -3323478 -1129059 83898
13769 83898 -480431 -1469854 -1779190 -1547892 -1572250 -2433619 -4002686 -5713893 -6925013
13760 -6925013 -7741321 -8272454 -7653035 -5919144 -4614348 -4068154 -2306186 1633598 5829632
13751 5829632 8908832 10971172 12234809 12968987 12834790 12626467 13257644 14112567 14042230
13742 14042230 12483980 9750993 7672586 7670801 8335253 8016744 6588629 5399902 5143199
13733 5143199 5071163 4676577 3979030 2772521 1246766 -54057 -728796 -667911 34820
13724 34820 1160233 3117205 5636001 6889529 5747716 3149741 471383 -1533508
13716 -1533508 -1803336 -435763 949000 1623196 1515797 104218 -2664020 -5699653 -7823267
13707 -7823267 -8304059 -7042729 -5536275 -4795265 -4575975 -4809786 -4392132 -3017299 -2348967
13698 -2348967 -2623702 -1638441 1308398 4218679 5737090 5777020 4285675 1552106 -1880285
13689 -1880285 -4888815 -5905754 -5528637 -4883045 -3993951 -2791510 -594867 2267918 3793282
13680 3793282 3278047 1666840 -421842 -2538335 -4306990 -4961559 -4832503 -4946377 -5270464
13671 -5270464 -4681268 -2300888 1350344 5493559 9223959 11205287 10957692 9879538
13663 9879538 9628925 9817390 9223447 8046386 7172927 6722742 7033260 7951011 9072641
13654 9072641 9604679 8310679 5461296 2173658 -356124 -1676656 -2393673 -3740588
13646 -3740588 -5900372 -6573886 -4200230 -380305 3035186 5797983 8477546 11240615
13638 11240615 13259158 14738713 15362159 14706245 14011896 14060820 14799660 16038828 17889587
13629 17889587 19179322 18429460 14978872 10242449 6532075 4523878 4138312 4736890
13621 4736890 5579297 5949565 5549668 5172731 5750283 7141345 9090969 10608211 11116283
13612 11116283 11068898 11056256 12224997 14407383 15851266 14920887 12337588 10058352 8751272
13603 8751272 7307790 5260656 3629508 2340379 1126573 541845 164646 -849031
13595 -849031 -2229777 -3305907 -3309507 -1456050 1657935 5238850 9051730 11846676 12112688
13586 12112688 9988663 7291355 5327148 3897569 2993095 2703955 3170189 4717911
13578 4717911 6382711 6762241 6348071 6329746 6084397 4514048 2650158 1234095 -61033
13569 -61033 -1520663 -2240284 -1825784 -1261821 -1125430 -1462934 -1956612 -1984310 -983830 209759
13559 209759 976931 1569127 1011538 -744166 -2620591 -4390145 -5949093 -7095876 -7094437
13550 -7094437 -4878870 269616 7751298 15040655 20014428 21786078 20637707 17756708
13542 17756708 14133585 10677650 8288739 7539153 7907798 8267921 8311362 8551454 8805925
13533 8805925 8442979 7105991 5007313 2220137 -655156 -2323652 -3262146 -5295044
13525 -5295044 -8160346 -9695542 -9677864 -9021802 -7640478 -5773710 -3979298 -2165263 -212217
13516 -212217 863632 780385 -291899 -2448435 -4571475 -6060814 -7623685 -10228202 -13209767
13507 -13209767 -15406801 -16790054 -17087318 -15715645 -13046086 -10651209 -9228319 -7611482
13499 -7611482 -5035688 -1719357 2076780 6116672 9960206 13166722 15506925 16795164
13491 16795164 17389399 17104501 15454455 12877070 10241385 7878452 5629444 3511903
13483 3511903 1516152 -230010 -1897403 -3982379 -6378944 -8732411 -9787897 -8854922
13475 -8854922 -7116646 -5725462 -4443209 -2944944 -1823750 -1784805 -2113641 -1464034 156517
13466 156517 2398174 4698660 5462393 4053789 2199535 1563954 2130480 3511500 4919488
13457 4919488 5594205 5725705 5749855 4332496 1058922 -2668747 -6307101 -9725341 -11812955
13448 -11812955 -11057879 -7378007 -2858985 -242724 -121441 -965834 -1357279 -846032 759215
13439 759215 2429264 2802140 2353015 2068553 1690363 1233179 1601272 2868155 3972141
13430 3972141 3829625 2779473 1851971 1231040 860413 339690 -253797 -445344 -420592
13421 -420592 -221358 -7316 -356084 -1730210 -3649838 -4569349 -4332045 -3962679 -3852036
13412 -3852036 -4460961 -5909110 -8002863 -10232920 -11476494 -10729273 -7814053 -4627027
13404 -4627027 -2980240 -3060136 -3686788 -3322575 -2606672 -2545719 -2913164 -3067410 -2668714 -1904500
13394 -1904500 -772006 615382 1857448 2282380 1958743 1406127 558989 -1131507 -3757644
13385 -3757644 -6060229 -6542278 -5344442 -3621679 -2221308 -1444988 -959487 -76940 487569
13376 487569 273534 -214915 -1280198 -2653051 -3356661 -2234449 746024 2779724 2344689
13367 2344689 1649264 2599992 5239026 8561727 9893370 7349088 2506954 -1589198
13359 -1589198 -3449547 -3720992 -3204777 -2949919 -2918086 -1847411 -211098 340782 -92792
13350 -92792 -544223 -793933 -1110155 -1792657 -2146657 -1815943 -1275816 -1391138 -2286682 -3284318
13340 -3284318 -4812784 -6393422 -6071008 -3782698 -1571201 -514423 -169457 4481 193013
13331 193013 194989 677017 1317633 1017676 -108797 -1489990 -2929043 -4331357 -5065077
13322 -5065077 -4775237 -3637727 -1890337 453084 2961169 5225463 7182620 8293661
13314 8293661 7880959 6499430 5560225 5456866 5773914 5797959 5162129 4548687 3664712
13305 3664712 2539666 1575497 1073575 1229518 1898357 3356779 5234181 6130464 6158946
13296 6158946 6492032 7600831 8773235 9378380 9213674 7595805 4624148 1122897 -2462342
13287 -2462342 -5446926 -7300355 -8641978 -9581002 -9527026 -8001188 -5224146 -1792143 2176155
13278 2176155 6673741 10645568 12506200 10936259 5990981 1078386 121523 2885718
13270 2885718 6354913 8760604 9887554 9725781 8793956 7702589 5985968 3329189
13262 3329189 1108308 23101 -527783 -1472760 -2653435 -3251658 -2492619 86885 3530004
13253 3530004 5345014 4412900 3228190 3326611 3824760 4493835 5514538 5690425 4775370
13244 4775370 3700517 2816208 3273090 5370024 8409170 11946911 15210298 17179232
13236 17179232 17351833 16215003 14794698 13278071 11429025 9568271 7636007 5702466
13228 5702466 4513234 4077612 3929132 3980098 4574876 6337321 9033514 11389367 12283509
13219 12283509 11676750 10955759 10983740 11558319 12423495 13297575 13502903 12309066 10097250
13210 10097250 8414297 8253752 9276163 10555522 10283400 8353511 6289880 4797063
13202 4797063 3977596 3031544 1989602 1467320 591296 -478915 -650417 271827 1858936
13193 1858936 3309677 3968065 4337058 4539161 4154437 3349876 2362440 1108879 -885005
13184 -885005 -2762853 -2776857 -828503 1968210 4561912 6267487 7015498 6880852 5892627
13175 5892627 4036171 2297818 1253377 565076 19178 -418445 -538598 -1054960 -2857564
13166 -2857564 -5191339 -6385974 -5623071 -3635478 -1789771 -198385 394043 -742449
13158 -742449 -1621545 -267125 1753986 2186546 1287463 -269232 -2955947 -5872216 -7000244
13149 -7000244 -6676101 -7001371 -7886004 -8504680 -8927935 -8916364 -8359840 -7633795 -7160743 -6202173
$$ [...]
##END NTUPLES=NMR SPECTRUM
##END=
