##TITLE=dept_DE-14HK2_HCl CH-,CH3- -up, CH2- -down
 D2O, 2100 sc
 30.10.2023
##JCAMPDX= 6.0         $$ Bruker NMR JCAMP-DX V2.0
##DATA TYPE= NMR SPECTRUM
##DATA CLASS= NTUPLES
##ORIGIN= UXNMR, Bruker Analytische Messtechnik GmbH
##OWNER= root
$$ XWIN-NMR		Version 3.5
$$ Mon Oct 30 16:14:14 2023 Russian Standard Time (UT+4h)  she@DPX200
##.OBSERVE FREQUENCY= 50.327992884445
##.OBSERVE NUCLEUS= ^13C
##.ACQUISITION MODE= SIMULTANEOUS
##.ACQUISITION SCHEME= undefined
##.AVERAGES= 2101
##.DIGITISER RES= 17
##SPECTROMETER/DATA SYSTEM= spect
##.PULSE SEQUENCE= dept135
##.SOLVENT NAME= CDCl3
##.SHIFT REFERENCE= (INTERNAL, CDCl3, 0, 214.665)
##AUDIT TRAIL= $$ (NUMBER, WHEN, WHO, WHERE, WHAT)
$$ ##TITLE= Audit trail, XWIN-NMR		Version 3.5
$$ ##JCAMPDX= 5.01
$$ ##ORIGIN= Bruker BioSpin GmbH
$$ ##OWNER= she
$$ F:/spectra/data/she/nmr/depta/1/pdata/1/auditp.txt
$$ ##AUDIT TRAIL=  $$ (NUMBER, WHEN, WHO, WHERE, WHAT)
(   1,<2023-10-30 16:13:16.37 +0400>,<she>,<DPX200>,
      <created by zg, POWCHK disabled, PULCHK disabled
       terminated by command 'halt'
       configuration hash MD5:
       00 E9 B6 7A A2 85 ED C7 34 08 36 98 17 FE 4E 26
       data hash MD5: 16K
       B6 49 C5 BC 19 EF 1C 2A 00 96 48 13 B0 A9 DE C4>)
(   2,<2023-10-30 16:13:19.09 +0400>,<she>,<DPX200>,
      <Start of raw data processing
       efp BC_mod = 2 LB = 3.5 FT_mod = 6 PKNL = 1 PHC0 = -3719.215 PHC1 = -1059.6 SI = 16K 
       data hash MD5: 16K
       DA 91 44 FD 3B 5E F2 12 65 7D 54 E7 F3 B1 26 EB>)
(   3,<2023-10-30 16:13:43.87 +0400>,<she>,<DPX200>,
      <pk PHC0 = -6.626646 PHC1 = 13.2 
       data hash MD5: 16K
       0C 52 B2 55 96 FF 17 05 AD A1 B8 CB 7C 3D AF 20>)
(   4,<2023-10-30 16:13:49.70 +0400>,<she>,<DPX200>,
      <abs ABSG = 5 
       data hash MD5: 16K
       86 35 86 73 CF DC 7A 83 70 2E 30 47 25 CB D9 AD>)
$$ ##END=
$$ 
$$ hash MD5
$$ 92 DD 7E D3 95 16 D2 95 80 60 90 BA 5D 9A 32 2A
##$RELAX= 
##$RELAX= 
##$RELAX= 
##$RELAX= 
##$RELAX= 
##$RELAX= 
##$RELAX= 
##$RELAX= 
$$ Bruker specific parameters
$$ --------------------------
##$DU= <F:/spectra>
##$EXPNO= 1
##$NAME= <depta>
##$PROCNO= 1
##$TYPE= <nmr>
##$USER= <she>
##$AMP= (0..31)
100 100 100 100 100 100 100 100 100 100 100 100 100 100 100 100 100 100 
100 100 100 100 100 100 100 100 100 100 100 100 100 100 
##$AQSEQ= 0
##$AQ_mod= 1
##$AUNM= <au_zg>
##$AUTOPOS= <>
##$BF1= 50.322709
##$BF2= 200.13
##$BF3= 200.13
##$BF4= 200.13
##$BF5= 200.13
##$BF6= 200.13
##$BF7= 200.13
##$BF8= 200.13
##$BYTORDA= 1
##$CFDGTYP= 0
##$CFRGTYP= 5
##$CHEMSTR= <none>
##$CNST= (0..31)
1 1 145 1 1 1 1 1 1 1 1 1 1 1 1 1 1 1 1 1 1 1 1 1 1 1 1 1 1 1 1 1 
##$CPDPRG= <>
##$CPDPRG1= <waltz16>
##$CPDPRG2= <waltz16>
##$CPDPRG3= <>
##$CPDPRG4= <mlev>
##$CPDPRG5= <mlev>
##$CPDPRG6= <mlev>
##$CPDPRG7= <mlev>
##$CPDPRG8= <mlev>
##$CPDPRGB= <>
##$CPDPRGT= <>
##$D= (0..31)
0 2 0.003448276 0 0 0 0 0 0 0 0 0 2e-05 0 0 0 0 0 0 0 0 0 0 0 0 0 0 0 
0 0 0 0 
##$DATE= 1698662201
##$DBL= (0..7)
120 120 120 120 120 120 120 120 
##$DBP= (0..7)
$$ [...]
##$SUBNAM2= <"">
##$SUBNAM3= <"">
##$SUBNAM4= <"">
##$SUBNAM5= <"">
##$SUBNAM6= <"">
##$SUBNAM7= <"">
##$SUBNAM8= <"">
##$SUBNAM9= <"">
##$SW= 219.3118970423
##$SWIBOX= (0..15)
0 1 3 0 0 0 0 0 0 0 0 0 0 0 0 0 
##$SW_h= 11037.527593819
##$TD= 16384
##$TD0= 1
##$TE= 0
##$TE2= 300
##$TE3= 300
##$TEG= 300
##$TL= (0..7)
120 120 120 120 120 120 120 120 
##$TP= (0..7)
150 150 150 150 150 150 150 150 
##$TP07= 0
##$TPNAME0= <>
##$TPNAME1= <>
##$TPNAME2= <>
##$TPNAME3= <>
##$TPNAME4= <>
##$TPNAME5= <>
##$TPNAME6= <>
##$TPNAME7= <>
##$TPOAL= (0..7)
0.5 0.5 0.5 0.5 0.5 0.5 0.5 0.5 
##$TPOFFS= (0..7)
0 0 0 0 0 0 0 0 
##$TUNHIN= 0
##$TUNHOUT= 0
##$TUNXOUT= 0
##$USERA1= <user>
##$USERA2= <user>
##$USERA3= <user>
##$USERA4= <user>
##$USERA5= <user>
##$V9= 5
##$VALIST= <valist>
##$VCLIST= <CCCCCCCCCCCCCCC>
##$VD= 0
##$VDLIST= <DDDDDDDDDDDDDDD>
##$VPLIST= <PPPPPPPPPPPPPPP>
##$VTLIST= <TTTTTTTTTTTTTTT>
##$WBST= 1024
##$WBSW= 2
##$XGAIN= (0..3)
0 0 0 0 
##$XL= 0
##$YL= 0
##$YMAX_a= 1174857
##$YMIN_a= -1329739
##$ZGOPTNS= <>
##$ZL1= 120
##$ZL2= 120
##$ZL3= 120
##$ZL4= 120
##$ABSF1= 214.6655
##$ABSF2= -4.669434
##$ABSG= 5
##$ABSL= 3
##$ALPHA= 0
##$AQORDER= 0
##$ASSFAC= 0
##$ASSFACI= 0
##$ASSFACX= 0
##$ASSWID= 0
##$AUNMP= <proc_1d>
##$AZFE= 0.1
##$AZFW= 0.1
##$BCFW= 0
##$BC_mod= 2
##$BYTORDP= 0
##$COROFFS= 0
##$CY= -3
##$DATMOD= 1
##$DC= 0
##$DFILT= <>
##$DTYPP= 0
##$F1P= 0
##$F2P= 0
##$FCOR= 0.5
##$FTSIZE= 16384
##$FT_mod= 6
##$GAMMA= 0
##$GB= 0
##$INTBC= 1
##$INTSCL= 0
##$ISEN= 128
##$LB= 3.5
##$LEV0= 0
##$LPBIN= 0
##$MAXI= 10000
##$MC2= 0
##$MEAN= 0
##$ME_mod= 0
##$MI= 0.4000791
##$NCOEF= 0
##$NC_proc= -2
##$NLEV= 6
##$NOISF1= 120.0001
##$NOISF2= 80.00006
##$NSP= 0
##$NTH_PI= 0
##$NZP= 0
##$OFFSET= 214.6655
##$PC= 4
##$PHC0= -3725.842
##$PHC1= -1046.4
##$PH_mod= 1
##$PKNL= yes
##$PPARMOD= 0
##$PSCAL= 0
##$PSIGN= 0
##$REVERSE= no
##$SF= 50.3227091
##$SI= 16384
##$SIGF1= 140
##$SIGF2= 120
##$SINO= 80
##$SIOLD= 32768
##$SREGLST= <13C.CDCl3>
##$SSB= 0
##$STSI= 16384
##$STSR= 0
##$SW_p= 11037.527593819
##$SYMM= 0
##$S_DEV= 0
##$TDeff= 16384
##$TDoff= 0
##$TI= <>
##$TILT= no
##$TM1= 0
##$TM2= 0
##$TOPLEV= 0
##$USERP1= <user>
##$USERP2= <user>
##$USERP3= <user>
##$USERP4= <user>
##$USERP5= <user>
##$WDW= 1
##$XDIM= 16384
##$YMAX_p= 297661744
##$YMIN_p= -206846983
$$ End of Bruker specific parameters
$$ ---------------------------------
##NTUPLES= NMR SPECTRUM
##VAR_NAME=  FREQUENCY,     SPECTRUM/REAL,   SPECTRUM/IMAG
##SYMBOL=    X,             R,               I
##VAR_TYPE=  INDEPENDENT,   DEPENDENT,       DEPENDENT
##VAR_FORM=  AFFN,          ASDF,            ASDF
##VAR_DIM=   16384,         16384,           16384
##UNITS=     HZ,            ARBITRARY UNITS, ARBITRARY UNITS
##FACTOR=    0.67371834180669, 1,            1
##FIRST=     10802.5493505904, 0,            0
##LAST=      -234.978243228581, 0,           0
##MIN=       -234.978243228581, -206846983,  0
##MAX=       10802.5493505904, 297661744,    0
$$ Real data points
##PAGE= N=1
##DATA TABLE= (X++(R..R)), XYDATA
$$ [...]
6934 1160349 1042705 847259 661156 833392 961937 401249 283142 1206360 2695578
6925 2695578 4351211 6377470 8648300 10064431 10284313 9459175 7914863 6014253 4011972
6916 4011972 2260807 512796 -1114615 -1970436 -1202455 1424777 5517842 9572840 11733629
6907 11733629 11727521 10535268 9164932 7383579 5188150 3091754 859382 -1194409 -2113267
6898 -2113267 -1721964 -1044280 -206182 731238 620409 92634 436052 1593140 2629464
6889 2629464 2042870 14026 -2102020 -3710493 -4122416 -2888464 -564771 886643 770448
6880 770448 153134 -553012 -1839979 -3523384 -4615062 -5184990 -5655789 -5902826 -5114187
6871 -5114187 -3531297 -2589795 -2424217 -1769961 203704 2421360 3474897 3929951 5349490
6862 5349490 7672354 9971548 11040270 10753101 10681034 10743136 9798332 8021259 6296996
6853 6296996 4894307 3848830 3479397 3704319 4497091 5874586 7855199 10093626 11487485
6844 11487485 11262740 9145530 6325314 4429206 3391464 2371971 1078481 -98900
6836 -98900 -757027 -838139 -433951 240645 1315545 3230407 5382948 6220673 4872301
6827 4872301 2798088 2197412 3497535 5627737 7450602 8619094 9257938 8786044 7084757
6818 7084757 5284519 3965860 2615664 991648 -311801 -294566 990647 2337787 3436615
6809 3436615 4524665 5594571 5860513 5205875 3923221 1875950 -128462 -1216135 -2069439
6800 -2069439 -3347162 -4175587 -4100641 -3463712 -2741184 -1810206 77193 2637003 5079714
6791 5079714 7068579 9136958 10951772 11368133 10220657 9041459 8848784 8970871 8633362
6782 8633362 7821546 6754999 5850747 5230478 4548385 3192138 1535586 1876715 5044987
6773 5044987 9526674 13144944 13978933 12442241 10958577 10163479 8818389 7125135 6290717
6764 6290717 6256298 7157992 9071773 10732408 10888245 9636740 8295566 7771504 7394187
6755 7394187 6254946 4521374 3339540 4045266 5926598 6689104 6584792 7068321 7567391
6746 7567391 7270407 6007657 3896143 1173625 -1135786 -1860104 -1218235 117060 1606784
6737 1606784 2187634 1829816 1949440 2688151 3044840 2874304 2458609 1118887 -1421661
6728 -1421661 -4120945 -6951298 -10496285 -13730688 -15427524 -15525657 -14849854 -13543472 -10893586
6719 -10893586 -6392062 -804279 4193208 7155480 8213798 7948702 7016607 5514779
6711 5514779 2602154 -287147 -1799331 -2903668 -4049403 -5101452 -6120632 -6808494
6703 -6808494 -7285010 -8581922 -10647749 -11892422 -10527923 -6796642 -2410153 1356510
6695 1356510 3021095 2534087 1469605 795901 631281 1276606 3443811 6966344 10600399
6686 10600399 12922896 13037822 11303174 9863593 10433438 12038791 13302947 14479312
6678 14479312 15675180 15889159 13804100 9108289 3635553 -94930 -1751731 -2827294
6670 -2827294 -4655611 -7224976 -10286964 -13507918 -15489194 -14964175 -12225143 -8919236
6662 -8919236 -6211351 -4059660 -1973403 -457997 -191363 -516100 -760119 -1236627 -2743389
6653 -2743389 -4303967 -3305255 200006 4636673 8512207 10276139 8970440 4924205
6645 4924205 -198998 -4588568 -6785658 -6593692 -4685310 -2384311 -985842 -653858 -1318161
6636 -1318161 -2085085 -2373518 -1752371 589807 3751762 6203900 7445186 7927423 7926200
6627 7926200 7484053 6010731 3472121 563531 -2103745 -4002773 -5527956 -6685663
6619 -6685663 -6603775 -5747951 -5554417 -6018929 -6654601 -7184184 -7135820 -6656270 -6201041 -5949945
6609 -5949945 -6819491 -9143221 -11594084 -12014753 -10064626 -7339861 -5053474 -3205251 -1909869
6600 -1909869 -1872276 -3434833 -5562386 -7088169 -8227300 -8941272 -8285256 -6580235 -5513714
6591 -5513714 -5490936 -5771959 -5736112 -4959383 -3658071 -2734506 -1841536 -431237 896104
6582 896104 1888922 2404960 2360675 1881248 1217184 1296505 1596098 512584 -1357102 -2674853
6572 -2674853 -3500692 -4876722 -6609148 -7296082 -6711367 -6042124 -6327399 -7306811 -8365846
6563 -8365846 -9157412 -9824167 -10198109 -9574921 -8094503 -7019049 -7187516 -7927705 -8089624
6554 -8089624 -7417897 -6462300 -5646490 -4761353 -3687254 -2427226 -100434 2887488 4912085
6545 4912085 5040067 2782335 -951991 -4557767 -7263650 -8684050 -8576990 -7497449 -6166649
6536 -6166649 -4825963 -3410166 -1046913 2329766 5368591 6441591 5802317 5484296 5518417
6527 5518417 5681147 6925069 8953587 10495581 10873061 10569168 9903989 8399379 6365331
6518 6365331 4265543 1751741 -623786 -1923566 -2099621 -1554326 -1112309 -923697 -565822
6509 -565822 -380760 449433 3183658 6888168 9583173 9671969 7336759 3930597 -191258
6500 -191258 -4090329 -5546697 -4469262 -3265448 -3095117 -2410688 -39301 3396346 6282418
6491 6282418 7833851 8703041 9077145 8300395 6264125 4023271 2222957 815742 -85692
6482 -85692 236996 2237870 4743403 6638262 7906868 8710072 8980214 8611992 7873954
6473 7873954 6847567 4539865 742700 -3168828 -5974860 -7127281 -6819120 -5916319 -5239913
6464 -5239913 -5488206 -6223221 -6036581 -4816915 -2498239 550726 2147570 1455672 185616
6455 185616 -596972 -633113 153482 1074235 1718241 2485039 2954271 2434957 1470828 647449
6445 647449 -209912 -1760594 -3512053 -4537249 -4733550 -4386411 -3742431 -2758749 -2151892
6436 -2151892 -2502108 -2820409 -3434123 -5017156 -6706079 -7516870 -7852242 -8744188 -9576845
6427 -9576845 -8871959 -6917631 -5063336 -3735213 -2864197 -2690214 -3764627 -5689483 -7291399
6418 -7291399 -8232102 -8648207 -8197082 -6860155 -5296730 -3826961 -2280739 -548575 1234797
6409 1234797 2499119 1700733 -1030537 -4062151 -6917589 -9441407 -11243519 -11162115 -8984347
6400 -8984347 -5703033 -2132128 1189424 3752797 5379327 6826361 8018006 8727907
6392 8727907 8934686 7933500 6166853 4500865 2745041 832636 -557599 -935251 261419
6383 261419 1877151 1342252 -1299861 -3797116 -4249721 -3257932 -1830308 503947 3128449
6374 3128449 5215807 6683599 6915138 5649461 3962890 2825358 2400236 3200213 5146786
6365 5146786 6800464 6557918 4097206 1028562 -601285 -316910 484701 185543 -1184939
6356 -1184939 -2439849 -3263823 -4016243 -5109386 -6363368 -6673311 -4743284 -819086 3449196
6347 3449196 6259228 6686718 4482595 576204 -3036571 -4784713 -4134074 -1911603 593585
6338 593585 2771629 3928987 3942119 3185773 1550000 -281760 -1595378 -2831822 -4188496
6329 -4188496 -4533128 -2651201 434167 2148919 1543430 -335420 -2506056 -4431924 -5361412
6320 -5361412 -4856782 -3104374 -538966 2253869 4362296 6175296 8148481 8942116 8238974
6311 8238974 6889467 5304438 3857526 2228822 -111079 -2378487 -3455842 -3248090
6303 -3248090 -1942688 -78498 1867729 3799694 5004995 5328568 4830076 3507927 2190207
6294 2190207 1109458 1001948 2406850 3274755 2194832 1124362 1422544 2046370 2406562
6285 2406562 2498897 2045608 983547 -505032 -2116459 -3686867 -4778736 -4347421 -2342076
6276 -2342076 -1064862 -2669681 -6193249 -9043690 -10305990 -10507006 -9921737 -8542154 -5909176
6267 -5909176 -2094569 916233 2436630 3019972 2614755 2135521 2187916 1343857 -1190662
6258 -1190662 -4536493 -7640533 -8864605 -7530972 -5346724 -4266782 -3940439 -3542263 -3678305
6249 -3678305 -4072050 -3595286 -1979529 482448 3542544 7153944 10066843 10573540 8630552
6240 8630552 6375940 5006410 3777037 2974280 2797639 1795866 -728545 -3180116 -3534926
6231 -3534926 -1553861 913920 2372152 2854559 3078122 3511232 3918949 3313670 873063
6222 873063 -2755025 -6356875 -8981828 -10342047 -10798094 -10545251 -9633995 -8912316 -8579818
6213 -8579818 -8004933 -7334605 -6907645 -6660267 -6265768 -5344214 -3807212 -2691180 -2092605
6204 -2092605 -1010010 -253685 -84486 938306 2888470 4770235 6046388 6344951 5175724
6195 5175724 3025986 874499 -498183 -987173 -1300250 -1845929 -2285068 -1269023 2060921
6186 2060921 6140825 8631268 9181728 8749224 9199104 11206471 13084284 13729211 14135350
6177 14135350 14767590 14115101 11561813 8496666 6421597 6318033 8302608 11376715 13905010
6168 13905010 14824773 14548025 13354850 10806972 8228457 7619505 8703132 9621404 9334582
6159 9334582 8419726 7620051 6454092 4175591 1745434 229457 -812263 -1813613 -2223816
6150 -2223816 -2310400 -2853514 -3520449 -3079499 -1056572 1467295 3503958 4466884 4362067
6141 4362067 4163202 4039259 2796606 -269696 -3454303 -4429689 -3163973 -1120578 1206039
6132 1206039 3256126 4170914 3390618 1906807 1698359 2913178 4469858 5331660 4726465
6123 4726465 3057525 1840346 1460213 1777976 3015833 4513687 4903495 4094732 3139912
6114 3139912 2856126 3149548 3227370 2276584 -333689 -3685648 -5903498 -6127019 -4981745
6105 -4981745 -3669449 -2388932 -1091990 598057 2623233 3746262 3571896 3372239 3756070
6096 3756070 3584124 2520581 1589849 1596500 2280474 2646655 1955727 810570 1053463 3217583
6086 3217583 5827588 8048995 10309554 11923868 11671338 9505819 6527269 3604737
6078 3604737 990424 -789556 -1975800 -3706783 -5793214 -6743180 -6204810 -4616245 -2332183
6069 -2332183 -4623 1242686 1079440 887929 1543623 2758708 3636000 3017806 1384147
6060 1384147 15196 -727518 -1548168 -2736958 -3811582 -4700750 -5103469 -4906174 -5159658
6051 -5159658 -5939412 -6730712 -7464019 -7640612 -6192496 -3178830 -483944 944041 1555892
6042 1555892 1536797 860539 -46819 -764918 -740286 153611 1048517 847440 -991179 -2925153
6032 -2925153 -3324560 -2930369 -3037433 -4512245 -6544087 -7721887 -8277180 -9165377 -10444301
6023 -10444301 -11448228 -11185068 -10101654 -10116063 -11607786 -13634303 -15694670 -17303064 -17758611
6014 -17758611 -16577574 -13943807 -11757188 -11374675 -12100173 -12448547 -10874071 -6754595 -889384
6005 -889384 5577431 10833365 12915445 11826273 9409314 7895810 7150114 5674353 3169548
5996 3169548 -5619 -3204486 -5744699 -7534139 -8751490 -8823882 -6576162 -2052587 2844866
5987 2844866 6366372 7771529 7292167 5727436 3909703 2922792 3852103 5940481 7853014
5978 7853014 9653573 11016212 11762574 12270938 12356233 11314042 9301036 7175893 5451031
5969 5451031 5152462 6422533 7596463 7561291 6930184 6481293 6406002 6054484 5032755
5960 5032755 3148678 170464 -2767638 -4103060 -3665009 -2356713 -594312 979779
5952 979779 1643205 1945271 2466986 3095122 3756034 3938285 3050274 957228 -1521273
5943 -1521273 -3360774 -4243039 -4594176 -4684190 -4694842 -4563375 -3688411 -1995441 -444807
5934 -444807 198400 375200 474671 656604 1269226 1909677 1970654 2151896 3265505 4358701
5924 4358701 4416361 4005044 3743053 3605719 3650351 3862911 4112457 3790105 2773117 2908146
5914 2908146 4197822 5320380 5655688 5351355 4890152 3891965 1921988 -764258 -2639367
5905 -2639367 -2249397 -350609 1441232 2160779 1575739 669413 660018 1729168 3297790
5896 3297790 4201866 3835268 2695641 1435717 526217 -378380 -1731179 -3080942 -3722881
5887 -3722881 -3779244 -4423971 -6160506 -7982620 -8568133 -7147666 -4931838 -3314157 -2156177
5878 -2156177 -802466 357437 942119 1220592 619424 -909123 -2461782 -3248678 -2826016
5869 -2826016 -1550114 7997 1388254 2690082 4484549 6691993 8357662 9470518
5861 9470518 10832020 11831509 11689515 11063635 10764094 11494764 13088550 13166848 11073981
5852 11073981 8757294 7132339 5332979 2694037 -179699 -2525084 -4476617 -6272573
5844 -6272573 -8158390 -9621507 -9504056 -8066657 -7063088 -7814347 -9544605 -10611027 -10422718
5835 -10422718 -9498429 -8454527 -6825836 -4185049 -1534075 -432391 -1151914 -2316772
5827 -2316772 -2823230 -2833387 -2638004 -1577000 588762 3346929 5808346 7770449 9708805
5818 9708805 11409677 12082700 12002982 12172043 12227191 11082942 8265124 4582326 1225849
5809 1225849 -1276491 -3283543 -5241633 -7093339 -8062275 -7341055 -5562930 -4095953 -3888734
5800 -3888734 -4955154 -6323586 -6813787 -6522568 -5860973 -4836382 -3002735 234882 3882871
5791 3882871 5707411 4552431 2301853 1300598 1547583 1960529 1365949 -844302 -4281674
5782 -4281674 -7277568 -7285192 -4386885 -1407131 -132329 228641 1185860 3168048 5170922
5773 5170922 5878654 5817578 5587343 4800892 3823220 2930596 2088891 1768653 2171598 3098375
5763 3098375 4874790 6946408 8009601 8454640 9219610 10063879 11014138 11889906 11140086
5754 11140086 8308843 5286640 3099052 1280632 -212669 -1484927 -2435272 -2776428
5746 -2776428 -3469496 -4793008 -5272202 -4530633 -3737933 -3125178 -2101364 -1025387 -563868
5737 -563868 -81901 254265 -992252 -2930987 -3828952 -4069213 -4285322 -4502049 -4563017 -3860033
5727 -3860033 -2767302 -1975552 -900652 734461 2312041 3550563 5005177 6761525
5719 6761525 7519693 6319826 3882788 952999 -2007644 -4605868 -7309047 -10051596
5711 -10051596 -11710631 -11645101 -9976391 -7571970 -5928054 -5235036 -5286444 -5894662 -6326425
5702 -6326425 -6389772 -5959870 -4916361 -3906615 -3676638 -4611653 -5700841 -5359217 -3185343
5693 -3185343 -459423 1965554 3574003 3609187 2340313 986470 950325 1969351 2375914
5684 2375914 1335776 -762388 -3213151 -5493831 -6928533 -6637133 -4597951 -1628337
5676 -1628337 1451521 4171525 6477766 8408968 9553280 9361414 8466150 7936739 8447749
5667 8447749 10185119 12237900 13644608 13494810 12143790 10636246 8677778 6258282
5659 6258282 4281486 3369551 2883692 989261 -1266755 -1012879 1834091 5428612 7824433
5650 7824433 8060810 6174521 3990017 3279720 3621142 3634557 3045957 2208039 1249277
5641 1249277 659477 501116 693064 1029843 1455937 2135443 2582624 2426991 1995659 1906326
5631 1906326 2410822 3737240 5445064 6190986 5913165 6144350 7263414 7910827 7691054
5622 7691054 7708105 8453597 8764514 7934229 6672041 5989044 6508686 8285177 9874582
5613 9874582 9733535 9066011 9225273 9710399 10192918 10790213 10884090 9730380 7697404
5604 7697404 5899577 5698467 6971423 7961106 7462378 5079968 1079698 -3706960 -8274003
5595 -8274003 -11581422 -12958514 -12544738 -10493640 -7118304 -3223168 34616 1588794
5587 1588794 1645871 1046261 82580 -1274705 -2083964 -1495242 -47675 800704 747828 766789
5577 766789 904128 245746 -1652802 -3856487 -4571757 -3856892 -2847470 -1505849 152820
5568 152820 1558711 2115532 1837599 991302 -16952 -997366 -2741171 -5591366 -8027987
5559 -8027987 -8547517 -7227594 -4471589 -1245886 658844 1230946 1449566 1764615 2319533
5550 2319533 2994258 3301828 3370883 3912190 4895556 5894080 6937083 8110991 9111178
5541 9111178 9439981 8634420 6320511 3550407 1978738 1937301 3050106 3935158 4020666
5532 4020666 3373423 1902102 751781 635925 948115 911924 -73166 -1911074 -3318868
5523 -3318868 -3277788 -1999918 -469232 185131 183891 229463 -49560 -1206257 -2240152 -1703977
5513 -1703977 -10184 1261850 2399493 3729686 4241064 3591189 3145966 3410211 3598501
5504 3598501 3233306 2024544 406433 66744 1658322 3250279 3532609 3495470 3617341
5495 3617341 3326642 2886276 3681128 6023853 8383510 9234153 8877133 8716109 8866321
5486 8866321 8301042 6472734 4522179 3511931 3242170 2759929 1371994 141504 370817
5477 370817 1736741 3025722 3557481 4054272 4512504 4095387 3053963 2119065 1444502
5468 1444502 1516174 3301027 6105938 8026965 8832868 10007146 12548496 15299497 16332365
5459 16332365 15179842 12908295 10960496 10435337 10389120 8938708 6091954 2969556 15701
5450 15701 -2332794 -4173678 -5464186 -5448388 -4232771 -3126428 -2162531 -633382 630983
5441 630983 696269 727813 1599963 2114285 1664880 1029125 491547 415791 1333056 2969659
5431 2969659 5159925 8071933 11440861 13856377 13840793 12633987 12368597 13383315 14258785
5422 14258785 13733822 12414596 11718282 11176451 9724482 8200549 7026154 5926814 4406573
5413 4406573 2952997 2528233 2827358 2868325 2487393 2595877 3624038 4471009 3846638
5404 3846638 2038314 527682 -11945 222628 1453260 2979476 3484680 3058872 3037797
5395 3037797 3952234 4170661 3205794 2377093 1476347 -660910 -2480132 -2018502 -269393
5386 -269393 586177 -63411 -1284928 -2011798 -2474865 -3086845 -3476493 -3455690 -3995510 -5141378
5376 -5141378 -5321560 -4088944 -2635895 -1635747 -795788 -88844 632492 2204023 4569783
5367 4569783 6493786 6911274 5963626 4622038 3851410 4033297 4775244 5260526 4453194
5358 4453194 2065344 -671769 -2517491 -2987756 -2416275 -1884122 -1706777 -1941685 -1966088
5349 -1966088 -892470 1004614 3405677 5804671 6717983 5429021 2863511 1269606
5341 1269606 1004846 60206 -2132438 -4162442 -5477520 -6750743 -8347398 -9686557 -10445956
5332 -10445956 -11026296 -11231127 -9852839 -7589850 -6932456 -7903887 -8682318 -9280820 -10574532
5323 -10574532 -12385914 -14697531 -17331433 -18902805 -18469034 -16409779 -13730708 -11700890
5315 -11700890 -10802528 -10019222 -8835059 -8002886 -7678036 -7254898 -6557314 -5390147 -3646018
5306 -3646018 -2801640 -3743400 -4625753 -3900425 -2593087 -1360658 139204 1078914 956687
5297 956687 399586 -8789 410 732910 1897321 2224223 1731381 849931 -667296 -1696847
5287 -1696847 -1150991 -98564 355851 760701 1874325 3740783 6231945 8681258 10154756
5278 10154756 10155135 8941626 8239777 8488300 8112980 7040134 6656252 6996280 7343774 8019900
5268 8019900 9462280 10518956 10003023 8098272 5959284 4229736 2403722 348955
5260 348955 -2049347 -4651649 -6723058 -8017088 -8521203 -7927755 -7082114 -7166726 -7979342
5251 -7979342 -8467956 -7892227 -6406989 -4513181 -2791636 -2554725 -3710071 -4074663 -2262578
5242 -2262578 1397594 5787300 9680274 12218302 12947303 12474457 11542667 10925592 9856226
5233 9856226 8225998 7298148 6485709 4267514 1223515 -1265202 -3033990 -4354832 -5885114
5224 -5885114 -7669044 -8937770 -8235953 -5745119 -3009766 -613841 1476468 3441658
5216 3441658 5195661 5535650 4240295 2473945 908761 -882126 -2871774 -4133732
5208 -4133732 -4498208 -4794902 -5199462 -4696158 -2864733 -729727 285225 -446435 -2734440
5199 -2734440 -5414194 -7374727 -9089299 -10579947 -11202042 -11761522 -12250537 -11453119 -9642885
5190 -9642885 -7996973 -7103691 -7369004 -8111704 -7366515 -4944715 -2515916 -779473 391518
5181 391518 745936 -548826 -3116694 -4398470 -3309943 -2250216 -2739395 -3302640 -2826665
5172 -2826665 -1735167 -1029164 -892116 -1366669 -2575562 -3332956 -2824518 -1709020 -1286269
5163 -1286269 -1508868 -1201882 -452393 554985 2446811 4980928 7054404 7257033 5205211
5154 5205211 2974071 2287014 2708234 2719462 1524211 -582264 -2784138 -4773039 -6487175
5145 -6487175 -7190438 -6527476 -4695819 -2392086 -626064 366045 1101763 1785612 2305471
5136 2305471 2689399 3286190 4820394 7188044 9217601 9602606 8084257 5742300 4023042
5127 4023042 3257501 2988198 2951572 3536870 4876654 6320838 7299787 7619723 7617972 7308680
5117 7308680 6942685 6731947 6628085 6529080 6481149 6685910 6348139 5220146 4095613 3164912
5107 3164912 2258614 1533435 1035118 550625 -397106 -2029259 -4369833 -6331434 -5932598
5098 -5932598 -3262303 40315 2152512 2550821 1914318 631841 -688608 -1570332 -2285116
5089 -2285116 -2514800 -1706819 -525401 202217 281712 -354811 -1631330 -2700301 -3064446
5080 -3064446 -2869029 -2576560 -2632268 -2374322 -958563 751331 1442480 959286 117245
5071 117245 -545052 -1255288 -1956918 -1663957 441575 2930585 3950805 3560594 2601568
5062 2601568 2004499 1871448 1408322 223992 -1325685 -1651546 279078 2853291 4147640
5053 4147640 3608870 1637206 -303588 -1444810 -2247710 -2857545 -2244057 -545874 12391
5044 12391 -1359836 -3756373 -6215281 -7852747 -8568621 -9150968 -9741530 -9696131 -9724334 -11208369
5034 -11208369 -13800476 -16365515 -18338271 -18888587 -18244807 -17218882 -15723614 -12968573
5026 -12968573 -9253863 -6204035 -4466026 -3681172 -3316512 -3049770 -2640644 -2729393 -3952100
5017 -3952100 -6156893 -8147167 -8407634 -6613488 -3250093 100501 1683138 1469785 283305
5008 283305 -1463283 -3456506 -4142347 -2533967 -687888 -401945 -1313938 -2421178 -3006822
4999 -3006822 -2856470 -2040882 -532839 1417005 2953909 3474857 3041448 2113510 901237
4990 901237 -1104330 -3538435 -5342715 -6044177 -5713520 -4718855 -3542573 -2462231 -1715350
4981 -1715350 -516312 2265431 5778188 8115858 8324891 6773603 4448081 2187763
4973 2187763 962683 1264928 2550772 3492040 3248412 3020976 3580259 4470460 5360936
4964 5360936 5604797 5031690 3833359 1606849 -1364619 -3166223 -2014828 1237737 4134649
4955 4134649 5488459 5671042 4906993 3192003 1597818 1060885 877392 457344 -329615
4946 -329615 -1443788 -2406409 -2881648 -2253573 -487558 1050221 1132959 817031 1264619
4937 1264619 2254194 3183886 3620381 3368062 2518514 1592537 754303 -420759 -2009503
4928 -2009503 -3012044 -2476149 -388749 2426649 4600585 4674348 2476433 -99857 -1698875
4919 -1698875 -2328246 -2735500 -4036985 -5582203 -5720551 -5236761 -5017538 -4061815 -2998834
4910 -2998834 -3332734 -4690401 -5428551 -5124392 -4514692 -4114376 -3775959 -3429347 -3345967 -3563801
4900 -3563801 -3189834 -1334241 1069855 2755433 3452010 3291089 2758014 2075125 1470085
4891 1470085 1596409 3333143 5771053 7126316 6860035 5170584 3035228 1681885 1105058
4882 1105058 -15279 -1706241 -1952804 -567569 549737 1114335 1541634 1342511 5932
4873 5932 -2417086 -5409563 -8276561 -10501931 -11205214 -9885571 -7695578 -6359172 -6279016
4864 -6279016 -6773413 -7340810 -6797332 -4748066 -2147374 -912184 -1650974 -3056740 -4289311
4855 -4289311 -5139122 -5079402 -3347236 -609185 1726653 3060305 3448718 3557944 3891393
4846 3891393 3996440 2870280 1020509 654255 2246846 3519595 3450617 2745323 1127252
4837 1127252 -501939 -384601 876075 1677748 1828796 2010840 2723213 3504301 3753439
4828 3753439 4468334 6691125 9139672 10465190 10929643 10176506 8295718 6356174 4784337
4819 4784337 4064960 3817718 2780783 1469932 807036 1195313 2252517 3017648 3889567
4810 3889567 5654616 7577819 8317483 8093378 7089937 5585745 4041086 2280919 -43554
4801 -43554 -3055038 -5741919 -6538905 -6132663 -6850216 -8657100 -8907315 -6052579 -1422062
4792 -1422062 2586474 5281024 6909401 7004610 5461484 3614639 2282780 1146569 -114322
4783 -114322 -981862 -1199952 -1584774 -2634353 -3321023 -2797765 -2157407 -2611038 -3252683 -2316702
4773 -2316702 -352048 566016 311633 -235665 -566305 157349 1699313 2716728 2048691
4764 2048691 492692 -377733 -447040 -576583 -236387 1063119 1962568 1489330 295347
4755 295347 -249681 351640 1082740 1188891 2317182 5528211 9195345 11730382 11976767
4746 11976767 9738209 7022676 5607631 5520440 5254863 3781461 2010699 910611 532022
4737 532022 1128565 2602949 3851860 4151963 3720496 2977134 2085338 1083381 327360
4728 327360 164739 459711 794533 1234954 2406177 4000632 5008064 5256102 4682019
4719 4682019 3541193 2398399 1193027 201564 -579480 -2186812 -4700962 -6730242 -7265103
4710 -7265103 -6467827 -4326476 -1426594 981370 1987933 1614871 722346 -908290 -2503666
4701 -2503666 -2267796 -451266 1416577 2683041 3215842 2959203 2216868 1389593 1174294
4692 1174294 2027244 2738944 2556810 2688885 3493709 3855933 2859668 1175153 -227001
4683 -227001 -1228192 -1718485 -1573264 -756269 13627 -32817 -591610 -1021094 -650273 913650
4673 913650 3348572 5303662 5192199 2925736 -333637 -3557054 -6249983 -7208998 -6248320
4664 -6248320 -4168811 -911812 2638012 5492542 7380907 7892242 7852674 8080814 7478629
4655 7478629 5796362 3960560 2479145 1630312 1939053 3028754 3794635 3866302 3597092
4646 3597092 3087525 1955887 409747 -801703 -1267582 -1430568 -1848393 -2839529 -3942418
4637 -3942418 -4446991 -4692021 -5313091 -6113119 -6446744 -5535921 -3814555 -2061106 -654732
4628 -654732 174997 363324 173121 -30202 -1077596 -3339963 -6244331 -9414014 -12490845
4619 -12490845 -14936254 -16185627 -16036050 -14964618 -12979191 -9772949 -6455358 -3808025
4611 -3808025 -1395957 687850 1799742 852066 -2378138 -6357552 -9098896 -9652514 -8219569
4602 -8219569 -5339992 -2048896 396190 1075537 630823 24989 -678801 -1860867 -3456460
4593 -3456460 -5179514 -7033181 -7980275 -7417372 -5805000 -2923464 1087822 4539772 6708433
4584 6708433 7428410 6415121 4424085 2348518 922180 353144 311246 556289 1083044
4575 1083044 2268866 4539448 7598198 10404886 11843369 11511684 9835999 8395875
4567 8395875 8244061 9539813 11344504 11743819 10017911 7039290 4389891 3785139 6190372
4558 6190372 10188794 13073811 13591952 11830747 8676609 5633558 3494473 2301534
4550 2301534 1825002 1183487 420055 23114 -26815 248406 1355464 3762335 6025633
4541 6025633 6848171 7316323 7434948 6753944 6145525 5612656 4751743 3619357 3136942
4532 3136942 4345221 6211851 5828152 2822721 -437032 -2081592 -2228368 -1341222 439643
4523 439643 2755789 4974882 5921985 5210673 4101617 4017849 4992039 5988352 6554222
4514 6554222 6598763 5631275 4469252 4061789 3813041 3493477 3353051 3615267 4284700 4802784
4504 4802784 4410029 2521138 -478089 -2822098 -3718927 -3393071 -1909677 112180 2137738
4495 2137738 3612776 4219363 4001796 2504616 -321374 -3418634 -5123014 -5178993 -4376114
4486 -4376114 -3600854 -3115470 -2424622 -1927662 -1748595 -1428450 -894933 -923933 -1568733 -2057602
4476 -2057602 -2749133 -3632281 -4077455 -4156801 -4471282 -5254314 -6232326 -6431426 -5023322 -2199051
4466 -2199051 383371 1058633 -45686 -1186604 -1243627 -551851 713716 1625978 1119277
4457 1119277 -220780 -1332044 -1821386 -2397646 -3868529 -5762792 -6301780 -4609736 -2221838
4448 -2221838 -697060 79664 989794 1618734 1669920 2372442 3554043 4196925 4900693
4439 4900693 6676512 8731939 8966559 6344394 2380958 -126146 -294817 978031 2910751
4430 2910751 4602121 5475027 6114079 6737933 5644125 2739475 326619 -181672 -152769
4421 -152769 -1220098 -2691701 -3323934 -3095120 -2659885 -1502181 161299 1295293 1727122
4412 1727122 1636270 1171758 1184698 1568886 1410620 1150278 1617706 2324895 2318612 1760915
4402 1760915 610823 -738014 -1737038 -2987408 -4233628 -4650953 -4620866 -5266593 -6394988
4393 -6394988 -7006626 -6608939 -6119596 -6414469 -7211402 -8098747 -9104963 -9857855 -9966548
4384 -9966548 -8454380 -4847408 -1364634 155310 219675 -154153 -64078 1278658 2938803
4375 2938803 3404814 2679152 1070883 -148142 -338123 -917732 -2775166 -5120228 -6891870
4366 -6891870 -7483030 -6753782 -5342823 -4340696 -3755553 -2720442 -979991 914462 2623249
4357 2623249 4124442 4450783 2670227 -170322 -2362123 -3592744 -3662533 -2511960 -1025686
4348 -1025686 23201 1190648 2162806 2211096 1962185 2524530 3974764 5198215 5869727
4339 5869727 6865895 8537399 10116723 10489826 9324486 7687378 6436161 5211197 4143015
4330 4143015 4308603 5095532 4874716 3451279 1682057 630411 181255 -521767 -1056590
4321 -1056590 -476492 912858 2014442 2663871 3181568 3537036 3751648 3867766 4469632
4312 4469632 5729340 6322010 5295678 2997815 -177180 -2824541 -3546837 -2658379 -1923257
4303 -1923257 -2485259 -3240985 -2752223 -1047208 763637 1612140 1151837 -138129 -1826110
4294 -1826110 -4285631 -7707363 -10707891 -11893656 -11204084 -9613326 -8214427 -6903303
4286 -6903303 -5321863 -4347930 -4622383 -5122840 -4955853 -4028995 -2385324 -595955 306769
4277 306769 232718 -61417 -454330 -1008236 -1107046 -843229 -614039 180523 1626207 2159282
4267 2159282 1072107 -646408 -2350396 -3973949 -5379058 -5445062 -4224701 -3065318 -3138727
4258 -3138727 -4417361 -5367897 -5483528 -4813178 -3350112 -1603644 -437766 301967 651221
4249 651221 -239803 -1454186 -1863910 -1567066 -771957 316101 1240048 1852046 2342233
4240 2342233 3391955 4635298 5326827 5720943 6040562 6017812 5329710 3724664 1471924
4231 1471924 -953339 -3494926 -5159225 -5467973 -5494443 -5837446 -5725016 -3811587 137394
4222 137394 4399696 6211836 5174609 3319600 2292478 2249445 1901558 1146579 1539710
4213 1539710 3759450 6301480 7474493 6810815 4902877 2981590 983177 -835711
4205 -835711 -1465110 -650873 1365820 2986966 3449801 3465305 3867002 4944896 5910502
4196 5910502 6007533 5044918 3461138 1825380 111798 -948710 -3398 3086608 6375485
4187 6375485 7974285 7969123 7474217 7104424 7065223 7430443 8146644 8696619 8349318 6982363
4177 6982363 5102409 3333758 1299856 -1344146 -3993817 -6081779 -7290308 -7960488
4169 -7960488 -8760783 -9321862 -9156313 -8129408 -6741922 -5783320 -5761852 -6945709 -8480975
4160 -8480975 -8913404 -8005004 -7211306 -7429342 -7840839 -7070375 -5135124 -3153283 -2125940
4151 -2125940 -1194405 530507 2343662 3209908 2273397 -193194 -3302802 -6768664 -10032307
4142 -10032307 -11612267 -11291211 -10909515 -10741510 -9424125 -6980991 -4968315 -4611270 -5424654
4133 -5424654 -6688840 -8548857 -10867823 -11976449 -10775825 -8255474 -6087531 -4913737
4125 -4913737 -4180220 -3209599 -1786584 -101450 1718599 4036616 6380534 6717381 4771742
4116 4771742 2706770 1919385 2695969 4105534 4723866 3604612 853847 -2034245 -3344712
4107 -3344712 -2400164 -88489 1868911 2369883 915637 -1951188 -4683338 -6897407 -8803985
4098 -8803985 -9249599 -8336731 -7151285 -5596739 -3729495 -2599215 -1861021 -643118 297472
4089 297472 476739 1050446 2902814 5052191 5771546 4799794 3446795 2526129 2774592
4080 2774592 4316491 5904451 7083062 8660005 10858983 13285902 15346566 16118131
4072 16118131 14970606 12559235 9957997 7852847 6476042 5530471 5505141 6932548 8305526
4063 8305526 7719417 5311579 2905911 1980138 1989826 2053764 1614893 537566 -714033
4054 -714033 -1982353 -2894042 -2758720 -1171215 1152239 3109983 4515525 5226601 4678701
4045 4678701 3028915 407960 -2438951 -3883874 -3254257 -1986683 -1676916 -2182373 -2451013
4036 -2451013 -2296699 -2141408 -1821402 -1265097 -720807 -249626 368264 1217754 2611418
4027 2611418 4647208 6899655 9197405 11211124 12185882 12257688 12472381 12943438 13230781
4018 13230781 13162583 12741382 12582709 13276065 14346881 15089827 15664771 16860831 19229989
4009 19229989 22026326 24123314 24799717 25457638 27646282 30762493 33770034 36432354
4001 36432354 39791657 45363962 54117747 65568682 78309496 88910365 93731450 93782964
3993 93782964 93143202 95438300 102217141 113779290 126644080 131824007 124059106 107742879
3985 107742879 89996169 75145107 64114451 55581026 47687122 39920463 33128279 28018364
3977 28018364 25442588 24973701 25128572 24911363 24188104 23790345 23259177 21227646 17982956
3968 17982956 14701727 12208918 10348216 8483945 7254647 7540208 8744725 9632645
3960 9632645 9701328 9932221 11248642 12662169 12523937 10886011 7915523 3507950 -416249
3951 -416249 -2315240 -2393798 -521829 3263493 7206689 9617933 10461501 10570523 10602730
3942 10602730 10989655 11865102 12908464 13453353 12419140 9513960 5878354 3065132 1076596
3933 1076596 -430492 -1315459 -1700210 -1885956 -2251789 -2528399 -2132014 -1294538 -91311
3924 -91311 1208358 1911281 1998217 2321278 3421097 4482141 4502564 4128563 4132420 4520951
3914 4520951 5335797 6301081 6635480 6287562 5817070 5749286 6243721 8051714 11086848
3905 11086848 13457258 13413219 11481622 9536931 7662909 4770306 1659976 175149
3897 175149 312095 559328 -231734 -1247495 -1198628 -767847 -1370300 -2044511 -1067692 1443212
3887 1443212 3786753 4387445 3212015 1918614 2081331 3752278 6063765 7553650 7696839
3878 7696839 6952899 5992806 4697117 2884870 1989405 2774026 4570204 6038923 6316450
3869 6316450 5911781 5804200 6619433 7631462 8284701 8923543 9854370 11358679 13515720
3860 13515720 16986941 23058175 32844094 46338716 61945127 77847811 91355060 97893608
3852 97893608 96810933 92851330 91695134 97041758 108647332 122845528 133028923 131770108
3844 131770108 117465067 96322559 75432212 58466606 45973716 37340488 32457528
3837 32457528 30546960 29648232 28139389 26086070 23405727 20107059 17182663 15767442
3829 15767442 15604530 15785808 15886300 15211535 13067332 10094023 7941770 7519738 8724329
3820 8724329 10646854 12010754 11971450 9680222 5372963 979668 -1718094 -3275049 -4607540
3811 -4607540 -5447704 -5518158 -5086989 -4485811 -3164290 -1116562 537175 1072893 565198
3802 565198 -791474 -2148799 -2404922 -1623292 -99782 2090208 3593111 2479750 -315272
3793 -315272 -2205656 -2199640 -940411 1174425 4197997 7435456 9488104 9968514 9888688
3784 9888688 10381245 10937623 10488521 8608113 5570953 2160503 -599559 -2095127 -2738923
3775 -2738923 -3269823 -4062375 -4041346 -2486650 -364189 855271 883912 130000 -1367948
3766 -1367948 -3197444 -4514035 -4387778 -2558148 40084 1862974 1769677 -122028 -2734965
3757 -2734965 -5143162 -6550530 -6345753 -4595234 -2210414 -202450 1015522 1084474 670435
3748 670435 1145908 2880123 4594296 4453577 2309980 -194425 -1678470 -1734244 -939799
3739 -939799 -85290 569545 769948 -63786 -1491903 -2485672 -3095397 -4523805 -6958975
3730 -6958975 -8772024 -8794404 -7892436 -7180433 -6321773 -5161316 -4779648 -5029713 -4080327
3721 -4080327 -771289 4210004 8731506 10813277 10492526 9293893 7934929 6341927
3713 6341927 3598924 -91639 -2660002 -3465918 -3093511 -2239451 -1260068 56109 1461696
3704 1461696 1506323 -217006 -2904120 -5482725 -6882056 -6692402 -5751431 -5237169 -5078800
3695 -5078800 -5450699 -6365701 -7459299 -8992983 -10357100 -10474051 -9210492 -7107156 -5104171
3686 -5104171 -3862334 -2970851 -1712588 -253230 958470 2386062 4223399 5436425
3678 5436425 4995073 3549265 2075909 930699 961326 2225406 2943618 1811472 -252244
3669 -252244 -1515053 -952683 811104 2385458 3402571 3752994 3180764 1791040 19903
3660 19903 -1355285 -2005982 -1614448 -875868 -1473249 -3166042 -4610389 -5085621 -4367134
3651 -4367134 -3046784 -2100974 -1348470 -734712 -527951 57682 1401152 2733003 3105895
3642 3105895 2337577 1047940 138098 483676 2038284 3604689 4537637 5359411 6068557
3633 6068557 6081899 5827095 5387749 4105653 1750642 -888604 -2665747 -3423225 -4038899
3624 -4038899 -4823768 -5228742 -4673350 -3079032 -1722000 -1821221 -2823655 -3309764 -2910200
3615 -2910200 -2118472 -906777 607787 1255476 536998 -1016677 -2670920 -3910433 -4278499
3606 -4278499 -3487257 -2763711 -3792165 -6490329 -10080203 -12863524 -13212260 -12151335 -11091482
3597 -11091482 -9475100 -6907791 -4165795 -1916999 -931683 -2288609 -5519363 -7747166
3589 -7747166 -7359657 -5573347 -3796773 -2367803 -1220721 -947075 -1619010 -1855674 -926772
3580 -926772 491254 1214975 1067213 1186526 1559702 1452313 1253117 1180674 671667 -630032
3570 -630032 -2122688 -3512877 -5088477 -7098712 -9801410 -13154824 -16177347 -17460102
3562 -17460102 -16360063 -13947661 -10942734 -7444244 -4257181 -2162535 -1026739 -619650
3554 -619650 -407828 -325633 -1527328 -5283703 -11351693 -19594046 -30807381 -45838427 -65973899
3545 -65973899 -89777928 -111461732 -122075911 -116688074 -100741886 -82955179 -68190647
3538 -68190647 -57027526 -48880644 -43827312 -41788138 -42138054 -43954784 -47156976 -53020277
3530 -53020277 -62527173 -75540856 -91156577 -108100021 -123900093 -131444544 -123528751 -102512448
3522 -102512448 -78395206 -58774192 -45467003 -37428620 -33029364 -30439803 -28028349 -25084636
3514 -25084636 -21677363 -18637268 -16728213 -15345328 -13593962 -11384277 -9816364 -8873027
3506 -8873027 -7251078 -4916503 -3335494 -3826462 -5777625 -7193681 -7094146 -6454446 -6274668
3497 -6274668 -6442399 -6778329 -7262296 -7697747 -7371148 -5541161 -2743388 -530364 72738
3488 72738 -549890 -2213146 -4452266 -5891467 -6211214 -6736839 -8168447 -9814828 -10770650
3479 -10770650 -10309165 -9481032 -10121698 -11517880 -12208176 -12242506 -12589175 -14054279 -15974396
3470 -15974396 -17302123 -16991027 -15625524 -14554251 -13186597 -10485275 -6930454 -4037490
3462 -4037490 -3150817 -3564295 -3934467 -4237144 -5264487 -7403107 -9911315 -11434906 -11615175
3453 -11615175 -11057049 -10009331 -8735236 -7204562 -5350973 -3887406 -3843034 -5254242 -6937608
3444 -6937608 -7776159 -7518045 -6664994 -6210486 -6092267 -5041665 -3101236 -1666270 -1613171
3435 -1613171 -1741423 -1072180 -170758 -126135 -1671111 -3950177 -4877630 -3800543 -2162866
3426 -2162866 -742564 845240 2656591 4250823 5130426 4452442 2427050 509334 -425595
3417 -425595 -339789 86142 341994 -77807 -1635988 -3570837 -4449923 -4033777 -2633959
3408 -2633959 -943624 -105321 -37813 -82879 217351 985708 2123313 3121368 3149296 2411791
3398 2411791 1859792 1788258 1555634 464414 -1182750 -2727870 -3434616 -3543275 -3907977
3389 -3907977 -4384358 -4897590 -5621125 -6765875 -8554551 -10809870 -12759662 -13516908 -13264563
3380 -13264563 -11913623 -9225057 -5586348 -1344340 2859568 5551264 5840006 4226238
3372 4226238 1699032 -174188 -826440 -1147654 -1256927 -1227117 -1890396 -3775583 -6510730
3363 -6510730 -8841110 -9395854 -8169163 -6753433 -6289807 -6856291 -8079394 -9095508 -9279762
3354 -9279762 -8683038 -7585805 -6744891 -6699678 -6596447 -5516185 -3996515 -2760844 -2240320
3345 -2240320 -2966810 -4426649 -4704560 -3638715 -2508253 -2052938 -2547013 -2526061 -820435
3336 -820435 1765714 4163485 6041206 6957742 6703137 5420252 4102678 3296058 2173437
3327 2173437 756591 -428682 -1715246 -2954007 -3058877 -1804745 -963399 -2221474 -4917279
3318 -4917279 -7679230 -9556150 -9890951 -9081245 -7896137 -6894368 -5992925 -4774501 -3638168
3309 -3638168 -2563674 -1020231 562556 1589487 2334096 3362677 3964156 3695086 2943034
3300 2943034 1990489 725124 -1332812 -3788357 -6016426 -6928809 -6204183 -5541128 -6300307
3291 -6300307 -7288534 -6784203 -5279065 -3838468 -2683816 -1926938 -1893118 -2352682 -3192706
3282 -3192706 -3728992 -2569524 -5990 2255352 3079339 2156939 2810 -2212094 -3446931
3273 -3446931 -3618820 -3378897 -3637706 -4565540 -4670650 -3450822 -2193989 -2452391 -3848416
3264 -3848416 -4311533 -3170567 -1482756 -865889 -2215590 -4526396 -6273531 -6965408 -7472281
3255 -7472281 -8494444 -9284822 -8588276 -6820586 -5121275 -3401654 -1902819 -1386198 -1797913
3246 -1797913 -3029073 -4932273 -6744462 -8242319 -9304616 -9310854 -7574406 -4616327 -2189719
3237 -2189719 -902917 -280984 -637885 -1752950 -2787334 -3005571 -2745179 -3163524 -4317469
3228 -4317469 -4864070 -3978522 -2148637 20928 2354244 4686384 5576284 4883505 4338917
3219 4338917 4529854 4316924 2496596 -136859 -2040692 -2898520 -3323624 -4246324 -5970054
3210 -5970054 -7478609 -7454852 -6190047 -4960736 -3811980 -2151780 -436653 372903 66565
3201 66565 -1062015 -3151783 -5637945 -7098174 -7273613 -7177573 -7031934 -7007744 -8100710
3192 -8100710 -10039663 -11193930 -10735034 -8764193 -5716039 -3361630 -3223626 -4430922 -5963688
3183 -5963688 -7724945 -8399535 -6781803 -3602656 269793 3536072 4742380 4105611 3565955
3174 3565955 3747842 4208545 4781877 5617472 6787884 8433512 10132390 10672229 9500958
3165 9500958 6849274 3857794 1437357 -414178 -1445429 -1503793 -829919 63507 883135
3156 883135 1956898 3723503 6432511 9001099 10397225 11558860 13524142 16795948
3148 16795948 20922667 24482978 26960007 29325530 33176594 38809955 45729103 54867750
3140 54867750 68014880 85946923 109400393 137870272 164877955 181458946 188818528
3133 188818528 196307581 208617335 223045332 233794174 235177861 223412274 202660866
3126 202660866 182202992 165480235 148024586 126318688 103386144 83436405 67212353
3119 67212353 53547942 42226191 33861659 28716708 25874501 24288564 22879790 21352829
3111 21352829 20553796 20528264 19612894 17655269 15322685 12732487 10023458 7677240 6850686
3102 6850686 7503712 8215898 8089214 7471695 6968024 7219104 8797423 10614172 11259683
3093 11259683 10204483 7784523 4779848 1718139 -409315 -1108805 -625422 1449401
3085 1449401 4900184 7924705 9861389 11141551 11842761 12269600 12387063 11896098 10439856
3076 10439856 8287982 6498902 5841262 6064789 6172891 6321509 6499584 5766636 4257623
3067 4257623 3211191 2995808 2813545 2776796 3571807 5153365 7197581 8553268 7980274
3058 7980274 6395220 5230601 4578876 3955694 3195134 2865701 3379833 4293797 4620669
3049 4620669 3841464 2701268 2221420 2138574 1912379 1752341 2546783 3698615 3710105 2950348
3039 2950348 2283285 2000554 1383154 150345 -311084 499302 1695392 2750212 3127788
3030 3127788 2587141 1340679 -815199 -4270033 -8142510 -11402498 -14918388 -20032165
3022 -20032165 -27139081 -35912140 -46118352 -58383591 -74454930 -96433716 -124414930
3015 -124414930 -154324805 -180921398 -199925459 -206846983 -198891431 -178074515 -150537220
3008 -150537220 -122278810 -96429184 -74119742 -56164781 -43473023 -35397863 -30563547
3001 -30563547 -27978242 -26910441 -26618728 -25435180 -21732923 -16428879 -11626720 -8744741
2993 -8744741 -7646556 -7308286 -7027081 -6567925 -7016606 -9143073 -11837817 -13042857 -12029288
2984 -12029288 -10424758 -9453228 -8094895 -5843237 -4073378 -3945402 -5262787 -7502588
2976 -7502588 -9965430 -11735216 -12048669 -11331126 -10518428 -9789500 -8980839 -8973869 -10503571
2967 -10503571 -11840651 -11072421 -8296188 -4206450 174128 2314181 1514429 -28984
2959 -28984 -596232 -251013 75950 250405 -154251 -2001983 -4583798 -6101287 -5857662
2950 -5857662 -4906186 -3653021 -2765849 -3285662 -4227598 -4170182 -2910997 -2030089 -2504204
2941 -2504204 -2714146 -1174259 1299774 3575385 5154131 5456359 4230143 1391858 -2251774
2932 -2251774 -4551833 -4743930 -4030287 -2724772 -930577 709881 1596912 1361653 -190508
2923 -190508 -2588331 -5209869 -7989563 -10034170 -10675529 -9844541 -7955093 -6619870 -5725494
2914 -5725494 -3935773 -2481345 -2638591 -3847253 -5481533 -7950107 -10570934 -11747960
2906 -11747960 -11608144 -10962408 -10088412 -9265783 -8369655 -7001490 -5624238 -5415959 -6520315
2897 -6520315 -7502508 -6920490 -4818408 -2339986 -234566 1703317 2603880 1632686 -144432
2888 -144432 -1643330 -2828840 -3984796 -4233897 -2754043 -219399 1182994 -333626 -3705079
2879 -3705079 -6797226 -9395227 -11364185 -11465845 -9534250 -7406734 -6760539 -7866983 -9824794
2870 -9824794 -11146148 -10645229 -8423371 -5253664 -1909965 591988 1439206 1039297 405663
2861 405663 -746928 -2769588 -5234536 -8020203 -10119258 -10816076 -11259772 -12280587 -13001370
2852 -13001370 -12828049 -11873684 -10307596 -9182556 -8469302 -7423558 -6145958 -4641673 -3112527
2843 -3112527 -2210115 -2349583 -3541022 -5770461 -8360200 -10146024 -10935250 -10837190 -10466837
2834 -10466837 -10902158 -12068281 -12956395 -12786354 -12106030 -11483538 -10472588 -9291704 -8305511
2825 -8305511 -6661257 -4076278 -1425620 971974 3084233 4334572 4006581 2956073
2817 2956073 2608984 2371479 842089 -1969559 -4841247 -7191564 -8462317 -8037005 -6685245
2808 -6685245 -5175037 -3377644 -1371332 -801133 -2285004 -3525718 -2314232 382923
2800 382923 2919457 4292516 4052472 3375612 2875407 1433267 -826320 -2714189 -3917706
2791 -3917706 -4287892 -3717111 -2508195 -735784 1442176 3737016 5789075 6607395 6038554
2782 6038554 4640801 2579213 206229 -1742120 -3112347 -3981171 -3788076 -3014646 -2576299
2773 -2576299 -2716519 -3522482 -4420109 -5041086 -5380316 -5140211 -3828333 -1422457 1565363
2764 1565363 4251592 5795659 5704720 4446504 2868405 1335356 400115 467252 778880
2755 778880 560339 86600 156661 1704262 3820725 4656940 4898401 6332870 8102598
2746 8102598 8560328 7956192 7107268 6557337 6033801 4680591 2154777 -714759 -3393794
2737 -3393794 -6214311 -8899887 -10722593 -11338419 -11386036 -11369182 -11209279 -10488577 -9403911
2728 -9403911 -8775428 -7993322 -6290655 -4607557 -3056032 -119231 3788688 7169281 8961751
2719 8961751 8889374 7204875 4076855 -352399 -5145001 -9012601 -11133200 -11546198 -10861368
2710 -10861368 -9440997 -7812803 -5574970 -2083715 1818171 5712512 9123636 10719488
2702 10719488 9872212 7150369 4015795 1630460 -458684 -2959525 -5878145 -9568359
2694 -9568359 -13319288 -15735548 -16746914 -16170449 -14392456 -12664483 -11484097 -10117864
2686 -10117864 -8232180 -6440394 -5364221 -4972637 -5300454 -6745672 -8416607 -8049171 -5772134
2677 -5772134 -4066467 -3654332 -3607332 -2914057 -1530986 -230576 346715 881217 2144116
2668 2144116 3221830 3093430 2353752 1677420 535854 -1789651 -4940114 -7163040 -7390063
2659 -7390063 -6623922 -5721297 -5117661 -4846209 -4652908 -4561055 -4860708 -4824600 -4587542 -5090407
2649 -5090407 -6037132 -5919171 -4793563 -4676018 -5956920 -7382050 -8212587 -8604760 -9110516
2640 -9110516 -9757575 -10259387 -11007016 -11521814 -10702738 -8538477 -5700154 -3882747 -4167807
2631 -4167807 -5386431 -6620169 -7216909 -6200569 -3580613 -720987 1091925 1828618 2101866
2622 2101866 2389458 2461546 1770534 775066 440039 721458 826395 426159 -183175 -687903
2612 -687903 -280743 1105532 2012077 1605464 156092 -1920693 -4168451 -6224976 -7846180
2603 -7846180 -8177554 -6620043 -4006619 -1615452 -969291 -2335326 -4375174 -6009760 -6547165
2594 -6547165 -5555728 -3409416 -1235788 -210608 -229922 -509247 -1052012 -2055668 -3305153
2585 -3305153 -3868526 -2975915 -544899 2370565 3843370 3780356 2949757 1284848 -1082801
2576 -1082801 -3363840 -5879199 -9086086 -12473590 -15860975 -20394968 -28227657 -39274253
2568 -39274253 -51017632 -60336915 -64395137 -63770731 -62316527 -63350392 -68827027 -78615730
2560 -78615730 -89164889 -94270910 -89563362 -77006983 -62651056 -49714349 -38555919
2553 -38555919 -29606789 -22956896 -17833203 -13602124 -10005871 -7641143 -6375250 -5103994
2545 -5103994 -2720549 581968 3847071 6215374 6880087 6245736 6075442 6928420 7496681
2536 7496681 6395226 3688251 526405 -2021226 -3394384 -3693668 -2818400 -1019274 430670
2527 430670 992061 1293507 1276868 599296 -429425 -1522450 -2620124 -4074627 -5598875
2518 -5598875 -6091388 -5952388 -5885733 -4767340 -1771649 1849693 4114600 4197186 3426174
2509 3426174 3596338 4705629 4772015 2434556 -1234024 -4281684 -5896814 -6846834 -8426290
2500 -8426290 -10617882 -11990049 -11648081 -9962787 -8584561 -8249707 -7451936 -5654858 -4200346
2491 -4200346 -4072940 -4596290 -4617084 -3624912 -904815 3203918 6892261 8608545 8121447
2482 8121447 5864308 2237841 -1282698 -3408269 -4245202 -4305125 -3695368 -2859879 -2938653
2473 -2938653 -4100223 -4721715 -4001130 -3163631 -3481219 -4352339 -4603437 -3972347 -3318167
2464 -3318167 -3501741 -4610744 -6060594 -6675429 -6636599 -7044137 -8243562 -9820399 -11286953
2455 -11286953 -12870685 -13999864 -13425834 -11422031 -9537080 -8937646 -10012304 -11743791
2447 -11743791 -12963220 -12992243 -12065661 -11453567 -11603921 -12506749 -14032233 -15738806 -17566305
2438 -17566305 -20341559 -24135072 -27879816 -31484638 -35628500 -41425468 -48825148 -56703821
2430 -56703821 -64353070 -69831941 -71094567 -69184947 -67684900 -68873976 -73585314 -81708933
2422 -81708933 -89222570 -90161258 -82574147 -69667151 -55938526 -43868744 -33924459 -25987912
2414 -25987912 -19579136 -14347439 -9853922 -5987450 -3197713 -1440131 -160379 225286
2406 225286 -454952 -904540 -709055 -52383 1133803 1716238 998719 -513621 -2280602
2397 -2280602 -3059442 -2055684 -157733 660554 -687684 -3536103 -6863870 -10003578 -12737896
2388 -12737896 -14729785 -15565715 -15266623 -14401222 -14072702 -14350678 -14517983 -14294549 -13805787
2379 -13805787 -12886204 -11190429 -9247683 -7651458 -5787154 -4237379 -4772540 -6768839
2371 -6768839 -8268594 -9022574 -9341464 -8876431 -8519075 -8992267 -9614363 -10050260 -10242322
2362 -10242322 -10306676 -10862133 -11418126 -10933477 -9711663 -8041065 -6922926 -7457750 -9173777
2353 -9173777 -10908390 -11938060 -11729513 -10349836 -8688531 -8035547 -8692719 -9988542 -10617756
2344 -10617756 -9868347 -8889202 -8956699 -10078414 -11399167 -13579381 -16924696 -20160719 -22422806
2335 -22422806 -22935492 -21710394 -19343316 -16188128 -13540736 -12655644 -12272798 -10871029 -7956013
2326 -7956013 -3967663 -441620 1731115 3114683 4660196 6507331 7482011 6312819
2318 6312819 3512786 586029 -1394961 -2526818 -4047208 -5312611 -4508579 -2198862
2310 -2198862 -286929 148936 -882317 -2351873 -2921031 -2135684 -663112 808776 1888340
2301 1888340 2846216 3921026 4012565 2547672 1002602 120442 -537698 -772980 -170525
2292 -170525 1948496 5168741 8182379 10049100 11265994 12152992 11704318 9447194 6535226
2283 6535226 3515075 147417 -3384628 -5555543 -5022089 -3375359 -2523123 -3006492 -4417372
2274 -4417372 -5652071 -6338755 -6315398 -5214077 -3583973 -2534487 -1647648 -290167 591806
2265 591806 1101011 1983733 2266509 1751445 2143064 3458980 4105868 3308862 1908030
2256 1908030 1212823 1305982 2050909 3694932 5811358 8269408 12152079 18480986 26875671
2247 26875671 37617330 52032362 71639887 98284345 132480149 172560594 214899996
2240 214899996 253762388 283238042 297661744 290820681 261166611 217388636 173073125
2233 173073125 136766114 109925701 90336321 75172159 61890147 49970399 40368872
2226 40368872 33315596 28031308 24776445 23640539 22967700 21964702 21185547 20502542 18292237
2217 18292237 14073222 9803348 7135794 6929997 7952697 8230559 8365449 9901745 12353297
2208 12353297 14387405 15665131 16943895 18096084 18149503 17449952 17176969 18391123 20352258
2199 20352258 21326741 20433056 18013911 14913875 11262848 8226097 7624326 9240600 10732045
2190 10732045 10130861 7957580 6092583 5396199 5176727 4790929 3820416 2673730 2351755
2181 2351755 3471059 5555326 8003425 10174317 11010877 10613085 9456995 7653178 4927845
2172 4927845 1642854 -821525 -1301625 201807 2702489 5016472 7129850 9577748
2164 9577748 12185657 15108430 18369196 21189388 22859281 24638447 28500723 35656376
2156 35656376 46722093 62264419 83161048 110253057 142284340 172170900 188821459
2149 188821459 186961435 170000188 145890739 122712526 105612618 95855743 91756760
2142 91756760 92228189 98028043 110452634 130544867 156603559 181242454 192923630 186503169
2134 186503169 165484522 136619917 108306620 85504401 68061284 54685755 43960718
2127 43960718 34364991 25436639 17129648 9729473 4356052 1276643 -279166 -710760
2119 -710760 -732539 -1260847 -1799529 -847864 2040809 5485501 7822965 8253252 7346918
2110 7346918 6099959 4627080 3087458 1316237 -956341 -3019648 -3656304 -2892406 -1664635
2101 -1664635 -288942 1624147 3605069 5014021 6556113 8998301 11316017 12085096
2093 12085096 11481457 10031187 8012765 5792202 3079319 -397325 -3986725 -6943136
2085 -6943136 -8551140 -8572942 -7550539 -6031851 -4476467 -3192915 -2428466 -2606141 -3996250
2076 -3996250 -5478469 -6050962 -5571139 -4435900 -3350401 -2675838 -2281152 -1622618 -230470
2067 -230470 1627768 2767216 2603209 1380306 509510 856296 1386913 1591596 1620794
2058 1620794 982701 -235290 -1287982 -1983199 -1943013 -717227 1724101 4109643 5024750
2049 5024750 4737289 4145532 3210095 1176234 -1618832 -3915912 -5008073 -4095025 -1524217
2040 -1524217 1226940 3212292 3681781 2795846 1912866 1322352 450586 -94556 769327
2031 769327 2628873 4175718 4373027 3953224 4556859 6062953 7267797 7510468 7669231
2022 7669231 8918885 11475442 15806591 22371428 30552516 40847317 53968047 69954426
2014 69954426 89375997 111134654 130453949 142810053 143891284 130315712 107644651
2007 107644651 85242271 66959743 52407502 41240441 33258744 27943823 25838496
2000 25838496 26831357 28582178 28994760 27660274 25271152 23491383 23975230 27108635 32882791
1991 32882791 41035863 51631428 65314747 81280810 94743668 101377666 105133378 112525479
1983 112525479 123081068 127612514 117533329 96415103 73698600 54429778 39799244
1976 39799244 29900951 23291281 18342520 15076315 13659707 13364782 12684297 11269298
1968 11269298 10716923 11726802 12304975 11600367 10865011 11281358 13506874 17112038 20721913
1959 20721913 23703456 26190492 27943918 28839459 29744410 31995859 37494948 48349486
1951 48349486 66361501 91302753 115676266 127340120 125615672 119492675 111195035 97564068
1943 97564068 80113997 63514318 49951415 39174879 30803997 25365412 22085483 19284965
1935 19284965 16377327 13309715 9949193 6649154 4414955 3851064 4170598 4570406 5019043
1926 5019043 5317621 4990676 3464235 1891218 1441026 1323379 1588135 2025323 1446029
1917 1446029 -159591 -2673197 -5388675 -7138046 -7330892 -6307416 -5078841 -4162142 -3264131
1908 -3264131 -2161755 -1303943 -1577179 -2986139 -4044388 -3419837 -789237 2834144 5701234
1899 5701234 7561710 8435243 7972134 6448460 3878561 1179873 195936 1003792 2314414
1890 2314414 3568228 4301493 3847470 2462257 869677 -381210 -938440 -1193774 -1946623
1881 -1946623 -3093798 -3692623 -3175268 -2120217 -1159463 59477 1191727 2364852 4621843
1872 4621843 7949804 12068257 17478275 24389977 32869581 42942560 55426744 72278223
1864 72278223 94760593 119790473 138535033 145522817 143012199 132331010 113902031
1857 113902031 92021248 72281491 56989433 45721302 37806579 32277782 28279767
1850 28279767 25631434 23096695 20293307 18266256 17498465 17440054 17328605 16735506 15378218
1841 15378218 13817194 12594551 11145831 9138625 7069664 5422638 4535484 3841039
1833 3841039 2171354 -27214 -1772039 -2874013 -3066991 -2203528 -843879 240716 684889
1824 684889 292216 -677763 -1251284 -1182850 -1043696 -503584 789634 2916966 5875497
1815 5875497 8850307 10402038 9493690 6813813 4519998 4281182 5182696 4935196 3026232
1806 3026232 409364 -1529227 -1851712 -1192228 -825047 -1225317 -2960790 -5734424 -7621123
1797 -7621123 -7370137 -6045092 -4621112 -2250989 1362857 4907709 6941139 7011946 5423414
1788 5423414 3112748 1104840 -721776 -2565027 -4837143 -6899285 -7515417 -7265822 -7081203
1779 -7081203 -6845588 -6606855 -6528650 -6260154 -5562815 -4901276 -5199503 -6253472 -6586489 -5613736
1769 -5613736 -4026699 -2146007 -1026697 -1543108 -2987798 -3949151 -3714551 -2453913 -659869
1760 -659869 1155489 2834547 4160772 4771265 4627470 4062495 4145237 4660935 4881289
1751 4881289 5776299 7676453 9065223 8502319 6379839 4039098 2463318 1625941 1315174
1742 1315174 1809302 2422025 1973475 1000097 -16235 -1047102 -2123528 -3491658 -4419164
1733 -4419164 -4058566 -2605011 -721633 1201097 2628140 3157609 3090889 2679487 1885139
1724 1885139 1286588 1670842 3296693 5758255 8050893 9950412 11771561 12986414 12798107
1715 12798107 11190965 9185605 6925474 4571905 3402265 3493897 5203971 7595701
1707 7595701 8683961 8075690 6139543 3698961 1971825 1213079 828305 1165688 2396020
1698 2396020 3871811 5017966 5614523 5512740 4588757 3715236 3813488 4348711 3705871
1689 3705871 979435 -2408521 -4378541 -4755813 -4428722 -3593118 -1851996 234833 1256036
1680 1256036 701328 -571078 -1621441 -2892734 -4191202 -4853461 -5571221 -7197566 -9351707
1671 -9351707 -10893203 -10905192 -8792055 -5181681 -1862834 -268457 -510695 -1618211 -2525966
1662 -2525966 -2573029 -1818864 -1291031 -2004128 -3305896 -3633864 -2455311 -743150 -313346
1653 -313346 -1458929 -2526867 -2334329 -923906 1556474 4054577 5967990 7192864 6621097
1644 6621097 4043511 63713 -4753830 -9157144 -11855497 -12597598 -12028161 -11251610 -11156213
1635 -11156213 -12183091 -13145114 -12540479 -11533890 -11555740 -11831112 -11451354 -10396778 -8799793
1626 -8799793 -7319268 -6324092 -5763454 -6395171 -8027517 -9522337 -10072050 -9543306 -7958646
1617 -7958646 -5649767 -3116381 -1439037 -1249176 -1781445 -1625816 -444470 384337 -544027
1608 -544027 -2536355 -4010040 -4180069 -3295428 -1648414 510871 2265874 3034141 2595140
1599 2595140 1481858 588702 -305920 -2400876 -5278113 -7216113 -7458314 -6794539 -5614818
1590 -5614818 -3299792 -606341 1489506 3214707 4397003 4980564 5436634 5679745 5893845
1581 5893845 6412683 6621505 5296211 2512192 -977621 -4296099 -6013645 -6155102 -5748810
1572 -5748810 -5158401 -4212576 -3015725 -2362048 -2480945 -2801601 -2598351 -1783318 -588309
1563 -588309 1465968 3964239 4653300 2332097 -1051884 -3640759 -4959831 -5297139 -5318847
1554 -5318847 -5086934 -4063524 -2175123 204539 2202168 3406816 4455720 5655645
1546 5655645 6789230 7764592 8507315 8520063 7739789 7320110 8136102 9715230 10844973
1537 10844973 10914406 10335434 9613767 8967034 8633142 8687131 8714697 8523800 8891639 8965836
1527 8965836 7083091 4270478 1997334 -160147 -2128034 -2729975 -2117778 -1644934 -2116646
1518 -2116646 -2596860 -2132921 -754996 1102137 2667644 3650819 3747378 2777490 1107562
1509 1107562 -870174 -3209500 -5897147 -8099415 -9022492 -8110836 -5298867 -1816195 1011931
1500 1011931 2550620 3468513 4620399 6034552 7666849 9601616 11194745 11119409 9717686
1491 9717686 7615418 5186202 3266100 2398209 2388058 2130765 1102584 -76116 -1101390
1482 -1101390 -2076097 -2407860 -1365766 833831 3054931 4901365 5859725 4419974 1900392
1473 1900392 835246 1122007 1504586 2555087 4591987 5534252 3772074 356372 -2130735
1464 -2130735 -2793853 -3502254 -5391106 -7720554 -9615719 -10194686 -9285027 -7664214 -6156297
1455 -6156297 -4786126 -3471279 -2202926 -487997 1884442 4916518 8059106 9841906
1447 9841906 9682347 8590345 6631301 3283698 -701983 -4057928 -5964109 -5810551 -3747326
1438 -3747326 -895320 1195749 1463779 771587 -42926 -890011 -1988583 -3495142 -5121881
1429 -5121881 -6906301 -8268801 -8807532 -9335411 -10180840 -11180092 -12325771 -12593453 -10500288
1420 -10500288 -6314481 -1688265 1326228 2555756 2903946 2124709 505126 -1053831
1412 -1053831 -1773326 -964493 1209741 4188565 7587770 10417546 11757728 11302064 8742949
1403 8742949 5429718 3554187 3407597 4157317 5635890 8051679 10438115 11658048 11311094
1394 11311094 9735788 7879089 6652279 6391429 6589891 7097523 7884478 7676899 5791750
1385 5791750 3367197 1272553 -960272 -3352868 -5155586 -6385357 -6979850 -6684806 -5642949
1376 -5642949 -4102699 -2293512 -1650996 -2483000 -3340323 -3410769 -2357250 -350889 1123730
1367 1123730 1118225 -52502 -1630244 -2699516 -2740563 -1843392 -341783 1072253 1690731
1358 1690731 1127300 -634046 -3038440 -4834041 -4835405 -3811083 -2996305 -2124077 -787589
1349 -787589 224344 244958 -49658 348997 1234859 1433791 910728 1329255 2722355 2771062
1339 2771062 1037661 -128012 602299 2925368 5396738 6129630 5526763 5342102 5702075
1330 5702075 6759549 8214532 8388141 6910549 5645968 5424017 5656329 6250619 7430462
1321 7430462 8176123 7830386 6341792 3506835 -474733 -4459343 -6402968 -4848888 -1268781
1312 -1268781 1183784 837298 -1534400 -3278863 -3639527 -3772839 -3740618 -3024023 -2160910
1303 -2160910 -1801698 -1258733 273972 2045000 2911150 2431826 1073682 -581738 -2367847
1294 -2367847 -3694570 -3892529 -2725988 -533220 1420679 2168888 2270400 2324369 1923323
1285 1923323 722590 -31404 123060 -20086 -498897 -649985 -452814 -175353 -180118 -764945
1275 -764945 -1724765 -2547234 -2870952 -2366526 -1214268 -890070 -1940739 -3481923 -4650001
1266 -4650001 -4978164 -4527099 -4154586 -4034764 -3401457 -2606499 -2252988 -1703571 -650785
1257 -650785 396529 683282 116649 -693888 -992104 -353144 1504372 3191057 2347844
1248 2347844 -648364 -3534834 -4939483 -5292095 -5712329 -6189595 -5718002 -3404995 -516119
1239 -516119 1685258 3574230 5563999 7466282 8112883 6875567 3815067 32736 -2692669
1230 -2692669 -4343922 -5640660 -6183206 -5684075 -5047073 -5170920 -5614160 -5213316 -3812066
1221 -3812066 -2707860 -2847991 -3488887 -3015697 -1419903 -320956 -594090 -697472 597892
1212 597892 2338216 3907849 5954764 8620381 10353461 9839749 7762685 4910111 2215086
1203 2215086 933912 1088415 1102715 282059 -418854 -145366 1531427 3805738 4808926
1194 4808926 4702868 4316469 3174951 1105378 -1144040 -2479330 -3186658 -3680454 -3239345
1185 -3239345 -1186955 2120450 5360447 7148014 7330106 6660999 6045295 6178216 6846505
1176 6846505 7409519 7821080 8364047 8830390 8669248 7641533 6012789 4620687 3684540
1167 3684540 2724557 2387394 4123744 7531988 9954056 9741407 8113563 6149957 3917187
1158 3917187 1841755 355604 -355251 152544 1627219 3252877 5079859 6934805 7875836
1149 7875836 7733258 6759208 5600930 5442944 6656600 8370609 9569124 9860898 9538346
1140 9538346 8775354 7362238 5772259 4030602 2252767 1607614 2354300 3725090 4476303
1131 4476303 3532281 1159481 -1157415 -2403246 -3544814 -5376324 -7281436 -8941273
1123 -8941273 -9759280 -8831761 -6994651 -5465025 -4225320 -2615794 -412621 2148710 5157528
1114 5157528 8181944 9462625 8789776 7956532 8302311 10079927 11362376 10230674 7305174
1105 7305174 3903762 111710 -3841321 -6866095 -8298506 -7939122 -5889538 -2600031
1097 -2600031 1571862 5915612 9599479 12084147 12542557 11266096 10048581 9472882 9388783
1088 9388783 10135482 10646411 9707540 7849702 6872578 7480409 8937779 10425439 10788252
1079 10788252 9095052 6088169 3365361 1558678 -2880 -1761879 -3570037 -5473936
1071 -5473936 -7300965 -8441537 -8420770 -7500349 -6145201 -4437186 -2663191 -1034433 -50439
1062 -50439 -368749 -1181569 -1233931 -418577 120783 -123325 -844728 -1235295 -992149 -322676
1052 -322676 836970 1310917 204785 -1458103 -2118555 -2223486 -2620323 -3376811 -4558969
1043 -4558969 -5848890 -6600885 -6739271 -6430647 -5516346 -4708703 -4844184 -5186383 -5062005
1034 -5062005 -4822525 -4689203 -4741811 -5167310 -6136487 -7778878 -9156939 -8507930 -6076583
1025 -6076583 -4568053 -5215712 -7184646 -9761021 -11863524 -12536813 -11747204 -10258346 -9569812
1016 -9569812 -10386568 -11885408 -12805892 -12911081 -12548769 -11569159 -9723869 -7882685 -6830250
1007 -6830250 -6183569 -5588139 -5357294 -5833594 -6944647 -7875317 -7609135 -7020821 -6679786
998 -6679786 -6114414 -5353925 -4884475 -4443927 -3395820 -2001369 -988743 -631547 -1286993
989 -1286993 -3203892 -5268394 -5792767 -4426431 -2453961 -1161558 -686499 -658721 -575935
980 -575935 186198 1672525 2687464 1907080 -407482 -2115308 -2348830 -1936354 -1432367
971 -1432367 -1079559 -482419 670612 1533555 1419183 893132 909317 1559710 2504509 4177288
961 4177288 5961821 6561144 5690942 4176599 2632858 653647 -1439435 -2902337 -3562255
952 -3562255 -3451465 -3006462 -3765678 -6361950 -9399132 -11245382 -11027894 -9050828 -6608767
943 -6608767 -4542759 -2690671 -554814 2329093 5715576 8832805 10740983 10808388 10307826
934 10307826 10086715 9222340 7521304 5270406 2177587 -1556427 -4545268 -6172692 -7010416
925 -7010416 -7124353 -6717766 -6427455 -6645990 -7361147 -7658038 -6849274 -5109593 -3249455
916 -3249455 -1481676 629710 3233797 6370213 9387798 11013808 10795041 9002213 6984699
907 6984699 5803063 5157916 4250321 3135757 3084437 4016479 5855975 9075100 12740445
898 12740445 15495387 16667233 15832025 13295431 10358911 8680580 8437990 8551640 8304763
889 8304763 7739891 6951827 5785369 4705807 4450491 5091301 6255641 7163726 7013289
880 7013289 6172449 5739652 5577139 4446751 2633637 1319912 319444 -944043 -2449201
871 -2449201 -3582799 -4138813 -3988558 -2875657 -1181691 927533 2283270 2163913 1420785
862 1420785 563982 -779449 -2668811 -3785254 -3746723 -4311831 -6845445 -10082238 -11343676
853 -11343676 -10692067 -9561962 -8152766 -6484307 -4627392 -2445146 664824 4478070
845 4478070 8001694 10547680 11719156 11778116 10934992 9752065 7969737 5078313 2100256
836 2100256 -370460 -2460114 -4199317 -5901148 -6892442 -5925227 -3065960 356282 3648941
827 3648941 5758827 6044056 5056831 2471232 -976683 -4463374 -7841341 -10887615 -13486133
818 -13486133 -14651809 -13510330 -10152930 -6139715 -3746546 -2992112 -2206143 -602457 1945203
809 1945203 4934723 7405375 8919088 8711191 7080774 5622889 5358144 6468993 7503707
800 7503707 6605367 4099423 2264798 2565814 4147534 5359172 5356321 4731422 4245722
791 4245722 3916867 3955567 4103515 3945428 3197079 1153778 -1884819 -4499325 -5403850
782 -5403850 -4269737 -1985232 -25155 475964 -425166 -2115091 -3480027 -3252876 -1945127
773 -1945127 -1592800 -2611277 -3756704 -5110930 -6845819 -8797551 -10302614 -10590330 -10199396
764 -10199396 -9790708 -9215236 -9186710 -10691750 -12792167 -13816502 -13776996 -13435671 -12820094
755 -12820094 -11852382 -10770359 -9777217 -8491461 -6722263 -4920820 -3938269 -3566849 -2253262
746 -2253262 -37087 1666216 2494216 2508151 2019640 1949784 2552370 3222026 3548738 3416568
736 3416568 2534114 1658927 1377951 660951 -1240735 -3083188 -2805843 -71889 3701716
727 3701716 7305299 9079670 7874543 4762100 1405930 -927172 -1684349 -774582 1607383
718 1607383 3969751 4654438 3515136 1369523 -372159 -1561587 -3156995 -5163013 -6710816
709 -6710816 -7762464 -8463924 -8413751 -7204180 -4884777 -2614193 -2047460 -2787620 -2892010
700 -2892010 -2440951 -2622942 -3121529 -3373698 -3451435 -3946292 -4543506 -4701561 -4227368 -2917329
690 -2917329 -1195978 650509 1545325 983386 23893 -417224 -647627 -1756267 -4137942
681 -4137942 -6598694 -7709132 -7190115 -5676260 -4528645 -4034172 -3279926 -1950746 -1040453
672 -1040453 -782647 -342318 134613 560253 2073396 5275339 8485736 9975070 9878187
663 9878187 8919549 7559152 6124413 4777290 3661340 2893935 2827690 2948261 2014118
654 2014118 106049 -1211110 -807411 146844 -389887 -2225547 -3445133 -3232417 -2670584
645 -2670584 -2314611 -1466838 223690 2338927 3491592 2863368 1317503 -221243 -1511144
636 -1511144 -2310610 -2665162 -2914171 -3297900 -3736627 -3685012 -2594657 -222284 2958750
627 2958750 5738550 6764558 5684138 3236155 1018219 344356 78608 -922015 -1547882
618 -1547882 -1057591 88462 838902 723282 307709 277176 608585 985946 1174946 950611
608 950611 1184499 2219005 2745161 2239509 2451348 4360731 6642276 7879427 7544958
599 7544958 6189696 4476524 3484517 3887824 4234422 3321342 1985778 1757393 2715779
590 2715779 4322880 6036331 7203660 7686589 7517838 6764190 5698329 5193185 5477391
581 5477391 5891654 6750519 7953402 7987763 6433254 5321434 5172195 5052592 4958729 4790320
571 4790320 4711570 4820646 4739971 4516749 4798293 4900201 4197280 3325136 2673821 1830865
561 1830865 826327 166808 107854 -393969 -2087847 -3494034 -3534521 -3214924 -3649758 -4511280
551 -4511280 -5322113 -6041702 -6573568 -6715120 -6773724 -6879175 -6329992 -4819050 -3088786 -2137008
541 -2137008 -1818022 -1969298 -2960629 -4462609 -6153651 -7779676 -8632098 -8122012 -6402751
532 -6402751 -4236487 -2543764 -1324293 -166705 504684 -351790 -2808037 -5412098 -6812515
523 -6812515 -7318966 -8147042 -10070289 -12093172 -12497375 -11028416 -8410202 -5373209 -2458683
514 -2458683 8857 1733809 2588827 2570879 1927986 1958670 2039490 734127 -846177 -1121518
504 -1121518 -265381 117426 -24864 866095 2795558 4857236 6888871 8343864 8822502
495 8822502 8310508 7520884 7074831 6399785 4868143 2788509 -57453 -3605218 -6626372
486 -6626372 -9128198 -10954615 -10749767 -8349624 -5520915 -4005012 -3487468 -2907946 -2703710
477 -2703710 -2851882 -2445886 -1498291 -304543 1532455 3917175 6499678 8683349 8901125
468 8901125 7128541 5515015 5168067 5010006 4676351 4839327 5617318 6516755 6910605
459 6910605 6390360 5336201 4471003 3670250 2857881 2388739 2072838 1448181 624583 -265282
449 -265282 -1327108 -2004887 -1661827 -1318308 -1851121 -3184430 -4915426 -5652835 -5074524
440 -5074524 -3915467 -2464982 -1331417 -1050772 -1640380 -2558902 -3464105 -4306666 -4596065
431 -4596065 -4159593 -3489844 -3798339 -4611850 -3853204 -1510562 835050 2067876 1804550
422 1804550 620917 70560 -223964 -1541229 -3470999 -4769642 -5110852 -4898738 -4517842
413 -4517842 -4213980 -3326830 -1496328 540407 2487560 5134404 7812123 9529046 9754422
404 9754422 8118646 4970410 2280685 2119749 4730810 8996138 12178958 11962316 9200935
395 9200935 6416889 4723264 3491572 2448700 1706593 2050190 3954157 6559971 9097199
386 9097199 11209014 12280200 11730044 10615976 10717632 11760567 12077024 11385524 9886267
377 9886267 6963640 3008706 173835 -148162 946498 2342601 4584471 8173975 11952194
368 11952194 14334752 15755629 17090331 17733425 17133908 16298184 15489029 14394452 12987140
359 12987140 10774561 8054943 6298303 6614225 7903729 8152665 6283301 2995120 291192
350 291192 -323930 1209113 3565865 5265722 5983579 6273747 6507490 6710495 7002786
341 7002786 7643553 8219877 8479796 8490090 8568236 8972386 9750583 11153449 12814633 13981996
331 13981996 14468992 14611417 14656678 14364766 13658211 13197241 12516300 11652527 11591391 12189415
321 12189415 12373872 11528059 9891665 8653940 8420774 8696202 9300006 9431457 8359757
312 8359757 6253028 3866727 2585044 3020589 4375060 5795992 6833426 6613888 4125628
303 4125628 -71420 -3973596 -5479149 -4401935 -2807062 -2123935 -2049718 -1233689 567806
294 567806 2034300 2517777 2681266 2797255 2513847 2470214 2816728 2630689 1839217 1429764
284 1429764 2200295 4142250 6243325 7857716 9472506 10664512 10857340 10031267 8617264
275 8617264 7974334 8599961 9771253 10939264 11831059 12618282 13769159 15319851 16769649
266 16769649 17536740 16727909 14322267 12212117 11555897 12037387 12933985 13511311 13426625
257 13426625 13301463 13241102 13074223 12868704 12592526 12377780 12511898 12962990 13025173 12387928
247 12387928 11002715 9036465 7174379 6255189 5789489 4588955 2316459 187400 -728638
238 -728638 -336333 328984 822817 1606236 2511705 3461092 4295946 5146057 6273211 8037398
228 8037398 10437020 12213151 12797905 12078963 10169409 8418741 7653820 7450763 7458941
219 7458941 7050175 6228085 5856967 5571729 4236342 2019978 645835 993172 1650377
210 1650377 1587754 1088377 344793 579306 3073698 7138794 10349080 11385222 11432582
201 11432582 11360696 11564823 12688263 13953889 14156947 12936248 10717621 8165476 5653159
192 5653159 3035068 999582 755948 1865634 2990216 4229994 6492599 9961114 13902567
183 13902567 16777140 17479770 16270997 13957058 11477537 9522984 8848778 9739289 11057972
174 11057972 11786938 11755933 11193885 10593472 10194538 10564149 11676749 12622572 13210404 13444807
164 13444807 12954209 11848683 10118724 8206887 6817611 5899035 5595043 5956245 6656489
155 6656489 7187761 7505321 8098367 9159116 10261069 10928899 11235764 11153632 10585950 10222619
145 10222619 10137191 9628609 9043375 8541351 7591045 6476299 6133992 6114570 5825784 5705970
135 5705970 5654325 5381000 5252786 5528226 5727855 5222065 4352290 4413074 6052837 8724832
125 8724832 11301968 12763300 12846170 11959320 11095735 10258778 8968309 7639721 6430162
116 6430162 5408282 5257595 5920011 6960646 8288445 9343968 9688041 9421503 8886168
107 8886168 8191382 8086379 9086702 11009651 13314271 15213175 16206688 15662234 13040148
98 13040148 9453977 6969267 5775581 5263783 5333833 5565156 5577819 5703789 6223427 6950007
88 6950007 7768232 8547280 9255325 9746853 10220423 10678111 10990403 11140260 11515702 12550330
78 12550330 13536965 13617047 12907822 11849091 10606307 9117554 8069188 7794834 7541649
69 7541649 7071814 6627820 5857391 4683049 3373578 1866274 420886 -532855 -771583
60 -771583 226987 2279037 4803913 7570328 9931994 11266766 11388397 10335610 8876040
51 8876040 8048488 8283757 8967082 9467600 9527498 8919678 8517338 9041015 10054103 10979886
41 10979886 11676500 11871961 11285078 10067125 9151360 8779254 8340777 7714717 7045735 6068244
31 6068244 5146791 4828939 4978714 5968998 7997301 9881403 10201266 9315096 8378880 7818844
21 7818844 7226468 6278723 5354068 4910232 5094537 5595832 6362484 7812853 9390934 10177270
11 10177270 10369114 10594414 11186164 12028169 12407506 12038302 11537800 11320551 11196778 10938884
1 10938884 10282567
0 10282567
$$ Imaginary data points
##PAGE= N=2
##DATA TABLE= (X++(I..I)), XYDATA
16383 -2398470 -3024118 -3734481 -4397178 -4985937 -4995084 -3904418 -2171256 -394972 1005619
16374 1005619 1335630 913857 957174 1186714 583271 -413371 -891613 -500207 660182
16365 660182 2111492 2944641 2702765 1649697 94244 -1691141 -3326268 -4317921 -4837698
16356 -4837698 -5393228 -5725175 -5754848 -5781261 -5551269 -4723205 -3305424 -1546581 -260689
16347 -260689 -105537 -958131 -1555446 -1016781 197561 1706007 3558758 5391101 6358015
16338 6358015 6563930 6544060 6078484 4911854 3014915 941081 -1028873 -3165530 -5162262
16329 -5162262 -6308316 -6380051 -6219514 -6554701 -6839699 -5923971 -3857234 -1672952 224201
16320 224201 1841445 2734665 2595994 1210793 -795575 -1942943 -1454092 -162150 435591
16311 435591 -530575 -2564700 -4257004 -4316609 -2867879 -1087199 -14588 458675 340260
16302 340260 -195368 179282 1929178 3665232 4226721 3678526 3025519 2856027 2151724
16293 2151724 521690 -913023 -1385772 -1289937 -1022695 -531609 -103300 -275289 -1140032
16284 -1140032 -2691718 -5073679 -7796022 -10332948 -12435877 -13657534 -13733105 -13167505 -12675473
16275 -12675473 -12182575 -11554106 -10779075 -10242532 -9726153 -9033154 -8327983 -8139467 -8815219
16266 -8815219 -9971523 -11144123 -11210632 -9849433 -8329397 -7691737 -7726127 -7195718 -4740287
16257 -4740287 -516230 3511544 5918802 6970104 6692660 4976073 2917563 1504860
16249 1504860 1167679 1964641 2952024 2799307 1434908 -222475 -2233936 -4758842 -6391639
16240 -6391639 -6127291 -4900961 -4201971 -4301632 -3894613 -1803694 2034663 5542434 6422374
16231 6422374 5519349 4987790 5473758 6390582 7130815 7330278 7025194 6497178 6115430
16222 6115430 6585947 7720336 8451272 7972319 6117309 3813053 1964207 190941 -2124038
16213 -2124038 -4488106 -6118349 -6625955 -6017775 -5284924 -5234124 -5961801 -7032011 -7385726
16204 -7385726 -6857387 -6070005 -5411835 -4873590 -4605700 -4479687 -4316608 -3973900 -3028743
16195 -3028743 -1631976 -331698 607598 1505270 2388907 1839079 -434574 -3020197 -4658856
16186 -4658856 -5331225 -5620948 -5948169 -6555691 -7625547 -8789686 -8779346 -7951953 -7474949
16177 -7474949 -7684923 -8318300 -8679299 -7964262 -6126394 -3841879 -1516371 763632 2246890
16168 2246890 2022570 700307 -457810 -789599 -456369 -165136 -239317 -689586 -1365737
16159 -1365737 -1160415 638338 3009899 4326676 3744649 2618307 2640637 3837223 5305259
16150 5305259 5623157 4572386 3293291 2218456 1449688 1117020 1311867 2033900 3092117
16141 3092117 4011893 4737991 4843044 3490952 1177131 -675474 -1223641 -1655539 -3594969
16132 -3594969 -6681239 -9097891 -10046250 -10246223 -9912758 -8268398 -5164596 -2327467 -1120575
16123 -1120575 -729440 -908112 -2021598 -3671985 -5732942 -7809650 -9105349 -9323990 -8831297
16114 -8831297 -7773561 -5873921 -3434494 -1858280 -1889220 -3297478 -5755640 -8321741
16106 -8321741 -10206076 -11465599 -12389631 -12721527 -11990941 -9941063 -7351968 -5755550 -5625817
16097 -5625817 -6245124 -7105490 -7999423 -8462192 -7997748 -6847359 -5237995 -3539955 -2646922
16088 -2646922 -2991068 -4024960 -5585121 -7153460 -8055490 -8715271 -9787109 -11412293 -12349118
16079 -12349118 -11364781 -9039473 -6070154 -2855692 -351348 484926 -374447 -1894137
16071 -1894137 -2812522 -1985501 138153 2299932 4440973 7524089 11111336 13878197
16063 13878197 15411323 15318413 13217864 9759389 6127514 3059009 628990 -1877369
16055 -1877369 -4738512 -6921496 -7569892 -7523867 -7171726 -5722616 -2867241 374422 3233757
16046 3233757 6136005 8604948 8436180 4818455 -15237 -3608223 -4452187 -2584399
16038 -2584399 -429173 -127365 -1487132 -3787061 -5811557 -6469876 -5855738 -5027540 -5468179
16029 -5468179 -7476725 -9556988 -10882222 -11983599 -12944664 -13044981 -12177702 -10725338 -9209063
16020 -9209063 -8017593 -6617615 -4783133 -2928329 -1717496 -1381613 -881406 314446
16012 314446 1419086 1522790 194808 -2641713 -6124036 -8970678 -10765509 -11664271 -11581378
16003 -11581378 -10971771 -10324213 -9650800 -8768175 -7255183 -5233577 -3611953 -3229317 -2937077
15994 -2937077 -1479569 892066 2918668 3729235 3314659 2071233 584131 -304234 -618962
15985 -618962 -1713658 -3848611 -6535897 -10076921 -14359503 -17589519 -18916089 -18948031 -17713823
15976 -17713823 -15685163 -13701131 -12275822 -11117365 -9324125 -7639639 -7548714 -8586497
15968 -8586497 -9829279 -10918121 -11343458 -10469439 -8059390 -5013530 -3346695 -3522709 -4411918
15959 -4411918 -4505038 -2985678 -517684 1321183 1367170 232635 -1112596 -2131577 -2525726
15950 -2525726 -1869504 -877994 -407549 -625136 -601079 238392 1736649 2987696 2927152
15941 2927152 3181533 5288260 7685323 7824643 4692363 201191 -3141279 -4111004 -2442456
15932 -2442456 1035093 5063599 8003458 9006496 8721705 7814334 7033739 7504653 9232762
15923 9232762 11260865 12822331 13734767 14539928 15457422 16582869 17372660 16280973 13465756
15914 13465756 10328807 7886215 5762671 3323821 1649072 2351151 5189907 8318482
15906 8318482 9657750 9177013 8160472 6376877 3607582 989458 -359492 -1479018
15898 -1479018 -4022476 -6709160 -7477523 -6276781 -3904196 -1608123 -626331 -531114 -66974
15889 -66974 1157892 2031314 1503698 310040 -888549 -1840997 -2026635 -2074285 -1991159 -504399
15879 -504399 1910356 3685358 4896208 5484232 4312474 1096986 -2985330 -6274405
15871 -6274405 -8099347 -9066703 -9834727 -10220866 -9995360 -8842548 -6341762 -2803917 834783
15862 834783 4198015 7159808 9327540 10455471 10183557 8540115 5815309 3116084
15854 3116084 1202402 -234392 -1597065 -3086339 -4786622 -5821131 -4869050 -2544853
15846 -2544853 -258231 1650310 2770784 2160982 182964 -1745413 -2588297 -1652080 909282
15837 909282 3606797 5680964 7132898 7407898 5976900 3600976 1862018 1087078 457951
15828 457951 -120047 -106068 544728 1278195 994032 57756 -206343 -18058 -54205 -90144
15818 -90144 -333056 -1288869 -2778731 -4863796 -7329296 -8926785 -8811713 -7298094 -4629835
15809 -4629835 -1733987 817862 2835160 3695101 3210469 2852236 4130238 6006567 6739677
15800 6739677 5843667 3571500 1168937 -658111 -1366368 -715238 -412309 -1742594 -4331739
15791 -4331739 -7202244 -10050842 -12788757 -14771795 -14438303 -10537184 -4573257 845154
15783 845154 4997450 8166499 10256001 11426923 12347542 12647393 11856451 10947057 10281467
15774 10281467 9219442 7994806 7259057 7604580 9183595 10283726 9445154 7606089
15766 7606089 5942345 4585186 3456341 2249751 218755 -1989006 -3556728 -3901336
15758 -3901336 -2366730 92766 1617603 1521995 453896 -1042283 -2341713 -3097821 -4325599
15749 -4325599 -5357062 -3891544 -501076 2771221 5209679 6761498 7410721 7107414
15741 7107414 5903143 4481381 3402295 2215038 992037 857934 1913202 3188023
15733 3188023 4365500 5571498 6180718 5462125 3013341 -667427 -4487160 -7359417
15725 -7359417 -8706403 -8835476 -8277745 -8597046 -10104609 -10833108 -9305260 -6332658 -3298248
15716 -3298248 437673 4763072 7786112 8652109 8307647 7737786 7018575 5852594 3869011
15707 3869011 1961295 1906214 3449750 5231570 6396943 6823078 6469660 4852136 1877068
15698 1877068 -1732719 -4324558 -5527289 -5918899 -5155170 -3244220 -940854 977538
15690 977538 1421873 306979 -1713750 -3776909 -5026722 -4707252 -2584974 326746 3081297
15681 3081297 4953838 5961073 6142184 5360790 4115496 2729373 1068480 -847039
15673 -847039 -3148676 -5390875 -6298089 -5485694 -4459601 -4438610 -4704852 -3980583 -1965350
15664 -1965350 596662 2273669 2152453 465137 -2135253 -4446298 -5476909 -5501030 -4729579
15655 -4729579 -3422477 -2777680 -2870771 -2369033 -1091190 413616 2022032 3227224 3468536
15646 3468536 3159205 3243998 4047244 5034537 5627730 5325555 4259078 2252152 -366006
15637 -366006 -2016760 -1735751 224064 2425012 3081463 1430436 -414797 -291908 642361
15628 642361 53885 -1646845 -2717270 -3306747 -3955520 -4152618 -4172868 -4246380 -3538115 -2551268
15618 -2551268 -2745807 -4241808 -5827635 -6086904 -5042144 -4165917 -3837862 -3401787 -3223792
15609 -3223792 -3865491 -4596593 -4796517 -5295287 -5945404 -5538826 -4433456 -3563096 -3401236
15600 -3401236 -4163480 -5723428 -7612873 -8985991 -9244533 -8394196 -6446039 -3644513 -997023
15591 -997023 -19324 -803338 -1761415 -1591917 -202318 1184726 2018301 2311895 2487472
15582 2487472 3178263 4585081 6167285 6656944 5274947 3351712 3188881 5523016 8500194
15573 8500194 9801928 8816240 6483227 4289006 2977142 2015169 565642 -1045838
15565 -1045838 -2282899 -3594425 -5451920 -7688343 -9903115 -11522897 -10677779 -6935129
15557 -6935129 -2240357 1302019 2478442 1117444 -928505 -2056697 -2323595 -1712475
15549 -1712475 -213964 1830758 3491167 4298174 3737948 1870310 -678504 -3151358
15541 -3151358 -4251665 -3602687 -2028762 458174 3709249 6657972 8120541 7682977
15533 7682977 6400067 5960490 6586844 6877487 5992359 4976875 4570069 4231051 3183409
15524 3183409 1514322 242400 112781 210125 -338803 -1394677 -3278073 -6076308 -8744074
15515 -8744074 -9714232 -9727369 -9835728 -9952206 -10515211 -11174233 -11206643 -10206236 -8591546
15506 -8591546 -6890298 -5051151 -3521204 -2593740 -1057479 1088517 2623222 3271506
15498 3271506 3254762 2740676 2033094 1039988 156507 -618705 -1821803 -2961567 -3527624
15489 -3527624 -3582136 -3576660 -4137764 -4587792 -4755541 -5811628 -7511845 -9345617 -11602462
15480 -11602462 -13213943 -13020791 -12825906 -13986788 -15653089 -16257745 -14885375 -12299256
15472 -12299256 -9535632 -6977833 -4760863 -2867104 -1622846 -1592420 -2379998 -3529262
15464 -3529262 -4857426 -6015273 -6696703 -7054164 -8187429 -10122877 -11564131 -11778539 -11431129
15455 -11431129 -10508450 -8518131 -5373481 -1519344 1670181 3965180 6112755 7442017
15447 7442017 6991576 5947467 6390366 8345264 9759702 8600118 4797976 198710
15439 198710 -2333710 -2042402 -569457 926005 1827615 1670459 389427 -1188642 -1990973
15430 -1990973 -1895225 -1743985 -2308815 -3433817 -4112172 -3969500 -3907692 -4809150 -6455706
15421 -6455706 -7553628 -7519267 -6896585 -6059528 -4605855 -1791462 2094461 6163125 9589287
15412 9589287 11776743 11610782 9525245 7598031 7026610 6695330 5276479 3904783 3582002
15403 3582002 2502942 -511055 -3137264 -3661477 -2601058 -2007064 -2533019 -3236287 -3586196
15394 -3586196 -3166103 -3025981 -4772366 -7178850 -8329119 -8981614 -9798152 -10084530 -10009388
15385 -10009388 -9451252 -7488060 -4798929 -3565806 -3957797 -4486919 -4500692 -3753671 -2254616
15376 -2254616 -1239580 -1348267 -1473180 -1061058 -508950 -124889 496396 1359369 2464917
15367 2464917 3768506 4581372 4066963 1981488 -824128 -3481493 -6217339 -8036779
15359 -8036779 -7573029 -6457256 -6864956 -8709449 -9444678 -7645790 -4965324 -2914491 -1440604
15350 -1440604 -104 1030691 935338 61751 -346660 697740 2900937 5207494 6368855
15341 6368855 6418754 6149635 5789167 4946765 3820849 3124993 2954566 2804753 2243347
15332 2243347 1431430 241327 -1170415 -1056818 634192 2070497 2564421 2170595 1355358
15323 1355358 385761 -72985 884194 2939599 4747806 5070081 3432764 1061256 -355931
15314 -355931 -983187 -1658837 -2203511 -2514118 -2198635 -397535 1451786 1463183 -295839
15305 -295839 -2803550 -5682602 -9197734 -12785551 -15536189 -16855499 -16282023 -14150803
15297 -14150803 -11230584 -8318787 -6154819 -4540029 -3218380 -2459165 -2175273 -1441034
15289 -1441034 176449 1403833 1172103 522336 1110561 3082467 4795713 4909229 3909020
15280 3909020 2647480 1256171 -63562 -864935 -1489727 -2799342 -4798428 -6972904
15272 -6972904 -8830921 -10204473 -11259616 -12294983 -13127772 -13207145 -11960686 -9949358 -8330850
15263 -8330850 -7504891 -7122579 -6014948 -4601743 -4120930 -4169567 -3880103 -2914237 -1072359
15254 -1072359 1324433 3228974 4735960 6096732 5931026 3492654 555976 -587920
15246 -587920 281241 1861462 3069291 3985568 5212699 5794901 5085609 3735978 2511311
15237 2511311 1494986 370431 -275652 -460017 -905493 -1098856 87820 2191937 3358259
15228 3358259 2507125 298991 -1330813 -1445894 -910904 66960 1676194 2452548 1486072
15219 1486072 -406067 -1297439 -220938 1748707 3770917 5760634 7532739 8207498
15211 8207498 8441550 9228663 10110048 10977765 12238634 13463362 12906995 9961521 6452800
15202 6452800 3257217 292548 -1891777 -3396328 -4919562 -6237380 -6599864 -6082741
15194 -6082741 -4752203 -2706005 -974792 -306936 -176742 -53352 -65301 326667 932675
15185 932675 35965 -2397108 -5029899 -7224878 -8047372 -6832467 -5057872 -4156308 -2894762
15176 -2894762 289037 4476825 8183292 11028061 13362913 15080799 15028477 13168395
15168 13168395 10502253 8085903 6643212 5948711 5398207 4666037 3769359 2866977 1948293
15159 1948293 450430 -2431385 -5574938 -7154170 -7691862 -8405073 -9623833 -10958302
15151 -10958302 -11597028 -11315672 -10500384 -9189662 -7080258 -4956469 -3327697 -2351337 -2160758
15142 -2160758 -2010415 -1854690 -2294549 -3625916 -5606989 -8109974 -11355779 -14978133 -17889580
15133 -17889580 -19277456 -19214437 -18751208 -18222983 -16051856 -11946032 -8035580 -5145461 -2817858
15124 -2817858 -485731 1865690 3910035 5378031 5400341 4014283 1908084 -398180
15116 -398180 -2363401 -3688239 -3895233 -3090724 -2151144 -1813866 -1925004 -1309131 613781
15107 613781 3603620 6893518 9528876 10830316 10766812 9512222 7368496 4859271 3141234
15098 3141234 2797740 3204100 3800746 4072016 4183950 4265246 2939141 188752 -2193410
15089 -2193410 -3090974 -2317080 -868007 64095 517298 1151804 2260263 3645770 4528179
15080 4528179 4412227 3900529 3954357 4646100 5232283 5183661 3922273 1007892 -2522992
15071 -2522992 -4807062 -4490187 -2138877 294439 1432911 804801 -1082909 -3509485
15063 -3509485 -6002310 -8129774 -9868700 -10689782 -10460495 -9630886 -8372672 -7343293 -6861130
15054 -6861130 -6117203 -4538856 -2202920 378696 2541251 3877287 4014835 3346022 2859527
15045 2859527 2676783 2187921 2145450 3410979 4388442 3583373 1523582 -483614 -1579992
15036 -1579992 -1419476 243203 3035558 5545159 5966953 4371274 1863881 -865015
15028 -865015 -2909060 -3372089 -2520102 -2115070 -2803744 -3227344 -2145944 70234 2422449
15019 2422449 3743207 3677987 2907065 2349999 3237953 4784273 5086901 4835641 5084476
15010 5084476 6561886 9463156 12037881 12137660 10103022 8321255 7907704 8473996 9071929
15001 9071929 9371562 8722166 6063558 2575750 537040 729202 2839186 5487948 7421320
14992 7421320 8471174 9246581 10013115 10488612 10703623 10402836 9548376 8526335 7139138
14983 7139138 4928190 1865464 -1554698 -4073487 -4979171 -4932432 -4604223 -4472258 -4882304
14974 -4882304 -5340651 -5110798 -2795055 1345719 4389003 4285067 1665084 -764506 -799214
14965 -799214 218356 -69387 -1093351 -1123267 -551134 -833294 -1486051 -1553165 -1146905 -673744
14955 -673744 87456 1152607 2237285 2844274 2842968 2619930 2825307 3414717 3536738 2991471
14945 2991471 2452751 2617243 3113446 3330170 3291272 3384860 3282685 2523600 1469066 735608
14935 735608 820844 1478572 1538449 438894 -1140399 -2278492 -2770109 -2463022 -1941568
14926 -1941568 -2473386 -3987727 -5259548 -5751267 -6370748 -7152217 -7401986 -6980736 -6120454
14917 -6120454 -5233217 -4264161 -2213225 705742 2883418 3820300 3820543 3296785 2685840
14908 2685840 1638524 99822 -1248531 -2445197 -2859514 -2309435 -2644935 -4919695 -7796536
14899 -7796536 -9030828 -8079479 -6413883 -5355298 -4743077 -4461828 -4627093 -4613571 -3845135
14890 -3845135 -2594189 -1443573 -1019443 -1792852 -2966806 -3127691 -2790616 -3267023 -4329167
14881 -4329167 -4666992 -3476696 -1198657 834803 1686222 971339 -672464 -2271354 -3394514
14872 -3394514 -4287462 -4979229 -4807504 -4366994 -4427861 -4619945 -5110703 -6095027 -6724205 -6933855
14862 -6933855 -7296772 -7277815 -6507065 -5624747 -4729720 -3300898 -1467858 -355084 -469457
14853 -469457 -771060 -363696 163812 798346 1981925 4218878 7348209 9946766 10994893
14844 10994893 10657675 10251320 10848411 11286691 9781560 6523361 3523910 1877509 1338740
14835 1338740 1834326 3120373 4079133 3881971 3136676 2902816 3227817 3853856 4150608
14826 4150608 4076647 3748260 2661782 1956729 2796614 4057339 4997013 5815483 6180874
14817 6180874 5316272 2619237 -1018083 -3969651 -6029358 -7115218 -6636335 -4603822
14809 -4603822 -1753866 820891 1938428 1413166 -156702 -2238604 -3843879 -3962573
14801 -3962573 -2346043 195609 2694670 4321937 5289102 6555409 8518176 10137743
14793 10137743 10061112 8301271 5714592 4019169 4048822 4954889 5895878 5771892 3905456
14784 3905456 1524413 631470 1528978 3303418 5615029 7729379 8252973 6425914 3010466
14775 3010466 -280953 -2126935 -2560118 -2539688 -2587070 -2572255 -2287112 -1481513 -96556
14766 -96556 1049432 1585751 2280831 4043531 6418902 8414537 9551025 10506293 12054014
14757 12054014 12839093 12031262 10650723 9962340 10171883 10172175 9662891 9225365 8711938 7555282
14747 7555282 6169656 5683294 5720329 4875247 3132893 1515709 1166071 1140117 -138170
14738 -138170 -2249059 -3911378 -5265052 -6178377 -5963606 -4662367 -2887976 -1598985 -1454390
14729 -1454390 -1854799 -1273343 646300 3206995 5839058 7855447 8349542 7315853 6045531
14720 6045531 5497036 4899849 3627952 2612859 2238185 1686439 820856 653984 1507156
14711 1507156 2221779 1436657 -811419 -2636278 -2740617 -2085103 -1862230 -1625765 -1375889
14702 -1375889 -1930500 -2834216 -3470147 -4432321 -5270606 -3935805 -445697 3218046 5694526
14693 5694526 6552703 5927626 4673783 4330821 4555002 3669434 1246218 -1810174 -4644047
14684 -4644047 -6429837 -6684164 -6320619 -6446265 -7622824 -8863107 -8712597 -7507524 -6219646
14675 -6219646 -5240427 -3992505 -2316884 -506269 661044 481661 -362350 -758284 -1246104
14666 -1246104 -2571831 -4186682 -5698553 -6938162 -7396602 -6608640 -5149624 -3979035
14658 -3979035 -2849662 -748905 2245220 5356667 8219794 10908569 13356395 14837517
14650 14837517 14594522 12460787 9490088 8264070 9421470 11035515 12252463 12847110
14642 12847110 12400340 10864446 8838836 7184590 6371851 6325300 6974312 7858519 8053190
14633 8053190 7845402 8657172 10377335 11503384 11415343 10500965 9680840 9174710 8969172
14624 8969172 9014330 8547624 6704645 3616374 413989 -2155211 -3230709 -2570662 -1870328
14615 -1870328 -2067602 -2517775 -2247851 -861594 1296329 4111402 7242075 9798471 10593564
14606 10593564 9129742 6321253 4127766 3780088 4164534 3152831 1077223 251636
14598 251636 1173799 2849323 4579418 5330144 3945000 1875951 1611982 3109801 5213146
14589 5213146 6875742 6624688 4851625 3914169 4597156 5540278 6335758 7580886 8694928
14580 8694928 8293680 6445513 4641993 3622831 2855027 1250312 -636735 -901804 470195
14571 470195 2376625 4037537 4791699 4682579 3744065 2472913 1739775 1475697 951534
14562 951534 386978 -268807 -1247195 -2211187 -2933904 -3517237 -4691364 -6127995 -6686018
14553 -6686018 -6065035 -4559365 -2728562 -1421364 -1333741 -2123539 -2471774 -2378441 -2164752
14544 -2164752 -1240791 -220723 -29462 -679543 -1543172 -1795556 -1395106 -981147 -1042668
14535 -1042668 -2132451 -4000750 -5928057 -7038774 -7240873 -6994896 -6270968 -5458458 -4222279
14526 -4222279 -2231230 149657 2287961 3799162 4473348 4160894 2710675 506805
14518 506805 -1285398 -2289986 -3397735 -5312748 -7500070 -9027904 -9617697 -8565505
14510 -8565505 -5681525 -2165372 392694 1171384 432553 -322159 138284 1051338 1674303
14501 1674303 2319424 2449347 1460863 -367678 -2506250 -4612300 -6089799 -6250430 -5894889
14492 -5894889 -5939952 -6220072 -6127598 -5103125 -3089808 -1236249 -723087 -1336669 -2016934
14483 -2016934 -1739688 -685225 -436534 -1511486 -2900362 -3461086 -3153648 -2648580 -2493118
14474 -2493118 -2546794 -2166664 -1636133 -1498971 -1506709 -1223371 -1286917 -2862158 -4703021 -5546767
14464 -5546767 -6243397 -6944507 -6922354 -6518098 -6246284 -5989619 -5299339 -4213751 -2675253
14455 -2675253 -104597 2928482 5630424 7076010 7483939 7984197 9118803 10092597 9841290
14446 9841290 8457133 7348126 7045553 6219497 3911815 1147438 363627 1309744 2011361
14437 2011361 2208502 2310083 2240364 2025418 2329115 2973254 2934376 2183564 1304677 885993
14427 885993 1268302 1873584 1577885 -167501 -2650090 -4933014 -6620667 -7422533 -7235243
14418 -7235243 -6131657 -4746584 -3470302 -2120310 -1090493 -1304810 -3023754 -5018847
14410 -5018847 -5815840 -5169318 -3359402 -557339 2504669 5165407 7299622 8028885 6630201
14401 6630201 4262768 2283629 1259984 827447 199236 -549402 -1075589 -1372795 -980852
14392 -980852 154657 1046331 1196993 550399 -373296 -1322860 -2537214 -3520002 -3688207
14383 -3688207 -3190976 -2609774 -2112947 -1877837 -2315237 -2932631 -2871985 -3081046 -4459980
14374 -4459980 -6220372 -7482376 -7781484 -6539180 -4253969 -2127390 -782322 -180867
14366 -180867 575172 996110 444027 -657522 -2202293 -4105815 -6307630 -8968965 -11217519
14357 -11217519 -11785640 -11366698 -10860646 -9667951 -7533039 -5124123 -3698938 -4129028 -6053044
14348 -6053044 -7582789 -6954491 -4863436 -2170029 334413 1327147 1206417 263917 -1759923
14339 -1759923 -4299512 -7252269 -9406345 -8741379 -5867133 -2340769 1049535 3386487
14331 3386487 3720374 1373531 -2507565 -5941745 -8457002 -10385177 -11321633 -10335767 -7921611
14322 -7921611 -5075743 -2261244 -366328 -1097975 -4061050 -7079170 -8877003 -9211945
14314 -9211945 -8328893 -6717534 -5213050 -3677455 -966588 2022295 3330650 2486821
14306 2486821 1222360 1194717 1813551 1246923 -837881 -3369772 -5405602 -6425852 -6369774
14297 -6369774 -5574248 -3900859 -1773066 -242298 -440219 -2554144 -4552772 -5174845 -4364555
14288 -4364555 -2676876 -961984 291218 1646250 3477303 5450114 6954069 6793292
14280 6793292 4896939 3295963 2894041 2577833 2078029 2229099 2948801 3169651 2434152
14271 2434152 1892836 2633816 4060252 4691880 4215547 3968535 4752340 5233031 4496464
14262 4496464 3309973 3377166 5209740 7426090 9394235 11374960 12729080 12529280 10529384
14253 10529384 7490961 4756713 3357084 2920449 2511859 2037877 2462936 3896258 5286772
14244 5286772 6221422 6539950 5995751 5418395 5508372 6675652 8357010 8670036 6847880
14235 6847880 4236488 2249334 981498 396322 910839 2443334 4133837 5463308
14227 5463308 5975451 5188559 3617142 1918797 720397 199945 -346754 -472407 254826
14218 254826 987875 850076 -455220 -2136970 -3319990 -4474749 -4923979 -3691038 -1155797
14209 -1155797 2145351 4975461 6169353 5911951 4973097 3620712 1936351 361173
14201 361173 -685322 -1323560 -1432472 -1733288 -3736021 -6133466 -6566202 -5582910 -4711335
14192 -4711335 -3676748 -2036547 -323937 623739 374128 -239027 165165 1118080 1231645
14183 1231645 239732 -1240596 -1785411 -377990 2183770 4240073 4819559 3853363 2215915
14174 2215915 1075399 -178180 -1796706 -2846355 -3253239 -3387685 -3338891 -3143729 -2819299
14165 -2819299 -2702702 -2502961 -1911848 -1497528 -1852135 -2062445 -1332823 -342380 312711
14156 312711 168044 -90903 824490 2832300 4992553 6049789 6185921 6081770 5847878
14147 5847878 5639464 5719485 5707316 4996648 4584176 6037713 9142770 11821920 12560531
14138 12560531 11020856 7572897 2955098 -1202978 -3666984 -4549332 -4452353 -3984138 -3088290
14129 -3088290 -1573262 564841 3169103 5495872 6573130 5117759 1540984 -1014096
14121 -1014096 -801015 410859 641559 405236 605432 1031712 1320454 676530 -1223933
14112 -1223933 -2927809 -3597493 -4585167 -6559910 -8164099 -8800823 -8996248 -8655010 -8842078
14103 -8842078 -9922689 -9951421 -8337833 -6403960 -4783573 -2553551 447988 2685014
14095 2685014 3424199 2866991 1583948 691385 985290 1771856 2787988 4612289 6461374
14086 6461374 7545536 8788618 11491806 15045809 18028429 19388189 17900377 13237320
14078 13237320 7592374 3126380 -192026 -2061400 -1897386 -28916 2741715 4118667
14070 4118667 2333802 -480761 -1360390 -268186 1506567 3042495 4335458 5258150
14062 5258150 5556155 5751742 5171555 3239214 602202 -1514305 -2755618 -3548872 -3580540
14053 -3580540 -2960850 -2438613 -1939506 -1376851 -720405 -334151 -1122437 -3243142 -5825373
14044 -5825373 -8111362 -9693133 -10080691 -9409962 -8000673 -6561406 -5774611 -5516115 -4693720
14035 -4693720 -2035712 2007761 5618379 7574385 8544738 10110742 12200875 13810372
14027 13810372 14610536 14840667 14143069 11975710 9080789 7349556 7597613 8631715 9650890
14018 9650890 10509574 10583586 9773431 7930557 5729116 4361292 4048140 4295336 4611559
14009 4611559 4858133 4937389 5128843 5760489 6333480 6876963 7426397 6708923 4644120
14000 4644120 2672775 1972756 2288311 2774363 3180239 3184504 1903667 -341718 -2086022
13991 -2086022 -2835106 -3214555 -3811736 -4228754 -3972765 -3148060 -1914698 158142 2959933
13982 2959933 5329752 6396726 6846333 7428879 7638259 7343274 7217496 8018358 8684391
13973 8684391 7507560 4912441 2199138 -231932 -2066718 -2919167 -2467767 -225188
13965 -225188 2937311 5033488 5635867 5502921 4615975 3150038 1924031 1222659 329808
$$ [...]
##END NTUPLES=NMR SPECTRUM
##END=
