##TITLE=dept_11P153_k5D2O CH-,CH3- -up, CH2- -down
 aceton-d6, 2200 sc
 28.09.2023
##JCAMPDX= 6.0         $$ Bruker NMR JCAMP-DX V2.0
##DATA TYPE= NMR SPECTRUM
##DATA CLASS= NTUPLES
##ORIGIN= UXNMR, Bruker Analytische Messtechnik GmbH
##OWNER= root
$$ XWIN-NMR		Version 3.5
$$ Thu Sep 28 16:21:22 2023 Russian Standard Time (UT+4h)  she@DPX200
##.OBSERVE FREQUENCY= 50.327992884445
##.OBSERVE NUCLEUS= ^13C
##.ACQUISITION MODE= SIMULTANEOUS
##.ACQUISITION SCHEME= undefined
##.AVERAGES= 2201
##.DIGITISER RES= 17
##SPECTROMETER/DATA SYSTEM= spect
##.PULSE SEQUENCE= dept135
##.SOLVENT NAME= CDCl3
##.SHIFT REFERENCE= (INTERNAL, CDCl3, 0, 214.665)
##AUDIT TRAIL= $$ (NUMBER, WHEN, WHO, WHERE, WHAT)
$$ ##TITLE= Audit trail, XWIN-NMR		Version 3.5
$$ ##JCAMPDX= 5.01
$$ ##ORIGIN= Bruker BioSpin GmbH
$$ ##OWNER= she
$$ F:/spectra/data/she/nmr/depta/1/pdata/1/auditp.txt
$$ ##AUDIT TRAIL=  $$ (NUMBER, WHEN, WHO, WHERE, WHAT)
(   1,<2023-09-28 16:20:08.37 +0400>,<she>,<DPX200>,
      <created by zg, POWCHK disabled, PULCHK disabled
       terminated by command 'halt'
       configuration hash MD5:
       00 E9 B6 7A A2 85 ED C7 34 08 36 98 17 FE 4E 26
       data hash MD5: 16K
       3F CB 2E 47 F5 5A 5F F2 3F E3 B8 9A 2E E3 4A 14>)
(   2,<2023-09-28 16:20:11.51 +0400>,<she>,<DPX200>,
      <Start of raw data processing
       efp BC_mod = 2 LB = 3.5 FT_mod = 6 PKNL = 1 PHC0 = -3724.938 PHC1 = -1066 SI = 16K 
       data hash MD5: 16K
       5C 30 2C 2D 18 E4 85 25 1F B9 3F E5 D3 72 A3 21>)
(   3,<2023-09-28 16:20:22.79 +0400>,<she>,<DPX200>,
      <abs ABSG = 5 
       data hash MD5: 16K
       98 DC 0C 0A D3 EF 03 3E 74 98 DE 71 5E 85 A4 52>)
(   4,<2023-09-28 16:20:49.89 +0400>,<she>,<DPX200>,
      <pk PHC0 = -5.078412 PHC1 = 16.60001 
       data hash MD5: 16K
       47 1F 46 5D A2 EA B7 7A 54 C9 65 1F 1A FC FE EC>)
(   5,<2023-09-28 16:20:53.21 +0400>,<she>,<DPX200>,
      <abs ABSG = 5 
       data hash MD5: 16K
       D7 9C 03 6B 19 BD 18 82 C1 66 2C B9 CE 7A C9 B5>)
$$ ##END=
$$ 
$$ hash MD5
$$ 83 3B E4 A5 BD 52 4A 34 4D 78 B0 D7 DB 18 33 CE
##$RELAX= 
##$RELAX= 
##$RELAX= 
##$RELAX= 
##$RELAX= 
##$RELAX= 
##$RELAX= 
##$RELAX= 
$$ Bruker specific parameters
$$ --------------------------
##$DU= <F:/spectra>
##$EXPNO= 1
##$NAME= <depta>
##$PROCNO= 1
##$TYPE= <nmr>
##$USER= <she>
##$AMP= (0..31)
100 100 100 100 100 100 100 100 100 100 100 100 100 100 100 100 100 100 
100 100 100 100 100 100 100 100 100 100 100 100 100 100 
##$AQSEQ= 0
##$AQ_mod= 1
##$AUNM= <au_zg>
##$AUTOPOS= <>
##$BF1= 50.322709
##$BF2= 200.13
##$BF3= 200.13
##$BF4= 200.13
##$BF5= 200.13
##$BF6= 200.13
##$BF7= 200.13
##$BF8= 200.13
##$BYTORDA= 1
##$CFDGTYP= 0
##$CFRGTYP= 5
##$CHEMSTR= <none>
##$CNST= (0..31)
1 1 145 1 1 1 1 1 1 1 1 1 1 1 1 1 1 1 1 1 1 1 1 1 1 1 1 1 1 1 1 1 
##$CPDPRG= <>
##$CPDPRG1= <waltz16>
##$CPDPRG2= <waltz16>
##$CPDPRG3= <>
##$CPDPRG4= <mlev>
##$CPDPRG5= <mlev>
##$CPDPRG6= <mlev>
##$CPDPRG7= <mlev>
##$CPDPRG8= <mlev>
##$CPDPRGB= <>
##$CPDPRGT= <>
##$D= (0..31)
$$ [...]
##$SUBNAM2= <"">
##$SUBNAM3= <"">
##$SUBNAM4= <"">
##$SUBNAM5= <"">
##$SUBNAM6= <"">
##$SUBNAM7= <"">
##$SUBNAM8= <"">
##$SUBNAM9= <"">
##$SW= 219.3118970423
##$SWIBOX= (0..15)
0 1 3 0 0 0 0 0 0 0 0 0 0 0 0 0 
##$SW_h= 11037.527593819
##$TD= 16384
##$TD0= 1
##$TE= 0
##$TE2= 300
##$TE3= 300
##$TEG= 300
##$TL= (0..7)
120 120 120 120 120 120 120 120 
##$TP= (0..7)
150 150 150 150 150 150 150 150 
##$TP07= 0
##$TPNAME0= <>
##$TPNAME1= <>
##$TPNAME2= <>
##$TPNAME3= <>
##$TPNAME4= <>
##$TPNAME5= <>
##$TPNAME6= <>
##$TPNAME7= <>
##$TPOAL= (0..7)
0.5 0.5 0.5 0.5 0.5 0.5 0.5 0.5 
##$TPOFFS= (0..7)
0 0 0 0 0 0 0 0 
##$TUNHIN= 0
##$TUNHOUT= 0
##$TUNXOUT= 0
##$USERA1= <user>
##$USERA2= <user>
##$USERA3= <user>
##$USERA4= <user>
##$USERA5= <user>
##$V9= 5
##$VALIST= <valist>
##$VCLIST= <CCCCCCCCCCCCCCC>
##$VD= 0
##$VDLIST= <DDDDDDDDDDDDDDD>
##$VPLIST= <PPPPPPPPPPPPPPP>
##$VTLIST= <TTTTTTTTTTTTTTT>
##$WBST= 1024
##$WBSW= 2
##$XGAIN= (0..3)
0 0 0 0 
##$XL= 0
##$YL= 0
##$YMAX_a= 7485586
##$YMIN_a= -6619607
##$ZGOPTNS= <>
##$ZL1= 120
##$ZL2= 120
##$ZL3= 120
##$ZL4= 120
##$ABSF1= 214.6655
##$ABSF2= -4.669434
##$ABSG= 5
##$ABSL= 3
##$ALPHA= 0
##$AQORDER= 0
##$ASSFAC= 0
##$ASSFACI= 0
##$ASSFACX= 0
##$ASSWID= 0
##$AUNMP= <proc_1d>
##$AZFE= 0.1
##$AZFW= 0.1
##$BCFW= 0
##$BC_mod= 2
##$BYTORDP= 0
##$COROFFS= 0
##$CY= -3
##$DATMOD= 1
##$DC= 0
##$DFILT= <>
##$DTYPP= 0
##$F1P= 0
##$F2P= 0
##$FCOR= 0.5
##$FTSIZE= 16384
##$FT_mod= 6
##$GAMMA= 0
##$GB= 0
##$INTBC= 1
##$INTSCL= 0
##$ISEN= 128
##$LB= 3.5
##$LEV0= 0
##$LPBIN= 0
##$MAXI= 10000
##$MC2= 0
##$MEAN= 0
##$ME_mod= 0
##$MI= 0.4000791
##$NCOEF= 0
##$NC_proc= -1
##$NLEV= 6
##$NOISF1= 120.0001
##$NOISF2= 80.00006
##$NSP= 0
##$NTH_PI= 0
##$NZP= 0
##$OFFSET= 214.6655
##$PC= 4
##$PHC0= -3730.016
##$PHC1= -1049.4
##$PH_mod= 1
##$PKNL= yes
##$PPARMOD= 0
##$PSCAL= 0
##$PSIGN= 0
##$REVERSE= no
##$SF= 50.3227091
##$SI= 16384
##$SIGF1= 140
##$SIGF2= 120
##$SINO= 80
##$SIOLD= 32768
##$SREGLST= <13C.CDCl3>
##$SSB= 0
##$STSI= 16384
##$STSR= 0
##$SW_p= 11037.527593819
##$SYMM= 0
##$S_DEV= 0
##$TDeff= 16384
##$TDoff= 0
##$TI= <>
##$TILT= no
##$TM1= 0
##$TM2= 0
##$TOPLEV= 0
##$USERP1= <user>
##$USERP2= <user>
##$USERP3= <user>
##$USERP4= <user>
##$USERP5= <user>
##$WDW= 1
##$XDIM= 16384
##$YMAX_p= 546393643
##$YMIN_p= -90183698
$$ End of Bruker specific parameters
$$ ---------------------------------
##NTUPLES= NMR SPECTRUM
##VAR_NAME=  FREQUENCY,     SPECTRUM/REAL,   SPECTRUM/IMAG
##SYMBOL=    X,             R,               I
##VAR_TYPE=  INDEPENDENT,   DEPENDENT,       DEPENDENT
##VAR_FORM=  AFFN,          ASDF,            ASDF
##VAR_DIM=   16384,         16384,           16384
##UNITS=     HZ,            ARBITRARY UNITS, ARBITRARY UNITS
##FACTOR=    0.67371834180669, 1,            1
##FIRST=     10802.5493505904, 0,            0
##LAST=      -234.978243228581, 0,           0
##MIN=       -234.978243228581, -90183698,   0
##MAX=       10802.5493505904, 546393643,    0
$$ Real data points
##PAGE= N=1
##DATA TABLE= (X++(R..R)), XYDATA
$$ [...]
12606C510495j25742K17700P8083k39718n72424o53103m58409n06215r23268p12302
12596c84903K21418O87163O86166Q46681J128580J318905J503506J544302Q23293
12587H375111m05396o76089p0545K05532N2490k07252j44509K30513K37664l8027
12577G559492m25322n31255k87769k78114n71589r74263j069864l11282N06357
12568C616391N52094P2019m04697m26207J30645P72381O28028k26629q33912n19986
12558C360127j82322m1707K23952P78341J469160J282065p2067j498666k473194
12549B845689k642460j390000O03272J795955J493806L48927n90816p21011l36068
12540A407294R2743L00940L29622N71860Q66138Q31188N33942O0393q33394j707133
$$ y = [3510495, 3384753, 3602453, 3680536, 3440818, 2868394, 2215291, 1756882, 1250667, 327399, -384903, -163485, 523678, 1209844, 2056525, 3185105, 4504010, 6007516, 7551818, 8375111, 7969715, 7293626, 7223081, 7428613, 7481103, 7273851, 7129342, 7359855, 7597519, 7559492, 7134170, 6602915, 6315146, 6037032, 5465443, 4491180, 3421316, 3110034, 3616391, 4168485, 4240504, 3835807, 3409600, 3540245, 4312626, 4940654, 4714025, 3880113, 3360127, 3177805, 3136098, 3360050, 4138391, 5607551, 6889616, 6817549, 5318883, 2845689, 203229, -1186771, -583499, 1212456, 2706262, 3055189, 2464373, 1743362, 1407294, 1500037, 1800977, 2130599, 2702459, 3568597, 4399785, 4933727, 4994120, 4160726, 2453593]
12530B453593j391045r0796R29303R47925L06670q04188j407104j057430l67166
12521d80238M82334Q29022M95155J85339J65999k55179r15296q88291n2300J299298
12511H65843K254058J781797M52501l47444n47543r21354j134097o51672L81985
12502B134074J275796J310340R43894O35503M27715K75116m42363j674778k439534
12493B445763k609668k021550q95302N45497J672127J845073J579290J265934
12485C827164N44280p30990j645974j736551j009272J15751P22977N79763j7589
12476F49559m67423l62257l23296k14757M15727P87172O74211N86946K84766j33926
12466A896722j55438J65004L56540Q71317J505098J193944P0381j256406k023275
$$ y = [2453593, 1062548, 971752, 1901055, 2848980, 3155650, 2351462, 944358, -113072, -480238, 2096, 831118, 1326273, 1511612, 1677611, 1422432, 507136, -381155, -433455, 865843, 3119901, 4901698, 5354199, 5006755, 4459212, 3537858, 2403761, 1752089, 2134074, 3409870, 4720210, 5664104, 6299607, 6727322, 7002438, 6560075, 4885297, 2445763, -163905, -2185455, -3080757, -2535260, -863133, 981940, 2561230, 3827164, 4371444, 3640454, 1994480, 257929, -751343, -635592, 87385, 667148, 649559, 182136, -180121, -503417, -718174, -302447, 484725, 1158936, 1745882, 2030648, 1896722, 1741284, 1906288, 2262828, 3134145, 4639243, 5833187, 5903568, 4647162, 2623887]
12457B623887j744430r08984k2141O84740J176768J481895J361421Q23205j1601
12448E464760n18477j68652N5720j66316l11163m11319o47201j043798j402663
12439H50891j348121q16869K73114J007948P79015O57656J101361J407351J101541
12430E013887K91873p71732r91547j02043O96931K48617o94086o89924M38845
12421C440821J315934J237740L59056n88914r32522r74770q24886k99738L23136
12412C055857O56467O15855N96262L44723l35663q68789q66101m68863O2162R08967
12402C700877J785316J748967Q14554J39852r5758o75444j662248j873045j119908
12393B763163l96873k1944K35526J38752n14200j123239j125078o91641k41233
$$ y = [2623887, 879457, -29527, -51668, 633072, 1809840, 3291735, 4653156, 5476361, 5464760, 4946283, 4777631, 4833351, 4667035, 4355872, 3944553, 3297352, 2253554, 850891, -497230, -1314099, -1040985, -33037, 745978, 1403634, 2504995, 3912346, 5013887, 5305760, 4534028, 3542481, 3440438, 4137369, 4385986, 3691900, 3001976, 3440821, 4756755, 5994495, 6353551, 5764637, 4832115, 3857345, 3032459, 2732721, 3055857, 3712324, 4328179, 4924441, 5269164, 4933501, 4064712, 3198611, 2729748, 2791910, 3700877, 5486193, 7235160, 8049714, 8189566, 8093808, 7418364, 5756116, 3883071, 2763163, 2366290, 2344346, 2579872, 2718624, 2204424, 1081185, -43893, -735534, -976767]
12384i76767O5884M60049Q00671R91920Q46874M32896M15389P06816M48866J35027
12374D327625O56217Q96081j7768j014018j501275j288261k04665Q29173R35145
12365C618254L17283l77404n38594j40477L00670L80105J51901k64051n50241
12356B897446n57827n34076p75946j193242j289797o28480R05369K086842J563750
12347B474039P16992J030809J416992J211848P62059L11294K18325M46829M08151
12338H997338l4208m10919q08277j041438o66252n14680p23182o82100m20313
12329C695969J54336N64253K28843m53376q69238q59436o13870j44629L94758
12320B097610M97849J81817q2028j61655J7633J23255k32346p87134j090270j061245
$$ y = [-976767, -910883, -450834, 349837, 1341757, 2188631, 2621527, 3036916, 3743732, 4192598, 4327625, 4983842, 5879923, 5862155, 4848137, 3346862, 2058601, 1853936, 2683109, 3618254, 3935537, 3558133, 3019539, 2879062, 3179732, 3559837, 3711738, 3447687, 2897446, 2339619, 1805543, 1029597, -163645, -1453442, -2081922, -1176553, 910289, 2474039, 3191031, 4221840, 5638832, 6850680, 7612739, 7924033, 8142358, 8589187, 8997338, 8963130, 8552211, 7743934, 6702496, 6036244, 5521564, 4798382, 4116282, 3695969, 3850305, 4414558, 4643401, 4190025, 3320787, 2461351, 1847481, 1702852, 2097610, 2595459, 2777276, 2695248, 2533593, 2551226, 2674481, 2442135, 1655001, 564731, -496514]
12310d96514q13603l60950L43427R23036P65198M77795M84277J11506l59421l46877
12300G27874J28362P65705R91144O00219L28143M16184O94348R15411L22073m96506
12290E392957q12277r89042j055104q67576p76964o58898l16126K29457P82483
12281I28910R90447M00222o62890q15813N5467R98220J157875N94953k1945O5993
12271C691439L84264J90472l79230p74045o46514l31390l27014m14089k52937
12262A140956J05192K22069K95976L02348Q6551k96370j104670j144761j55872
12253e48581O51202J006046P38089j63625n98066j1055Q06758O18796j49934l22816
12243B026814o6350m72304j179527j184625l44037N12402O57345O54317J103692
$$ y = [-496514, -1310117, -1671067, -1327640, -404604, 360594, 838389, 1322666, 1434172, 1074751, 727874, 856236, 1621941, 2613085, 3213304, 3541447, 3957631, 4651979, 5567390, 5889463, 5392957, 4580680, 3591638, 2536534, 1668958, 891994, 233096, -83030, 146427, 928910, 1919357, 2319579, 1656689, 840876, 896343, 1894563, 3052438, 3647391, 3625446, 3691439, 4075703, 4266175, 3886945, 3112900, 2466386, 2134996, 1807982, 1393893, 1140956, 1246148, 1468217, 1764193, 2066541, 2153092, 1856722, 752052, -392709, -548581, 102621, 1108667, 1846756, 1683131, 1085065, 1074010, 1880768, 2499564, 2349630, 2026814, 1960464, 1488160, 308633, -875992, -1220029, -707627, -50282, 604035, 1707727]
12234A707727J127441O71335N91196K49947m91479q96289o83484l23831m17503
12225A535060q25459o32162r7005L61741M77857K90803O8849k13300k65606m0285
12215F60493P3901Q9375L75499O58016M50726K09207O94434R05988J22788q00788
12205C439639p86027M05631J354591R12197K72388K55394M03629R9463p42221
12196E614684j375472j171500l01810J43641l52497j016769j223932r03862l09411
12187h96928R6870J23632l4267Q9713j0526o71477j554110j829267q84598O08249
12177d962709K062370K709797K265578J329113O28941M19439N75071P54187R35935
12168F717722J053802M60880m52021o70005l59016k53525j23402J74427J31978
$$ y = [1707727, 2835168, 3506503, 4097699, 4347646, 3856167, 2959878, 2276394, 1952563, 1535060, 709601, 77439, -19566, 342175, 820032, 1110835, 1179684, 966384, 700778, 660493, 734394, 823769, 1199268, 1857284, 2308010, 2517217, 3211651, 4117639, 4240427, 3439639, 2653612, 3059243, 4413834, 5326031, 5598419, 5853813, 6257442, 6356905, 5614684, 4239212, 3067712, 2765902, 2909543, 2557046, 1540277, 316345, -587517, -896928, -800058, -676426, -710693, -620980, -631506, -1302983, -2857093, -4686360, -5570958, -4962709, -2900339, -190542, 2075036, 3404149, 4033090, 4452529, 5027600, 5781787, 6717722, 7771524, 8232404, 7780383, 7110378, 6751362, 6497837, 6374435, 6548862, 6680840]
12159F680840l08495n20509n71323n83351l1437O72183Q03568N29318K48797j74810
12149F744781r59353j480792j065507r2077K19227j96227m76893j15942M90176
12140C067393M73003j86802p74450q45658j63581N95836L62036l58946m63281
12131A705550r0879P7705O608k71343r9322M42382J32945l93942L4323M43555
12121A987582J011256J705742J222716m9387q96091j437034k265420k539444j449273
12112b709353M6871N70042J39997j05880K2446J15149J49274P7250j04803m28432
12102b227439n03481M3948M31863J9007q13338j496191j163415J61485R00695
12093d646866R05137J188188J528142J852483J864110J268023M79543J15065L52997
$$ y = [6680840, 6372345, 5851836, 5280513, 4697162, 4665725, 5337908, 6141476, 6670794, 6919591, 6744781, 5785428, 4304636, 3239129, 3147052, 3366279, 3170052, 2693159, 2577217, 3067393, 3540396, 3353594, 2579144, 1733486, 1569905, 2165741, 2527777, 2168831, 1705550, 1614671, 1692376, 1698984, 1427641, 1328319, 1770701, 1903646, 1509704, 1544027, 1987582, 2998838, 4704580, 5927296, 5877909, 4981818, 3544784, 1279364, -1260080, -2709353, -2662482, -2092440, -1952443, -2058323, -2035877, -1920728, -1771454, -1694204, -1799007, -2227439, -2730920, -2686972, -2255109, -2236102, -3049440, -4545631, -5709046, -5547561, -4646866, -3741729, -2553541, -1025399, 827084, 2691194, 3959217, 4438760, 4553825, 4906822]
12084D906822Q09386R57938R21195J214216J261191j18396j744474j708315j036064
12075E463499j236615j720758j302909k9447J082195J739221J713709N08574j023043
12066E194426j499107j229784q88143m3042J270977J819336Q07739m61178q93562
12057D077662o08143m08762k09404r8791m56090m82768J92805M48587j60552o87116
12047A607428p60195o61124l24685L12706Q66872J267610J252484O74960K56712
12038D492768L71787j12257r09949r08866o42430r08893j212066p14663k9122
12029e73691K03517N63508Q19639P66206N86414l42611j592439j694856n37461
12020a801774O76155J174279P62833j32742p78123r57743r20588o46178r8334
$$ y = [4906822, 5716208, 6674146, 7595341, 8809557, 10070748, 9952352, 8207878, 6499563, 5463499, 4226884, 2506126, 1203217, 1173770, 2255965, 3995186, 5708895, 6217469, 5194426, 3695319, 2465535, 1577392, 1534350, 2805327, 4624663, 5432402, 4971224, 4077662, 3469519, 3060757, 2851353, 2752562, 2296472, 1813704, 2006509, 2455096, 2294544, 1607428, 847233, 186109, -138576, 174130, 1041002, 2308612, 3561096, 4236056, 4492768, 4864555, 4752298, 3842349, 2933483, 2291053, 1382160, 170094, -544569, -573691, -370174, 193334, 1012973, 1779179, 2365593, 2022982, 430543, -1264313, -1801774, -1125619, 48660, 811493, 678751, -99372, -1057115, -1977703, -2623881, -2722215]
12011b722215M59510O33770Q72229J173678R56976O53789M06564J53554l39895
12002B247960j38131J017768J165112L33048l14962p88861q01006o45871q81130
11993A193927r37286r2683P73916N0905j464779j927183r63911L73433R70187
11984b023474R19889O46998k76586j190476j049658o9039R68305J524290J063387
11975E13636J79942j3713K77150P69187N51504j39082j44952M64450J065731R32952
11965D456805J87730k27621k37711j27152l16313p99602j146665r21291n4132
11956H14048M93691J97175K5436M31955K73521l97469m41810O7453K36790k29543
11946A471247j065717j033748J9641P70354O65925L66252N14913P47562N53828
$$ y = [-2722215, -2262705, -1628935, -756706, 416972, 1373948, 2027737, 2434301, 2587855, 2247960, 2109829, 3127597, 4292709, 4625757, 4310795, 3521934, 2720928, 2075057, 1193927, 256641, 163958, 937874, 988779, -476000, -2403183, -3367094, -2993661, -2023474, -1103585, -456587, -733173, -1923649, -2973307, -3042346, -2074041, -549751, 513636, 693578, 679865, 957015, 1726202, 2277706, 2138624, 1993672, 2458122, 3523853, 4456805, 4644535, 4416914, 4179203, 4052051, 3735738, 2936136, 1789471, 868180, 814048, 1307739, 1504914, 1530350, 1962305, 2235826, 1838357, 1396547, 1464000, 1700790, 1471247, 405530, -628218, -608577, 161777, 827702, 1193954, 1708867, 2456429, 3010257]
11937C010257j11354p11313p74346o14644o00143m34112L91435J330904J416048
11928B902732O78196j05586l37580n45155q56680n05574N14280J379965J254482
11919D379080N02258K01036J12721m29510j112705j560934j689349j468746j120157
11910b186306m76145K54034O00940N97761M22444L93218O31983Q73284P06570
11901A817783K09654j98986n12161n57379j68002M84458J118870J078907N18015
11892C791159j3031m45364q41474r54666n41646K17800N35583M73363P11627J287295
11882D220646J468984R24995M01051K47045j46758q66927j427160j665597j577769
11873A578510q79215M33524J184121P76590K81177m690j15438M7390J2730j3734
$$ y = [3010257, 2898903, 2187590, 1413244, 798600, 198457, -235655, 155780, 1486684, 2902732, 3580928, 3475342, 3137762, 2592607, 1735927, 1230353, 1744633, 3124598, 4379080, 4881338, 5082374, 5195095, 4765585, 3652880, 2091946, 402597, -1066149, -2186306, -2662451, -2408417, -1807477, -1209716, -787272, -394054, 237929, 1111213, 1817783, 2027437, 1828451, 1316290, 758911, 590909, 1075367, 2194237, 3273144, 3791159, 3778128, 3332764, 2491290, 1536624, 994978, 1212778, 1748361, 2221724, 2933351, 4220646, 5689630, 6614625, 7015676, 7262721, 7115963, 6249036, 4821876, 3156279, 1578510, 699295, 1132819, 2316940, 3093530, 3374707, 3370017, 3254579, 3301969, 3314699, 3300965]
11863C300965J3331j97840m90342o11402m80011k77740j39430k60997n25283o51225
11853c19974n19900L8308N10648L41814l14336q24140o78430P9812M69849M60492
11843g55857N69358P29356L99883J21149K51765K22862k95570q36932q82027r16753
11833a392766j297220j252108r21313r42443o48293K56521J078244J010194M37742
11824c671442K18408J76697j69722l57616M31638J292915J297796R00116L83439
11815E02229q3641m91229q42458p35015L52553K096070K793723J673209L13345
11806E578786l11879l74859l73723q99940j593958j206825l71566K89949J407896
11797B143881J765386J049098O61644Q76037O41153n9504j89134O3136q8423m79281
$$ y = [3300965, 3314296, 3116456, 2626114, 2014712, 1534701, 1256961, 1117531, 856534, 331251, -319974, -839874, -801566, -290918, 50896, -263440, -1087580, -1766010, -1686198, -1216349, -755857, -186499, 542857, 942740, 1063889, 1315654, 1538516, 1242946, 406014, -476013, -1392766, -2689986, -3942094, -4863407, -5805850, -6454143, -6197622, -5119378, -4109184, -3671442, -3453034, -3276337, -3446059, -3803675, -3372037, -2079122, -781326, 118790, 502229, 418588, -72641, -915099, -1650114, -1297561, 798509, 3592232, 5265441, 5578786, 5266907, 4892048, 4518325, 3618385, 2024427, 817602, 446036, 735985, 2143881, 3909267, 4958365, 5620009, 6496046, 7137199, 7077695, 6888561, 6951697, 6863274, 6383993]
11787F383993n07385m61943m23231j38047J1986l65044o75461l56502N49156J119645
11777E137167O80695J5873k01935k77208n05656p49520m79406l0118Q1678j37424
11767C534146p43492p31423L16018R55119O21110j97452q29753m78235L44642
11758B790680O03933M75166L36016K17209p8982n18535q26576p89371n70029m32649
11748A206862p58072j122967o12972K24192M40717R6350o25262j095462q90323
11739c136937j55027M89558P91309J129132J009358N74739K47553K94053O16598
11730A860336O72818N12764O61171N39172n2833m40236m01849q2532l081l42767
11720B922963r09145j336276n73858Q65004J290965Q11147M04224K88527N03298
$$ y = [6383993, 5876608, 5414665, 4991434, 4853387, 4865373, 4500329, 3824868, 3468366, 4017522, 5137167, 5817862, 5833735, 5631800, 5354592, 4848936, 4099416, 3620010, 3589892, 3671570, 3534146, 2790654, 2059231, 2375249, 3330368, 3951478, 3754026, 2924273, 2446038, 2790680, 3394613, 3869779, 4205795, 4423004, 4344022, 3825487, 2998911, 2209540, 1639511, 1206862, 448790, -674177, -1287149, -1062957, -622240, -525890, -1151152, -2246614, -3136937, -3291964, -2802406, -2011097, -881965, 127393, 702132, 949685, 1243738, 1860336, 2533154, 3045918, 3707089, 4246261, 4193428, 3753192, 3351343, 3268811, 3265730, 2922963, 2013818, 677542, 103684, 968688, 2259653, 3070800, 3475024, 3763551, 4266849]
11711D266849N00619k64898j226463j754935k027465j861557j161567l51252N80101
11702c300568J762453K253028J571843P73246K35943J6408o5365o79042j302618
11693A265328j245605o54156j03098J85295M31175K45914k26244m96711n60292
11684a158394J4866J079114J440131R70400J59306q57512j382573j238870p55888
11675a729420j21094L17318P10373R51495N89332L61928N92981P80800J030458
11666C484171J315638J813785J923557J372283Q67832N03344k95802j532183k174989
11657G277636j883160q09605K19969K17015O1015N61885M87144n89597j003906
11648D538396l02194K65728n8939o93036o38538j25323K09740K03377M4172k15113
$$ y = [4266849, 4767468, 4502570, 3276107, 1521172, -506293, -2367850, -3529417, -3880669, -3300568, -1538115, 714913, 2286756, 3060002, 3295945, 3312353, 3246988, 2567946, 1265328, 19723, -634433, -737531, -552236, -121061, 124853, -101391, -598102, -1158394, -1143528, -64414, 1375717, 2346117, 2505423, 1647911, 265338, -973532, -1729420, -1850514, -1533196, -822823, 128672, 718004, 1079932, 1672913, 2453713, 3484171, 4799809, 6613594, 8537151, 9909434, 10777266, 11280610, 10984808, 9452625, 7277636, 5394476, 4584871, 4804840, 5021855, 5082870, 5644755, 6131899, 5542302, 4538396, 4236202, 4501930, 4442991, 3749955, 3111417, 2986094, 3195834, 3399211, 3443383, 3228270]
11638C228270o63549j002513p17034K39466Q34929R39187R89246Q79515R40540
11629E668057P97739K73535J03865k17830j103484j557457j480850j510024j274369
11620c00818o99348j13433O38325J371496J584654N39403o90224p29277j85801
11611A414977r4473p34946j313687q62061N361K99893L29504K22095k81362o54089
11601a668788r69963j449273j608805r46841M31869J656998K133331J738563Q37612
11592A54703o4065j009509j647580j367515p43308m25600o4878P01538J006571
11583c459643P01834N13572N92818M35022K9082j14016r1182J14315O28626M57906
11573a91666j71313j1992J226685K172943J721279M73290o80096j271245j238016
$$ y = [3228270, 2564721, 1562208, 845174, 1084640, 1919569, 2858756, 3848002, 4727517, 5668057, 6465796, 6739331, 6843196, 6625366, 5521882, 3964425, 2483575, 973551, -300818, -1000166, -1113599, -475274, 896222, 2480876, 3020279, 2330055, 1600778, 1414977, 1320504, 585558, -728129, -1590190, -1584829, -1284936, -955432, -733337, -1014699, -1668788, -2638751, -4088024, -5696829, -6643670, -6211801, -4554803, -2421472, -682909, 154703, 90638, -918871, -2566451, -3933966, -4677274, -5102874, -5167752, -4466214, -3459643, -2757809, -2244237, -1651419, -1216397, -1187315, -1301331, -1392513, -1278198, -649572, -191666, -362979, -374971, 851714, 3024657, 4745936, 5219226, 4539130, 3267885, 2029869]
11564B029869q41049m2829J148079J863147J447673L92246j01856j37203k78083
11555E479994j99875O3094L3332m08653p16647o43290n30840m74389m88499o45504
11545A468723p06213j75946N02100L36472k08274n53760m02384j52648l46842
11536b38772o85935p25035n17021n32611m52222k15227k33287m49074n47702J86372
11526d410514J135928R94964M15122L68859P00436Q88207R33768Q75497N31923
11517B434190j82634o28395n46135m22358n79089j201219j998756j783348l49567
11508e257311J183549J954431K053481J648949P60301k43446j090496j410968
11500d01510j233851p31764J99819O36885j50279q34472o66288k5630O44632J004311
$$ y = [2029869, 1188820, 1145991, 2294070, 4157217, 5604890, 5997136, 5895280, 5758077, 5479994, 5280119, 5343213, 5376545, 4967892, 4251245, 3607955, 3077115, 2602726, 2114227, 1468723, 762510, 586564, 1088664, 1425136, 1216862, 663102, 260718, 108070, -238772, -924707, -1649742, -2166763, -2699374, -3151596, -3366823, -3600110, -4049184, -4596886, -4410514, -3274586, -2279622, -1864500, -1495641, -795205, 93002, 1026770, 1902267, 2434190, 2251556, 1623161, 1077026, 654668, 75579, -1125640, -3124396, -4907744, -5257311, -4073762, -2119331, -65850, 1583099, 2343400, 2099954, 1009458, -401510, -1635361, -2367125, -2167306, -1530421, -1680700, -2515172, -3181460, -3207090, -2562458, -1558147]
11490a558147R83758P56178R21863J444049J208930j49032j495136j999675j871580
11481a758792j157111k77842J17445M56967O88729N38976N35617Q18896J031953
11472I94838P33246J44682q5898k64028k45881Q1772M25688J58913p15771q38363
11462C89198j93384O27107J744644K189736J400514K32954k78903n98983j405211
11453D107672j735953j061681J20748J269671J928484J699184P73535l45948j220468
11444E535244j728398j821307j109829L2572O01033P29239J004863K27512r84687
11435B486242p46994J21637K99279k50309j016267j314112p73192n9413J71918
11426a081211J12771l5001n2209k43545n26464n0201P59641Q62653M54397O5335
$$ y = [-1558147, -574389, 181789, 1103652, 2547701, 3756631, 3607599, 2112463, 112788, -1758792, -2915903, -3193745, -3076300, -2619333, -1930604, -1391628, -856011, -37115, 994838, 1728084, 1872766, 1786868, 1522840, 1276959, 1358731, 1784419, 1943332, 1227561, 389198, 195814, 822921, 2567565, 4757301, 6157815, 6390769, 6111866, 5512883, 4107672, 2371719, 1310038, 1430786, 2700457, 4628941, 6328125, 7101660, 6755712, 5535244, 3806846, 1985539, 875710, 908282, 1509315, 2238554, 3243417, 3470929, 2486242, 1739248, 1860885, 2160164, 1909855, 893588, -420524, -1193716, -1253129, -1081211, -968440, -1003441, -1055650, -1299195, -1825659, -1875860, -1116219, -253566, 200831, 266166]
11416B66166Q9240M34182K21926l91981o83713l57834J60549J01262l44201m98920
11406a003324l85448j14638K46909N76496O20716L50310M71585N26648P4135j55316
11396A208073k19571n77097p36020m36973k82945m92754l94017L52726P51722
11387h26856M64694M80308P22431N41000L20581M62885M72094o7076n76075r18787
11377A075199j519150j728121p89345J30494K98833K22356N02830R73062J249200
11368D15358P21100m24171j087580m45027K87278l0343q22748j262699r52514
11359c601346L2296O64981R02393J175165Q41555L75868M56371K60240j99147
11350I08376k50105m81212j211255j547302j153404n92780l19960K7353Q82007
$$ y = [266166, 355406, 789588, 1011514, 619533, -64180, -422014, -261465, -160203, -504404, -1003324, -1388772, -1503410, -1256501, -680005, -59289, 291021, 762606, 1289254, 1363389, 1208073, 988502, 411405, -324615, -761588, -1044533, -1537287, -1931304, -1578578, -826856, -362162, 118146, 840577, 1381577, 1702158, 2165043, 2637137, 2570061, 1993986, 1075199, -443951, -2172072, -2961417, -2830923, -2532090, -2309734, -1806904, -833842, 415358, 1136458, 712287, -375293, -820320, -533042, -563385, -1386133, -2648832, -3601346, -3569050, -2904069, -2001676, -826511, 15044, 390912, 847283, 1107523, 908376, 658271, 177059, -1034196, -2581498, -3734902, -4327682, -4647642, -4620289, -3738282]
11341c738282J669202J595894N00227l99018k02074N04552R52081R38612P40885
11332B562079O20397N0231q67410j356883j086203n69798o04441n19253k07499
11323a978780o94432j271624j097185p08658j1747P05033N31381L56977M95824
11314c673211M31589K10186o7335j25502K26282M83850L99682N016p07710j416873
11304d234026j483289q64617j26855J003746K049096J681788N37013o12368j494285
11295c543797j284339j96965L70148J22576J30522O28608Q69401Q45366J039202
11286a019278J313062R55942o7979j012854r06399o8807M15363q402p81163r10648
11276b091163n26160n0299j86895q18339q83668k76219M40796O79169O08437M31980
$$ y = [-3738282, -2069080, -473186, 27041, -371977, -574051, -69499, 882582, 1821194, 2562079, 3182476, 3232707, 2365297, 1008414, -77789, -647587, -1252028, -1771281, -1978780, -2673212, -3944836, -5042021, -5750679, -5762426, -5057393, -4526012, -4169035, -3673211, -3241622, -3031436, -3098771, -3224273, -2997991, -2514141, -2114459, -2109443, -2817153, -4234026, -5717315, -6581932, -6708787, -5705041, -3655945, -1974157, -1437144, -2049512, -3543797, -4828136, -5025101, -4654953, -4532377, -4401855, -3773247, -2903846, -2058480, -1019278, 293784, 1249726, 1181747, 168893, -737506, -806313, -390950, -399352, -1180515, -2091163, -2617323, -2667622, -2854517, -3672856, -4556524, -4832743, -4391947, -3712778, -3104341, -2672361]
11266b672361J79118j36364p00074r35201m36381P08107J645607J394538P37804
11257b15207L82599l93229j480478j946780j165906L8320K54766m7875K04958
11248d368832R12822J391088J634559J700673J703982J411500Q21524J13594j123704
11239D197206j980533j630027o55819k03622j24180m4496q1260M29981J190264
11230A097514J165786K58577o84095j081290p25028n19640q23442q03917k34380
11221b349915N36466P57576L7303n69240l65036J20366N95624Q76147O75582M08056
11211G22929L83583k57607j332047j757786j667141j584325j149282j61715O75888
11202f127503J151569J701729J537851N42257m14668r06677p97316q24464q57420
$$ y = [-2672361, -2493243, -2629607, -3329681, -4264882, -4701263, -3993156, -2347549, -953011, -215207, 167392, -225837, -1706315, -3653095, -4819001, -4780681, -4525915, -4573790, -4368832, -3456010, -2064922, -430363, 1270310, 2974292, 4385792, 5207316, 5320910, 4197206, 2216673, 586646, -69173, -272795, -396975, -441471, -522731, -92750, 1097514, 2263300, 2521877, 1837782, 756492, 31464, -488176, -1311618, -2115535, -2349915, -1813449, -1055873, -1018570, -1587810, -1952846, -1832480, -1236856, -360709, 314873, 722929, 1106512, 848905, -483142, -2240928, -3908069, -5492394, -6641676, -6803391, -6127503, -4975934, -3274205, -1736354, -1194097, -1608765, -2515442, -3312758, -4137222, -4994642]
11193d994642l04720J66140o3306m90174l25993L94008Q79386P81457N47316M31115
11183b979413L53171j24296o72259o23390j05450N66006M89925m08172o52390
11174d156268L11782J315666J305404N63992m95418j327346j610651q84332J93383
11165d783788Q39999J367480J057382p0138o95807p49893n06285P8250K35845
11156c226955K2763j48850P9914P90526J047636P49744N91442Q56320P14889P340
11146A484769k32974R8048L29862J1588m22735l07733q6938m83448j255866j504213
11136b369640q37498M4558J91371k98992j85719O34731Q98248L74451J12105M08223
11126a028162K51278m09874n82459l83575m27068p59530j238270j325535q39929
$$ y = [-4994642, -5299362, -5133222, -5196528, -5686702, -6012695, -5618687, -4739301, -3957844, -3410528, -2979413, -2626242, -2750538, -3422797, -4046187, -4151637, -3585631, -3095706, -3503878, -4156268, -3844486, -2528820, -1223416, -659424, -1154842, -2482188, -4092839, -4977171, -4783788, -3943789, -2576309, -1518927, -1589065, -2284872, -3034765, -3541050, -3462800, -3226955, -3204192, -3353042, -3273128, -2482602, -1434966, -685222, -93780, 762540, 1477429, 1484769, 1251795, 1349843, 1679705, 1691293, 1268558, 960825, 873887, 390439, -865427, -2369640, -3207138, -3162580, -2971209, -3270201, -3455920, -2821189, -1922941, -1548490, -1436385, -1028162, -776884, -1186758, -1769217, -2152792, -2579860, -3339390, -4577660, -5903195, -6743124]
11117f743124l09503R3642N85567R22094P10322k46797q62244n76333k62213j39513
11107f828102R5584O47675Q51159L89779N0254q3582k55404j47526N85524J166365
11097c528274R83051M90111k3826l30106k47885J25289N35231Q39084R71095J044513
11087H58283M49291q91620j667355j225546j85339L93416N22488M75016M54820
11078h16546N57421J58474q51229j477827j256799n89510M04877J222336J580645
11069a068158J696256J187774k9579p45719m70177j54351l27778o39197n97634
11060a148563k03324O8162L13153J95009k65298o42527o64466k68506r3306n9361
11050b769027L86791P04749P01548O53548K33469k36121k69363j47517J86021
$$ y = [-6743124, -7052627, -6958985, -6373418, -5451324, -4741002, -4987799, -5850043, -6426376, -6688589, -6828102, -6732518, -6084843, -5233684, -4843905, -4793651, -4877233, -5132637, -5280163, -4694639, -3528274, -2545223, -2055112, -2078938, -2409044, -2656929, -2531640, -1996409, -1157325, -186230, 858283, 1307574, 415954, -1251401, -2476947, -2662286, -2268870, -1746382, -1271366, -816546, -259125, -100651, -951880, -2429707, -3686506, -4276016, -3871139, -2648803, -1068158, 628098, 1815872, 1786293, 1040574, 570397, 416046, 88268, -550929, -1148563, -1351887, -1283725, -970572, -775563, -1040861, -1683388, -2347854, -2616360, -2709666, -2769027, -2382236, -1677487, -975939, -322391, -88922, -325043, -594406, -741923, -555902]
11041e55902m3140q07797j156590q80622l86007j3794J13991K08031M15899O17205
11031b488726N27265K28605K34953O26123J213142J599795J305129O30187L12776
11022D189249M1450p00980j232354r97106m36633l16389o62276o32696J08756
11013f38979J196577J803799J508923O50976n40178j722991k151445k015555j537882
11004c446755n92487M85656J526315J734882Q03862k99495r25243r47189o82693
10995b343147j79200l7561k12902q3091K23287J73699l05861p30476o79123J33626
10985d040749J003251J077357Q78009N79313J5744m41726n67291o73960p38360
10976b908412o93929m79677j9725M25485P62932P56937P07787R75627Q73420K50373
$$ y = [-555902, -599042, -1406839, -2563429, -3444051, -3830058, -3843852, -3729861, -3521830, -3105931, -2488726, -1961461, -1732856, -1497903, -871780, 341362, 1941157, 3246286, 3876473, 4189249, 4230699, 3529719, 2297365, 1300259, 863626, 547237, -115039, -747735, -638979, 557598, 2361397, 3870320, 4521296, 3981118, 2258127, 106682, -1908873, -3446755, -4039242, -3553586, -2027271, -292389, 511473, 211978, -713265, -1660454, -2343147, -2522347, -2559908, -2772810, -2855901, -2632614, -2458915, -2764776, -3495252, -4174375, -4040749, -3037498, -1960141, -1082132, -502819, -487075, -928801, -1496092, -2170052, -2908412, -3602341, -4082018, -4101743, -3676258, -2913326, -2156389, -1448602, -472975, 400445, 650818]
10966F50818j81894l03807l26619k89967l52100p26367r29212n97968L31515J198695
10956a526906O84524j74286n65203r15897j052788n60622O64380J525712J319072
10947f02014Q72255P72669Q61256N03972l42595p31655o03438l44288j41197m17321
10937a72356n57905j73649J80623P2919k70589n68049o63254n70268j010273j494011
10927e226812r71626K03453N83443j45348m36969K41442J053199J626159J779247
10918a293812J586327J121572L81936Q6604K63899L68503M05449L05084m39647
10909B785915j455100j577706q43743l72321m12607l66331l2763N8613l50829
10900b566872r50707j542080j509384o36604N97296J162280P79484N0764o01013
$$ y = [650818, 468924, 165117, -161502, -451469, -803569, -1529936, -2459148, -3057116, -2725601, -1526906, -842382, -1016668, -1581871, -2497768, -3550556, -4111178, -3446798, -1921086, -602014, 270241, 1042910, 1904166, 2408138, 2065543, 1333888, 730450, 386162, 244965, -172356, -730261, -903910, -723287, -650368, -920957, -1489006, -2152260, -2722528, -3732801, -5226812, -6198438, -5994985, -5411542, -5556890, -5993859, -5752417, -4699218, -3073059, -1293812, 292515, 1414087, 1796023, 1882627, 2146526, 2515029, 2920478, 3225562, 2785915, 1330815, -246891, -1090634, -1462955, -1875562, -2241893, -2274656, -2216043, -2566872, -3517579, -5059659, -6569043, -7205647, -6608351, -5446071, -4666587, -4615823, -5216836]
10891e216836p89316p97779n88997m44331n81254L8920J037606J145557L69779
10882e826651k85520l59877j10431J95518Q57475J384294J148122O68813J36365
10873b191892l42237n18657m87863l88095j83159l81904p84939p03191l79978
10864f361915j21472p583L53445Q44517P88982M80270M38529N25675K49811k82775
10854c092516m07733M838J31213q0748R0756J35198p3514l13418n99926p97386
10844e003236j113543j250227p00302J13370Q21762J175268J340829J761904J886782
10835i67393J243293P70232M00884k34284r25284j617060k060008j931645j104214
10826f425479k37075N68326J429820J758561J523633J045217O97470P71461P80749
$$ y = [-5216836, -6006152, -6803931, -7392928, -7837259, -8418513, -8379593, -7341987, -6196430, -5826651, -6112171, -6472048, -6582479, -6386961, -5529486, -4145192, -2997070, -2328257, -2191892, -2534129, -3052786, -3540649, -3928744, -4111903, -4493807, -5278746, -5981937, -6361915, -6483387, -6490970, -6137525, -5293008, -4504026, -4023756, -3585227, -3059552, -2809741, -3092516, -3500249, -3495411, -3364198, -3444946, -3354190, -3218992, -3292506, -3605924, -4205850, -5003236, -6116779, -7367006, -8067308, -7953938, -7132176, -5956908, -4616079, -2854175, -967393, 275900, 1046132, 1447016, 1212732, 287448, -1329612, -3389620, -5321265, -6425479, -6662554, -6094228, -4664408, -2905847, -1382214, -336997, 360473, 1131934, 1912683]
10817A912683N57292K33951k1943p9970l90669p13150r37274j225061r51013J00382
10807a514772Q34116P84183p905j069138j283650l45255P25133J193980Q31338
10798A48030J00077j89932k58556N978M52486J89215n11805p96257p32000o08518
10788b201282o63111n35793l1566O2018j58169l5493M84572J029062J263938J157535
10778C71711K67838j030240j570038j188911j156311j504936j172168M3307J266173
10769e673575J323623N78805L08320M58295M03152K42977m830o91567j235457
10760d290257r60071j55720L62415N64395P46968P03187Q11350Q04869M76938
10751i35926N79806R13961O50990R6800l27329m73462j31534P8745j44036k81307
$$ y = [1912683, 2469975, 2703926, 2681983, 2602013, 2211344, 1498194, 560920, -664141, -1615154, -1514772, -680656, 103527, 95622, -973516, -2257166, -2602421, -1877288, -683308, 148030, 248107, 58175, -200381, -194403, 258083, 447298, -64507, -860764, -1592764, -2201282, -2864393, -3400186, -3431752, -3369734, -3527903, -3563396, -3078824, -2049762, -785824, 371711, 639549, -390691, -1960729, -3149640, -4305951, -5810887, -6983055, -6939748, -5673575, -4349952, -3771147, -3462827, -3004532, -2601380, -2358403, -2363233, -3054800, -4290257, -5250328, -5406048, -5043633, -4479238, -3732270, -3029083, -2217733, -1412864, -935926, -356120, 557841, 1208831, 1305631, 978302, 504840, 373306, 452051, 308015, 26708]
10741B6708j76015k38241m00120m01881m29028r04240j259397p78518J34180L46629
10731d079923l2632r9514P3942J34010K37641L34595N23900P28676Q22384Q61797
10721d95124L90285p27961j516126j507807j059712j15801R20411J328699J252924
10712a530212R25916M97225k41642j167649j656734j449750p67600m86969m62837
10703f340252l67874k58271k27563o21128r21560o62844M8575J156473K186045
10694f008399K693228K401590J611841R35399M22537J82479J61436J1875l43652
10685B068334q08928j245935j339735j193518q98840k79692K45700M34247N76699
10676b441668M81200p5930l16095l38238p80506j092760p82905J16670J419550
$$ y = [26708, -149307, -387548, -787668, -1189549, -1618577, -2522817, -3782214, -4560732, -4426552, -4079923, -4112555, -4212069, -4138127, -4004117, -3766476, -3431881, -2907981, -2179305, -1356921, -495124, -104839, -832800, -2348926, -3856733, -4916445, -5032246, -4111835, -2783136, -1530212, -604296, -107071, -348713, -1516362, -3173096, -4622846, -5390446, -5877415, -6340252, -6708126, -6966397, -7193960, -7815088, -8736648, -9399492, -9350917, -8194444, -6008399, -3315171, -913581, 698260, 1633659, 2056196, 2238675, 2400111, 2411986, 2068334, 1259406, 13471, -1326264, -2519782, -3418622, -3698314, -3452614, -3018367, -2441668, -1960468, -2036398, -2352493, -2690731, -3471237, -4563997, -5346902, -5230232, -3810682]
10667c810682K247838J844507O51311k86480p20723o18169k36497j03205k32283
10658a264383n12446j119697j824788j872826j247554m59169K9838j12582o11675
10649h995282o92949l60579k50347k96033l44104j64621L88664J024818J390886
10640h299547J333655P42805K32814K93423M57215M03583M88143K94361l68706
10631d422254p41188m69139j49095o49996j677484j810471j414951j117673k82399
10622a2734650P76101J133754J082787Q08956M24488P39437J419232J664538R29980
10613c755377j42599o18001m29901m6804k92839q64351q81808m37376P6893K97164
10603g094999N904m19735p10258n57459l7959M9952k15449k14547m8434L3468
$$ y = [-3810682, -1562844, 281663, 932974, 646494, -74229, -692398, -928895, -1032100, -1264383, -1776829, -2896526, -4721314, -6594140, -7841694, -8300863, -8271025, -8383607, -8995282, -9688231, -10048810, -10299157, -10595190, -10939294, -11103915, -10715251, -9690433, -8299547, -6965892, -6223087, -5990273, -5696850, -5239635, -4836052, -4347909, -4053548, -4422254, -5163442, -5632581, -5781676, -6431672, -8109156, -9919627, -11334578, -12452251, -12734650, -11958549, -10824795, -9742008, -8933052, -8508564, -7769127, -6349895, -4685357, -3755377, -3897976, -4515977, -4945878, -4992682, -5285521, -6149872, -7031680, -7469056, -7392163, -7094999, -7089095, -7508830, -8219088, -8776547, -8814506, -8764554, -8980003, -9194550, -9242984, -9209516]
10593i209516P0567o3299j53688k2022M43022P70574P28141P90996R10707N50489
10583e184029K64519M26312K70382n29998j261389j260514o18963L00865J147875
10574f444940J658165J880522J863245J456570R19776L73771n4823J2509K16715
10565A881510j90139r05399j182108o08438K41820M54611R5653l87829q25851
10556a426170j151908j123480p21724k01489r6004j93215L21514J102037J150919
10547b339520M28460m71988p45750q0917Q72752J497305J539287Q85707n1423
10538A533913j019342j473818j008594k55108j69027o71315j033381j249442j066555
10529f412669m88895j0003M23625Q41590Q34530Q02576J338857J445034N11431
$$ y = [-9209516, -9138949, -9202248, -9355936, -9377958, -8934936, -8164362, -7436221, -6645225, -5734518, -5184029, -4919510, -4493198, -4222816, -4752814, -6014203, -7274717, -7893680, -7592815, -6444940, -4786775, -2906253, -1043008, 413562, 1333338, 1707109, 1652286, 1664795, 1881510, 1691371, 785972, -396136, -1004574, -762754, -308143, -212490, -600319, -1426170, -2578078, -3701558, -4423282, -4624771, -4720775, -4913990, -4592476, -3490439, -2339520, -1911060, -2383048, -3128798, -3209715, -2336963, -839658, 699629, 1585336, 1533913, 514571, -959247, -1967841, -2222949, -2391976, -3063291, -4096672, -5346114, -6412669, -6901564, -6911567, -6487942, -5646352, -4811822, -4009246, -2670389, -1225355, -713924]
10520g13924J16333N53067N61678M92074N36142N88945O00814M0046k50678n8838
10510B465659J87571K51415M4409k28495q12046j152480q06017j38059O74997
10501D86954J172861Q74493k70203j336583j266717n11625k02503j15639J36697
10492a032265m3601o09638j067926n68528P80739J745386J615283P56415j11605
10483A464260m99603o86756q61258o34353J19266P77949P03043J06217k45011
10474B43754J9527K89335j1415n35456r06620j001165j342467k110577k223194
10465g578278j469738q47837m60483M31720J198974J010444O65741O57985O26031
10456e765441N47350L01419J37104L05705O33473P37090L57840l29934r18151
$$ y = [-713924, -597591, -44524, 517154, 1009228, 1545370, 2134315, 2735129, 2775175, 2524497, 2465659, 2653230, 2904645, 2949054, 2720559, 1908513, 756033, -49984, -188043, 486954, 1659815, 2534308, 2264105, 927522, -339195, -850820, -1053323, -1168962, -1032265, -1075866, -1685504, -2753430, -3321958, -2541219, -795833, 819450, 1575865, 1464260, 964657, 277901, -583357, -1217710, -1098444, -320495, 382548, 488765, 243754, 263281, 552616, 541201, 5745, -900875, -1902040, -3244507, -5355084, -7578278, -9048016, -9895853, -10356336, -9924616, -8725642, -7715198, -7049457, -6391472, -5765441, -5218091, -4916672, -4779568, -4473863, -3840390, -3103300, -2745460, -3075394, -3993545]
10447c993545j334383j280426n79728L6078J74346k34578o23162j05836O83137
10438g258097J238318J513818J504065J197359N35022P8075J63073J56969l08323
10429a179721p78734l09530Q88372J462572J008944K30238j18923K01555M71647
10420A876420o0777j022803j715469j965981j530993n63030K00842O19226N98573
10411c563992Q06m18372l69306o43704q74967o47669p59266j093050l99074Q42418
10401g926176J304972J202710R37083N0883q30286j003919j007482p47393k05625
10392h225233K42254L99083N06244J018935J782660K531721L007910K310188M30626
10383D004388o81588j39259N29241M41561L26279K78826m7471m91924o90636n00439
$$ y = [-3993545, -5327928, -6608354, -7188082, -7152004, -6977658, -7212236, -7835398, -7941234, -7258097, -6019779, -4505961, -3001896, -1804537, -1269515, -1191440, -1028367, -871398, -1179721, -1958455, -2267985, -1379613, 82959, 1091903, 1322141, 1203218, 1404773, 1876420, 1815643, 792840, -922629, -2888610, -4419603, -4982633, -4781791, -4162565, -3563992, -3563186, -3981558, -4350864, -4994568, -5869535, -6517204, -7276470, -8369520, -8768594, -7926176, -6621204, -5418494, -4481411, -4430528, -5260814, -6264733, -7272215, -8019608, -8225233, -7982979, -7583896, -7077652, -6058717, -4276057, -1744336, 1263574, 3573762, 4004388, 3322800, 3183541, 3712782, 4154343, 4480622, 4759448, 4711977, 4220053, 3529417, 3028978]
10373C028978k29114k96736p17093j185850j155713l05787Q10727J386673J094712
10364B430797J93163m73334n28253m28638o27918q42311p24691n62796m68250
10355b032231k0361L49644J39628m71640r92339j067913o44089q6164L22143P41352
10345c761970J006061Q66222N80240L95431J35540m56329q20707j50433J311165
10336h94780K307044K019695O26457o78617q39795j90257N23462J208428J643004
10327E724641J010089M4339p55145j323671j350638j186045j169776j195387j402027
10318a603620j358463l86200N82051P67994N42802L51043P79433J733968K100342
10309C509350J694729J299533J126111R38464O96754j76071j058676j102862j067612
$$ y = [3028978, 2799864, 2503128, 1786035, 600185, -555528, -861315, -50588, 1336085, 2430797, 2623960, 2150626, 1622373, 1193735, 565817, -276494, -1001185, -1563981, -2032231, -2052592, -1702948, -1563320, -2034960, -3027299, -4095212, -4739301, -4825465, -4503322, -3761970, -2755909, -1889687, -1309447, -914016, -778476, -1234805, -2055512, -2205945, -894780, 1412264, 3431959, 4058416, 3379799, 2540004, 2349747, 2873209, 4081637, 5724641, 6734730, 6779069, 6023924, 4700253, 3349615, 2163570, 993794, -201593, -1603620, -2962083, -3348283, -2766232, -1998238, -1455436, -1104393, -324960, 1409008, 3509350, 5204079, 6503612, 7629723, 8568187, 9264941, 9088870, 8030194, 6927332, 5859720]
10300E859720j232231j385987j307085j110265j005920j160768j109791p65600
10292c217927l33544J93883M01338K12693j13685l88546p7354O94005J529264
10283a099873J708552J111210M59796J01718J3212j04246p06392j087820o18418
10274b22261J69087L01626k89593p83726r90541p88870k58984P5722n7356l41865
10264c186761m20222l48189l4401M88258M63437k1192j11720N66656J300179J316624
10254A2669O46197l08881r32747q34315n60782r32636j348784j045611q20364
10245f125254r24132j140333j568932j311080J21052J295047J715274J925163
10237f013195J683062Q99408J60622k04630l22975k00382j1707p9270j80147j02372
$$ y = [5859720, 4627489, 3241502, 1934417, 824152, -181768, -1342536, -2452327, -3217927, -3551471, -3357588, -2956250, -2743557, -2857242, -3245788, -3323142, -2629137, -1099873, 608679, 1719889, 2179685, 2281403, 2294615, 2190369, 1483977, 396157, -222261, -53174, 248452, -41141, -824867, -1815408, -2604278, -2863262, -2787540, -2844896, -3186761, -3606983, -3955172, -3989573, -3501315, -3037878, -3059070, -3170790, -2604134, -1303955, 12669, 658866, 349985, -582762, -1417077, -1977859, -2910495, -4259279, -5304890, -6125254, -7049386, -8189719, -9758651, -11069731, -10948679, -9653632, -7938358, -6013195, -4330133, -3430725, -3270103, -3474733, -3797708, -3998090, -4009797, -4089067, -4269214, -4371586]
10227d371586K46767P79259J187704J122762P66141L44287K25638K01230m568
10218D97634n43699j106454j131295q40441n44908o67828r22210l40719J011767
10209d588153K100481K334770J842702Q48241p2820n23534k71693J77448M04991
10200B252433N59391M33308L05342J66695q1618J55305M59338J61374n92504j430231
10190B388833j649090j378196j052886q48158l31017L28920J69139m15046m70568
10181c258069K10327P86882Q95235J149090J559750J348966M04757k03292l0387
10172B863259N30265J158644J710195J592870Q53147J57905l16227n94618n27552
10163G427888j92268j38662l77641j86822k4249l14254l05180k29550n78498q08697
$$ y = [-4371586, -4124819, -3345560, -2157856, -1035094, -268953, 75334, 300972, 502202, 497634, -46065, -1152519, -2283814, -3124255, -3669163, -4336991, -5259201, -5599920, -4588153, -2487672, -152902, 1689800, 2538041, 2465221, 1941687, 1669994, 1847442, 2252433, 2811824, 3245132, 3550474, 3717169, 3635551, 3790856, 4250194, 4411568, 3819064, 2388833, 739743, -638453, -1691339, -2539497, -2870514, -2541594, -2372455, -2787501, -3258069, -3047742, -2260860, -1365625, -216535, 1343215, 2692181, 3096938, 2893646, 2863259, 3393524, 4552168, 6262363, 7855233, 8708380, 8866285, 8550058, 7955440, 7427888, 7235620, 7096958, 6719317, 6532495, 6508246, 6193992, 5888812, 5659262, 5080764, 4272067]
10153D272067l68266n8535n88965j138643j038626j66234Q29968J119374J173984
10144D036124J300860J205361N39606j01283J05092P12884R47841O65529Q96805
10135A0308819J216552J149655P25585r0882n52243n06862j674O71807J345642
10126A4266399J611914J262412Q10105K22865j35033J65841M50977L48845K26369
10117A9230694N5004J00091M92855N96893J43681k81976k95083p794M32415O86278
10107B1153058L21636l31401n81870l56038k85263n0361O72446J202852J363670
10098B3108729J482781J385610R06754J84277j75483K50616R47086J431960J534814
10089C1057144J305187P35540L05928K4146N2142L56516P62857J184169J461176
$$ y = [4272067, 3903801, 3845266, 3256301, 2117658, 1079032, 912798, 1742766, 2862140, 4036124, 5336984, 6542345, 7081951, 6980668, 7085760, 7798644, 8746485, 9412014, 10308819, 11525371, 12675026, 13400611, 13309729, 12757486, 12250624, 12248950, 12920757, 14266399, 15878313, 17140725, 17950830, 18173695, 18038662, 18204503, 18655480, 19004325, 19230694, 19285698, 19385789, 19878644, 20475537, 20619218, 20337242, 20042159, 20034365, 20466780, 21153058, 21474694, 21143293, 20561423, 20205385, 19920122, 19869761, 20542207, 21745059, 23108729, 24591510, 25977120, 26883874, 27068151, 26892668, 27143284, 28090370, 29522330, 31057144, 32362331, 33097871, 33403799, 33427945, 33480087, 33836603, 34599460, 35783629, 37244805]
10080C7244805J533631J187120R05872J197256J362420R68558R16233J697895
10072D7013790K514639K778461K941863L680781M680803N117127N060444M989528
10064G8777436M908067N064616N842421P294258R105105R605513P241515L078305
10056A30917236N34686J265307L416114M900209N626256O191662P085625Q840450
10048A68777545J1324860J4216613J7872705K2451998K7516570L2926332L8662545
10041C33749168M4010298M7345374M5506652L5316640J7733515l284585k2453143
10034D97923919l4254258l8409842l7742292l3196901k6709349k0824552j5119670
10027B91667055r598823o658060p445940j0241871j2407694j2793817j1542715
$$ y = [37244805, 38778436, 39965556, 40871428, 42068684, 43431104, 44399662, 45315895, 47013790, 49528429, 52306890, 55248753, 58929534, 63610337, 68727464, 73787908, 78777436, 83685503, 88750119, 94592540, 101886798, 110991903, 120597416, 127838931, 130917236, 131451922, 132717229, 136133343, 141033552, 146659808, 152851470, 159937095, 168777545, 180102405, 194319018, 212191723, 234643721, 262160291, 295086623, 333749168, 377759466, 425104840, 470611492, 505928132, 523661647, 520377062, 497923919, 463669661, 425259819, 387517527, 354320626, 327611277, 306786725, 291667055, 282068232, 275410172, 267964232, 257722361, 245314667, 232520850, 220978135]
10020B20978135j0114441r857308r756412q198317n734581m110218l492193k610723
10012A67103942j237077l00610m94513j912874l083944j938165L42461P87311
10004A59266531p44272k052009k233447j731775r55466L51510K622448N093513
9996A59617033O374471N901225N063864M761939L959357K718072K106955K904517
9988A93407433M869027O930060Q783019J0382575J0308998P414610L975824K653671
9980B48725217L539570O170175J0205607J4483061J6884710J6858961J4810191
9973C31677492J3233041J4979626J8102206K0416640K1796484K2054562K1583232
9966D63843283K1351087K1252665K0011013J4860708N074887o573332j6434008
$$ y = [220978135, 210863694, 201006386, 191249974, 183051657, 177317076, 173206858, 169714665, 167103942, 165866865, 165566255, 165071742, 163158868, 160074924, 158136759, 158479220, 159266531, 158522259, 156470250, 154236803, 152505028, 151549562, 151901072, 154523520, 159617033, 165991504, 171892729, 176956593, 181718532, 185677889, 188395961, 190502916, 193407433, 198276460, 205206520, 213989539, 224372114, 234681112, 242095722, 246071546, 248725217, 252264787, 258434962, 268640569, 283123630, 300008340, 316867301, 331677492, 344910533, 359890159, 377992365, 398409005, 420205489, 442260051, 463843283, 485194370, 506447035, 526458048, 541318756, 546393643, 539820311, 523386303]
9959E23386303k2680325k5919457k6003285k2619805j7605789j4841758j7804555
9952C75911329k5260611l0370327k8857943k3462586j7780837j2699022q976607
9945B28503396q047607j0065204j2880455j3852468j2336297r788509p398946
9938A54133910n484486m717839n175190n930340o144273n326465l942471l236021
9930A14176825k649433j493908q16149j344213j821666j504192j208091j235656
9922A02103517j359998j682933k218322k466350k458158k491759k426759j904283
9914H5094955j404664j271568o99702L91127J632195K277187J740513K61008j459515
9905H6561536k495655k782366l037973l041121k245643q71472M47568J060657
$$ y = [523386303, 500705978, 474786521, 448783236, 426163431, 408557642, 393715884, 375911329, 350650718, 320280391, 291422448, 267959862, 250179025, 237480003, 228503396, 220455789, 210390585, 197510130, 183657662, 171321365, 161532856, 154133910, 148649424, 143931585, 138756395, 132826055, 126681782, 121355317, 117412846, 114176825, 111527392, 110033484, 109217335, 107873122, 106051456, 104547264, 103339173, 102103517, 100743519, 99060586, 96842264, 94375914, 91917756, 89425997, 86999238, 85094955, 83690291, 82418723, 81719021, 82110148, 83742343, 86019530, 87760043, 88021051, 86561536, 84065881, 81283515, 78245542, 75204421, 72958778, 72087306, 72534874, 73595531]
9897G3595531J448639J834877J362190j65146j705675k422111k487443k820682
9889F8640180l328190l037284j712314m66656K42558O68938P33162L94268k30162
9880F1904500p22007p38277m45307K94934J253049J480301Q81940k19703j488146
9871F2201284k214015k013357j125648J15501J125988J484922J776014K254156
9863F3604845K127800J291627N7276j026853j188770k63768R94278J395509R21328
9854F7913272L11015l41412r07974j000840p95646n33692p35294j456882j380682
9845F1071865J43353K299707L772274M031180L256682K622339K663149K886407
9837H2746956L188116L545595L777718L970609M207553M547972M768630N389761
$$ y = [73595531, 75044170, 76879047, 78241237, 78076091, 76370416, 73948305, 71460862, 68640180, 65311990, 62274706, 60562392, 60095736, 60338294, 61007232, 61740394, 62134662, 61904500, 61182493, 60444216, 59998909, 60293843, 61546892, 63027193, 63909133, 63689430, 62201284, 59987269, 57973912, 56848264, 56963765, 58089753, 59574675, 61350689, 63604845, 65732645, 67024272, 67081548, 66054695, 64865925, 64602157, 65596435, 66991944, 67913272, 68224287, 67882875, 66974901, 65974061, 65178415, 64644723, 63909429, 62452547, 61071865, 61215218, 63514925, 67287199, 71318379, 74575061, 77197400, 79860549, 82746956, 85935072, 89480667, 93258385, 97228994, 101436547, 105984519, 110753149, 116142910]
9829A16142910O284874O940567P625463Q407025Q798645Q247714P245172O823950
9821A76516320O746124N588351K451394j389000m256942n583850m828069l499606
9813A71744722m427910q515280j3411662j6125496j6294577j4935620j2587755
9806H5446422r615348o533849m146030l436786m309130m613884l481063k254215
9798D7056117j423976p09297j98005r3684K22062L59411o12382j620137j675876
9789D1304233q15734r2497l90992j697707l001613l358818k837573j982153j261623
9780B5865523q80410r29797j052804q87442r83448j458529j885733j893500j702685
9771A4191175j231322k04256P80044J188874N85197m26652q43323n16512p5741
$$ y = [116142910, 122427784, 129368351, 136993814, 145400839, 154199484, 162447198, 169692370, 176516320, 183262444, 188850795, 191302189, 189913189, 185656247, 180072397, 175244328, 171744722, 167316812, 158801532, 145389870, 129264374, 112969797, 98034177, 85446422, 75831074, 69297225, 65151195, 61714409, 57405279, 52791395, 49310332, 47056117, 45632141, 44922844, 44724839, 44631155, 44853217, 45212628, 44600246, 42980109, 41304233, 40488499, 40396002, 40005010, 38307303, 35305690, 31946872, 29109299, 27127146, 25865523, 24985113, 24055316, 23002512, 22115070, 21131622, 19673093, 17787360, 15893860, 14191175, 12959853, 12755597, 13535641, 14724515, 15309712, 14883060, 14039737, 13523225, 13447484]
9762A3447484Q0610M4817m92897r36358n28294L60712N19446k55114j418013k315928
9752H506465k629043k763480k755684k164724o21424R70375K074271K705960K523486
9743E846202J671424R76202R72759Q94938J41257j028752j950901j979858j627545
9734C915726j144291K63841J434493J142158M75543n01699k045463k694477j896727
9725a050896p21831L17739J076274J048667L52393J16996N21224N83983L01923
9716B546472J78412n73807j829883k008482r25893L13496Q25309L12196n26015
9707a688195r51472q05111l02477J08350K81570L96291L06080J42511J217l71278
9697b882514n89820m88272n46999q55793q31024r6089K31031l11143r50152j114567
$$ y = [13447484, 13528094, 13572911, 13080014, 12143656, 11615362, 11976074, 12495520, 12240406, 10822393, 8506465, 5877422, 3113942, 358258, -1806466, -2427890, -1457515, 616756, 3322716, 5846202, 7517626, 8493828, 9466587, 10361525, 10502782, 9474030, 7523129, 5543271, 3915726, 2771435, 3035276, 4469769, 5611927, 6087470, 5585771, 3540308, 845831, -1050896, -1772727, -1454988, -378714, 669953, 1022346, 1139342, 1660566, 2244549, 2546472, 2724884, 2151077, 321194, -1687288, -2613181, -2299685, -1474376, -1162180, -1688195, -2639667, -3444778, -3747255, -3638905, -3357335, -2961044, -2654964, -2512453, -2511236, -2882514, -3472334, -3960606, -4507605, -5363398, -6194422, -6290511, -6059480, -6370623, -7320775, -8435342]
9687h435342o97632J5435N49647J081635J506080J508376Q55782P6081k76318
9678c816256m73895k74389j21068j09545J93537P85178J273176J410552R02658
9669b30052j0146n19743q73198j369996j540898q67407k49603l68684o94485o46174
9659g370386j89932p7094K70110J027376J531020J253552N43057k6814o27670
9650c666781p55192l21953j04943l12896n13636k15132L24354K3870r32062j057849
9640g532220n22677o4086p6486k46344o3368k0967l28413m83208J27117Q29269
9630h381383J066269Q80201L90526P413l08943p38490o99003q8090L43012L88211
9620g140277l11814j069150j147727o15690J73604N85055P26398R62781J027821
$$ y = [-8435342, -9132974, -9117539, -8567892, -7486257, -5980177, -4471801, -3616019, -3539938, -3816256, -4290151, -4564540, -4685608, -4795153, -4601616, -3816438, -2543262, -1132710, -230052, -240198, -759941, -1633139, -3003135, -4544033, -5411440, -5661043, -6029727, -6724212, -7370386, -7560318, -7637412, -7367302, -6339926, -4808906, -3555354, -3012297, -3039111, -3666781, -4421973, -4743926, -4848869, -5161765, -5675401, -5890533, -5566179, -5542309, -6474371, -7532220, -8054897, -8118983, -8195469, -8441813, -8505181, -8526148, -8854561, -9337769, -9210652, -8381383, -7315114, -6434913, -6044387, -6036974, -6345917, -7084407, -7783410, -7871500, -7528488, -7140277, -7452091, -8521241, -9668968, -10284658, -10111054, -9525999, -8799601, -7836820, -6808999]
9611f808999Q73582P02360N68603J30548l67287o24777r75532q88499j09009L78563
9601g120447o5135m44933o24408n04699J09208M98817L28534M494j85136k13298
9591h217003J83255N27292N96109P27572N64495K37756L73509M14156O6100j26703
9581d653462n01740r42791j120860j225071j070656n98414j27093N20069J279930
9572h440088J311535L03251r44366j059560r5668N73653O19153K99659j18108
9563g550539l10866J41671R42663R91636J68307m88515l80841m3606K91348K85707
9553e953035J24145J75443j3827l07464l65957k02676J40197M40530N88750M89307
9543d884587j03068q86152r98459n27301l59245l91823J04614L69809j05365n11408
$$ y = [-6808999, -5935417, -5233057, -4664454, -4533906, -4901193, -5525970, -6501502, -7390001, -7499010, -7120447, -7185582, -7630515, -8254923, -8759622, -8650414, -8151597, -7823063, -7818569, -8003705, -8217003, -8033748, -7506456, -6910347, -6182775, -5618280, -5380524, -5007015, -4592859, -4526759, -4653462, -5155202, -6097993, -7218853, -8443924, -9514580, -10112994, -10240087, -9720018, -8440088, -7128553, -6825302, -7769668, -8829228, -8924896, -8351243, -7732090, -7432431, -7550539, -7861405, -7719734, -6777071, -5785435, -5617128, -6105643, -6486484, -6530090, -6238742, -5953035, -5828890, -5653447, -5667274, -5974738, -6340695, -6543371, -6403174, -5962644, -5373894, -4884587, -4987655, -5873807, -6872266, -7399567, -7758812, -8150635, -8046021, -7676212, -7781577, -8292985]
9533h292985n40231j39133P52991J537653J619480J141234r8601j811310k386450
9524h217352j506641o21162m37609n59682m71650m18251n14673q4070Q70753J250364
9514a0709973J233765R26381J8808m88226j46323L93764L13953l71223j058375
9505i887449p48923K22937Q54314R39273Q04188P04499M12772J69612O9721l2033
9495f491089j54281l46606l5908J175309K094172J672962O17005K9318k05010
9486a644128k29240j82836n13570m87983K36908Q13944O93512k27165j081220
9477b621778j400878j279553l94213Q0645q42709j732453j588575j430343j728054
9468a2937911j279334j1590Q64471J064123J038757P62344L73170K92487P79696
$$ y = [-8292985, -8833216, -8972349, -8219358, -6681705, -5062225, -3920991, -4019592, -5830902, -8217352, -9723993, -10345155, -10782764, -11342446, -11814096, -12232347, -12747020, -12831090, -11960337, -10709973, -9476208, -8549827, -8531019, -9019245, -9165568, -8771804, -8457851, -8829074, -9887449, -10636372, -10413435, -9559121, -8619848, -7815660, -7111161, -6698389, -6528777, -6459056, -6491089, -6645370, -6991976, -7027884, -5852575, -3758403, -2085441, -1468436, -1439118, -1644128, -1873368, -2056204, -2569774, -3057757, -2820849, -2006905, -1313393, -1540558, -2621778, -4022656, -5302209, -5696422, -5615777, -6458486, -8190939, -9779514, -11209857, -12937911, -14217245, -14228835, -13364364, -12300241, -11261484, -10499140, -10125970, -9833483, -9053787]
9459i053787J555146J710696J162223L86201j34825r1694j9285L9997J837n92451
9449e035942p74421j4673K50743l76891p48451p46903q47520j550585j928679
9440a1773322j068681L4498M25639M06600O14373J044957J225361P98609K12683
9431h079283j4586P1804O09073J155790J051294R4649j067433j332759m98487
9422h009938O37246J036435R04514N09187J82879Q2932l46580p60175p56929p30419
9412g250848q98444q71338k70524N56473J076826J016910K55906n41458r51841
9403g878338q20324m93504j46681K36489N00468O44536P52610M75309l19391n64592
9393g613418k44287o9454l63892n48343n1725L26428P8434l96466o13281p14260
$$ y = [-9053787, -7498641, -5787945, -4625722, -4239521, -4374346, -4466040, -4485325, -4445328, -4443491, -5035942, -5810363, -5825036, -5574293, -5951184, -6699635, -7446538, -8294058, -9844643, -11773322, -12842003, -12807505, -12381866, -11975266, -11360893, -10315936, -9090575, -8291966, -8079283, -8093869, -8022065, -7412992, -6257202, -5205908, -5111259, -6178692, -7511451, -8009938, -7372692, -6336257, -5431743, -4922556, -4739677, -4656745, -5003325, -5763500, -6520429, -7250848, -8149292, -9020630, -9291154, -8734681, -7657855, -6640945, -6385039, -6926497, -7878338, -8698662, -9192166, -9338847, -9102358, -8601890, -7957354, -7204744, -6729435, -7048826, -7613418, -7857705, -7927159, -8291051, -8839394, -8891119, -8564691, -8486257, -8882723, -9496004, -10210264]
9383a0210264q51908p31407n53100k11540M24912J038120J057434M09587q0180
9374i708346O09779J320585O06819o49583r47982k06824L22182k36748o98263
9365i588381J2476P61223P11782J66236m20070m68944R3637O38228O43255O39793
9355f810765Q05302N68113l71201j529778j818617r03476P78300J844975J964169
9346e472978K061515J817270R02108n0k07254j02819l45414l62165j19781l99936
9336b229504j282086j798400j215710l3385J218195J790774J368852O70658L78137
9327a132469N42941N98568L37725j03789o45080j160778j410720j578374j857495
9318f409471j637802j112398r63539j014420p43031l13997J5939K26575K72927
$$ y = [-10210264, -11062172, -11793579, -12346679, -12558219, -12133307, -11095187, -10037753, -9628166, -9708346, -9098567, -7777982, -7171163, -7820746, -8768728, -8975552, -8653370, -8890118, -9588381, -9575905, -8814682, -8102900, -7936664, -8356734, -8825678, -8732041, -8093813, -7450558, -6810765, -6005463, -5437350, -5808551, -7338329, -9156946, -10060422, -9282122, -7437147, -5472978, -3411463, -1594193, -692085, -692135, -899389, -1002208, -1347622, -1709787, -1829568, -2229504, -3511590, -5309990, -6525700, -6559085, -5340890, -3550116, -2181264, -1510606, -1132469, -589528, 9040, 346765, 242976, -402104, -1562882, -2973602, -4551976, -6409471, -8047273, -9159671, -10123210, -11137630, -11880661, -12194658, -12178719, -11952144, -11679217]
9309a1679217P98017J638556J731120O29668j68085k58949o19780o10962j40874
9300h680506O0309J56394L13349P08983J252960J517048J348212J405722J613008
9291c04521J198780O16260K92030k50811j044049j441444j299198j221316j166584
9282d620853n52923M65025Q80763K33762p00709j133441q47967l35963l06704
9273f919010r34110j714196j915273j271503n3118Q86820J142913P96229J36582
9264i844666l82629m23177P5945Q62437J128229M97612l61136p59015m82130k93312
9254i981842m72556r07382q54609Q965J281506K518271K594860J522527j66749
9245d457009j474693j083775N0228N37237O47622P47672M18416m91407j099929
$$ y = [-11679217, -10881200, -9242644, -7511524, -6881856, -7049941, -7308890, -7928670, -8539632, -8680506, -8620197, -8463803, -8150454, -7441471, -6188511, -4671463, -3323251, -1917529, -304521, 894259, 1510519, 1802549, 1551738, 507689, -933755, -2232953, -3454269, -4620853, -5173776, -4708751, -3827988, -3594226, -4294935, -5428376, -6276343, -6612306, -6919010, -7853120, -9567316, -11482589, -12754092, -12807210, -11920390, -10777477, -9981248, -9844666, -10227295, -10650472, -10574527, -9712090, -8583861, -8086249, -8447385, -9206400, -9688530, -9981842, -10454398, -11361780, -12216389, -12207424, -10925918, -8407647, -5812787, -4290260, -4457009, -5931702, -7015477, -6965249, -6428012, -5780390, -5032718, -4614302, -5105709, -6205638]
9236f205638j023844r48671j076090j098991m93433O45375J094681K44054p15536
9227i578093o55914o9430K45346J21073K26298P43545J432945K142349K129580
9218c262301J435058J193932R13639j46864r01117r93069n38676j83137k54185
9209b736720k20251l28479j027161j770661k055067j759622j061923l09975k1290
9200a1291149j90169n50949o35147K65858J427653J618751L67027j480509k102744
9191a2571378j142500N0977Q02709J117656J026834M49386k71783m79914j00888
9182a1118901P39269J302324J085800M08815k07694k90329Q4851L89903j4645
9173g620607m75618j88182M5443O4141N51418P53025K13227k31826k91359K3049
$$ y = [-6205638, -7229482, -8178153, -9254243, -10353234, -10846667, -10201292, -9106611, -8862557, -9578093, -10234007, -10303437, -10058091, -9937018, -9710720, -8967175, -7534230, -5391881, -3262301, -1827243, -633311, 280328, 133464, -767653, -1760722, -2299398, -2482535, -2736720, -2956971, -3285450, -4312611, -6083272, -8138339, -9897961, -10959884, -11269859, -11291149, -11481318, -12032267, -12667414, -12401556, -10973903, -9355152, -8988125, -10468634, -12571378, -13713878, -13662901, -12860192, -11742536, -10715702, -10266316, -10538099, -11018013, -11118901, -10379632, -9077308, -7991508, -7582693, -7790387, -8080716, -7995865, -7605962, -7620607, -8096225, -8284407, -8238964, -8174823, -7623405, -6870380, -6657153, -6888979, -7180338, -7157289]
9163g157289N16541P65979J70845j118724k136710j998885q75354m6944O9146
9154a1811395n8544J41990P12500R07185O26527P7783l53870k04934R4614J56437
9144i711707l6834q36218j253629l17784J028940J717660J398113Q91608P84096
9135f335755L18993r3967R8991L92731K64671k50595n26105n93477l86659K37373
9125f873799Q48638J186316J042305J80795q79563j330738r63296r1477M95206
9116f385613j607p00732o69683n10342n65230q16582r44540l51907P23118J305265
9106h917853J342958J274037J070757J097625J169187J012231M71381o5027j67266
9097a711970K28561O77516L41137m43241k24483N48312R21546K43519j096548
$$ y = [-7157289, -6640748, -5874769, -5703924, -6822648, -8959358, -10958243, -11833597, -11880541, -11811395, -11869939, -11727949, -11015449, -10108264, -9481737, -9403954, -9757824, -9962758, -9868144, -9711707, -9748541, -10584759, -11838388, -12156172, -11127232, -9409572, -8011459, -7119851, -6335755, -6016762, -6110729, -6011738, -5619007, -5354336, -5604931, -6131036, -6724513, -7111172, -6873799, -6025161, -4838845, -3796540, -3615745, -4495308, -5826046, -6789342, -6880819, -6385613, -6387220, -7087952, -7757635, -8267977, -8833207, -9649789, -10594329, -10946236, -10223118, -8917853, -7574895, -6300858, -5230101, -4132476, -2963289, -1951058, -1479677, -1544704, -1711970, -1483409, -805893, -464756, -907997, -1132480, -584168, 337378, 580897, -515651]
9088e15651j574824j686494j757135j588382j199647m13641P04232J318892Q52640
9079e860010j2768k71303j26664j0015N95176J244881J027814j32877j447917
9070d993683j785382j264247o24863J12468Q69021J792600K652068K638296J620112
9061A016390L8834j063326j060404n15460n05161j053006j081307m64027J75161
9052d512306J000217J021467J20179N985P28389Q38124l34054j316143j169517
9043c617659l08527M76724O43659K10555l43388p83242o80800k3927R23872J315923
9033b186810R66570K13731p68178j016450o62838o58672o74617L53552J807450
9024b626262J899168M93971j136187j847530j438355o81173K54688J054283Q80159
$$ y = [-515651, -2090475, -3776969, -5534104, -7122486, -8322133, -8735774, -8031542, -6712650, -5860010, -5872778, -6144081, -6270745, -6280760, -5685584, -4440703, -3412889, -3545766, -4993683, -6779065, -8043312, -8668175, -8555707, -7686686, -5894086, -3242018, -603722, 1016390, 1055224, -8102, -1068506, -1583966, -2089127, -3142133, -4223440, -4687467, -4512306, -3512089, -2490622, -2370443, -2364458, -1636069, -797945, -1131999, -2448142, -3617659, -3926186, -3449462, -2805803, -2595248, -2938636, -3721878, -4402678, -4426605, -3502733, -2186810, -1220240, -1006509, -1774687, -2791137, -3453975, -4112647, -4787264, -4433712, -2626262, -727094, -233123, -1369310, -3216840, -4655195, -5336368, -5081680, -4027397, -3147238]
9015c147238k59611j153502j614751k048445j648570o79056p2014J95938J76277
9006a0250972M89425J153766J120658M49934K66697M89206Q16135J243019J138612
8997c083520K01096o50892q78305l24933O75476J274050J088988Q33366R82180
8988A17506J099846Q17891J0767j487157k667461k583145j935079j707702k040752
8979a0375286j665177k77255O85088O06690L29269J68418M22335J185447J566908
8970g353563J084974L72621l10935j006523j306765q51200k72884K77639J342793
8961h023843K176651K024126J460065R72456K10083l38966n05290j157811k218155
8952e400684k687117k282986j467990o58491L93721J341000J650854J405414O34440
$$ y = [-3147238, -3406849, -4560351, -6175102, -8223547, -9872117, -10551173, -10623187, -10427249, -10250972, -9761547, -8607781, -7487123, -7037189, -6770492, -6281286, -5465151, -4222132, -3083520, -2882424, -3533316, -4411621, -4736554, -4061078, -2787028, -1698040, -864674, 117506, 1217352, 2035243, 2046010, 558853, -2108608, -4691753, -6626832, -8334534, -10375286, -12040463, -12317718, -11632630, -11025940, -10696671, -10528253, -10105918, -8920471, -7353563, -6268589, -5895968, -6206903, -7213426, -8520191, -9371391, -9644275, -9366636, -8023843, -5847192, -3823066, -2363001, -1390545, -1180462, -1519428, -2024718, -3182529, -5400684, -8087801, -10370787, -11838777, -12497268, -12103547, -10762547, -9111693, -7706279, -7071839]
8943g071839R8403N88855J119303R55577O93056L05568j83831m91217p83882j215332
8933e985339j422824q92356m43274P0557J454696K620441K091646O00717j13683
8924b019419j78149k57282n04940m27200R63K18835J94265L7182K9428N09173
8914b397144J117248Q30801k06173n43703k41029l04237p24472j205636j565801
8905e240146j334432p31279o27848r36051r92389n71123o908O09186J219801J217037
8895g394152O76669K61831O0876j22381K09408Q38133N87430l91807q59628q73117
8885g006738j115356j593159j680223p06923R05028J704628J518656J005101L41018
8876f627968k66965p75135m84252O04567J594076J610149K00980j463293j976883
$$ y = [-7071839, -6973436, -6384581, -5265278, -4309701, -3616645, -3311077, -3494908, -3986125, -4770007, -5985339, -7408163, -8300519, -8743793, -8673236, -7218540, -4598099, -2506453, -1905736, -2019419, -2197568, -2454850, -2959790, -3386990, -3386027, -3167192, -2972927, -2935745, -2906317, -2397144, -1279896, -449095, -655268, -1198971, -1440000, -1744237, -2468709, -3674345, -5240146, -6574578, -7305857, -7933705, -8869756, -9862145, -10433268, -10440176, -9830990, -8611189, -7394152, -6717483, -6455652, -6394776, -6517157, -6307749, -5469616, -4882186, -5273993, -6133621, -7006738, -8122094, -9715253, -11395476, -12102399, -11197371, -9492743, -7974087, -6968986, -6627968, -6894933, -7670068, -8154320, -7549753, -5955677, -4345528, -4144548, -5607841, -7584724]
8867g584724j077098k82899O8887L99675L69410R0880m99707r45986n75567L71541
8857i665588R93758J242293J384721J002283M66417K51694K10685O48282J038966
8848b426489R29089Q14957L15869j005133k494052l048005k333063j210808n85156
8839a1042791p01286j085729j198798j450190j353381l51331R03915K008652K728329
8830a1542610K874697K203224J347304R22614K31592q47511j172305o51193p23087
8821g357275j286103j422311j135332k11910J013536J588146J499658J083626
8813f227965N7263j094003j348033n37330N69819J521551J963396J469897K18255
8804c407150r01369r22997n20320m06233j86333k7k49084n38082K30807J470019
$$ y = [-7584724, -8661822, -8944721, -8875834, -8476159, -8106749, -8015869, -8515576, -9461562, -10037129, -9665588, -8671830, -7429537, -6044816, -5042533, -4576116, -4324422, -4113737, -3465455, -2426489, -1497400, -682443, -366574, -1371707, -3865759, -6913764, -9246827, -10457635, -11042791, -11744077, -12829806, -14028604, -15478794, -16832175, -17183506, -16279591, -14270939, -11542610, -8667913, -6464689, -5117385, -4194771, -3963179, -4810690, -5982995, -6634188, -7357275, -8643378, -10065689, -11201021, -11412931, -10399395, -8811249, -7311591, -6227965, -6170702, -7264705, -8612738, -9150068, -8580249, -7058698, -5095302, -3625405, -3407150, -4308519, -5231516, -5751836, -6158069, -6344402, -6344429, -6593513, -7131595, -6900788, -5430769]
8794e430769J763368J355508O88245R660k88398m84876j143358j563043j570567
8785f664230j529310j246139k66796N80871M88018L48795P61518J048158P56961
8776e722154L80096N60088R54403M36323j096644j931183r30198K42580L69326
8767f737363M35456Q86599R13851N84828J1864m69304l27940J19256M99503M92136
8757c591114J63051j95671m48229j09684J79704j79833m24332k88871J21722O19712
8747d153545Q09033N97602r8248r96285j527602j311756r46936j163720r57746
8738i749203J35000R98263J126409J140720J511387J738345J169540p7866p34631
8729b742036l74351J3952k78396q88127q79621q013R15532J123435N06626l78802
$$ y = [-5430769, -3667401, -2311893, -1623648, -1613988, -1902386, -2387262, -3530620, -5093663, -6664230, -8193540, -9439679, -9706475, -9125604, -8637586, -8288791, -7527273, -6479115, -5722154, -5342058, -4781970, -3827567, -3391244, -4487888, -6419071, -7349269, -7106689, -6737363, -6301907, -5415308, -4501457, -3916629, -3904765, -4374069, -4702009, -4582753, -4083250, -3591114, -3428063, -3623734, -4071963, -4181647, -4001943, -4181776, -4606108, -4894979, -4773257, -4153545, -3344512, -2746910, -2845158, -3841443, -5369045, -6680801, -7627737, -8791457, -9749203, -9614203, -8615940, -7489531, -6348811, -4837424, -3099079, -1929539, -2007405, -2742036, -3116387, -3102435, -3380831, -4268958, -5148579, -5156592, -4241060, -3117625, -2610999, -2989801]
8719b989801p79469p88407p90859k79905N40957L65501l10689l50448j77982m47520
8709f008622j138631j391731p97098J62919J088929J482675J087147L98765K0916
8700e094731K05830O16512K68813o77182j025323p10627m67783m77594k63176
8691g625261P62107J986599K554858K251111J239991j93502j234908j777395k644839
8682d681239l120617k485632j505893m10052Q08828J445876J206134O11229j12637
8673h244003p41129k71675O29917J070954J661982J798971J106602M61712R309
8664b517360j33824j61083o02336j235279j347798q58263l51778k88392k64629
8655g760742K43367O27491L60644o8707k5664M67097N23774j80766r28644q84262
$$ y = [-2989801, -3769270, -4557677, -5348536, -5628441, -5087484, -4721983, -5032672, -5383120, -5561102, -6008622, -7147253, -8538984, -9336082, -9173163, -8084234, -6601559, -5514412, -5115647, -5094731, -4888901, -4272389, -4003576, -4680758, -5706081, -6416708, -6884491, -7362085, -7625261, -6863154, -4876555, -2321697, -70586, 1169405, 975903, -259005, -2036400, -4681239, -7801856, -10287488, -11793381, -12203433, -11394605, -9948729, -8742595, -8131366, -8244003, -8985132, -9256807, -8626890, -7555936, -5893954, -4094983, -2988381, -2526669, -2517360, -2651184, -2812267, -3414603, -4649882, -5997680, -6855943, -7207721, -7496113, -7760742, -7517375, -6889884, -6529240, -6597947, -6623611, -6156514, -5632740, -5813506, -6742150, -7626412]
8645g626412m21789l58823j90683L62769Q15969J019165P00276k33466m62501
8636f395495J53753L70189K35003M24685O28359R9292o76422n86736R1475L62432
8626e293465J63032l47786q66214n76829O3282N42662R37144R78660P57322O65410
8616b976782L51611J06902J60666k17885n91591n63833n61369p04915l38782J93492
8606e142486K94090L43292N02006M91491j22684j014259r86059o7449R26985J226419
8596c548654J179581J459526J254127K76899o52807j015836r97480r96850j215718
8587d257212j384300r87159k1226R83713J630828J660942J146554K36785m52031
8578a443106o40621o67620j18886P04393O85797l8566n66920m66498k0482N69432
$$ y = [-7626412, -8048201, -8407024, -8597707, -8234938, -7418969, -6399804, -5699528, -5932994, -6395495, -6241742, -5871553, -5636550, -5211865, -4583506, -4484214, -5160636, -5747372, -5655897, -5293465, -5130433, -5478219, -6344433, -6921262, -6857980, -6315318, -5378174, -4399514, -3642192, -2976782, -2625171, -2518269, -2357603, -2575488, -3167079, -3730912, -4292281, -4997196, -5335978, -5142486, -4848396, -4505104, -4003098, -3511607, -3634291, -4648550, -5634609, -5702058, -4775073, -3548654, -2369073, -909547, 344580, 621479, -31328, -1047164, -2044644, -3041494, -4257212, -5641512, -6628671, -6649897, -5666184, -4035356, -2374414, -1227860, -991075, -1443106, -2083727, -2751347, -2870233, -2165840, -1480043, -1518609, -2085529, -2552027, -2572509, -2003077]
8568b003077R59003P64450N72299P65458Q02375K87377o16277j105712q59083
8559d33187Q5184J108622J337436R28914M43629P5731j22160o38558j449447j785645
8549d49481j672081j527869j040449k68077J12235R5252J0620K25970L31467m41521
8539d623934j735394j856367n34257P46940J298823J240415O74706j70454o83225
8530e642747l52114L18233M7999q25121j136267o81213j98810m5057J82260P58458
8520g574379J179702J415703J488883N78789n34493r29571r02293o34619j78148
8511f090426M23446J134796J880063K034356J342007J75401p63087r29280j000898
8502a793622j329296j340112q31208m12481j76099J07388L35782J96462l06770
$$ y = [-2003077, -1044074, -279624, 292675, 1058133, 1860508, 2147885, 1531608, 425896, -433187, -348003, 760619, 2098055, 3026969, 3470598, 3546329, 3424169, 2785611, 1336164, -449481, -2121562, -3649431, -4689880, -4957957, -4845722, -4750470, -4739850, -4513880, -4182413, -4623934, -6359328, -8215695, -8749952, -8003012, -6704189, -5463774, -4789068, -4959522, -5642747, -5994861, -5676628, -5628629, -6453750, -7590017, -8271230, -8470040, -8515097, -8332837, -7574379, -6394677, -4978974, -3490091, -2911302, -3445795, -4375366, -5277659, -5912278, -6090426, -5666980, -4532184, -2652121, -617765, 724242, 899643, 136556, -792724, -1793622, -3122918, -4463030, -5294238, -5706719, -5882818, -5775430, -5439648, -5243186, -5549956]
8493e549956p91252p30390R3067J196493J587243J246849P74620P42644J143337
8484b87345J096236K44552r88872j801901j329144k76284L81506O94051Q58102
8475a409099N99353k7539o64731j016948m74876Q19981J684686J350475K06883
8466A068185p56238j432083j950576k083639j621047o02478J37213L38603O30995
8457f271065O94974P9965n40600n33565m17797o77088l37172Q96486J723704J712506
8447c669652J018827K38187J01168L11743O93012J065024J255008P87540m37592
8438A363265j193253p27379K16612N44482K71228q479j93764j35324O5367P9049
8428B81804J42396J62410n78597j286185j243385j038066o94630P6793R27638
$$ y = [-5549956, -6341208, -7071598, -6978531, -5782038, -4194795, -2947946, -2173326, -1430682, -287345, 808891, 1053443, 64571, -1737330, -3066474, -3342758, -2961252, -2267201, -1409099, -809746, -837285, -1502016, -2518964, -2993840, -2173859, -489173, 861302, 1068185, 311947, -1120136, -3070712, -5154351, -6775398, -7377876, -7240663, -6902060, -6271065, -5576091, -5496126, -6036726, -6570291, -6988088, -7665176, -8002348, -7105862, -5382158, -3669652, -2650825, -2412638, -2311470, -1999727, -1306715, -241691, 1013317, 1800857, 1363265, 170012, -557367, -340755, 203727, 474955, 466476, 272712, 137388, 202755, 281804, 424200, 586610, 8013, -1278172, -2521557, -3559623, -4254253, -4177460, -3249822]
8419c249822Q94409P6790m4393N19140J125828J288996N14368n01313j079814
8410d55811j157585p58817k09162n1133J47805Q26458J034683L92986l89357o23767
8400a243700m20276M7127M70717L07323j61683m82332l60773O06235J749517J943632
8390B455787N32486j142593j735174j445273p04375k29388r2858k52110m69407
8381c082905l18395k41507k70397j84193l03769j25484O85481J078397O47036
8372b115736K62570N651m67496q07120q49750k40924J013461J355101O03850j16655
8362a357048m78823n08568R0347R60472J070582M68741n93696j523427j925769
8353c797189j561787o19734K67124J96114j054790j838573j230735j69459K91531
$$ y = [-3249822, -2355413, -2278623, -2323016, -1803876, -678048, 610948, 1125316, 624003, -455811, -1613396, -2372213, -2581375, -2632508, -2484703, -1658245, -623562, -230576, -619933, -1243700, -1663976, -1616849, -1146132, -838809, -1000492, -1482824, -1843597, -1237362, 512155, 2455787, 2988273, 1845680, 110506, -1334767, -2039142, -2268530, -2361388, -2613498, -3082905, -3401300, -3642807, -3913204, -4097397, -4401166, -4526650, -3841169, -2762772, -2115736, -1853166, -1847515, -2315011, -3122131, -3971881, -4212805, -3199344, -1844243, -1240393, -1357048, -1835871, -2344439, -2254092, -1293620, -223038, 245703, -347993, -1871420, -3797189, -5358976, -5978710, -5711586, -5515472, -6570262, -8408835, -9639570, -9809029, -9517498]
8344i517498J47495l5108j30989M306K73020L55628J87663K08465O92450P00969
8334g113599n7447o73989n63119l20139R6096O12058J033360J531319J940170
8325c515290J906232J356507M84655M5899J20668j86934j154062j898640j683732
8316d524697n80839M98576O86717J92040j59668K74636J238160J851171J707516
8307A183612J052729K87701N8341j50370j053612k192503k392334j635280q07831
8298e649547j79020M46462J130581J667580K044902J921693J379028O21232l46629
8289C036282j095486j171104p91154o35030r85293r42749o00707l08710n0673
8280c544624K03829M43015J76124m39160p66687m56087J82401N70545Q54972R42661
$$ y = [-9517498, -9370003, -9405111, -9536100, -9531794, -9258774, -8903146, -8715483, -8507018, -7814568, -7113599, -7171046, -7845035, -8408154, -8728293, -8632197, -8020139, -6986779, -5455460, -3515290, -1609058, -252551, 232104, 278003, 398671, 211737, -942325, -2840965, -4524697, -5105536, -4606960, -3920243, -3728203, -3887871, -3613235, -2375075, -523904, 1183612, 2236341, 2524042, 2582383, 2432013, 1378401, -814102, -3206436, -4841716, -5649547, -5828567, -5382105, -4251524, -2583944, -539042, 1382651, 2761679, 3382911, 3036282, 1940796, 769692, -21462, -656492, -1641785, -2584534, -3185241, -3493951, -3544624, -3340795, -2897780, -2721656, -3160816, -3927503, -4383590, -4201189, -3630644, -2775672, -1833011]
8270a833011L53030o83810j337560o26821K53495L12056L76655N74316M41584
8261b170066Q3405j40185J29547P51874P97990k30496j321169j312797n90295
8252d002192l82670m58978Q8357N36238J08527p72793p23469O65036J442811Q71783
8242b627350L00533J86209L85700O78779P52020P52652P51975M54854k6937q0116
8232A528319j41572o09958j106125j337907j291958r73957n52778j74138K58334
8223d401740R16324J337052J133581M98658j41825n85638r56474r58643l50281
8214c508986Q7980m68438j105857o32391M45388J037934J009199N68843K88861
8205b277467N17503P35118O66759N75639N00338P1462o30641j387248k216816
$$ y = [-1833011, -1479981, -2163791, -3501351, -4128172, -3874677, -3562621, -3185966, -2611650, -2170066, -2086661, -2226846, -2097299, -1345425, -547435, -777931, -2099100, -3411897, -4002192, -4384862, -4843840, -4755483, -4219245, -4110718, -4883511, -5606980, -4941944, -3499133, -2627350, -2326817, -2140608, -1754908, -1076129, -324109, 428543, 1180518, 1635372, 1608435, 1528319, 1386747, 776789, -329336, -1667243, -2959201, -3933158, -4485936, -4660074, -4401740, -3485416, -2148364, -1014783, -516125, -657950, -1243588, -2200062, -3158705, -3508986, -3421006, -3889444, -4995301, -5627692, -5182304, -4144370, -3135171, -2566328, -2277467, -1759964, -1024846, -358087, 217552, 717890, 789352, 158711, -1228537, -3445353]
8196c445353k511152j601087l48889K52901P66407J292114R31406J02963j18865
8187d679555K80540R49462J415650J284403J109559Q34719N84865L86950j30636
8178B035957p37341j224346j585534j475371n33950M06772P61881R76029J262199
8169a13704J022845J45999m09572k55922K76022Q84133Q45582K99145J35220K49144
8159C078892L5395o78257j323810j255103r72007j146630j403466j102173l54344
8150e121503L91965J012728J630958J963858J486497O27319J0624k41471j76082
8141A584893J2360J69772L54003O61570P26152O27230P8084j039645j812194j583717
8131b21492n31161M18007P11420L78342J52180J78464l09725r13352j242860j146124
$$ y = [-3445353, -5956505, -7557592, -7906481, -7653580, -6887173, -5595059, -4663653, -4560690, -4679555, -4399015, -3449553, -2033903, -749500, 360059, 1194778, 1779643, 2166593, 2035957, 1298616, 74270, -1511264, -2986635, -3520585, -3113813, -2351932, -1375903, -113704, 909141, 1055140, 645568, 389646, 665668, 1549801, 2395383, 2694528, 2829748, 3078892, 3114287, 2436030, 1112220, -142883, -1114890, -2261520, -3664986, -4767159, -5121503, -4729538, -3716810, -2085852, -121994, 1364503, 1991822, 2002446, 1760975, 1584893, 1597253, 1767025, 2121028, 2782598, 3508750, 4135980, 4214064, 3174419, 1362225, -221492, -752653, -334646, 376774, 755116, 907296, 1085760, 776035, -137317, -1380177, -2526301]
8121b526301m51204J55758M62033R18389J102058O94903k28615r54330q21652
8112a648961j00100O92134M82493q84109j858706j525528l94288O27637J185896
8103c423532J023345L9068o27894m29361k69810k17061n288M3738j41457j81871
8093d190123R9605P20688J308677J376564J175929O94287L42646L73767K57876
8084B159916Q9200J06002L56952P46398Q89562L55978l54812n68956m90027n77464
8074B712749m30709J97406K33817p77998j841691j422466k02829K72504p73k97591
8064a557581j19868J24561p2656k27313N0422K06869n12369j543682j684114j327819
8054f663550r46251j27668R07080J804259K329591K084309J362622M97046k18774
$$ y = [-2526301, -2977505, -2821747, -2359714, -1441325, -339267, 355636, 127021, -827309, -1648961, -1749061, -1056927, -574434, -1458543, -3317249, -4842777, -5237065, -4609428, -3423532, -2400187, -2361119, -2989013, -3418374, -3688184, -3905245, -3910533, -3866795, -4008252, -4190123, -4090518, -3369830, -2061153, -684589, 491340, 1185627, 1528273, 1902040, 2159916, 2249116, 2355118, 2712070, 3458468, 4348030, 4704008, 4349196, 3780240, 3290213, 2712749, 2282040, 2479446, 2713263, 1935265, 93574, -1328892, -1531721, -1259217, -1259990, -1557581, -1677449, -1552888, -1625544, -1852857, -1802435, -1595566, -2107935, -3651617, -5335731, -6663550, -7609801, -7737469, -6830389, -5026130, -2696539, -612230, 750392, 1247438, 1028664]
8045A028664q32706j015578o53010j80693R7975J21591K81593M81290L24240k82664
8035f29298j023605j618973j698960j129525l99937p6512k4041k5698m9676M34936
8025f241289R94104J087255P36745R3736l3601L14179R09430J434858J218089
8016E13506K20895o86366o66931j22317M44912R40391J251753J499309J217939
8007D613091P5067j286148j726375p37919O34045J073999Q13135M23130K0209
7998C902234n50861j018697j171999j374561j246419n51703L91571J065097R88437
7989D33099K53980o34238j065660p66847l53706j87979j39085n88827o65856J45152
7979c569967M61733k8211l27904k80237j53322j35354J98347R81440J257757J115485
$$ y = [1028664, 195958, -819620, -1472630, -1653323, -1555348, -1433757, -1152164, -670874, -346634, -629298, -1652903, -3271876, -4970836, -6100361, -6500298, -6576810, -6600851, -6626549, -6676225, -6241289, -5247185, -4159930, -3423185, -3329449, -3363050, -3048871, -2139441, -704583, 513506, 734401, 48035, -618896, -741213, -296301, 644090, 1895843, 3395152, 4613091, 4688158, 3402010, 1675635, 937716, 1571761, 2645760, 3458895, 3882025, 3902234, 3351373, 2332676, 1160677, -213884, -1460303, -2012006, -1620435, -555338, 433099, 687079, 52841, -1012819, -1779666, -2133372, -2321351, -2460436, -3049263, -3715119, -3569967, -3108234, -3136445, -3464349, -3744586, -3897908, -4033262, -3834915, -2853475, -1595718, -480233]
7969d80233R53898N44116R9634j02917k68094n31670q95116j093533p23134j85575
7959b682624J08062L92192M59520K5667n28328l69545N23862J091986R46747M63529
7949D31068l37979j315280j227742j67524P86685J016158L97604K36043O65387
7940D84420N56188k4389l91182m42698n21788o30416j22349N87255O95898O15809
7930H06748K92498l49589j070097j827222k143265j861130j389621p28467L43087
7921g927058J264674J433182Q72363K93651L23896P61191J104925J344767J186903
7912F58494P04363J66302l76943n82527j04002N35212N15081j08559m40921m3211
7902I23289N02513O93887M46203j02745o75796j089025j173106m86945M57063
$$ y = [-480233, 473665, 1017781, 1117415, 1014498, 746404, 214734, -680382, -1773915, -2497049, -2682624, -2574562, -2182370, -1722850, -1697183, -2225511, -2595056, -2071194, -979208, -32461, 431068, 93089, -1222191, -2449933, -2617457, -1830772, -814614, -417010, -180967, 484420, 1040608, 1016219, 625037, 182339, -339449, -969865, -1092214, -504959, 190939, 806748, 1099246, 749657, -320440, -2147662, -4290927, -6152057, -7541678, -8270145, -7927058, -6662384, -5229202, -4356839, -4063188, -3739292, -2978101, -1873176, -528409, 658494, 1362857, 1529159, 1152216, 569689, 465687, 1000899, 1515980, 1407421, 966500, 923289, 1425802, 2119689, 2565892, 2463147, 1787351, 698326, -474780, -961725, -504662]
7893e04662K94928r35938j771833j242707q3497O24982O34818O68411R77222J169199
7883a69077J094580P30969J22040m00692m26988j86797L19408N74562K45867N0028
7873A953900K44239K84519p2604m02408m04695j87499j33408k29788Q6846M55842
7863A594944K48629j13349k03160K13512R21485J341207J323054P40098P471m58198
7853E615693q86782r61424o38033l84544j77290m1246K2142O2034K58623N65960
7843C435133Q08495O40374q3262p13509r08512j203883j452495j493524j720305
7834b691488j992472j617596o37668K26674N94125M45836K9402l63165l63880
7825f370232r6307L4407K14504O09148Q40204L95489n9674L89402Q70288P46116
$$ y = [-504662, -209734, -1145672, -2917505, -4160212, -4243709, -3618727, -2983909, -2315498, -1338276, -169077, 925503, 1656472, 1778512, 1377820, 950832, 764035, 1083443, 1658005, 1903872, 1953900, 2198139, 2482658, 2410054, 2007646, 1602951, 1415452, 1282044, 1052256, 1139102, 1594944, 1843573, 1730224, 1527064, 1740576, 2662061, 4003268, 5326322, 6066420, 6073891, 5615693, 4728911, 3767487, 3129454, 2744910, 2567620, 2526374, 2548516, 2610550, 2869173, 3435133, 4243628, 4884002, 4800740, 4087231, 3178719, 1974836, 522341, -971183, -2691488, -4683960, -6301556, -6939224, -6712550, -6118425, -5672589, -5643187, -6006352, -6370232, -6466539, -6432132, -6217628, -5608480, -4768276, -4372787, -4432461, -4043059, -3172771, -2426655]
7815b426655P00690Q67107Q45491Q05615M86880O9487P895K43655M19688M45795
7805B465648L26474J26746J00038M52294O55733J71986o63104p46924k46040l29166
7795B313685m30533j48157j84309l52840q3606N19296P99426L15506q4197K16438
7785B880709R73470J073052L56269j02131N5173K18845n5179r25787j756628j488822
7775A228971k76730Q15030J404438J523216Q28831j48834j278452k220337k200627
7766c24494j301467J32845J753167K518838K167594J435896M86081n70020j404440
7757D894000j394241r72957r05485j046870j052495r17220k75253O64853Q50894
7748a54774N77671L35162J91177k2623j50643N1884j04590n29947o45223l20398
$$ y = [-2426655, -1725965, -858858, -13367, 792248, 1279128, 1348615, 1356510, 1600165, 2019853, 2465648, 2792122, 2918868, 3018906, 3471200, 4126933, 4298919, 3635815, 2888891, 2642851, 2313685, 1883152, 1734995, 1550686, 1197846, 1114240, 1633536, 2432962, 2748468, 2664271, 2880709, 3854179, 4927231, 5283500, 5181369, 5236542, 5455387, 5400208, 4474421, 2717793, 1228971, 952241, 1767271, 3171709, 4694925, 5523756, 5374922, 4096470, 1876133, -324494, -1625961, -1493116, 260051, 2778889, 4946483, 6382379, 6868460, 6298440, 4894000, 3499759, 2526802, 1621317, 574447, -478048, -1395268, -1670521, -1005668, -154774, 422897, 758059, 949236, 926613, 775970, 827854, 723264, 193317, -451906, -772304]
7738g72304K92956N16400K87188J35018J22716M28281N72736J04963p25111j355585
7728c92742r42370M3361q84n77381j33848P12892P78590L30011k7714j82031n64811
7717i56927r48669n51423M07752J212199J269135M26157m61428o16747n48439
7708g68390n29737j04189O45036J199364J374790J142736P65423P08038M78785
7699D911856n4835J14289N90277J37614r13737j435937j206049p41735k69877
7690A131866j63971m68470j58226P99186J314608J410517J668283J356678L0281
7681F920752j225518j413522j001791r03372p70596p4532O63649J019558Q97551
7672D112179K47578o83516r75889m77781r4512K8481J33736R7501Q421j750j28709
$$ y = [-772304, -479348, 37052, 324240, 459258, 581974, 1010255, 1582991, 1687954, 962843, -392742, -1335112, -1291751, -1292635, -1870016, -2003864, -1290972, -512382, -182371, -210085, -392116, -956927, -1905596, -2457019, -2049267, -837068, 432067, 858224, 396796, -219951, -768390, -1298127, -1402316, -757280, 442084, 1816874, 2959610, 3725033, 4433071, 4911856, 4857021, 4971310, 5561587, 5699201, 4785464, 3349527, 2143478, 1401743, 1131866, 967895, 499425, 341199, 1140385, 2454993, 3865510, 5533793, 6890471, 6920752, 5695234, 4281712, 3279921, 2376549, 1605953, 1531421, 2195070, 3214628, 4112179, 4359757, 3676241, 2700352, 2222571, 2128059, 2156540, 2290276, 2387777, 2396198, 2394448, 2265739]
7661B265739l93893p52327q89766q43600n78239J83741O28418N46335O07317O88681
7651A462406O28783N74143L90513O2813l84163q15887r61481q51199k42885P70280
7641F33323J603999J608607P48509l10259r72174r97141n22950L8301J36790k92117
7631A674888p08379j046097j142394p67698m74913m14033m81163k79269K40880
7622c398178Q68805J653822K139314J884823J092423J53298r28396j790585j790368
7613a15042j229999p33778n06079l97925m64383p00499m88117M89345J271772
7604b874705J375313J213750J134496J350278J312823O15375l47886j236760j423821
7595A118863p09505k3083O9524N0481k13826k99700k0562j26865j79169k69740
$$ y = [2265739, 1871846, 1119519, 229753, -613847, -1192086, -1008345, -379927, 166408, 773725, 1462406, 2091189, 2665332, 3055845, 3118658, 2734495, 1918608, 957127, 105928, -136957, 633323, 2237322, 3845929, 4594438, 4284179, 3312005, 2314864, 1791914, 1830215, 1967005, 1674888, 966509, -79588, -1221982, -1989680, -2464593, -2878626, -3359789, -3639058, -3398178, -2529373, -875551, 1263763, 3148586, 4241009, 4394307, 3465911, 1675326, -115042, -1345041, -2078819, -2584898, -2982823, -3447206, -4147705, -4635822, -4146477, -2874705, -1499392, -285642, 848854, 2199132, 3511955, 4127330, 3779444, 2542684, 1118863, 409358, 386275, 455799, 506280, 292454, -7246, -27808, -154673, -333842, -603582]
7585f03582n26124o33515n06487o7430K37778J92074L70967N00973K59763L32921
7575d42662R70657J689452K032402J377799K72176j94821L9340Q7451n42941j111643
7565D177210j363538j628058j421289n27592K57653L11624l70631o33051O6783
7556a130889O17055L66459k49590m30153l10361m46031k38780N29450J136867
7547a55973J368197J554801J110850J68287l00043j70552K97044Q35261J017951
7538E725823Q15852K97645l67525o71602o49755r58643p68404m3729N12262Q73217
7528D765141Q09914N23630L61303K38597R1777O7685j89206r66012j671268j403518
7518B628043k52888J089126J673164J258014P32174M89336L16249R3285k69590
$$ y = [-603582, -1129706, -1763221, -2269708, -2337138, -2099360, -1907286, -1536319, -1035346, -775583, -442662, 527995, 2217447, 4249849, 5627648, 5899824, 5705003, 5744343, 5831794, 5288853, 4177210, 2813672, 1185614, -235675, -763267, -505614, -193990, -564621, -1197672, -1130889, -513834, -147375, -396965, -827118, -1137479, -1583510, -1822290, -1292840, -155973, 1212224, 2767025, 3877875, 4046162, 3746119, 3575567, 3872611, 4707872, 5725823, 6541675, 6839320, 6471795, 5800193, 5150438, 4191795, 3423391, 3379662, 3891924, 4765141, 5575055, 6098685, 6459988, 6698585, 6790362, 6858047, 6668841, 5702829, 4031561, 2628043, 2375155, 3464281, 5137445, 6395459, 7127633, 7616969, 7933218, 8026503, 7756913]
7509G756913o77204j201229j330477r88663o17260m98469l57976m01418m69427
7500A214790k95299J224M25473P28163N02858J32379L26409L95929l17300j033856
7490B080770q14957j40550J65778M46103N84034r3573o80186k90974K42822K63139
7480A762406L26428O31608K80427k69341l07013k62300m71865n86425j91608L32413
7470A244730K19592j86363l36522l54729o8746M98475P52135M57024K62993J69538
7460B658127J26780J3939k43883j61382L99365Q20619P56949P31871Q61689J106603
7450G070677J052552N11284p4021q8353J81877j92069r41065j222531p25852n66798
7440E005701j093119j091855m58253R7331L38123L85475L79268J19847M1670K89335
$$ y = [7756913, 7079709, 5878480, 4548003, 3559340, 2942080, 2443611, 2085635, 1684217, 1214790, 919491, 920715, 1346188, 2074351, 2577209, 2709588, 3035997, 3431926, 3114626, 2080770, 1265813, 1125263, 1291041, 1737144, 2321178, 2227605, 1547419, 1256445, 1499267, 1762406, 2088834, 2720442, 3000869, 2731528, 2424515, 2162215, 1690350, 1103925, 912317, 1244730, 1464322, 1277959, 941437, 586708, 517962, 1016437, 1768572, 2225596, 2488589, 2658127, 2784907, 2798846, 2554963, 2393581, 2792946, 3613565, 4370514, 5102385, 5964074, 7070677, 8123229, 8634513, 8560492, 8472139, 8654016, 8461947, 7520882, 6298351, 5572499, 5005701, 3912582, 2820727, 2362474, 2459805, 2797928, 3183403, 3562671, 3682518, 3724188, 4013523]
7430D013523P09491R77449Q34853O06871O06813N20424N25669N00239L28964J4460
7420I638756p3470P6985l53101j101773j236685j89863J076452J274189M69484
7411I580974n30823j063521j056076p47389j00883L75479M19669N38757O40243
7402H056430M05294J93375P1892l37281j121208j507158j184275m31206J88381
7393D334244J16209p4139Q3885J85492k06355p37142r42619q75320j45760J058385
7383B796880J580070J040941N28980L8616r47666j482039j025516L9142R06495
7374C475903J304413Q97643K03985k81218r41716q54134J72641Q16783L99467
7365E193767o11380r94197k84150K25136N04049J020181R18830K26948m0864K74420
$$ y = [4013523, 4723014, 5700463, 6535316, 7142187, 7749000, 8269424, 8795093, 9295332, 9624296, 9638756, 9565286, 9642271, 9289170, 8187397, 6950712, 6760849, 7837301, 9111490, 9580974, 9050151, 7986630, 6930554, 6183165, 6082282, 6457761, 6877430, 7416187, 8056430, 8461724, 8655099, 8726991, 8389710, 7268502, 5761344, 4577069, 4145863, 4334244, 4450453, 4376314, 4460199, 4645691, 4439336, 3702194, 2759575, 1884255, 1738495, 2796880, 4376950, 5417891, 5946871, 5985487, 5037821, 3555782, 2530266, 2569408, 3475903, 4780316, 5677959, 5881944, 5600726, 4659010, 3804876, 3977517, 4794300, 5193767, 4582387, 3588190, 3304040, 3529176, 4033225, 5053406, 5972236, 6199184, 6158320, 6432740]
7355F432740M79572K07941p06069j671266j666674r81463j40729K45326J88280
7346B387658O33311J360804J334712Q23027L57257k45790o82985p33735n98984
7337D635275p38962j161710j290571j337016j536470j312550o92426k17540L486
7328c648484L97211R24115J204589Q22618j2755p91913q83575m41322j03867l9161
7318b572544K44825O57563P81784O58790N07542K33838n25774j173580p92076
7309a979632K23864P71775M99158k14996n08024O2308R27084J230120P84677J62783
7299A959117n37303q49979m13370L50124J021607Q37888L38946O4622l57775j206623
7289A207254j868215j759382n28422R80537J092704O17598Q46712Q79745M63519
$$ y = [6432740, 6912312, 7120253, 6414184, 4742918, 3076244, 2094781, 1954052, 2199378, 2387658, 3020969, 4381773, 5716485, 6539512, 6896769, 6650979, 5967994, 5234259, 4635275, 3896313, 2734603, 1444032, 107016, -1429454, -2742004, -3434430, -3651970, -3648484, -3251273, -2327158, -1122569, -299951, -312706, -1104619, -1988194, -2429516, -2533383, -2572544, -2327719, -1670156, -888372, -229582, 277960, 511798, -13976, -1187556, -1979632, -1755768, -983993, -484835, -699831, -1207855, -1145547, -218463, 1011657, 1796334, 1959117, 1421814, 571835, 158465, 508589, 1530196, 2368084, 2707030, 2771652, 2413877, 1207254, -660961, -2420343, -2948765, -1968228, -875524, -257926, 588786, 1468531, 1932050]
7280A932050N53891R10837N80065k56493j131929j451083p17798K77124M42109
7271A138773k37242p71760l14168K39216L99356M47413N26019Q76524J035938
$$ y = [1932050, 2485941, 3396778, 3976843, 3720350, 2588421, 1137338, 419540, 696664, 1138773, 901531, 129771, -184397, 54819, 454175, 901588, 1427607, 2304131, 3340069]
$$ [...]
##END NTUPLES=NMR SPECTRUM
##END=
