##TITLE=dept_SR164 CH-,CH3- -up, CH2- -down
 DMSO-d6, 1800 sc
 23.02.2023
##JCAMPDX= 6.0         $$ Bruker NMR JCAMP-DX V2.0
##DATA TYPE= NMR SPECTRUM
##DATA CLASS= NTUPLES
##ORIGIN= UXNMR, Bruker Analytische Messtechnik GmbH
##OWNER= root
$$ XWIN-NMR		Version 3.5
$$ Thu Mar 23 16:19:13 2023 Russian Standard Time (UT+4h)  she@DPX200
##.OBSERVE FREQUENCY= 50.327992884445
##.OBSERVE NUCLEUS= ^13C
##.ACQUISITION MODE= SIMULTANEOUS
##.ACQUISITION SCHEME= undefined
##.AVERAGES= 1801
##.DIGITISER RES= 17
##SPECTROMETER/DATA SYSTEM= spect
##.PULSE SEQUENCE= dept135
##.SOLVENT NAME= DMSO
##.SHIFT REFERENCE= (INTERNAL, DMSO, 0, 214.665)
##AUDIT TRAIL= $$ (NUMBER, WHEN, WHO, WHERE, WHAT)
$$ ##TITLE= Audit trail, XWIN-NMR		Version 3.5
$$ ##JCAMPDX= 5.01
$$ ##ORIGIN= Bruker BioSpin GmbH
$$ ##OWNER= she
$$ F:/spectra/data/she/nmr/depta/1/pdata/1/auditp.txt
$$ ##AUDIT TRAIL=  $$ (NUMBER, WHEN, WHO, WHERE, WHAT)
(   1,<2023-03-23 16:18:34.28 +0400>,<she>,<DPX200>,
      <created by zg, POWCHK disabled, PULCHK disabled
       terminated by command 'halt'
       configuration hash MD5:
       00 E9 B6 7A A2 85 ED C7 34 08 36 98 17 FE 4E 26
       data hash MD5: 16K
       6C D7 E3 13 F9 85 A6 74 99 1D B8 5B 67 CD D8 69>)
(   2,<2023-03-23 16:18:36.75 +0400>,<she>,<DPX200>,
      <Start of raw data processing
       efp BC_mod = 2 LB = 3.5 FT_mod = 6 PKNL = 1 PHC0 = -3682.414 PHC1 = -1038.801 SI = 16K 
       data hash MD5: 16K
       18 07 CC B1 5D 15 F7 24 9C 11 DF 72 4B 3F A9 0C>)
(   3,<2023-03-23 16:18:40.78 +0400>,<she>,<DPX200>,
      <abs ABSG = 5 
       data hash MD5: 16K
       92 FD 57 0C 6B BB 00 7A 1D E6 32 C0 0F 2E E4 92>)
$$ ##END=
$$ 
$$ hash MD5
$$ A8 66 B9 C9 52 D8 66 F9 2D FD 1F E2 59 54 D4 2D
##$RELAX= 
##$RELAX= 
##$RELAX= 
##$RELAX= 
##$RELAX= 
##$RELAX= 
##$RELAX= 
##$RELAX= 
$$ Bruker specific parameters
$$ --------------------------
##$DU= <F:/spectra>
##$EXPNO= 1
##$NAME= <depta>
##$PROCNO= 1
##$TYPE= <nmr>
##$USER= <she>
##$AMP= (0..31)
100 100 100 100 100 100 100 100 100 100 100 100 100 100 100 100 100 100 
100 100 100 100 100 100 100 100 100 100 100 100 100 100 
##$AQSEQ= 0
##$AQ_mod= 1
##$AUNM= <au_zg>
##$AUTOPOS= <>
##$BF1= 50.322709
##$BF2= 200.13
##$BF3= 200.13
##$BF4= 200.13
##$BF5= 200.13
##$BF6= 200.13
##$BF7= 200.13
##$BF8= 200.13
##$BYTORDA= 1
##$CFDGTYP= 0
##$CFRGTYP= 5
##$CHEMSTR= <none>
##$CNST= (0..31)
1 1 145 1 1 1 1 1 1 1 1 1 1 1 1 1 1 1 1 1 1 1 1 1 1 1 1 1 1 1 1 1 
##$CPDPRG= <>
##$CPDPRG1= <waltz16>
##$CPDPRG2= <waltz16>
##$CPDPRG3= <>
##$CPDPRG4= <mlev>
##$CPDPRG5= <mlev>
##$CPDPRG6= <mlev>
##$CPDPRG7= <mlev>
##$CPDPRG8= <mlev>
##$CPDPRGB= <>
##$CPDPRGT= <>
##$D= (0..31)
0 2 0.003448276 0 0 0 0 0 0 0 0 0 2e-05 0 0 0 0 0 0 0 0 0 0 0 0 0 0 0 
0 0 0 0 
##$DATE= 1679573602
##$DBL= (0..7)
120 120 120 120 120 120 120 120 
##$DBP= (0..7)
150 150 150 150 150 150 150 150 
##$DBP07= 0
##$DBPNAM0= <>
##$DBPNAM1= <>
##$DBPNAM2= <>
##$DBPNAM3= <>
##$DBPNAM4= <>
##$DBPNAM5= <>
##$DBPNAM6= <>
##$DBPNAM7= <>
##$DBPOAL= (0..7)
$$ [...]
##$SUBNAM3= <"">
##$SUBNAM4= <"">
##$SUBNAM5= <"">
##$SUBNAM6= <"">
##$SUBNAM7= <"">
##$SUBNAM8= <"">
##$SUBNAM9= <"">
##$SW= 219.3118970423
##$SWIBOX= (0..15)
0 1 3 0 0 0 0 0 0 0 0 0 0 0 0 0 
##$SW_h= 11037.527593819
##$TD= 16384
##$TD0= 1
##$TE= 0
##$TE2= 300
##$TE3= 300
##$TEG= 300
##$TL= (0..7)
120 120 120 120 120 120 120 120 
##$TP= (0..7)
150 150 150 150 150 150 150 150 
##$TP07= 0
##$TPNAME0= <>
##$TPNAME1= <>
##$TPNAME2= <>
##$TPNAME3= <>
##$TPNAME4= <>
##$TPNAME5= <>
##$TPNAME6= <>
##$TPNAME7= <>
##$TPOAL= (0..7)
0.5 0.5 0.5 0.5 0.5 0.5 0.5 0.5 
##$TPOFFS= (0..7)
0 0 0 0 0 0 0 0 
##$TUNHIN= 0
##$TUNHOUT= 0
##$TUNXOUT= 0
##$USERA1= <user>
##$USERA2= <user>
##$USERA3= <user>
##$USERA4= <user>
##$USERA5= <user>
##$V9= 5
##$VALIST= <valist>
##$VCLIST= <CCCCCCCCCCCCCCC>
##$VD= 0
##$VDLIST= <DDDDDDDDDDDDDDD>
##$VPLIST= <PPPPPPPPPPPPPPP>
##$VTLIST= <TTTTTTTTTTTTTTT>
##$WBST= 1024
##$WBSW= 2
##$XGAIN= (0..3)
0 0 0 0 
##$XL= 0
##$YL= 0
##$YMAX_a= 2626610
##$YMIN_a= -2500692
##$ZGOPTNS= <>
##$ZL1= 120
##$ZL2= 120
##$ZL3= 120
##$ZL4= 120
##$ABSF1= 214.6655
##$ABSF2= -4.669434
##$ABSG= 5
##$ABSL= 3
##$ALPHA= 0
##$AQORDER= 0
##$ASSFAC= 0
##$ASSFACI= 0
##$ASSFACX= 0
##$ASSWID= 0
##$AUNMP= <proc_1d>
##$AZFE= 0.1
##$AZFW= 0.1
##$BCFW= 0
##$BC_mod= 2
##$BYTORDP= 0
##$COROFFS= 0
##$CY= -3
##$DATMOD= 1
##$DC= 0
##$DFILT= <>
##$DTYPP= 0
##$F1P= 0
##$F2P= 0
##$FCOR= 0.5
##$FTSIZE= 16384
##$FT_mod= 6
##$GAMMA= 0
##$GB= 0
##$INTBC= 1
##$INTSCL= 0
##$ISEN= 128
##$LB= 3.5
##$LEV0= 0
##$LPBIN= 0
##$MAXI= 10000
##$MC2= 0
##$MEAN= 0
##$ME_mod= 0
##$MI= 0.4000791
##$NCOEF= 0
##$NC_proc= -2
##$NLEV= 6
##$NOISF1= 120.0001
##$NOISF2= 80.00006
##$NSP= 0
##$NTH_PI= 0
##$NZP= 0
##$OFFSET= 214.6655
##$PC= 4
##$PHC0= -3682.414
##$PHC1= -1038.801
##$PH_mod= 1
##$PKNL= yes
##$PPARMOD= 0
##$PSCAL= 0
##$PSIGN= 0
##$REVERSE= no
##$SF= 50.3227091
##$SI= 16384
##$SIGF1= 140
##$SIGF2= 120
##$SINO= 80
##$SIOLD= 32768
##$SREGLST= <13C.CDCl3>
##$SSB= 0
##$STSI= 16384
##$STSR= 0
##$SW_p= 11037.527593819
##$SYMM= 0
##$S_DEV= 0
##$TDeff= 16384
##$TDoff= 0
##$TI= <>
##$TILT= no
##$TM1= 0
##$TM2= 0
##$TOPLEV= 0
##$USERP1= <user>
##$USERP2= <user>
##$USERP3= <user>
##$USERP4= <user>
##$USERP5= <user>
##$WDW= 1
##$XDIM= 16384
##$YMAX_p= 419931801
##$YMIN_p= -140701218
$$ End of Bruker specific parameters
$$ ---------------------------------
##NTUPLES= NMR SPECTRUM
##VAR_NAME=  FREQUENCY,     SPECTRUM/REAL,   SPECTRUM/IMAG
##SYMBOL=    X,             R,               I
##VAR_TYPE=  INDEPENDENT,   DEPENDENT,       DEPENDENT
##VAR_FORM=  AFFN,          ASDF,            ASDF
##VAR_DIM=   16384,         16384,           16384
##UNITS=     HZ,            ARBITRARY UNITS, ARBITRARY UNITS
##FACTOR=    0.67371834180669, 1,            1
##FIRST=     10802.5493505904, 0,            0
##LAST=      -234.978243228581, 0,           0
##MIN=       -234.978243228581, -140701218,  0
##MAX=       10802.5493505904, 419931801,    0
$$ Real data points
##PAGE= N=1
##DATA TABLE= (X++(R..R)), XYDATA
$$ [...]
12570A469195m6142j83967N09L55170J3823K77679J063523J359467J724373K175521
12560H209151K050917J074720K22491k34910p87801j299676j450070j596477j709122
12551D479223j143776j35147Q07719M93692j377106k841262k139132k59842J514112
12542f01519K181961J698751J152157J45523q92210j313089j455232j106309q97750
12533a087717q69460J53833J186691Q97804m34319j340904j064629p39387o67073
12524c965161k21772O90845J668263K062896K032009J614677P16936m4717j2693
12515D541283O14236J207222J330045P17094q56458k829649l764179k807396j351445
12506c199247o28861o96361o27358K92349J460095J474959L12045q93158l51610
$$ y = [1469195, 1423053, 1239086, 1239595, 1594765, 1608588, 1886267, 2949790, 4309257, 6033630, 8209151, 10260068, 11334788, 11557279, 11322369, 10534568, 9234892, 7784822, 6188345, 4479223, 3335447, 3200300, 4008019, 4501711, 3124605, 283343, -1855789, -2115631, -601519, 1580442, 3279193, 4431350, 4576873, 3684663, 2371574, 916342, -189967, -1087717, -1957177, -1803344, -616653, 281151, -153168, -1494072, -2558701, -3298088, -3965161, -4186933, -3496088, -1827825, 235071, 2267080, 3881757, 4598693, 4553976, 4541283, 5155519, 6362741, 7692786, 8409880, 7553422, 4723773, 959594, -1847802, -3199247, -3828108, -4524469, -5151827, -4859478, -3399383, -1924424, -1612379, -2505537, -2857147]
12497b857147J385883K032441J133941p98468k400101k959093k182608n2600J893689
12488d804063K456490K372970J795520J06416j791737k767766k616537j295588
12480f544295M39218J862667K568574K817835K768915J668039j04462r70386j330489
12471C175616j796245j681459r81836J49175R27522K5885j725477k238442j745953
12462e891214j077420m27097K15341J016658J016667P48319J216417J821329J456419
12453I5419j01149j384881r21126J72831O18132N76990O97165O37939M67208J525234
12443B383762K998371K617782O91975p86844m14728J394310J752704J11552j521503
12434I227381k471702l048681l123379k918246j860271j81782J139869J989013
$$ y = [-2857147, -1471264, 561177, 1695118, 896650, -1503451, -4462544, -6645152, -6697752, -4804063, -2347573, 25397, 1820917, 1927333, 135596, -2632170, -5248707, -6544295, -6105077, -4242410, -1673836, 1143999, 3912914, 5580953, 5476491, 4506105, 3175616, 1379371, -302088, -1283924, -1134749, -207227, -181342, -1906819, -4145261, -5891214, -6968634, -7395731, -7180390, -6163732, -5147065, -4398746, -3182329, -1361000, 95419, -5730, -1390611, -2311737, -2138906, -1520774, -943784, -246619, 391320, 858528, 2383762, 5382133, 7999915, 8691890, 7905046, 7490318, 8884628, 10637332, 10748884, 9227381, 6755679, 3706998, 583619, -2334627, -4194898, -4376680, -3236811, -1247798]
12426a247798K766373L789875L562527J388171j025952k433967k556341j241243
12418C001645K65908L59688n18564j078175j011283p59730n87237o68656r18378
12409a914782j431029j903467j664584p42386L81609J003431J127377J163306
12401c980525P12764k73554j106926j169419o20860K00000Q78790J267884Q94363
12392c197483p96507k534703k330827m61609N72466K88511K92040N35875Q7599
12383g544638o08808p33899r1411J109553J691850R33518N04044J115987J617093
12374b006711J276413R29464J107683Q25099k54583j274242j839131k101416j245470
12365d582894N53897K417333L696631L362750J640562O44728P70659Q32809L01120
$$ y = [-1247798, 1518575, 5308450, 8870977, 10259148, 9233196, 6799229, 4242888, 3001645, 3267553, 3627241, 3108677, 2030502, 1019219, 259489, -327748, -996404, -1914782, -3345811, -5249278, -6913862, -7656248, -7274639, -6271208, -5143831, -3980525, -3267761, -3541315, -4648241, -5817660, -6438520, -6238520, -5359730, -4091846, -3197483, -3993990, -6528693, -8859520, -9321129, -8748663, -8460152, -8168112, -7632237, -7544638, -8153446, -8887345, -8978756, -7869203, -6177353, -5243835, -4739791, -3623804, -2006711, -730298, 199166, 1306849, 2131948, 1877365, 603123, -1236008, -3337424, -4582894, -4028997, -1611664, 2084967, 5447717, 7088279, 7733007, 8503666, 9336475, 9637595]
12356I637595K13551R58755Q07617J5561m2648K90647J42542m08712j229125j878106
12346H507677j443030j066817j039318o69709m00605J28919R18821P51799Q795
12337E696532m4502N58462Q13341j513j196209j526203j344224j453553j774088
12328b71957j657726l61887J656813K973071K482613J573668R21944q68550l094268
12319C353721l483284k428348j871854j499080n11292P85163J433139Q95805R2696
12310c233334O12518K276508K656471J676284J011000J461512J566896L50j608519
12301F419686j395579l28748K60462N57885P03550M33564j47155o00155o62721
12292E240789p29826j202204j199287L31303J952433J678948K31782l49803K94882
$$ y = [9637595, 9851146, 10809901, 11617518, 11633079, 11590431, 11881078, 12023620, 11614908, 10385783, 8507677, 7064647, 5997830, 4958512, 4288803, 3888198, 4017117, 4935938, 5687737, 5696532, 5652030, 6210492, 7023833, 7022320, 5826111, 4299908, 2955684, 1502131, -271957, -1929683, -2291570, -634757, 2338314, 4820927, 6394595, 7316539, 6447989, 3353721, -129563, -2557911, -4429765, -5928845, -6440137, -5654974, -4221835, -3326030, -3233334, -2620816, -344308, 2312163, 3988447, 4999447, 6460959, 8027855, 8028205, 6419686, 5024107, 4695359, 4955821, 5513706, 6217256, 6650820, 6503665, 5903510, 5240789, 4510963, 3308759, 2109472, 2440775, 4393208, 6072156, 6303938, 5954135, 6249017]
12283F249017K34548p98554j470153j275145j06291N86102N7811o65779q41506
12274A970050m37178L51820O42085m64154j631855j046510o432m24201j387978
12265b434353p07484J092990K044751J783230M71754o33914k71452R47647J883028
12256D176197J539496N75763K07708M03641L92613j46493m71902p72121j375764
12247D529138j702158j627062q09807P26483J688165J766974J923038J877927
12239H372698J352224M74428l91087o32261p01303o41712M08682J396019J625528
12230A1263216J562989K92246j636415k496901k258418j583354p29455M44908
12222D858816J372108J384563R60842J34949p57267o29856l94492r34663j100088
$$ y = [6249017, 6483565, 5685011, 4214858, 2939713, 2833422, 3419524, 3477335, 2811556, 1970050, 1532872, 1884692, 2526777, 2062623, 430768, -615742, -622174, -1046375, -2434353, -3141837, -2048847, -4096, 1779134, 2250888, 1616974, 1345522, 2293169, 4176197, 5715693, 6291456, 6499164, 6902805, 7295418, 7148925, 6677023, 5904902, 4529138, 2826980, 1199918, 390111, 1116594, 2804759, 4571733, 6494771, 8372698, 9724922, 10199350, 9808263, 9176002, 8474699, 7832987, 8241669, 9637688, 11263216, 12826205, 13118451, 11482036, 8985135, 6726717, 5143363, 4413908, 4858816, 6230924, 7615487, 8576329, 8711278, 7954011, 7324155, 6929663, 5995000, 4894912]
12213D894912o42144n86535j492829l052560l237238j327396L99431J504541J933568
12204a606250J298895L09060Q0641K7776l34463m57588l07837q562J25962k7502
12194h99868o13718j149206q39668j92585M5269K8230R93681J903861K294988
12185A570984K198878K006320J837827J301238K55477q06513j403506k028944
12177D931761k779752l133920l049641k104442K3372J716349K934306L898030
12169B436063L363437J415623l36409q69198p42770r27723q25109l09578P8632
12160C282968N66172R72286O02410o47464j432196j210524j208072j325086j275150
12151a674656j070964j226854j887020j319288M27008J742461J778918R97353
$$ y = [4894912, 4252768, 3666233, 2173404, -879156, -4116394, -5443790, -5044359, -3539818, -1606250, -307355, 1705, 82346, 110122, -224341, -681929, -989766, -998328, -872366, -899868, -1513586, -2662792, -3502460, -3695045, -3649776, -3621546, -2627865, -724004, 1570984, 3769862, 5776182, 7614009, 8915247, 9170724, 8364211, 6960705, 4931761, 2152009, -981911, -4031552, -6135994, -6112622, -4396273, -1461967, 2436063, 5799500, 7215123, 6878714, 6009516, 5266746, 4339023, 3513914, 3204336, 3282968, 3849140, 4821426, 5423836, 4776372, 3344176, 2133652, 925580, -399506, -1674656, -2745620, -3972474, -5859494, -7178782, -6751774, -5009313, -3230395, -2233042]
12143b233042M34872q1551j68933O47113J712968K037429J043948j216958k338957
12134a63111j665503j268609j116503l8129J204669J701683J631992J017912L03131
12125A607532k96003o41166q96361l46095Q54558K156862L009005K334795M08279
12116H191406j477532k170174j401578l58382q92632j730947j442582o55585n71425
12107b509431o77738l12903l49851l85775L50574Q26766M79195j54406m76789
12098c210358j23158r4385m44901p36862j287370j565684j393350j248834j300651
12089a1405553r47813j08104J019520J708769Q64648r99247k288686j992980n27368
12080a4676814R88257K007472K080948J060652l90806j408259p15112R78740K024854
$$ y = [-2233042, -1798170, -1879721, -2048654, -1401541, 311427, 2348856, 3392804, 2175846, -163111, -1828614, -3097223, -4213726, -4251855, -3047186, -1345503, 286489, 1304401, 1607532, 1311529, 670363, -225998, -572093, 282465, 2439327, 5448332, 7783127, 8191406, 6713874, 4543700, 3142122, 2783740, 1891108, 160161, -1282421, -1938006, -2509431, -3187169, -3500072, -3849923, -4235698, -3885124, -3058358, -2579163, -2733569, -3210358, -3333516, -3427901, -3872802, -4609664, -5897034, -7462718, -8856068, -10104902, -11405553, -12353366, -12461470, -11441950, -9733181, -8868533, -9867780, -12156466, -14149446, -14676814, -13688557, -11681085, -9600137, -8539485, -8930291, -10338550, -11053662, -10074922, -8050068]
12071h050068J751355J086362J266412J488818P65712m40865j130300j287739
12063d550313j446340j555319j185389m65383R3526P69852J080121M82220J32523
12054f644502M63016O56030Q93553J252842O93770k22766j3226N99597N19985
12045a801701J55699j63140o9366k44565r82464j297367m22543M44286L59072
12036d022089k84211j111981j364527r49787k74190N04012J377508K020370K130652
12027a974243J622456J432841K203731K170572P08904j456003l062376l139009
12019a493127k188247p91175M23837J141156J545793J659486Q32041k94203j402532
12010e66971k012705j668473j022646k06009Q00598J663911J990517J028857l08159
$$ y = [-8050068, -6298713, -5212351, -3945939, -2457121, -1691409, -2132274, -3262574, -4550313, -5996653, -7551972, -8737361, -9202744, -9109218, -8339366, -7259245, -6777025, -6644502, -6181486, -5525456, -4631903, -3379061, -2685291, -2908057, -2921283, -2321686, -1801701, -1646002, -1809142, -1878508, -2123073, -3105537, -4402904, -4825447, -4381161, -4022089, -4306300, -5418281, -6782808, -7732595, -8006785, -7502773, -6125265, -4104895, -1974243, -351787, 1081054, 3284785, 5455357, 6164261, 4708258, 1645882, -1493127, -3681374, -4472549, -4048712, -2907556, -1361763, 297723, 1129764, 835561, -566971, -2579676, -4248149, -5270795, -5476804, -4676206, -3012295, -1021778, 7079, -301080]
12001c01080p10979l24742J40575M91093O64584J90595q42053j464934j255854
11992c412795o85440N9124N55928N0633q84904q08619J58891N63777O17754J102052
11982b683599J709748J840055J077430j60778k93552J049214J816468O63495r02073
11973D116408q28295O31466K062832L222927L589269K118916j08589j619910j963709
11964A1221315j971315j879160j274221o62275q82572j492674j697578j663177
11956c01657j461372j129344j006669l04708K92358L01287M42215O54675N12193
11947b001022J42176K85481N52204o3749n38626R799P06653J179476J347120Q77966
11937B497478j69033q79696j460068j849847j121381N07856J754742J647281P12913
$$ y = [-301080, -1012059, -1336801, -1196226, -705133, -40549, 150046, -692007, -2156941, -3412795, -4098235, -4039111, -3483183, -3432550, -4317454, -5126073, -4967182, -4403405, -3785651, -2683599, -973851, 866204, 1943634, 1782856, 1489304, 2538518, 4354986, 5018481, 4116408, 3288113, 3919579, 5982411, 9205338, 12794607, 14913523, 14804934, 13185024, 11221315, 9250000, 7370840, 6096619, 5434344, 4551772, 3059098, 1361520, -301657, -1763029, -2892373, -3899042, -4203750, -3911392, -3610105, -3167890, -2513215, -2001022, -1858846, -1573365, -1021161, -1084910, -1623536, -1613737, -907084, 272392, 1619512, 2497478, 2328445, 1448749, -11319, -1861166, -2982547, -2474691, -719949, 927332, 1640245]
11928A640245l9897K96657J211811O61824j565024l324269l478260k184645k79770
11919g061328N88275O87761J038821J195144P95568J53251o86944q67588K32972
11910c924068J292721J515325J399918J137171O5199j062526j085701m4624O27800
11901g8785K86062k9024j254305k807327k640972j312930l5923L53309j01005
11892g620900l48718N3793K14836j70612o41067p76316l90175K52754K12946k98513
11882i511972K74893J407747J396337N01113l06083l20970N02232R95857Q86316
11873d174530R67862J295036J042249L80262m00404q49008q83426o38992M36555
11864b824396J429775J777066J747522J427605P60533J54528M13275M39937o07194
$$ y = [1640245, 1600348, 1897005, 3108816, 3770640, 2205616, -1118653, -4596913, -6781558, -7061328, -6473053, -5785292, -4746471, -3551327, -2755759, -2602508, -3289452, -4157040, -3924068, -2631347, -1116022, 283896, 1421067, 1486266, 423740, -661961, -706585, -78785, 207277, 178253, -1076052, -3883379, -6524351, -7837281, -7873204, -7519895, -7620900, -7969618, -7915825, -7700989, -7871601, -8512668, -9288984, -9679159, -9426405, -9213459, -9511972, -9237079, -7829332, -6432995, -5931882, -6237965, -6558935, -6056703, -5060846, -4174530, -3206668, -1911632, -869383, -489121, -889525, -1738533, -2621959, -3260951, -2824396, -1394621, 382445, 2129967, 3557572, 4318105, 4472633, 4885908, 5325845, 4718651]
11855D718651j049386l51516L27545N91637k59384j591771k297796j828661j20805
11846a861486J252051J454631Q09389k30764p47094l73473Q77345J153973k89181
11837B045391j469916j687788q65340O18553J098965L59954m71775r4570J241714
11828G75188K208463J706437l65386k717950k780026q74839L48168L52848K34122
11819a112975J62476l7410j87595n98410q02480q34445j016714r73218n82469
11810e983240q9051N6094l8036K3490L30368K81142m1211q27096k167162k104814
11800a0559516n72035Q33016J104881O78342O30115J118366J740065K880645L189748
11791A043627J478916M6127L53344O61445N19760J074080J056604n22807k273429
$$ y = [4718651, 3669265, 3317749, 3645294, 4236931, 3977547, 2385776, 87980, -1740681, -1861486, -609435, 845196, 1654585, 1423821, 676727, 303254, 1180599, 2334572, 2045391, 575475, -1112313, -1977653, -1359100, -260135, 99819, -371956, -466526, 775188, 2983651, 4690088, 4324702, 1606752, -1173274, -2048113, -1699945, -1347097, -1112975, -950499, -987909, -1175504, -1773914, -2576394, -3410839, -4427553, -5400771, -5983240, -6072291, -6016197, -6054233, -6030743, -5700375, -5419233, -5460444, -6287540, -8454702, -10559516, -11131551, -10298535, -9193654, -8515312, -7885197, -6766831, -5026766, -2146121, 1043627, 2522543, 2568670, 2922014, 3583459, 4103219, 5177299, 6233903, 5711096, 3437667]
11782C437667k710008j893312p63279K91117M86146q702k38220N3552L28073L82841
11772f34125L22291K4848l76550j095617k261440k427903o94117J243255J269786
11763d629572j71164p85426M0158P94968K99713q27689j069253p61816j182628
11754h292709k132002k230404j582249n89539N70333J519658K468710L046832
11746g221370L047405K643785J395871o65911j999296j373716L02869J107787
11738b762576P58346k01983j377313j709821q84921o21137j780711k278720l54713
11729a1213549K539928L625000K507469J288191Q23032L68291j47195L83844R28006
11720A103017m06272k036162j868248n17149N3922K99341J460577K643598K926616
$$ y = [3437667, 727659, -1165653, -1928932, -1637815, -1151669, -1160371, -1398591, -1345039, -1016966, -634125, -311834, -286986, -663536, -1759153, -4020593, -6448496, -7142613, -5899358, -4629572, -4800736, -5586162, -5546004, -4751036, -4451323, -5279012, -6348265, -7110081, -8292709, -10424711, -12655115, -14237364, -14826903, -14256570, -12736912, -10268202, -7221370, -4173965, -1530180, -134309, -800220, -2799516, -4173232, -3870363, -2762576, -2004230, -2206213, -3583526, -5293347, -6178268, -6799405, -8580116, -10858836, -11213549, -8673621, -5048621, -2541152, -1252961, -429929, -61638, -208833, 175011, 1103017, 696745, -1339417, -3207665, -3724814, -3670892, -3371551, -1910974, 732624, 3659240]
11711C659240J770656J23223k89645j44418n38938j320433j574436j372354j587526
11702a274631j798346j381750k03373J292767K282967K355495J444563j08223
11694B609469r62422m46444k69246j024598j368915o87780l21378r82052j972107
11685e425473j880418q87099k68512N33321J255314J593395J721702J306709P36744
11676a314317N26618P63995R60771O66716O24490J080849R81647Q2045l87172
11667C985642J15660Q56488R79115L35717m95536j094460j179880j043890j226014
11658A232842j446203j480072q67852M28876J241850J452896J242167K76420j120519
11649I60405j757114j104663O5184Q43942Q12131N64469R71335J534930R55740
$$ y = [3659240, 5429896, 5553119, 5263474, 5119056, 4580118, 3259685, 1685249, 312895, -1274631, -3072977, -4454727, -4658100, -3365333, -1082366, 1273129, 2717692, 2609469, 1647047, 1200603, 931357, -93241, -1462156, -2149936, -2471314, -3453366, -5425473, -7305891, -8192990, -8461502, -7928181, -6672867, -5079472, -3357770, -2051061, -1314317, -787699, -23704, 937067, 1603783, 2228273, 3309122, 4290769, 4372814, 3985642, 4101302, 4957790, 5936905, 6272622, 5777086, 4682626, 3502746, 2458856, 1232842, -213361, -1693433, -2561285, -2132409, -890559, 562337, 1804504, 2080924, 960405, -796709, -1901372, -1836188, -992246, -180115, 384354, 1355689, 2890619, 3846359]
11640C846359l84031r52509j301799j526232p73397k48396m23258k4106M89350
11631a298019P0044o06357m38989Q07009J743013J442371L12382l99758K07217
11622A838913J141853J485761J218142l5270j614662k001505q39917L03286N41816
11613B038417J05947k52800k52943M975K68995l01426j613408j703612o72914
11604b378769l38652j198910j816721j397890o89133L91555J900025K859068K630217
11595c9210J976894J276007P43311R63847J313632J380064J576327J465600J035609
11586A1692081N17979j61917q50321j869820l060828m006704m196412k862893
11578d798835r68790K81805O23923P26092Q51601P38102R94727J432619J295177
$$ y = [3846359, 3462328, 2509819, 1208020, -318212, -1091609, -1340005, -1763263, -1787369, -1298019, -1227975, -1834332, -2273321, -1466312, 276701, 1719072, 2031454, 1631696, 1838913, 2980766, 4466527, 5684669, 5649399, 4034737, 2033232, 1193315, 1496601, 2038417, 2144364, 1891564, 1638621, 1643596, 1912591, 1611165, -2243, -1705855, -2378769, -2717421, -3916331, -5733052, -7130942, -7820075, -7428520, -5528495, -2669427, -39210, 1937684, 3213691, 3957002, 4920849, 6234481, 7614545, 9190872, 10656472, 11692081, 12210060, 12048143, 11197822, 9328002, 6267174, 2260470, -1935942, -4798835, -5767625, -5485820, -4861897, -4135805, -3284204, -2546102, -1551375, -118756, 1176421]
11569A176421J033853J196988J844898K620084K824901K509040K359751J887348
11561A7453284Q5936k248843l823106l650419k416543k337812k780746k120923
11553a839172j107523j003956n32526J127281K290577K280983K045088J630846
11545D891598N85105n47456j807814k248315j268767R50112K654325K540892J640457
11536G390137M23544o60509p43748j33184O69070N41239j079958k729989k612442
11527A064160n08392J205622J210570J076772J445239J329160Q72385L45744q35323
11518G205937j827987j247741m02023q7718P36018J279692M86499m56687j299269
11509D386721j893705k154493k518170k429929j332355k39760m16482p89136J20164
$$ y = [1176421, 2210274, 3407262, 5252160, 7872244, 10697145, 13206185, 15565936, 17453284, 17539220, 15290377, 11467271, 7816852, 5400309, 3062497, 281751, -1839172, -2946695, -3950651, -4483177, -3355896, -1065319, 1215664, 3260752, 4891598, 5476703, 4929247, 3121433, 873118, -395649, 554463, 3208788, 5749680, 7390137, 7813681, 7153172, 6409424, 6276240, 6945310, 7486549, 6406591, 3676602, 1064160, 555768, 1761390, 2971960, 4048732, 5493971, 6823131, 7695516, 8041260, 7205937, 5377950, 4130209, 3728186, 3640468, 4376486, 5656178, 6142677, 5685990, 4386721, 2493016, 338523, -2179647, -4609576, -5941931, -6181691, -6598173, -7387309, -7267145]
11500g267145Q30600P91312P46198K79125l6016L84705J872955L450499L382999
11491D435232J980940M32468q23256j799289j543504p32473p57785j352039q15904
11482i75610Q39978J421918P74781J48045m47961j132236j167598j110422j168168
11473b817273n67151J72707J028601J940902J803281J690121K710122K668427
11465H629737L49153k265939l387667l500499l106511j934840m68140N69811J768990
11456c345905K715055K067186R46810r1065j149150j936311k071610r46253N28921
11447c282322Q16399l9039j149803j724866j183708m50800n58334l92953N31031
11438g434395M20708J41410O92313J050622J078771O08211J44510J243651K924276
$$ y = [-7267145, -6436545, -5645233, -4899035, -4619910, -4655926, -4271221, -2398266, 1052233, 4435232, 6416172, 6848640, 6025384, 4226095, 2682591, 1950118, 1192333, -159706, -975610, -135632, 1286286, 2061067, 2209112, 1761151, 628915, -538683, -1649105, -2817273, -3384424, -3211717, -2183116, -242214, 1561067, 3251188, 5961310, 8629737, 8978890, 6712951, 3325284, -175215, -3281726, -5216566, -5684706, -5114895, -3345905, -630850, 1436336, 2383146, 2292081, 1142931, -793380, -2864990, -3811243, -3282322, -2465923, -2504962, -3654765, -5379631, -6563339, -7014139, -7572473, -7965426, -7434395, -7013687, -6872277, -6179964, -5129342, -4050571, -3442360, -3297850, -2054199, 870077]
11429H70077L236423K897735K530112J023168m69126q94805o95706M61135J452374
11420A0411387N99510j333244k030797j325709o97620l83467l42043j403417k380429
11411A114171j641163k06733J97512n21552j549910k692862l298757k926889j982956
11402a3509139o44368M88498J063119J308726J525324J354974J61349j203960
11394i455477p22271J545002L182651L358513K128582J1804j489956j565288j10437
11385c116877R09074L92657o53716j412281j454176p84574K38864J008358O72106
11376d200565Q4293K07385M57321P55643J110716P95477m02439p29092J07537
11367a813724L20291l28727j2551J008073J802233K359012J801754M49306o13971
$$ y = [870077, 4106500, 7004235, 9534347, 10557515, 10088389, 9193584, 8497878, 8959013, 10411387, 11010897, 9677653, 7646856, 6321147, 5623527, 5240060, 4898017, 3494600, 1114171, -526992, -733725, -536213, -1057765, -2607675, -5300537, -8599294, -11526183, -13509139, -14153507, -13665009, -12601890, -11293164, -9767840, -8412866, -8251517, -9455477, -10177748, -8632746, -5450095, -2091582, 37000, 48804, -1441152, -3006440, -3116877, -2207803, -1815146, -2468862, -3881143, -5335319, -6119893, -5881029, -4872671, -4200565, -4116272, -3908887, -3451566, -2695923, -1585207, -789730, -1192169, -1921261, -1813724, -1493433, -1822160, -1834711, -826638, 975595, 3334607, 5136361, 5585667, 4971696]
11358D971696q20109p46553r84571q64335p3883P16151J039124J01347j229105
11349B109762j957639k553930k639190k287951j800926p70694J080560K860633
11341e959375K490278O07269j54685M4364K76571P18267J507250K211960J489547
11332C231446J6637n26713o36506k72956R52116J899074J372498m08127j520302
11323D107167j395824p56843q43819j623192j939257n40791K060149L656369L717501
11314F441460K957603J664138j27425j240470j365840j583837j334251J91248
11306E602626O75817k07248j50650O36469O24007l30015L06176K404002K851571
11297A2412755Q09311j871305l335419l325917k623561j682013m92836J26154
$$ y = [4971696, 4151587, 3405034, 2420463, 1556128, 1482245, 2198396, 3237520, 3338867, 2109762, 152123, -2401807, -5040997, -7328948, -9129874, -9900568, -8820008, -5959375, -3469097, -2861828, -3016513, -2972149, -2695578, -1977311, -470061, 1741899, 3231446, 3248083, 2721370, 2084864, 1811908, 2764024, 4663098, 6035596, 5627469, 4107167, 2711343, 1954500, 1110681, -512511, -2451768, -2992559, -932410, 2723959, 6441460, 9399063, 11063201, 10935776, 9695306, 8329466, 6745629, 5411378, 5602626, 6278443, 6071195, 5920545, 6557014, 7181021, 6851006, 7157182, 9561184, 12412755, 13222066, 11350761, 8015342, 4689425, 2065864, 383851, -108985, 17169]
11289A7169J61877K54747N16451Q53560Q02938K17268m40752m73409J15013J19816
11279B144678p40189j335381j209331o83515l22584k38951k21483o38538j815567
11270e060861k415468r46988J273741K175910J807175J161961M59979n3171m89579
11261b087301q78648j091404j045162m94603N8957J28960k38777j073232j260538
11252g981748k75013P39283J36445l88943L22743R60047J372830J196934N94742
11243c322680k15341j001981p57962k76465j49388N29186J254886J378174J480547
11234a081024J749713J124558k00572j180390j000402l0646N86655O70609Q83070
11225A521571J614399J447465K60752j97529K34355M7914j209490k163089k323951
$$ y = [17169, 179046, 433793, 950244, 1803804, 2606742, 2824010, 2383258, 1909849, 2024862, 2144678, 1404489, 69108, -1140223, -1823738, -2146322, -2385273, -2606756, -3245294, -5060861, -7476329, -8423317, -7149576, -4973666, -3166491, -2004530, -1544551, -1597722, -2087301, -2965949, -4057353, -5102515, -5597118, -5538161, -5409201, -5647978, -6721210, -7981748, -8256761, -7517478, -7381033, -7769976, -7447233, -6487186, -5114356, -3917422, -3322680, -3538021, -4540002, -5297964, -5574429, -5723817, -5194631, -3939745, -2561571, -1081024, 668689, 1793247, 1592675, 412285, -588117, -618763, -32108, 638501, 1521571, 3135970, 4583435, 4844187, 4646658, 4881013, 4928927, 3719437, 1556348, -767603]
11216g67603k401545k862503k983882j631325N57591J851282J225937N81558J371342
11207e059148J770971K08512j866399k281224j161246M89699J550347J283594
11199e064894N18156J80054j3046m71543r87418o18887M04707O29679M11877M26304
11189d585011M89564K80976k55610r33633j146825r71226m67897L99749O94550
11180f495363O95353J146747J053468L21623J99346R5418l22625k10864k49389
11171c766286k70011K27578m1405r88997j535269j758640j053977P71366J902504
11162f513137J518981L79731r14935j523680q40075N34076K063128L152372K855857
11153G12318J399855N29288L42503m56506j650331k854360l297192k358608j147994
$$ y = [-767603, -3169148, -6031651, -9015533, -10646858, -10089267, -8237985, -7012048, -6430490, -5059148, -3288177, -3079665, -4946064, -7227288, -8388534, -7898835, -6348488, -5064894, -4546738, -4366684, -4379730, -4851273, -5838691, -6457578, -6052871, -5423192, -5011315, -4585011, -4095447, -3814471, -4070081, -5003714, -6150539, -7121765, -7589662, -7189913, -6495363, -5800010, -4653263, -3599795, -3278172, -3078826, -2983408, -3306033, -3516897, -3766286, -4036297, -3808719, -3850124, -4839121, -6374390, -8133030, -9187007, -8415641, -6513137, -4994156, -4614425, -5529360, -7053040, -7893115, -7359039, -5295911, -2143539, 712318, 2112173, 2641461, 2983964, 2527458, 877127, -1977233, -5274425, -7633033, -8781027]
11144h781027o8060Q40060J377971K155447K523852K003755J627181J549926O42028
11135C871133j482394l499113m408629l970624k639952j495280j013697K48000
11127a4390556K184629K580926J496481P47424M56319l70818j022802q41557j84667
11118i344621P12780J219513J462848J858660J980815J571810J008082N41865
11110A011752k4048j130846k139906k393826k007430j574063j655138j646601
11102a1560106j547127r51198K35220R85124N35968m2441N96848J580663J596033
11093h571016Q61040P16534J611751K915350L241327J687918o64389j366237o18094
11084a85816o02707r78827p69235j047115k016937j971235o8517J618303J855803
$$ y = [-8781027, -8849087, -8009027, -6631056, -4475609, -1951757, 51998, 1679179, 3229105, 3871133, 2388739, -1110374, -5519003, -9489627, -12129579, -13624859, -14638556, -14390556, -12205927, -9625001, -8128520, -7381096, -6924777, -7295595, -8318397, -9159954, -9344621, -8631841, -7412328, -5949480, -4090820, -2110005, -538195, 469887, 1011752, 987704, -143142, -2283048, -4676874, -6684304, -8258367, -9913505, -11560106, -13107233, -14058431, -13823211, -12838087, -12302119, -12344560, -11747712, -10167049, -8571016, -7709976, -6993442, -5381691, -2466341, 774986, 2462904, 1798515, 432278, -185816, -788523, -1767350, -2536585, -3583700, -5600637, -7571872, -7640389, -6022086, -4166283]
11075d166283J172382R14906J492046J618340q6729k044359k003237p91227k58083
11066d152244n31491p34628l62064J52476k15613l60682m8303o26310k231100
11057i109959l936593l419880r56305m0715j070380j222693L93290J883215K372584
11048a5107436J814415N58162j09006K57263R98825J490254Q42530p4262K55166
11039i074089J409163J805717J226608O89505O69027K5353r19393m00938P77556
11030c791491P81673K43l93592k09225Q3500j80132p20975j473479k158164j626283
11020i687925r9462K05997r39823j381247q57987n04648n42278p62467p23366
11011a5293206j78782K14738R4304Q5562K15306O43500J151943P81877J56510
$$ y = [-4166283, -2993901, -2078995, -586949, 1031391, 944662, -1099697, -3102934, -3894161, -4152244, -4683735, -5418363, -5780427, -5627951, -5843564, -6204246, -6252549, -6878859, -9109959, -13046552, -16466432, -17422737, -17463452, -18533832, -19756525, -19363235, -17480020, -15107436, -13293021, -12734859, -12843865, -12586602, -11587777, -10097523, -9254993, -9329255, -9074089, -7664926, -5859209, -4632601, -3943096, -3274069, -3248716, -4168109, -4569047, -3791491, -3009818, -3009575, -3403167, -3612392, -3528892, -3709024, -4429999, -5903478, -8061642, -9687925, -9787387, -9581390, -10521213, -11902460, -12760447, -13265095, -13807373, -14569840, -15293206, -15471988, -15257250, -15162946, -15077384, -14862078, -14218578, -13066635, -12284758, -12128248]
11002a2128248M60344J193952J127889O90455R0222o66559m21018J30241L97363
10993i125359J516672K841882K755652J668204M50795o60479p15057K4629j27270
10984a370331o28274K04438J178211J126796L19371o70770j820116k179357j159625
10975d999657J37810J034595J433847J514422J116593K32872q28777j339822r65586
10966b663703k8712L47833l42493j123962r31922J92413J480794K796131L690144
10957C416523L350263K340553J510798q6550k375024l753799l032754j567150
10949a97140j258117r01786N72687J600777J296293J051177R24656L67155q45329
10940B610373j726315j541856k58665J309267K212772K325865R67658j120653
$$ y = [-12128248, -11667904, -10473952, -9346063, -8655608, -8565386, -9231945, -9652963, -9522722, -9125359, -7608687, -4766805, -2011153, -342949, 107846, -552633, -1267690, -1243061, -1370331, -1998605, -1794167, -615956, 510840, 830211, 159441, -1660675, -3840032, -4999657, -4861847, -3827252, -2393405, -878983, 237610, 470482, -358295, -1698117, -2663703, -2692415, -2344582, -2687075, -3811037, -4742959, -4550546, -3069752, -273621, 3416523, 6766786, 9107339, 10618137, 10531587, 8156563, 4402764, 1370010, -197140, -1455257, -2357043, -1784356, -183579, 1112714, 2163891, 3088547, 3455702, 2610373, 884058, -657798, -916463, 392804, 2605576, 4931441, 5899099, 4778446]
10932D778446j715014j463232j770264k054202j584765L37868J870290J705565
10924A04692M81847L3737P24416J64039j498701k135187k091038k220444j965500
10915h402139r79207q3673J99927L55515O15904J082016J757478K342394K725467
10906c86318J818454Q9067r96840k046852k922471k747359j422114K34059J370937
10897g009437J269412j22209j799460k651107k244917r20810L01444O28019j563
10888a2550628l53395J26241O80323J357960J656727J281416P84359L58849J71727
10879f486421J244714K918831L318361K202058N80534j090316k761235l230005
10871c303479k190992r83530k01548M24565J251778K204492K694158K144440R27192
$$ y = [4778446, 3063432, 1600200, -170064, -2224266, -3809031, -3471163, -1600873, 104692, 586539, 620276, 1344692, 1508731, 10030, -2125157, -4216195, -6436639, -8402139, -9381346, -9465019, -9265092, -8909577, -8293673, -7211657, -5454179, -3111785, -386318, 1432136, 1521203, 524363, -1522489, -4444960, -7192319, -8614433, -8380374, -7009437, -5740025, -5862234, -7661694, -10312801, -12557718, -13478528, -13177084, -12549065, -12550628, -12904023, -12777782, -12097459, -10739499, -9082772, -7801356, -7016997, -6658148, -6486421, -5241707, -2322876, 995485, 3197543, 3778077, 2687761, -73474, -3303479, -5494471, -6478001, -6679549, -6254984, -5003206, -2798714, -104556, 2039884, 2967076]
10862B967076N62635J212639J578347J268051N32324j67654o29814r51447o70027
10853E702130m17196q18094j743421k411347j593213l82139k19745m69143o04398
10844b956566j152394j655816j069417P9246J313167K596789L495230L673789
10836D324028K617297N05855q38335j156661j025387o31785j32389O90206J113444
10827E466273P43458M64825K54047o9077m00799o62185q92558j451352j734531
10818A718101j733340k476530l333680k861003j162956Q79411K308694K339548
10810d321755J643890J656559J931740J139051j30861n07894M6799K78640M01172
10801B137341P33526P01434L56646J1760k85132m66768N7207O00955M16584L2908
$$ y = [2967076, 3529711, 4742350, 6320697, 7588748, 8121072, 7953418, 7323604, 6372157, 5702130, 5284934, 4466840, 2723419, 312072, -1281141, -1663280, -1883025, -2352168, -2956566, -4108960, -5764776, -6834193, -6754947, -5441780, -2844991, 650239, 4324028, 6941325, 7447180, 6608845, 5452184, 4426797, 3795012, 3662623, 4352829, 5466273, 6209731, 6674556, 6928603, 6859526, 6458727, 5796542, 4903984, 3452632, 1718101, -15239, -2491769, -5825449, -8686452, -9849408, -8969997, -6661303, -4321755, -2677865, -1021306, 910434, 2049485, 1918624, 1410730, 1457529, 1736169, 2137341, 2870867, 3572301, 3928947, 3940707, 3655575, 3188807, 3246014, 3846969, 4263553, 4296461]
10791D296461J3826m28487j855477k652398k005838o88331N40020R29595L80325
10782a470304n35489j042716k20158J618729K454091J940659J356272R67244O35621
10773E703949O5865l54795j06424K77514J176276J516936K5126j034639j213410
10764F056398j841306l032842l920935l018297n31672J332912J516609O38533
10756b800600R8507m10810r28603n73243M80782J434274J065275k46546n40163
10747b421127L18828M53097O72510J557090J575479M26686l09195l58279m10433
10738A504656k46892k93458j481094k313095j042703N86815M50853p30726j078428
10729d644072K60927J739746J690833O06886M5188O32091J601896K289454K383185
$$ y = [4296461, 4310287, 3881800, 2026323, -626075, -2631913, -3320244, -2780224, -1850629, -1470304, -2005793, -3048509, -3268667, -1649938, 804153, 2744812, 4101084, 5068328, 5703949, 5769814, 5415019, 5308595, 5586109, 6762385, 8279321, 8304447, 7269808, 6056398, 4215092, 1182250, -2738685, -5756982, -6288654, -4955742, -3439133, -2800600, -2702093, -3112903, -4041506, -4614749, -4133967, -2699693, -1634418, -1880964, -2421127, -2102299, -1649202, -976692, 580398, 2155877, 2582563, 2273368, 1915089, 1504656, 1257764, 964306, -516788, -2829883, -3872586, -3285771, -2834918, -3565644, -4644072, -4383145, -2643399, -952566, -345680, -300492, 331599, 1933495, 4222949, 6606134]
10720F606134J377441l66187j573441j529239r71228r77506q49597n02334o73014
10711E41029p82232m38419J24177J89748k67409p62426j168200j260279o75703
10702d499714K694R1181j84985o15661o67629m23222j67976M90045J339715J048146
10692c587406k38607o90270m28820j10136N36573O09013K49401k4702l58168l73277
10682d416399K08664M24168M49141R40907J118188M79332o09697r69180j023571
10673c398447r77657m40593p2086J87078l15997j792798j517880P80950J916728
10664e630702Q41520l98683r65656j211322k41182J489432K591869K495236J528452
10655D98964M79257m54123o02248k59157p28451j540097j871606j781036r78217
$$ y = [6606134, 7983575, 7617388, 6043947, 4514708, 3543480, 2565974, 1716377, 1214043, 541029, -241203, -679622, -555445, -365697, -633106, -1395532, -2563732, -3824011, -4499714, -4497020, -4405839, -4590824, -5206485, -5874114, -6297336, -6465312, -5975267, -4635552, -3587406, -3826013, -4516283, -4945103, -5055239, -4518666, -3909653, -3660252, -3684954, -4043122, -4416399, -4207735, -3783567, -3334426, -2393519, -1275331, -795999, -1405696, -2374876, -3398447, -4376104, -4816697, -4888783, -4701705, -5017702, -6810500, -8328380, -7547430, -5630702, -4789182, -5187865, -6153521, -7364843, -7606025, -6116593, -3524724, -1029488, 498964, 978221, 524098, -78150, -337307, -1065758, -2605855, -4477461, -6258497, -7236714]
10646g236714K96622J290646J381634J11128j342244k015861j865540p89197R68055
10637i201471K292913K984804L417308K723293K372346K848242J831906m84021
10629H785320k520693k910843j615878l88773m05679j293992j453268r9686J734109
10620a69383K609747K258903J024595m60574j678815k530327k448988j672091
10612c066933j718491j771482n08215J162022J895346J424456M70527j221537
10604c334307k405848k148170r89738M76178J599776J861222J739418J719476
10596a481993Q60421o0734P5718J6787m11701l34867l90858k45750L5344j76192
10586b113825l19595l54488L0010R56511J886615J909589Q18689p54456k129122
$$ y = [-7236714, -6940092, -5649446, -4267812, -4156684, -5498928, -7514789, -9380329, -10169526, -9201471, -6908558, -3923754, -506446, 2216847, 4589193, 7437435, 9269341, 8785320, 6264627, 3353784, 1737906, 1349133, 943454, -350538, -1803806, -1903492, -169383, 2440364, 4699267, 5723862, 5263288, 3584473, 1054146, -1394842, -3066933, -4785424, -6556906, -7065121, -5903099, -4007753, -2583297, -2112770, -3334307, -5740155, -7888325, -8878063, -8401885, -6802109, -4940887, -3201469, -1481993, -621572, -682306, -606588, -589801, -1001502, -1336369, -1727227, -1972977, -1937633, -2113825, -2433420, -2787908, -2757898, -1801387, 85228, 1994817, 2813506, 2059050, -70072]
10577g0072k559634j435081R27562K512828K914739K714880J883831L07242j143868
10568F052427j527708j214564j126448j317815n24218J534139K197615Q1168j664510
10559B490086j555015q93405m24096l03007j72844j40031l17097o90261j011836
10550c017506r28809K82874K020634K964293K941565J666448p75235k752036k580626
10541a78398j446048j139104j367771j334621j387991j167463p51761o51813q27770
10532a0252740r89153r57923j127892p16135L75969J229679P84707p61237r36197
10523a3350922R03067K742685L092036K192246J598571J473886O90704n33109
10515a190836q63310M89094K149344K873291K175343R63185M26164K4382q17770
$$ y = [-70072, -2629706, -4064787, -3137225, -624397, 2290342, 5005222, 6889053, 7196295, 6052427, 4524719, 3310155, 2183707, 865892, 341674, 1875813, 4073428, 4154596, 2490086, 935071, 41666, -382430, -685437, -858281, -998312, -1315409, -2005670, -3017506, -3946315, -3663441, -1642807, 1321486, 4263051, 5929499, 5154264, 2402228, -178398, -1624446, -2763550, -4131321, -5465942, -6853933, -8021396, -8773157, -9424970, -10252740, -11241893, -12199816, -13327708, -14043843, -13667874, -12438195, -11653488, -12414725, -13350922, -12447855, -9705170, -6613134, -4420888, -2822317, -1348431, -657727, -1190836, -2054146, -1565052, 584292, 3457583, 5632926, 6596111, 7022275, 7046657, 6228887]
10506F228887j866190k550500j993479j061835m34602n6552R9660L67304P57998
10497e09309J27833j567272k446649j690529q93850j065675j067107j00175J031136
10488h181597J900826K736003K534051P83404j054537j369072J75751J981768
10480d93403J660898N19425l99532m84400J13842k74962j153621j383255j279972
10471c174980p19512N53893J913627K022792J357336J271236K500975L834670
10463I560037K924924J458915J016565O38009N7425j27205M18626N97541m42485
10454A6102352j550980j845026k022123l091852m283553m410853m417014m438256
10446i957305l914276k343299m58788o5287l22998M01388J456112J628941J861561
$$ y = [6228887, 4362697, 1812197, -181282, -1243117, -1677719, -1734271, -1634611, -1267307, -509309, -381476, -1948748, -4395397, -6085926, -6979776, -8045451, -9112558, -9212733, -8181597, -6280771, -3544768, -1010717, -227313, -1281850, -2650922, -2475171, -493403, 1167495, 1686920, 1287388, 802988, 916830, 641868, -511753, -1895008, -3174980, -3894492, -3340599, -1426972, 595820, 1953156, 3224392, 5725367, 9560037, 12484961, 13943876, 14960441, 15598450, 15655875, 15528670, 15947296, 16544837, 16102352, 14551372, 12706346, 10684223, 7592371, 3308818, -1102035, -5519049, -9957305, -13871581, -16214880, -16673668, -16738955, -17061953, -16660565, -15204453, -13575512, -11713951]
10437a1713951K341462K003878J404314J429276J458552J467299J257262O80477
10429C28569O44855M27089p43876j319048k67992P72123M66225l93664m83610
10420e69329p79217k120269l073011k940806k249830j727832j295166j226527
10412a5981987j779443j249279O71878K520154L225187K401774J131683O75105
10404h384928P90776Q96398J663101L072531L593259K500762K98529j133711j283830
10395B012887j971307k049845m04203J84315j150463j653733m95126R20780J363925
10386c242770R94596j78890j562918j449421q44048p31694l66746O98506J817374
10377d866011J893394O61158l94428J97313Q00786P5565j432400k441159k107813
$$ y = [-11713951, -9372489, -7368611, -5964297, -4535021, -3076469, -1609170, -351908, 328569, 973424, 1400513, 656637, -662411, -930403, -158280, 307945, -85719, -569329, -1348546, -3468815, -6541826, -9482632, -11732462, -13460294, -14755460, -15981987, -17761430, -19010709, -18338831, -15818677, -12593490, -10191716, -9060033, -8384928, -7594152, -6697754, -5034653, -1962122, 1631137, 4131899, 4430428, 3296717, 2012887, 41580, -2008265, -2412468, -2228153, -3378616, -5032349, -5527475, -4606695, -3242770, -2248174, -2427064, -3989982, -5439403, -6283451, -7015145, -7381891, -6683385, -4866011, -2972617, -2311459, -2705887, -2508574, -1707788, -1632223, -3064623, -5505782, -7613595]
10368g613595r19195J15725P13402J169092J654744J921600J372376M37324l98568
10359a547095j130935j348794q56072l3011N39177N03578j5175j052108j304240
10350f244675q65830j216203j112096L55366K275330K982295K439467R50068j021395
10341a457673j701241p82635O13189J778817K330035K111889J170680L4505o35496
10332C462070m12867L45052j01017j498687k036172j110636j80397j82665j238307
10323b953626k036741j252919l46202o86719j294015q14672R8841J64618p26253
10314i847688j163145m6189J407952R92190j073611k649605k181888J87545K122335
10305a2252104K699957K876082L418832L541777K013009M95841L84727J127936
$$ y = [-7613595, -8532790, -8417065, -7703663, -6534571, -4879827, -2958227, -1585851, -1148527, -1547095, -2678030, -4026824, -4882896, -4915907, -4376730, -3873152, -3888327, -4940435, -6244675, -7110505, -8326708, -9438804, -9083438, -6808108, -3825813, -1386346, -436278, -1457673, -3158914, -3941549, -3328360, -1549543, 780492, 2892381, 4063061, 4097566, 3462070, 3049203, 3394255, 3293238, 1794551, -241621, -1352257, -1532654, -1715319, -2953626, -4990367, -6243286, -6589488, -7276207, -8570222, -9384894, -9286053, -9121435, -9847688, -11010833, -11057022, -9649070, -8656880, -9730491, -12380096, -14561984, -14374439, -12252104, -9552147, -6676065, -3257233, 284544, 2297553, 2793394, 3178121, 4306057]
10297D306057Q70519m48933j919543k806701k054465o22729P15830J231095M03814
10288c25056k91756L761j54289m62019k42800p1920P9357m4868l56210k60256
10278b126056N20866J091826P50097k36054j377766j849174j353755j064887j704806
10269g349709j881155j122771j16561J39804q01622j097602M2025Q83888Q62287
10260a0441416K566j198681q71193N56588P12099n36508j368284n76071J015213
10251a2705687K444770L154019L061708K436399J237054L75744M16186J635746
10243B055939K911564J702657o58011j771194j663341o96115N34644L85202j58867
10234B642478l27436r09404j183264l39542J330664J822467Q21207K01685N34084
$$ y = [4306057, 5176576, 4727643, 2808100, 1399, -2053066, -2675795, -1959965, -728870, -325056, -616812, -613051, -767340, -1229359, -1472159, -1544079, -1464722, -1509590, -1865800, -2126056, -1605190, -513364, 236733, 679, -1377087, -3226261, -4580016, -5644903, -7349709, -9230864, -10353635, -10470196, -10330392, -11132014, -12229616, -12187591, -11303703, -10441416, -10438850, -11637531, -12508724, -11952136, -11240037, -11776545, -13144829, -13720900, -12705687, -10260917, -7106898, -4045190, -1608791, -371737, 4007, 420193, 2055939, 4967503, 6670160, 6012149, 4240955, 2577614, 1881499, 2416143, 2801345, 2642478, 2315042, 1405638, 222374, -117168, 1213496, 3035963, 3857170, 4058855, 4592939]
10225D592939N80395J91009j60465j08561P0234N80586Q54111J39870l39510J01170
10215F501778K88685j05038J28306J117062J558861Q78717n26745j745027k257345
10206E839254j492720L76596J364873Q54139J58430O600K97820Q33582Q96480
10197I135054M34540K5907j59544j13868m3803o60535j080211r1288Q52863P43227
10187I042342N5410n11006q56347p88849J38048J702487K468142K014107J101872
10178A4366206m46380j477769j362366m40236J210221J791152N73352o86551j006511
10169A2521118l04198P36058J27826j302804j933473j286915L70507P83477j178304
10160H533292k902142j545480N98210J23475j235009r63514J72620M22681l58311
$$ y = [4592939, 5173334, 5364343, 5203878, 5095317, 5165551, 5746137, 6600248, 6740118, 6400608, 6501778, 6790463, 6685425, 6813731, 7930793, 9489654, 10368371, 9841626, 8096599, 5839254, 4346534, 4723130, 6088003, 6942142, 7100572, 7107172, 7404992, 8238574, 9135054, 9569594, 9595501, 9435957, 9322089, 9278286, 8617751, 7537540, 7446252, 8299115, 9042342, 9097752, 8586746, 7730399, 6941550, 7079598, 8782085, 11250227, 13264334, 14366206, 13919826, 12442057, 11079691, 10639455, 11849676, 13640828, 14214180, 13527629, 12521118, 12216920, 12952978, 13080804, 11778000, 9844527, 8557612, 8928119, 9711596, 8533292, 5631150, 4085670, 4683880, 4807355, 3572346, 2608832, 2781452, 3204133, 2845822]
10151B845822o47234j17861N03646P20454J047850J447877J238083R63973J67081
10142H169691l65096K81966J042767J346481P80306k58016p22441p55172p53801
10133H766685n40673l71034q58432j386574j294068j208722j039560o53343N83226
10124A997505K577088K765894J308708N77794J178426J490956O64618N875q31431
10115A1735433j777671j970336j267823J80545K395634M342909M792157L853692
10107B2284540J921652l7684j599867k137416j371823r72837j306194r95413M7648
10098A5832606J528493K840610L557262L016315J524331J610456K798578L015711
10090C5724362K420352K224180K150047J639941K73743j410552k120072j357617
$$ y = [2845822, 2198588, 2080727, 2584373, 3304827, 4352677, 5800554, 7038637, 8002610, 8169691, 7804595, 8086561, 9129328, 10475809, 11256115, 10998099, 10275658, 9520486, 8766685, 8226012, 7854978, 6996546, 5609972, 4315904, 3107182, 2067622, 1414279, 1997505, 4574593, 7340487, 8649195, 9226989, 10405415, 11896371, 12560989, 12566864, 11735433, 9957762, 7987426, 6719603, 6900148, 9295782, 13638691, 18430848, 22284540, 24206192, 24168508, 22568641, 20431225, 19059402, 18086565, 16780371, 15784958, 15832606, 17361099, 20201709, 23758971, 26775286, 28299617, 29910073, 32708651, 35724362, 38144714, 40368894, 42518941, 44158882, 44432625, 43022073, 40902001, 39544384]
10082C9544384k89098J55299M76728P66860R14566K014452L583625L325104K009414
10073E2501334J531691K291711L660888M052828L889773N189608P163963Q147284
10065H8429080Q203680Q334517R027553R524028Q798382P035381O302475P066077
10057A52721173P728774P322354P081131Q629626J1520523J4359371J5368035
10050B24730987J1139270J126394j1886078k3415919k8929876k8311789k4355721
10043A20097268j9059680j3347374q894265o475356n661829n450289m116674j979691
10035E5112110p64919j333341k256560k238485j306191j06328R74575J901874
10027D9982735K039179R99232r30544j998637j181948J240241L905876N039032
$$ y = [39544384, 39255286, 39410585, 39887313, 40654173, 41568739, 43583191, 47166816, 50491920, 52501334, 54033025, 56324736, 59985624, 64038452, 67928225, 73117833, 80281796, 88429080, 96632760, 104967277, 113994830, 123518858, 132317240, 139352621, 145655096, 152721173, 160449947, 167772301, 174853432, 183483058, 195003581, 209362952, 224730987, 235870257, 236996651, 225110573, 201694654, 172764778, 144452989, 120097268, 101037588, 87690214, 78795949, 72320593, 66658764, 61208475, 57091801, 55112110, 54347191, 53013850, 50757290, 48518805, 47212614, 47106286, 48080861, 49982735, 52021914, 53021146, 52090602, 50091965, 48910017, 50150258, 54056134, 59095166]
10019E9095166M711020M112469L942177M271226M337755M785139N607120O566367
10011I7428439P850017R019856J0081975J0531502J0258144J0755616J3477333
10004A69402882J6809528J8854476K0388972K3136080K8050150L4171552L9050225
9997C49863865L8089892K6426080N551964j1393524j5606747j2288056p898005
9990C72745469l850541L77790L938368M499336l65927j2196077k6929629l6933428
9982C01285361l8688494l4225397k7448143k0584211j4826113j0642637p906343
9975A46964023o562478n528902l825020k026764m87475Q84361K070746J835522
9967A33324013j019705m319056n468634m526169k354361m76819Q31264J078386
$$ y = [59095166, 63806186, 67918655, 71860832, 76132058, 80469813, 85254952, 90862072, 97428439, 105278456, 114298312, 124380287, 134911789, 145169933, 155925549, 169402882, 186212410, 205066886, 225455858, 248591938, 276642088, 310813640, 349863865, 387953757, 414379837, 419931801, 408538277, 392931530, 380643474, 372745469, 368894928, 369272718, 373211086, 377710422, 377344495, 365148418, 338218789, 301285361, 262596867, 228371470, 200923327, 180339116, 165513003, 154870366, 146964023, 140401545, 134872643, 131047623, 129020859, 128533384, 129417745, 131488491, 133324013, 132304308, 127985252, 122516618, 117990449, 115636088, 115159269, 115990533, 117068919]
9959A17068919K01743j165773l126160m709722n214606m670422l441776k206745
9951I2735458j772003j691886q95441J272699M289309P453706J0528040J2054961
9943A23974843J0802403O824450N93422n777105j0236755j2406828j2065996r712708
9935I1995726p410338n437930l323739j542765j069161k258027l939142m581776
9927F2432848l765415k551498p59663J325187K683142L501403M413709N229938
9919G2509651N304167M212800K281831J019811Q63177P22217R82272K156244L727636
9910I3779806O076569Q803060J0951251J2794020J4520679J6841438K0286831
9903A84053654K2776896J9937930Q552340q997768k4351522l0981296k9629009
$$ y = [117068919, 117270662, 116104889, 112978729, 108269007, 103054401, 98383979, 94942203, 92735458, 90963455, 89271569, 88376128, 89648827, 93938136, 101391842, 111919882, 123974843, 134777246, 141601696, 142195118, 136418013, 126181258, 113774430, 101708434, 91995726, 84585388, 79147458, 75823719, 74280954, 73211793, 70953766, 67014624, 62432848, 58667433, 56115935, 55356272, 56681459, 59364601, 62866004, 67279713, 72509651, 77813818, 82026618, 84308449, 85328260, 86191437, 86913654, 87895926, 90052170, 93779806, 99856375, 108659435, 119610686, 132404706, 146925385, 163766823, 184053654, 206830550, 226768480, 235320820, 226323052, 201971530, 170990234, 141361225]
9896A41361225k3772259j7278344j2166056r073043q214064q228083p459139n342198
9888D9828039l103393j778046j321989j383171j788025j493550p29541k66768
9880C7963556p9599L2665m6719L11719M42940n69757j656673k346267k675786
9871C1376079k617453k561364k532404j502290L20682J474843J354786P57792
9863B6070671J043405J825056J833457J316854M97299p23237j505001r46102Q60475
9854C0272877K756788L284201K399823J098679Q65156K115795L728742M657159
9846E1179220N504847O276611O492897P250934P853251O759658M264332N31254
9838I6113004m309717q357061j0084009r234576p520693n954286m333018l068642
$$ y = [141361225, 117588966, 100310622, 88144566, 79071523, 70857459, 62629376, 55170237, 49828039, 46724646, 44946600, 43624611, 42241440, 40453415, 38959865, 38230324, 37963556, 37883957, 37916622, 37869903, 38181622, 38624562, 38054805, 36398132, 34051865, 31376079, 28758626, 26197262, 23664858, 22162568, 22483250, 23958093, 25312879, 26070671, 27114076, 28939132, 30772589, 32089443, 32586742, 31863505, 30358504, 29412402, 30272877, 33029665, 36313866, 38713689, 39812368, 40677524, 42793319, 46522061, 51179220, 56684067, 62960678, 69453575, 76704509, 84557760, 91317418, 95581750, 96113004, 91803287, 83446226, 73362217, 64127641, 56606948, 50652662, 46319644, 43251002]
9830D3251002k084849j129377q98355k052962l404968l060978j660797p53593
9822B8205123r57693k619345m270615l820962j524560M54294J248017O70732n68453
9813A6816538j440605j745286j772838j920633k059705k477220k549078j964000
9805H87173j078516M39335J355878Q54900K22678J42617J18264J63390O53470
9796C759189Q37956M58720l60140j706460k724025k636764j664494o04382K87910
9787d352490J235119J990674K413111J980072J98248j236128j262812j316160
9779c50366j175619m75157j39072m74688k89861J110608K522233K451001N28135
9770C707214j167973p23855L83495m21575k151762k743135k746651k182449r79612
$$ y = [43251002, 41166153, 40036776, 39138421, 37085459, 33680491, 30619513, 28958716, 28205123, 27247430, 24628085, 20357470, 16536508, 15011948, 15466242, 16714259, 17384991, 16816538, 15375933, 13630647, 11857809, 9937176, 7877471, 5400251, 2851173, 887173, -191343, 247992, 1603870, 2458770, 2681448, 2824065, 2942329, 3105719, 3759189, 4597145, 5055865, 4695725, 2989265, 265240, -2371524, -4036018, -4640400, -4352490, -3117371, -1126697, 1286414, 3266486, 3464734, 2228606, 965794, -350366, -1525985, -2001142, -2140214, -2614902, -2904763, -1794155, 728078, 3179079, 3707214, 2539241, 1815386, 2198881, 1777306, -374456, -3117591, -5864242, -8046691, -9026303]
9761i026303k92505j09242m0905K62632Q55375J095385M20714O6487O60323J100682
9751e007357Q07172J36890j42829Q3571P19201J643512Q82927j171766j863214
9742c911893j209566l58926L12645R74972J404437R06446l22088j511722k251184
9733e966879k193635j086523O65265K248213K831285K283332O00344j790256l781293
9724f190147m169935k099649Q535O6081o21752l31579J489233L145829M246929
9715d456455M540841L103397Q80260r28142k207532l279538l362506k098039q35197
9706h642911r72933j770630j368213m12532N35734J693984K609348K959858K830502
9697b537793K466909J560294M47516o7474m68403j419727j627044j03615J520901
$$ y = [-9026303, -9318808, -9428050, -9468955, -9206323, -8350948, -7255563, -6834849, -6768362, -6108039, -5007357, -4200185, -4063295, -4206124, -4122553, -3403352, -1759840, -876913, -2048679, -3911893, -5121459, -5480385, -5167740, -4192768, -2788331, -1881885, -2203973, -3715695, -5966879, -8160514, -9247037, -8581772, -6333559, -3502274, -1218942, -618598, -2408854, -6190147, -10360082, -12459731, -12451196, -12385115, -13006867, -13338446, -11849213, -8703384, -4456455, 84386, 3187783, 4068043, 3139901, 932369, -2347169, -5709675, -7807714, -8642911, -9615844, -11386474, -12754687, -13167219, -12631485, -10937501, -8328153, -5368295, -2537793, -70884, 1489410, 1936926, 1869452, 1401049, -18678, -1645722, -1749337, -228436]
9688b28436J344625n5696j193551j419922j314871p28499J61695k49465j895710
9679e579830k181800m65125J097781O45842p48619p79194k7350O77183P71234
9670f589878K18906P6945L17743O61908P94381J087008J565776J383676P27879
9661B44344L95155N93028N27338l38194j249484q41338M9785K91893L48964O49649
9651F71140O64587l78317j509332j965534j291963k28675O08859J152341N67285
9642a709609l1673l5668p61854j996392k217947j207952L66986K187883L617471
9633a788755L438348J415059k74704n79473o58396o89946l73428n34258j539727
9624a585280l319115m437631m395963l427479o01419K633041M120064L149556
$$ y = [-228436, 1116189, 1060493, -133058, -1552980, -2867851, -3596350, -3434655, -3684120, -5579830, -7761630, -8226755, -7128974, -6483132, -7231751, -8010945, -8038295, -7361112, -6589878, -6370972, -6294027, -5976284, -5314376, -4519995, -3432987, -1867211, -483535, 244344, 639499, 1232527, 1759865, 1421671, 172187, -669151, -619366, -327473, 21491, 671140, 1335727, 957410, -551922, -2517456, -3809419, -4038094, -3429235, -2276894, -1709609, -1741282, -1776950, -2538804, -4535196, -6753143, -7961095, -7594109, -5406226, -1788755, 1649593, 3064652, 2789948, 2210475, 1552079, 862133, 488705, -45553, -1585280, -4904395, -9342026, -13737989, -17165468, -17766887, -15133846, -11013782, -7864226]
9616g864226J592204N26695m47369r01869p50604o60632p14274q3R19643J663449
9606f637066K378783J629195j038557l712908m516458l583076j691477P73653
9598a6397911K642128L447536L147253J122999p09781l74307R0499o52722j109544
9589h793850o88970k91622k99042j11922P07359J525065J342135R17917P96237
9580d896693J25822m13460K84227R68048O83708O33874P16179l50293k162361
9571d410949k717538j304428L47284J993485K738630J050234j252316j978361
9563e533959j334110k90842N53211Q47808R65454J072888L23300r77686r09703
9554e283639P55288K218533K348058J855232N56767q71708j405993j902935j876830
$$ y = [-7864226, -6272022, -5745327, -6192696, -7094565, -7845169, -8505801, -9220075, -9220158, -8300515, -6637066, -4258283, -2629088, -3667645, -7380553, -11897011, -15480087, -17171564, -16397911, -13755783, -10308247, -7160994, -6037995, -6747776, -7122083, -7031584, -7684306, -8793850, -9482820, -9774442, -10073484, -10185406, -9478047, -7952982, -6610847, -5692930, -4896693, -4770871, -5184331, -4900104, -3932056, -3248348, -2614474, -1898295, -2248588, -4410949, -7128487, -8432915, -8085631, -6092146, -3353516, -2303282, -3555598, -5533959, -6868069, -7158911, -6605700, -5757892, -4792438, -3719550, -3396250, -4373936, -5283639, -4528351, -2309818, 38240, 1893472, 2450239, 1578531, 172538, -1730397, -3607227]
9545c607227p43036L02610L70093j57173l27014L32313P63369K86276o42963j714957
9535e137709j633246m17847O09932O89285j7832o78046n31210M50632M60971k76759
9525f481829J68769J059634O21205k83325l28135J40744O86839J299851P91909
9516b324338o11377j499736j689997j048036p7392M65542J29738n93445q40545
9507h089586j107773j606882j687313r62783k60320o34468j332345j811916j630754
9498a9124140p78872r37328j310582K6154J864495K543939J815801J011200J137706
9489a3751627J015098P71443Q30696J064186J666075J377868J52292m97370j14130
9480g485469P36072J030950L27575j003807j651727j003872J65716J063144J593414
$$ y = [-3607227, -4350263, -4047653, -3677560, -3834733, -4161747, -3829434, -3066065, -2779789, -3422752, -5137709, -6770955, -7188802, -6578870, -5889585, -5907417, -6585463, -7116673, -6666041, -6205070, -6481829, -6313060, -5253426, -4632221, -4915546, -5243681, -5102937, -4416098, -3116247, -2324338, -2935715, -4435451, -6125448, -7173484, -7250876, -6785334, -6655596, -7249041, -8089586, -9197359, -10804241, -12491554, -13454337, -13714657, -14349125, -15681470, -17493386, -19124140, -19903012, -20840340, -22150922, -22124768, -20260273, -17716334, -15900533, -14889333, -13751627, -12736529, -11965086, -11134390, -10070204, -8404129, -7026261, -6873969, -7371339, -7485469, -6749397, -5718447, -5390872, -6394679, -8046406, -9050278, -8884562, -7821418, -6228004]
9471f228004J494569O96161L41112P97475O27760j24589m86979l95746m72136
9462c750377q28592r75162q98212o74782q47523j510317k011478r02207J629475
9453a0769175L381743L260846K044431J412556J217101M12979M9186M02473K28853
9444A640993m60906m20106L14242K34120j182395j921461j266208q72121j655215
9435e589057k083743j274934j76764N05528L29751j65270k19022m67164l07177
9426i447852J250140K102130P64931n78686J14093J292606O92899q12572j556398
9417f178709j477107j327690j193773k24608P20056L53974p25393n31724J135449
9408i449525J902030Q97336L04124N24233P7747r92931k069039j497862N20000
$$ y = [-6228004, -4733435, -4037274, -3696162, -2898687, -2270927, -2395516, -2882495, -3278241, -3750377, -4578969, -5554131, -6452343, -7127125, -7974648, -9484965, -11496443, -12398650, -10769175, -7387432, -4126586, -2082155, -669599, 547502, 960481, 1009667, 1412140, 1640993, 1180087, 759981, 1074223, 1308343, 125948, -1795513, -3061721, -3933842, -5589057, -7672800, -8947734, -9124498, -8618970, -8289219, -8454489, -8673511, -9140675, -9447852, -8197712, -6095582, -5330651, -5909337, -5795244, -4502638, -3809739, -4622311, -6178709, -7655816, -8983506, -10177279, -10401887, -9681831, -9327857, -10053250, -10584974, -9449525, -7547495, -6650159, -6346035, -5821802, -5744055, -6736986, -8806025, -10303887, -9783887]
9399i783887K026779K901739L379751K639954P24774p72474p88535r60315j984657
9390b616871k404958j410234N31319J463134P37807L32594P53785P64155K97331
9381a551938L2381K38528M59346Q09223J116189N04322n93694r29532l22165j3886
9371b51226p12771j010110n46085r1495l01952r88576j332457j786919k576276
9362i597867l305806l554436k320220J49335J852596K366134K221919J311624
9354a0876721J32010q64312r97052o05981j65675K80900L26349R4489J65179N85226
9344a1925588Q47491M59788m06137o34767l37535J37500J124017J703926J290927
9335g740378L17552j75918K68932O42783N51992L93475J65342j32908k63594j84004
$$ y = [-9783887, -7757108, -4855369, -1475618, 1164336, 1889110, 1116636, 328101, -632214, -2616871, -5021829, -6432063, -5900744, -4437610, -3699803, -3367209, -2613424, -1849269, -1551938, -1519557, -1281029, -821683, -12460, 1103729, 1608051, 1014357, 84825, -237340, -251226, -963997, -1974107, -2520192, -2611687, -2913639, -3902215, -5234672, -7021591, -9597867, -12903673, -16458109, -18778329, -18628994, -16776398, -14410264, -12188345, -10876721, -10744711, -11609023, -12606075, -13212056, -13377731, -13096831, -12770482, -12675993, -12510814, -11925588, -11078097, -10618309, -11024446, -11659213, -11996748, -11859248, -10735231, -9031305, -7740378, -7422826, -7598744, -7329812, -6687029, -6135037, -5741562, -5576220, -5709128, -5972722, -6156726]
9325f156726M2383M50120L43528m54985r32095j305643j841346j444989k34347
9316a1534100J159945K088653J075030o87888r33048m41624l78218k76617M48386
9307i479481J580193J959795J220690N09407J95023j6198n16934j254914j893197
9298g695616j412855P8754J391221K232316K508080J976508R75068K13667l51630
9289h4487m15946K31084M85395j23811o07249j35457L9370j042354j926923k066837
9279e647215j066125K73458Q28751J299551K452570K975162J972645R39207M51043
9270D479047j0788m30093n52775n09655j172477j894800j246774M63913J783891
9261I09489K735839L211204K136443M05841q35907j843221k454182k274596j972785
$$ y = [-6156726, -6114343, -5664223, -5320695, -5775680, -6707775, -8013418, -9854764, -11299753, -11534100, -10374155, -8285502, -7210472, -7898360, -8831408, -9273032, -9651250, -9927867, -9479481, -7899288, -5939493, -4718803, -4209396, -4014373, -4030571, -4547505, -5802419, -7695616, -9108471, -9029717, -7638496, -5406180, -2898100, -921592, 53476, 267143, -84487, -500433, -269349, 216046, 92235, -515014, -650471, -611101, -1653455, -3580378, -5647215, -6713340, -6439882, -5611131, -4311580, -1859010, 1116152, 3088797, 4028004, 4479047, 4468259, 4038166, 3485391, 2975736, 1803259, -91541, -1338315, -874402, 909489, 3645328, 6856532, 8992975, 9398816, 8562909, 6719688, 4265506, 1990910, 18125]
9252A8125j368325q96354j012779q72109k66454N66174J051813O93585M1757p07920
9242b752487j004882m1060Q51737R41321J616266K560976K576253J886427L07254
9233F941805j271469j603499r11423n26382p33066j191593k029794k885710l735651
9224g946782m036466k389854j47582J062741J480166J225237J445965K580750
9216f725825K458301R33778o1788k39045k67553l14024m27066p31043r46718j166725
9206g487708r42238N7515J054571J701613J797512J335307J036137P81625J36809
9197e28857n75580j221958j685141j393600q50370o4261P62178m04852l074266
9188i036707l475991r50438J483046K146367J140587M68880Q06997N14837k67784
$$ y = [18125, -1350200, -2246554, -3259333, -4131442, -4397896, -3831722, -2779909, -2086324, -2044567, -2752487, -3757369, -3798429, -2946692, -2005371, -389105, 2171871, 4748124, 6634551, 6941805, 5670336, 4066837, 3155414, 2629032, 1895966, 704373, -1325421, -4211131, -7946782, -11983248, -14373102, -14520684, -13457943, -11977777, -10752540, -9306575, -6725825, -4267524, -3333746, -3395534, -3634579, -3902132, -4216156, -4643222, -5374265, -6320983, -7487708, -8429946, -8372431, -7317860, -5616247, -3818735, -2483428, -1447291, -665666, -528857, -1104437, -2326395, -4011536, -5405136, -6255506, -6319767, -5557589, -5962441, -9036707, -12512698, -13463136, -11980090, -9833723, -8693136, -8224256, -7417259, -6902422, -7170206]
9179g170206j75625L24902J009358K305656K944574K575402J099334q20674k224503
9170a31782k801766k934608k331465l36582J464887R77424m67550l94105O38311
9161f317236J510213J731700P41879j230365k627389k359502j812709j816896
9153a2180305q65699R74510K597648K790280J311554n78981j926391j934306j168815
9144a0980505j03549J221507K107826J838249Q43163L64135O47664N96939j39392
9135c603963j011492j777538j479462l87217P00376J703055K301926K251440J401230
9126I8355M36154k98291j001768j278297r12172Q8351J171765J462172J561827
9117A328096J885832J378961R38279J101896O38241m44023q08063o47029n72008
$$ y = [-7170206, -7345831, -7020929, -6011571, -3705915, -761341, 1814061, 2913395, 2092721, -131782, -2933548, -5868156, -8199621, -8536203, -7071316, -6093892, -6561442, -6955547, -6317236, -4807023, -3075323, -2333444, -3563809, -6191198, -8550700, -10363409, -12180305, -13046004, -12071494, -9473846, -6683566, -5372012, -5950993, -7877384, -9811690, -10980505, -11084054, -9862547, -7754721, -5916472, -5073309, -4709174, -4061510, -3464571, -3603963, -4615455, -6392993, -7872455, -8259672, -7559296, -5856241, -3554315, -1302875, 98355, 534509, 236218, -765550, -2043847, -2956019, -2867668, -1695903, -233731, 1328096, 3213928, 4592889, 5531168, 6633064, 7271305, 6827282, 6019219, 5372190, 4800182]
9108D800182r1101M19857k18720r53806p63409o20548j354030k551128k787646
9099d120349j439940N7547K07769k8626M85587J081083J309928J848023K104296
9090A505318J822975J408889J182506J043523K71603o18555r1480J029394J210666
9081H764839K92706j057075k079248k724112k679906j854370j099420n36333m88772
9072c461691j054088j531184j064971k11061J43488Q66075K476934L887299L640816
9063C691617J581495q77896k264204j769174l58048l6650r45459j723922j584276
9054d286517n07712O44065J443937J819068J372854N68156m20381j381939k025035
9045b773504k597616k672057j317482P49369K360446K520075J788255R83849k49507
$$ y = [4800182, 4709081, 5128938, 4910218, 3956412, 3193003, 2572455, 1218425, -1332703, -4120349, -5560289, -5502742, -5294973, -5323599, -4838012, -3756929, -2447001, -598978, 1505318, 3328293, 4737182, 5919688, 6963211, 7234814, 6616259, 6524779, 7554173, 8764839, 9057545, 8000470, 5921222, 3197110, 517204, -1337166, -2436586, -2972919, -3461691, -4515779, -6046963, -7111934, -7322995, -7179507, -6313432, -3836498, 50801, 3691617, 5273112, 4395216, 2131012, 361838, 3790, -32860, -978319, -2702241, -4286517, -4794229, -4150164, -2706227, -887159, 485695, 1053851, 633470, -748469, -2773504, -5371120, -8043177, -9360659, -8611290, -6250844, -3730769, -1942514, -958665, -1208172]
9036a208172j241461j238659o23568k58065k53742n90265j537293k705024l354223
9027a3010472l350818k255900n94893M41551J054967J046539J301253J811252
9019a3556521J812198J561329J554532J412480L95801r50682j946806k404694
9011a2122363j994251j70122J981788K629753J928067J411992J089761M75879
9003d769496j23847n46118o68192p64762p27854j120579k768511m041606l034672
8994a8565637j80998K222605K591398J477086M27358o04479j436799m59619J558520
8985a2970565K584319K612587K010674R74124n05093j704405j708757j096054
8977i803170p97724J53701K796519M551358L431289N99850j608711j650385o94274
$$ y = [-1208172, -2449633, -3688292, -4311860, -4569925, -4823667, -5413932, -6951225, -9656249, -13010472, -16361290, -18617190, -19212083, -18770532, -17715565, -16669026, -15367773, -13556521, -11744323, -10182994, -8628462, -7215982, -6820181, -7770863, -9717669, -12122363, -14116614, -14286736, -12304948, -9675195, -7747128, -6335136, -5245375, -4769496, -4893343, -5439461, -6107653, -6872415, -7600269, -8720848, -11489359, -15530965, -18565637, -18746635, -16524030, -13932632, -12455546, -12028188, -12632667, -14069466, -14529085, -12970565, -10386246, -7773659, -5762985, -4788861, -5293954, -6998359, -8707116, -9803170, -10600894, -10447193, -7650674, -3099316, 331973, 931823, -676888, -2327273, -3021547]
8968c021547n4269N26328L89690l92183q05693j078435k153880k599252j666640
8959a0855881J08789J661868J580482P57698M79232N98916l4353m84736K72875
8950e915110N42224l45674m96892L76760N94271o06400k738425l684399j968059
8941a4241704N42797J711299K024523J921073J051637K48760J04740l53615m41165
8932g431655l09739l85488q0405J29840p1307n01131j82991Q36765J860990J848182
8922d286939M32920j207700j570683p03470l02155k72142j66044n61859j892730
8913a0530802k964713k272483p28210J13116J39167N20399K110488L010157K322859
8904h280022J958144J595113Q01341N84913J279770J795539J631821J458370J225837
$$ y = [-3021547, -3075816, -2549488, -2159798, -2551981, -3357674, -4436109, -6589989, -9189241, -10855881, -10747092, -9085224, -7504742, -6747044, -6267812, -5668896, -5703249, -6187985, -5915110, -5372886, -5718560, -6215452, -5838692, -5244421, -5850821, -8589246, -12273645, -14241704, -13698907, -11987608, -9963085, -8042012, -6990375, -6741615, -6636875, -6990490, -7431655, -7741394, -8126882, -8207287, -8077447, -8148754, -8649885, -8832876, -7996111, -6135121, -4286939, -3854019, -5061719, -6632402, -7335872, -7638027, -7910169, -8076213, -8638072, -10530802, -13495515, -15767998, -16496208, -16383092, -16243925, -15723526, -13613038, -10602881, -8280022, -6321878, -4726765, -3925424, -3340511, -2060741, -265202, 1366619, 2824989, 4050826]
8895D050826J251900J496710J521070Q95547q83138k647009k690341k030740k194016
8886a229191k190961j494186j015034m10627K73256L44216L66591M89685J278964
8877c587287J766517O87858r41208j161119m80274p34268r65022M3426J161718
8868d209659R97339o95063j969193q17252R43954R55293m96425j951653k472519
8859i715178k188371j517643o90269L0848L67113Q90055J527546J663170J154359
8850h478370M17015k40757o71431m21250J84757J49592q25218j768951j790939
8841a3445552j003778m21640k98954K8789k28048r46948n40618Q16502J216599
8832a4823648N41225N04428J128114R56353m29523j467391j651607k108930k352349
$$ y = [4050826, 5302726, 6799436, 8320506, 9216053, 8332915, 5685906, 2995565, 964825, -1229191, -3420152, -4914338, -5929372, -6339999, -6066743, -5722527, -5355936, -4866251, -3587287, -1820770, -1132912, -2074120, -3235239, -3715513, -4449781, -5414803, -5371377, -4209659, -3212320, -3907383, -5876576, -6693828, -5749874, -4794581, -5291006, -7242659, -9715178, -11903549, -13421192, -14111461, -14080613, -13713500, -12823445, -11295899, -9632729, -8478370, -8061355, -8302112, -8973543, -9394793, -9210036, -9060444, -9885662, -11654613, -13445552, -14449330, -14870970, -15169924, -15141135, -15369183, -16316131, -16856749, -16040247, -14823648, -14282423, -13777995, -12649881, -11693528, -12123051, -13590442, -15242049, -17350979, -19703328]
8823a9703328p83763J088706K029013K981111L660063L333474K365752J116281
8815c912691o3962j02124J066562K308832K273251Q13113q39851k052615k276808
8806b786293k018495j937958j562205o4451K345515L322407K059656J29568j147924
8797a660180j972250k184097j565628j250855j132290j69762J077702J950852
8789f906508K556007L042912L139681K317880Q02918J89495P03021L01846j395081
8780D752171k771424l015911k062866r70825m38382L33450P55738L94624L35939
8771b687486O50300Q52216L54678q66574j654293j203931j16860J91557J5389
8762d465004P6807k20263p36198q04314n84917P574P36024O74930n8194n96445
$$ y = [-19703328, -20487091, -19398385, -17369372, -14388261, -10728198, -7394724, -5028972, -3912691, -3976653, -4078777, -3012215, -703383, 1569868, 2382981, 1543130, -509485, -2786293, -4804788, -6742746, -8304951, -8369402, -6023887, -2701480, -641824, -512256, -1660180, -3632430, -5816527, -7382155, -8633010, -9765300, -9935062, -8857360, -6906508, -4350501, -1307589, 1832092, 4149972, 4952890, 5142385, 5845406, 6147252, 4752171, 1980747, -1035164, -3098030, -4068855, -4507237, -4173787, -3418049, -3023425, -2687486, -2037186, -1184970, -830292, -1696866, -3351159, -4555090, -4671950, -4480393, -4465004, -4388197, -4608460, -5344658, -6148972, -6733889, -6726315, -5990291, -5315361, -5373555, -5970000]
8752e970000m48094L64461J754753L018680L232574K258588J152493R53503J201445
8743G518403N28144n29195k73327J07395r068N34968J057282K07523j080479j974129
8733F087517k517269k086750r57653l83800L14168R81872J093501Q42947l01359
8724C073174j868637k278793j733128j306726q21917K51898R41726N85643L77537
8715b779223M09077J67539j35148q24878j836967j826237n12244R53991R06348
8706e477742N52978J490161K289058K525181K474280J454744j2578q74451j711301
8697B710330k304309k062982j175223j44907O28481J000588J084021R22556K91427
8688I49982j84002l55376k27241r5844n07661q45950q56429j040117j746662k134984
$$ y = [-5970000, -6418094, -6053633, -4298880, -1280200, 1952374, 4210962, 5363455, 6316958, 7518403, 8046547, 7517352, 7244025, 7351420, 7342352, 7877320, 8934602, 9142125, 8061646, 6087517, 3570248, 1483498, 525845, 142045, 456213, 1438085, 2531586, 3374533, 3073174, 1204537, -1074256, -2807384, -4114110, -4936027, -4684129, -3742403, -3156760, -2779223, -2370146, -2202607, -2337755, -3162633, -4999600, -6825837, -7338081, -6384090, -5477742, -4924764, -3434603, -1145545, 1379636, 3853916, 5308660, 5296082, 4421631, 2710330, 406021, -1656961, -2832184, -2977091, -2348610, -1348022, -264001, 658555, 949982, 765980, 410604, 183363, 87519, -420142, -1266092, -2122521, -3162638, -4909300, -7044284]
8678g044284j554061j11559J031014P17912M14620R61418J628768J776316Q27607
8669a352249k52098j198232k131400j926128n52489N64821N83891J5302m53800
8660f702382j99685O54523J189574J270384J612021K327579K520781R81659j357591
8651B296863k177738j025090N15439J237930J247956J076844O53390l85082j555405
8642A885107j549166p20119M72583J100149K51835j770627l357024k637386r85922
8633g310570p50756j439639j189309K68548J685925J515927N93385O09076J162451
8624d854962J444522K049596K100754J042505L44047j18106p98800j457333j631045
8615a878822r60844l15423N1824J050632K132443K066957J262283L85789n1960
$$ y = [-7044284, -8598345, -8709904, -7678890, -6960978, -6546358, -5584940, -3956172, -2179856, -1352249, -1604347, -2802579, -4933979, -6860107, -7412596, -6847775, -6263884, -6248582, -6702382, -6902067, -6247544, -5057970, -3787586, -2175565, 152014, 2672795, 3654454, 2296863, 119125, -905965, -390526, 847404, 2095360, 3172204, 3825594, 3440512, 1885107, 335941, -384178, 88405, 1188554, 1440389, -330238, -3687262, -6324648, -7310570, -8061326, -9500965, -10690274, -10421726, -8735801, -7219874, -6626489, -6017413, -4854962, -3410440, -1360844, 739910, 1782415, 2126462, 2008356, 1209556, -247777, -1878822, -2839666, -3155089, -3103265, -2052633, 79810, 2146767, 3409050, 3794839, 3742879]
8606C742879j09219j107849k522092l129710l163118k158088l55897O24634J032659
8597g145801K041112K334589J378766O74338l05376p50188J43985O67698Q4786
8588h76091q26185k045110l311192l191026k318171j355898P3621J816545K618575
8579i414932J116746j645984l113336k229136j20199K261127L647694L711507
8571e786513L095843K167831Q34968j9984M39796J013100j1952o91533J45676
8562A187232J237923J856833J190378j71507r46767q35347j046718k392390l299312
8553c219675k734601j405409k25685J000415J664150J321911L72976p51887j241800
8544e219605m36949J407842K374091K267327J624492j32011j587265j207006j27564
$$ y = [3742879, 3633660, 2525811, 3719, -3125991, -6289109, -8447197, -8803094, -8178460, -7145801, -5104689, -2770100, -1391334, -716996, -1022372, -1772560, -1628575, -960877, -876091, -1702276, -3747386, -7058578, -10249604, -12567775, -13923673, -13850052, -12033507, -9414932, -8298186, -9944170, -13057506, -15286642, -15406841, -13145714, -9498020, -5786513, -2690670, -522839, 312129, 292145, 731941, 1745041, 1733089, 1041556, 1187232, 2425155, 4281988, 5472366, 5300859, 4354092, 3518745, 2472027, 79637, -3219675, -5954276, -7359685, -7585370, -6584955, -4920805, -3598894, -3225918, -3977805, -5219605, -5656554, -4248712, -1874621, 392706, 2017198, 1885187, 297922, -909084, -1036648]
8535a036648Q65789J651062J630400Q98419L79104R99p26926j764350j881909
8526A5940m11174J155967J054550k02489p29280O8854O73290N19206K47449o8204
8516B324109k45447p6011j951l80645j858413l397276k600546m79537J67061k22281
8506f770937L74644J261749P61133L40535N85798P85734Q61941N60664k32174
8497a470913j155988j732880j152957O4127N15768L20114M51971R71189J362142
8488a827427J084766N75880L27825N18059J96651n91097o65494l86383k32810
8479a000030n2632k78807j251247j587858j331240j413382j233258j28424J337849
8470f939029J592546J637803K534090J980828j94857j649491k300181k546039
$$ y = [-1036648, -170859, 1480203, 3110603, 4009022, 4388126, 4389125, 3662199, 1897849, 15940, -395234, 760733, 1815283, 1612794, 883514, 952368, 1625658, 2144864, 2392313, 2324109, 2078662, 2002651, 2000700, 1620055, -238358, -3635634, -6236180, -6715717, -6548656, -6770937, -6396293, -5134544, -4373411, -4032876, -3447078, -2661344, -1799403, -1238739, -1470913, -2626901, -4359781, -5512738, -5448611, -4932843, -4612729, -4160758, -3189569, -1827427, -742661, -166781, 161044, 679103, 875754, 284657, -380837, -767220, -1000030, -1052662, -1331469, -2582716, -4170574, -5501814, -6915196, -8148454, -8276878, -6939029, -5346483, -3708680, -1174590, 806238, 611381, -1038110, -3338291, -5884330]
8462e884330j947666q85153K76194J211397J073672K94282J44862J71634l37251
8453e882359q69326n40495Q19300K073948K789871L303383K884489J890043J184660
8444G653514L72046L3856K75005K73499q67619k625986k983575k076255l37974
8435b83489J579378K467924J482919o75815k360220k484430j699598p01160M35293
8426b239198J994994K659216J327485j32909n56016p44645n85329O6862L86688
8417B177148M87484P95233K58023k08541O2529l77537j464286j850583j606076
8408a726606j483443j357790m84346Q36993J938805K445150J905495P59728k40065
8399B593921o4395J200843K084964J427778K59110p7683P0896M37840M79759j94328
$$ y = [-5884330, -7831996, -8717149, -8440955, -7229558, -6155886, -5861604, -5716742, -5545108, -5882359, -6751685, -7292180, -6472880, -4398932, -1609061, 1694322, 4578811, 6468854, 7653514, 8025560, 8059416, 8334421, 8607920, 7740301, 5114315, 2130740, 54485, -283489, 1295889, 3763813, 5246732, 4570917, 2210697, -273733, -1973331, -2674491, -2239198, -244204, 2415012, 3742497, 3609588, 3053572, 2308927, 1723598, 1790460, 2177148, 2664632, 3459865, 3717888, 3509347, 3571876, 3194339, 1730053, -120530, -1726606, -3210049, -4567839, -5052185, -4215192, -2276387, 168763, 2074258, 2833986, 2593921, 2529526, 3730369, 5815333, 7243111, 7502221, 7424538, 7495434, 7933274, 8413033, 8218705]
8389H218705q91046q00733r03994j621465j985496j336765j17902P22516Q54862
8380B138682L12569n21382j111019r46110n2833Q61899J047122J019094R31195
8371C679217J105330Q68213n35790j869119j510327K74041J841671K034103J236524
8362G123863L5906r57718j146035o67336j4789J39349n20895j382497k148400
8353D61448k215463j328220l4296R67195Q11012n29948j991327k351258j975072
8344h185929j496690q10589J83702J110125K154863K699811K236942J409577P73636
8335G5448k06119j803758k636359j947958l52718J277858J423295K68269o32783
8326d534825r17765p96025l17812J77864N84010J062419J543826J618700R02413
$$ y = [8218705, 7327659, 6526926, 5622932, 4001467, 2015971, 679206, 561304, 1283820, 2138682, 2451251, 1929869, 818850, -127260, -180093, 681806, 1728928, 2748022, 3679217, 4784547, 5652760, 5116970, 3247851, 1737524, 2011565, 3853236, 5887339, 7123863, 7159769, 6202051, 5056016, 4388680, 4373891, 4513240, 3992345, 2609848, 461448, -1754015, -3082235, -3116531, -2149336, -1338324, -1868272, -3859599, -6210857, -8185929, -9682619, -10493208, -10309506, -9199381, -7044518, -4344707, -2107765, -698188, 75448, -130671, -1934429, -4570788, -6518746, -6871464, -5593606, -4170311, -3902042, -4534825, -5452590, -6248615, -6566427, -6388563, -5804553, -4742134, -3198308, -1579608, -677195]
8317f77195N69266J163376J439137N98115l10646j016763j636329j741870o04131
8308b217040N84881L98270M59275J096586O70260p52334j828367j955399j427060
8299d970928r70729n18826j42399n3641q82819k537651l680507l516510j004516
8290a8278526K225672L250319K275470J392077P30445M85393J208875J283977
8282e426298J133901K088405K813643K248976J197379l08167k103937k560059
8274i16157j734039p32659M94507J705755K470364K698728J785167j72229j686684
8265C912753k619830l566127l720721k446878m60963R57832J183141L71263q46619
8256g236149j529511j328736l14829O87624J510248K267961K230842J929191J321953
$$ y = [-677195, -107929, 1055447, 2494584, 3092699, 2782053, 1765290, 128961, -1612909, -2217040, -1632159, -1233889, -774614, 321972, 992232, 239898, -1588469, -3543868, -4970928, -5941657, -6460483, -6602882, -6656523, -7539342, -10076993, -13757500, -17274010, -18278526, -16052854, -12802535, -10527065, -9134988, -8404543, -7919150, -6710275, -5426298, -4292397, -2203992, 609651, 2858627, 4056006, 3747839, 1643902, -916157, -2650196, -3382855, -2888348, -1182593, 1287771, 3986499, 5771666, 5599437, 3912753, 1292923, -2273204, -5993925, -8440803, -8901766, -7943934, -6760793, -6389530, -7236149, -8765660, -10094396, -10409225, -9721601, -8211353, -5943392, -3712550, -1783359, -461406]
8247d61406L6490o42055k83216K02980L93616L55734N72824J464301K308141K811595
8237F759004L087121K291844N66891j247211k410855k634827j822608j417883
8229C171476k192553k139019p31084L07828O98354P3634j311970r10459P85612
8220b248181J455865J323755J378781J283997N65882K6848m83814j050288m05335
8211A847510O35351M11580p53758p32624M44387J158876O67741m37991j419069
8202A822003j656909n37104J217649J573752N8804j435738j760239n13156J470999
8193B40061K182032R66462p30829j510270j612043j723561j392473n39796l4675
8184d155092p72084k020681k053608j571449j877492k251989j530920p8086J324185
$$ y = [-461406, -424916, -1066971, -1350187, -1147207, -753591, -397857, 174967, 1639268, 3947409, 6759004, 9846125, 12137969, 12704860, 11457649, 9046794, 6411967, 4589359, 3171476, 978923, -1160096, -1891180, -1583352, -884998, -811364, -2123334, -3033793, -2248181, -792316, 531439, 1910220, 3194217, 3760099, 3786947, 3303133, 2252845, 1847510, 2482861, 2894441, 2140683, 1408059, 1852446, 3011322, 3679063, 3241072, 1822003, 165094, -372010, 845639, 2419391, 2478195, 1042457, -717782, -1230938, 240061, 2422093, 3388555, 2657726, 1147456, -464587, -2188148, -3580621, -4120417, -4155092, -4927176, -6947857, -9001465, -10572914, -12450406, -14702395, -16233315, -16311401, -14987216]
8175a4987216J979068K248606K376784K231200J663688L33729j508997l107362
8167h770500k871655j828740j802577k532181k733824j535364M44271K341900
8159a9288670L085275K061637J050827Q86160Q15285J314501J522006R44232J069321
8150f539426J419059M88997j021559j386217k42017Q33452J45914j097932q36265
8141h235994M02120J233307J411769O27100k32083p67403p40854J03378N84212
8132e614448K77251j26916M15215J648105K789315K917565J994795J396539Q97521
8123F594942p98375k493834k201146q91228m15623l21770o68034j289383r21400
8114c405851l57607M59607J649654J958836J868384J608610J138163J072834J320875
$$ y = [-14987216, -13008148, -10759542, -8382758, -6151558, -4487870, -4154141, -5663138, -8770500, -11642155, -13470895, -15273472, -17805653, -20539477, -22074841, -21630570, -19288670, -16203395, -14141758, -13090931, -12204771, -11389486, -10074985, -8552979, -7608747, -6539426, -5120367, -4631370, -5652929, -7039146, -7281163, -6447711, -6301797, -7399729, -8235994, -7833874, -6600567, -5188798, -4561698, -4793781, -5561184, -6302038, -6198660, -5614448, -5337197, -5464113, -5048898, -3400793, -611478, 2306087, 4300882, 5697421, 6594942, 5796567, 3302733, 1101587, 210359, -205264, -527034, -1195068, -2484451, -3405851, -3763458, -3303851, -1654197, 304639, 2173023, 3781633, 4919796, 5992630, 7313505]
8105G313505Q40845l8522o08686o50786k00508P39694J073278Q47648M18638p01486
8095I033620j245680m16295M35988N44169j32761q36505q15585p55959q27592
8086D983400j052174r60887k95504m10850k001279k892157k431474j466005m81769
8077g008699n24191m35764J014647J405841J12643q52042n58011P58108J569963
8068d517505J505349J776136J751276M65008j252590j317370j3448P03673P20956
8059a78515M77112K93014j00340p25262q37086m44993M39164M76438l26760K05339
8049g21889J311493J339071N16996l28972o19085m42824m86507j008174q75416
8040a315307k65423m84415j073195j405572j837104j978941j723681j672280p27034
$$ y = [7313505, 8154350, 8115828, 7507142, 6856356, 6655848, 7395542, 8468820, 9316468, 9735106, 9033620, 7787940, 7371645, 7807633, 8351802, 8219041, 7382536, 6566951, 5810992, 4983400, 3931226, 2970339, 2674835, 2263985, 262706, -2629451, -5060925, -6526930, -7008699, -7532890, -7968654, -6954007, -5548166, -5435523, -6287565, -6845576, -6087468, -4517505, -3012156, -1236020, 515256, 980264, -272326, -1589696, -1603144, -899471, -178515, 298597, 591611, 491271, -233991, -1071077, -1516070, -1076906, -600468, -927228, -721889, 589604, 1928675, 2445671, 2116699, 1497614, 1054790, 568283, -439891, -1315307, -1580730, -2065145, -3138340, -4543912, -6381016, -8359957, -10083638, -11755918, -12482952]
8031a2482952P94146J351578J129222P20299M93276O43908P81966J110216K175422
8022c282919K407002J143062l0050r54311k249611k124816l19991O31295P14297
8013d066042J618695K675669K790750K181502J133578n5913j110327j326860r83673
8004B857379q09015m36588Q07021J937348K032000J243436J79601o15987r24442
7995F270753p61671J62994J273446R92076o16343k374315k683389j847126p39195
7986c22770N43623J667476K151606J847161J131572J03332n76933l24329L68422
7977F589160P81383K70734m30567m90495r33189k209445l554001l766582k374205
7968f117207K19923K659494L241019K089850K48241j669164l376345l842332l426770
$$ y = [-12482952, -11688806, -10337228, -9208006, -8487707, -7994431, -7350523, -6568557, -5458341, -3282919, -875917, 267145, 237095, -717216, -2966827, -5091643, -5411634, -4780339, -4066042, -2447347, 228322, 3019072, 5200574, 6334152, 6278239, 5167912, 3841052, 2857379, 2048364, 1611776, 2418797, 4356145, 6388145, 7631581, 7811182, 7195195, 6270753, 5509082, 5672076, 6945522, 7937598, 7321255, 4946940, 2263551, 416425, -322770, 220853, 1888329, 4039935, 5887096, 7018668, 7122000, 6545067, 6220738, 6589160, 7370543, 7641277, 7210710, 6720215, 5787026, 3577581, 23580, -3743002, -6117207, -5897284, -3237790, 3229, 2093079, 2341320, 672156, -2704189, -6546521, -9973291]
7959i973291k534323j124491M34113J825857K791016K919549K239761J165581
7951b256228M05327M00166k160q95930j097985J68592J659080K060568Q25424
7942A266854o66392q13229n09306q1119Q9350n94772j553986j800895j265709
7933e929204l64253P6321J45509M66752J021860K032265K914535J925937o70082
7924A619640k405470k854033k861287k741998j934091q30853n04170m26481j22683
7915a3061426J39501J16119n61594j641406k188413j895918j309330J14799K043363
7906a8244305L553506M619937N045472M450844L349540K406046K110218J249779
7898H541037r19888k423507k398110k344304k244604j463173L23556J510669J079935
$$ y = [-9973291, -12507614, -13632105, -13197992, -11372135, -8581119, -5661570, -3421809, -2256228, -1850901, -1450735, -1452895, -2348825, -3446810, -3278218, -1619138, 441430, 1266854, 600462, -212767, -722073, -803192, -713842, -1308614, -2862600, -4663495, -5929204, -6293457, -6217136, -6071627, -5604875, -4583015, -2550750, 363785, 2289722, 1619640, -785830, -3639863, -6501150, -9243148, -11177239, -12008092, -12512262, -12938743, -13061426, -12921925, -12805806, -13367400, -15008806, -17197219, -19093137, -20402467, -20287668, -18244305, -14690799, -10070862, -5025390, -574546, 2774994, 5181040, 7291258, 8541037, 7621149, 5197642, 2799532, 455228, -1789376, -3252549, -2928993, -1418324, -338389]
7889c38389L98427L46344O61443k83898j790543j868556n95359O42983L01237
7880b526311o80190l92418j43181K2781N77822O16736M14216J98386m71931j101675
7870c485765r96036j64261Q62793J148174R35359J570210K181452J727117N92793
7861D371836R5480J8328p17528j587779j275843J80338J040730K42955j120241
7852A248276j341770r2819J488894J381827K4270r60094j317513r25381n07171
7843a001481p80510j552111j223198O65590J596841Q85199k95361r61521r3212
7834b759764J511525J670697n011j725845k713676k616997j831781j118780N44743
7825i044889K154996K342397J838150J032426k10516j672059j770415j97131P76708
$$ y = [-338389, 60038, 406382, 1067825, 783927, -1006616, -2875172, -3470531, -2827548, -2526311, -3206501, -3598919, -3742100, -3719319, -3141497, -2524761, -2110545, -1912159, -2384090, -3485765, -4481801, -4646062, -3783269, -2635095, -1699736, -129526, 2051926, 3779043, 4371836, 4467316, 4485644, 3768116, 2180337, 904494, 1084832, 2125562, 2368517, 1248276, -93494, -186313, 1302581, 2684408, 2708678, 1748584, 431071, -494310, -1001481, -1781991, -3334102, -4557300, -3891710, -2294869, -1409670, -1705031, -2666552, -2759764, -1248239, 422458, 417447, -1308398, -4022074, -6639071, -8470852, -9589632, -9044889, -6889893, -4547496, -2709346, -1676920, -1887436, -3559495, -5329910, -5527041, -4750333]
7816d750333J076665J339592J822492K567763L005455L227949L055218K239655
7808A3584456P50185j009499j445211j037253j153575r25527K0429M82393L37036
7799I603434K3817r38294j589836q53666K84535P75413P98980P26372Q78590L24597
7789A0033942j288548k282060j464497M35832J582911J054352l56924j953246
7781E761762k232359j435261j151656q14116J83608J240015J252555N03104N80585
7772C888237J253464J443230R9626j948877l065060k669928j611991n80521M51141
7763b740679J087182J283240M90715o95222j390373j617642j308067n45032N05347
7754d930531Q60653j95768j218234j311478k76227J125635J446906J140294O85763
$$ y = [-4750333, -3673668, -2334076, -511584, 2056179, 5061634, 8289583, 11344801, 13584456, 14334641, 13325142, 11879931, 10842678, 9689103, 8763576, 8784005, 9266398, 9603434, 9627251, 8688957, 7099121, 6245455, 6529990, 7305403, 8104383, 8830755, 9709345, 10033942, 8745394, 6463334, 4998837, 5434669, 7017580, 8071932, 7715008, 5761762, 3529403, 2094142, 942486, 128370, 311978, 1551993, 2804548, 3307652, 3888237, 5141701, 6584931, 6684557, 4735680, 1670620, -999308, -2611299, -3191820, -2740679, -1653497, -370257, 120458, -574764, -1965137, -3582779, -4890846, -5435878, -4930531, -4069878, -4265646, -5483880, -6795358, -7071585, -5945950, -4499044, -3358750, -2672987]
7745b672987N11237J476156K772774K378086l8468j863293k146579k342457k224211
7736d149742j242645q77358j123283o39173L81543J228973K297443L143757L020138
7727B039653J647860j895303n718189o156271l201552J068007L710121L523821
7719d981853K752769K917026L108984K464315J353814J69785j044518j710829
7711E029493j642310r37691N56695J985052K433405K481602K546644J925018K24027
7702A4601935j293707j406089m11064K36457p8463l60141q70285k296803l121494
7693E000346j848260r3447J79539o72665j465649j178884N3636J327569J628588
7684B930773J197331O95552k72017j312436j394854o79468l50376n60356j178976
$$ y = [-2672987, -2161750, -685594, 2087180, 4465266, 4426798, 2563505, 416926, -1925531, -4149742, -5392387, -6269745, -7393028, -8032201, -7650658, -6421685, -4124242, -980485, 2039653, 3687513, 1792210, -3925979, -10082250, -13283802, -12215795, -8505674, -4981853, -2229084, 687942, 3796926, 6261241, 7615055, 7784840, 6740322, 5029493, 3387183, 2449492, 3006187, 4991239, 7424644, 9906246, 12452890, 14377908, 14601935, 13308228, 11902139, 11491075, 11727532, 11649069, 11288928, 10418643, 8121840, 5000346, 3152086, 3058639, 3238178, 2565513, 1099864, -79020, -25384, 1302185, 2930773, 4128104, 4823656, 4551639, 3239203, 1844349, 1164881, 814505, 254149, -924827]
7675i24827j859391j239814L83246N51343n50711o72873P63139K347521L129799
7666A927432K452922P13991l64169n89006l45961R3339N52218J224472J185292
7657F850530M98444K29165j21201j296353j891085p97621P07963J611454J718767
7648G510063J579563R66798K36440J20365P4715q63528j945436j955977j635216
7639D087787j586538j637488j294610j196401l87279J667571K848244J915409
7631D416695L91625l07960o15916r61173p88981J29635J096400J456146J647446
7622F463917K443028K966731K672727J078132j377757l070923k973727k270974
7614E931154j656131n34520M30858j31598j058586j481786j515321l92683P13599
$$ y = [-924827, -2784218, -4024032, -3640786, -3089443, -3640154, -4313027, -3549888, -1202367, 1927432, 4380354, 5094345, 4730176, 4141170, 3795209, 3888548, 4440766, 5665238, 6850530, 7348974, 7578139, 7456938, 6160585, 4269500, 3471879, 4179842, 5791296, 7510063, 9089626, 10056424, 10292864, 10413229, 10487944, 9624416, 7678980, 5723003, 4087787, 2501249, 863761, -430849, -1627250, -2014529, -346958, 2501286, 4416695, 4808320, 4500360, 3884444, 2923271, 2134290, 2263925, 3360325, 4816471, 6463917, 8906945, 11873676, 14546403, 15624535, 14246778, 11175855, 8202128, 5931154, 4275023, 3740503, 4171361, 4039763, 2981177, 1499391, -15930, -408613, 304986]
7605C04986M22331j14360K46083L17057M68356J464458K183711J564384j48367
7596F708639j800432k125681j646140j606647j408678p05369N15501J374800J150455
7587D56448J260253K194165J880468K70252j21357P614o01762q98814k69028M66496
7577D644735M08527k45817m44424j63690m56344r96301j137850r49413o79503
7568b0080m22523m59575p62964j090753r55288N70555K179512K544895J612797
7559C196576L48477m05125n40164K06689J068079J064424Q98459Q40788O37946
7550G316149R3912o80564j589093k017267j058350M58903R55411J93404o79875
7541B992630m99598K55330L96275J10691P54690K358206L366397L270022J822836
$$ y = [304986, 727317, 612957, 859040, 1176097, 1644453, 3108911, 5292622, 6857006, 6708639, 4908207, 2782526, 1136386, -470261, -1878939, -2584308, -2068807, -694007, 456448, 1716701, 3910866, 5791334, 6061586, 5940229, 5947843, 5346081, 4447267, 4178239, 4644735, 5053262, 4807445, 4363021, 4199331, 3742987, 2746686, 1608836, 659423, -20080, -442603, -902178, -1665142, -2755895, -3711183, -3140628, -961116, 1583779, 3196576, 3545053, 3139928, 2599764, 2806453, 3874532, 4938956, 5837415, 6678203, 7316149, 7410061, 6729497, 5140404, 3123137, 2064787, 2523690, 3479101, 3672505, 2992630, 2493032, 2748362, 3144637, 3255328, 4010018, 6368224, 9734621, 13004643, 14827479]
7532A4827479n84729k324864k642933k178020j331000l45412J13936J08921j07130
7523E536248j704M08426O20291n4325j258899j788679j532540q88175n08930j48579
7513C83134P70045J800025J985774J624600J029924L31280q9943j03745J9844
7504G750938l74302o28200k10758l79846n71107k04474k84686o62796m18311M83985
7494D500443J408373J141363k42863r76072j288012j671036j111441j20002J083130
7485B723883J950111J195918M9391k12848K67082N77460j31908o89088n33804
7476E196197J01471N8613j456392k061483j129376k67016M51639J023191J086283
7467C003127P76243N39274l98762j105449r92220j219860j266385o56183K84948
$$ y = [14827479, 14242750, 11917886, 9274953, 7096933, 5765933, 5420521, 5534457, 5643378, 5536248, 5534544, 5942970, 6563261, 6508936, 5250037, 3461358, 1928818, 1040643, 531713, 383134, 1153179, 2953204, 4938978, 6563578, 7593502, 7924782, 7834839, 7731094, 7750938, 7376636, 6748436, 6537678, 6157832, 5586725, 5382251, 5097565, 4434769, 4016458, 4500443, 5908816, 7050179, 6807316, 5831244, 4543232, 2872196, 1760755, 1640753, 2723883, 4673994, 5869912, 5919303, 5706455, 5973537, 6550997, 6419089, 5730001, 5196197, 5297668, 5356281, 3899889, 1838406, 709030, 442014, 893653, 1916844, 3003127, 3779370, 4318644, 3919882, 2814433, 1822213, 602353, -664032, -1320215, -1035267]
7458a035267N91979J24537J50539P99592R14419N80290J044627J949485J819449
7449F939650P87469J55055K52985N48238R8263j508676l004866l357183k452322
7440a541387j169026j32883N50956J337497K059137K049848R74780q68894k180770
7431A079258j334383N14305R10591N19413M00543L92634P38360Q02224l65462
7422C657483j337895j268578r26219j092294n57556J134217K226761K885847L381497
7413H103263K224827J59767r13957q49642q34134j623085j915106j463689q58530
7404B029714o8650J186229J760038M44400j186487j494993j636300k067857j686997
7395b720903q88698n43246r44270j162792o90961q56662j712595j540731l18977
$$ y = [-1035267, -443288, -318751, -168212, 631380, 1545799, 2126089, 3170716, 5120201, 6939650, 7727119, 7882174, 8135159, 8683397, 8781660, 7272984, 4268118, 910935, -1541387, -2710413, -2843296, -2292340, -954843, 1104294, 3154142, 4128922, 3260028, 1079258, -255125, 259180, 1169771, 1689184, 2089727, 2482361, 3220721, 4022945, 3657483, 2319588, 1051010, 124791, -967503, -1525059, -390842, 1835919, 4721766, 8103263, 10328090, 10487857, 9573900, 8724258, 7890124, 6267039, 4351933, 2888244, 2029714, 1961064, 3147293, 4907331, 5351731, 4165244, 2670251, 1033951, -1033906, -2720903, -3609601, -4152847, -5097117, -6259909, -6950870, -7807532, -9520127, -11060858, -11379835]
7386a1379835J274607K350286K565612J454719K81516J87340Q23144K197285K828798
7377B583472J489641j56294n69653k56003m8455p56231j764478j708287o83655
$$ y = [-11379835, -10105228, -7754942, -5189330, -3734611, -3453095, -3265755, -2442611, -245326, 2583472, 4073113, 3916819, 3347166, 3091163, 3042708, 2286477, 521999, -1186288, -1869943]
$$ [...]
##END NTUPLES=NMR SPECTRUM
##END=
