##TITLE=1H_SR_IM6_3
 CDCl3
 8 sc, 
 15.11.2021
##JCAMPDX= 6.0         $$ Bruker NMR JCAMP-DX V2.0
##DATA TYPE= NMR FID
##DATA CLASS= NTUPLES
##ORIGIN= UXNMR, Bruker Analytische Messtechnik GmbH
##OWNER= root
$$ XWIN-NMR		Version 3.5
$$ Mon Nov 15 12:58:47 2021 Russian Standard Time (UT+4h)  she@DPX200
##.OBSERVE FREQUENCY= 200.131346
##.OBSERVE NUCLEUS= ^1H
##.DELAY= (6, 6)
##.ACQUISITION MODE= SIMULTANEOUS
##.ACQUISITION SCHEME= undefined
##.AVERAGES= 8
##.DIGITISER RES= 18
##SPECTROMETER/DATA SYSTEM= spect
##.PULSE SEQUENCE= zg30
##.SOLVENT NAME= CDCl3
##.SHIFT REFERENCE= (INTERNAL, CDCl3, 0, 15.7039)
##AUDIT TRAIL= $$ (NUMBER, WHEN, WHO, WHERE, WHAT)
$$ ##TITLE= Audit trail, XWIN-NMR		Version 3.5
$$ ##JCAMPDX= 5.01
$$ ##ORIGIN= Bruker BioSpin GmbH
$$ ##OWNER= she
$$ F:/spectra/data/she/nmr/H-F/1/audita.txt
$$ ##AUDIT TRAIL=  $$ (NUMBER, WHEN, WHO, WHERE, WHAT)
(   1,<2021-11-15 12:55:11.03 +0400>,<she>,<DPX200>,
      <created by zg, POWCHK disabled, PULCHK disabled
       configuration hash MD5:
       00 E9 B6 7A A2 85 ED C7 34 08 36 98 17 FE 4E 26
       data hash MD5: 16K
       26 00 B9 67 0E 44 0F 1E 3E 7B 43 12 39 92 53 6E>)
$$ ##END=
$$ 
$$ hash MD5
$$ 84 BF 6B C9 FD FB 6A 1E 6C 43 F2 81 F1 65 69 2F
##$RELAX= 
##$RELAX= 
##$RELAX= 
##$RELAX= 
##$RELAX= 
##$RELAX= 
$$ Bruker specific parameters
$$ --------------------------
##$DU= <F:/spectra>
##$EXPNO= 1
##$NAME= <H-F>
##$PROCNO= 1
##$TYPE= <nmr>
##$USER= <she>
##$AMP= (0..31)
100 100 100 100 100 100 100 100 100 100 100 100 100 100 100 100 100 100 
100 100 100 100 100 100 100 100 100 100 100 100 100 100 
##$AQSEQ= 0
##$AQ_mod= 1
##$AUNM= <au_zg>
##$AUTOPOS= <>
##$BF1= 200.13
##$BF2= 200.13
##$BF3= 200.13
##$BF4= 200.13
##$BF5= 200.13
##$BF6= 200.13
##$BF7= 200.13
##$BF8= 200.13
##$BYTORDA= 1
##$CFDGTYP= 0
##$CFRGTYP= 5
##$CHEMSTR= <none>
##$CNST= (0..31)
1 1 145 1 1 1 1 1 1 1 1 1 1 1 1 1 1 1 1 1 1 1 1 1 1 1 1 1 1 1 1 1 
##$CPDPRG= <>
##$CPDPRG1= <>
##$CPDPRG2= <>
##$CPDPRG3= <>
##$CPDPRG4= <mlev>
##$CPDPRG5= <mlev>
##$CPDPRG6= <mlev>
##$CPDPRG7= <mlev>
##$CPDPRG8= <mlev>
##$CPDPRGB= <>
##$CPDPRGT= <>
##$D= (0..31)
0 1.2 0 0 0 0 0 0 0 0.06 0 0.03 0 0 0 0 0.0002 0 0 0 0 0 0 0 0 0 0 0 0 
0 0 0 
##$DATE= 1636966510
##$DBL= (0..7)
120 120 120 120 120 120 120 120 
##$DBP= (0..7)
150 150 150 150 150 150 150 150 
##$DBP07= 0
##$DBPNAM0= <>
##$DBPNAM1= <>
##$DBPNAM2= <>
##$DBPNAM3= <>
##$DBPNAM4= <>
##$DBPNAM5= <>
##$DBPNAM6= <>
##$DBPNAM7= <>
##$DBPOAL= (0..7)
0.5 0.5 0.5 0.5 0.5 0.5 0.5 0.5 
##$DBPOFFS= (0..7)
0 0 0 0 0 0 0 0 
##$DE= 6
##$DECBNUC= <off>
##$DECIM= 32
##$DECNUC= <off>
##$DECSTAT= 4
##$DIGMOD= 1
##$DIGTYP= 9
##$DL= (0..7)
0 120 120 120 120 120 120 120 
##$DP= (0..7)
150 150 150 150 150 150 150 150 
##$DP07= 0
##$DPNAME0= <>
##$DPNAME1= <>
##$DPNAME2= <>
##$DPNAME3= <>
##$DPNAME4= <>
##$DPNAME5= <>
##$DPNAME6= <>
##$DPNAME7= <>
##$DPOAL= (0..7)
0.5 0.5 0.5 0.5 0.5 0.5 0.5 0.5 
##$DPOFFS= (0..7)
0 0 0 0 0 0 0 0 
##$DQDMODE= 0
##$DR= 18
##$DS= 0
##$DSLIST= <SSSSSSSSSSSSSSS>
$$ [...]
##$SUBNAM2= <"">
##$SUBNAM3= <"">
##$SUBNAM4= <"">
##$SUBNAM5= <"">
##$SUBNAM6= <"">
##$SUBNAM7= <"">
##$SUBNAM8= <"">
##$SUBNAM9= <"">
##$SW= 18.0517287032376
##$SWIBOX= (0..15)
0 0 2 0 0 0 0 0 0 0 0 0 0 0 0 0 
##$SW_h= 3612.71676300578
##$TD= 16384
##$TD0= 1
##$TE= 0
##$TE2= 300
##$TE3= 300
##$TEG= 300
##$TL= (0..7)
0 120 120 120 120 120 120 120 
##$TP= (0..7)
150 150 150 150 150 150 150 150 
##$TP07= 0
##$TPNAME0= <>
##$TPNAME1= <>
##$TPNAME2= <>
##$TPNAME3= <>
##$TPNAME4= <>
##$TPNAME5= <>
##$TPNAME6= <>
##$TPNAME7= <>
##$TPOAL= (0..7)
0.5 0.5 0.5 0.5 0.5 0.5 0.5 0.5 
##$TPOFFS= (0..7)
0 0 0 0 0 0 0 0 
##$TUNHIN= 0
##$TUNHOUT= 0
##$TUNXOUT= 0
##$USERA1= <user>
##$USERA2= <user>
##$USERA3= <user>
##$USERA4= <user>
##$USERA5= <user>
##$V9= 5
##$VALIST= <valist>
##$VCLIST= <CCCCCCCCCCCCCCC>
##$VD= 0
##$VDLIST= <DDDDDDDDDDDDDDD>
##$VPLIST= <PPPPPPPPPPPPPPP>
##$VTLIST= <TTTTTTTTTTTTTTT>
##$WBST= 1024
##$WBSW= 4
##$XGAIN= (0..3)
0 0 0 0 
##$XL= 0
##$YL= 0
##$YMAX_a= 99458
##$YMIN_a= -140223
##$ZGOPTNS= <>
##$ZL1= 120
##$ZL2= 120
##$ZL3= 120
##$ZL4= 120
##$ABSF1= 10
##$ABSF2= 0
##$ABSG= 5
##$ABSL= 3
##$ALPHA= 0
##$AQORDER= 0
##$ASSFAC= 0
##$ASSFACI= 0
##$ASSFACX= 0
##$ASSWID= 0
##$AUNMP= <proc_1d>
##$AZFE= 0.1
##$AZFW= 0.1
##$BCFW= 1
##$BC_mod= 2
##$BYTORDP= 1
##$COROFFS= 0
##$CY= 11.3945322036743
##$DATMOD= 1
##$DC= 2
##$DFILT= <>
##$DTYPP= 0
##$F1P= 2.36226072786647
##$F2P= -0.459571619588291
##$FCOR= 0.5
##$FTSIZE= 0
##$FT_mod= 4
##$GAMMA= 1
##$GB= 0.15
##$INTBC= 1
##$INTSCL= 1
##$ISEN= 128
##$LB= 0.24
##$LEV0= 0
##$LPBIN= 0
##$MAXI= 10000
##$MC2= 0
##$MEAN= 0
##$ME_mod= 0
##$MI= 1.114404
##$NCOEF= 0
##$NC_proc= 0
##$NLEV= 6
##$NOISF1= 3.799351
##$NOISF2= 2.8
##$NSP= 1
##$NTH_PI= 0
##$NZP= 0
##$OFFSET= 15.70392
##$PC= 1
##$PHC0= -15506.55
##$PHC1= 6.00081
##$PH_mod= 1
##$PKNL= yes
##$PPARMOD= 0
##$PSCAL= 0
##$PSIGN= 0
##$REVERSE= no
##$SF= 200.130013532006
##$SI= 16384
##$SIGF1= 3
##$SIGF2= 2
##$SINO= 400
##$SIOLD= 16384
##$SREGLST= <1H.CDCl3>
##$SSB= 0
##$STSI= 0
##$STSR= 0
##$SW_p= 3612.71676300578
##$SYMM= 0
##$S_DEV= 0
##$TDeff= 0
##$TDoff= 0
##$TI= <>
##$TILT= no
##$TM1= 0
##$TM2= 0
##$TOPLEV= 0
##$USERP1= <user>
##$USERP2= <user>
##$USERP3= <user>
##$USERP4= <user>
##$USERP5= <user>
##$WDW= 1
##$XDIM= 8192
##$YMAX_p= 0
##$YMIN_p= 0
$$ End of Bruker specific parameters
$$ ---------------------------------
##NTUPLES= NMR FID
##VAR_NAME=  TIME,          FID/REAL,        FID/IMAG
##SYMBOL=    X,             R,               I
##VAR_TYPE=  INDEPENDENT,   DEPENDENT,       DEPENDENT
##VAR_FORM=  AFFN,          ASDF,            ASDF
##VAR_DIM=   8192,          8192,            8192
##UNITS=     SECONDS,       ARBITRARY UNITS, ARBITRARY UNITS
##FACTOR=    0.0002768,     1,               1
##FIRST=     0,             0,               0
##LAST=      2.2672688,     0,               0
##MIN=       0,             -140223,         0
##MAX=       2.2672688,     99458,           0
$$ Real data points
##PAGE= N=1
##DATA TABLE= (X++(R..R)), XYDATA
$$ [...]
$$ plain form
1779 -212 -129 137 -130 9 -213 -58 -114 28 -265 159 0 -87 -84 -52 -80 135 178 140 364 155 118 -85 -178 -151
1803 -151 -8 125 -251 70 -140 66 -378 41 -57 -166 -21 -31 -33 -357 85 -116 248 -158 -47 61 204
1824 204 -68 7 274 249 61 19 -32 54 257 -121 73 57 3 -17 0 55 306 -158 -217 -49 -225 -322 -76 -32
1848 -32 16 274 26 -99 -33 -2 -181 317 61 113 256 108 -46 517 -26 161 297 -17 174 58 -149 -192
1870 -192 -150 -183 -235 93 -138 5 -226 -366 -98 -151 -105 83 278 -104 71 235 -46 -177 281 116 -181 -108
1892 -108 135 213 -48 -62 -69 8 116 -22 -298 -73 60 -197 -89 -219 -42 146 -38 -72 -120 -94 -9 -84 -64 -102
1916 -102 -3 53 183 115 -102 -2 -127 -211 -97 1 -51 131 17 -104 -38 -71 -201 -62 -50 192 -324 -100 146
1939 146 -133 -335 -40 -19 281 -160 71 63 56 148 -164 132 -109 134 48 106 162 255 50 -139 -18 -447 -21
$$ packed form
1779b12Q3K66k67J39k22J55n6J42k93M24j59q7LL2k8K15M3l8K24k09l7k03r3K7
1803a51J43J33l76L21k10K06m44M19r8j09J45j0kl24M42k01L64m06J11J08J43
1824B04k72P5K67k5j88m2n1Q6K03l78J94j6n4k0J7N5K51m64n9J68j76r7K46M4
1848c2M8K58k48j25O6L1j79M98k56N2J43j48j54N63n43J87J36l14J91j16k07m3
1870a92M2l3n2L28k31J43k31j40K68n3M6J88J95l82J75J64k81j31M58j65k97P3
1892a08K43P8k61j4pP7J08j38k76K25J33k57J08j30J77J88j84l4m8K6Q5p5K0l8
1916a02R9N6J30o8k17J00j25q4J14R8n2J82j14j21O6l3j30J39J2K42n16K24K46
1939A46k79k02K95K1L00m41K31qpR2l12K96k41K43q6N8N6R3k05j89J21m29M26
$$ plain form
1962 -21 204 -306 -262 -175 -103 -305 -42 -96 -140 -96 -87 -93 5 -139 -164 55 -20 30 14 -35 -54 28 74 187 8 117 -171
1989 -171 183 208 -156 113 -48 -9 -81 -117 -52 -194 -193 59 -184 -187 56 -43 306 -116 51 -127 -4 72 45 -56
2013 -56 10 186 242 130 -126 -45 93 -38 -39 1 98 -68 -188 -225 115 19 -54 -128 -229 -4 -200 -354 -66 63
2037 63 9 -75 186 111 -183 -212 147 22 29 7 230 38 0 216 46 49 220 -354 -113 166 -136 -75 245 103
2061 103 -243 -187 -145 -159 58 -87 -44 -107 -140 -159 -46 -88 65 -17 9 351 52 80 182 126 102 157 28 -81 -143
2086 -143 73 -192 -1 41 -135 -83 -108 -57 -234 -109 -1 101 67 -210 236 -2 -94 233 -167 44 -244 216
2108 216 74 -18 230 -226 229 -57 91 -39 127 104 227 -57 -20 -73 146 104 -43 -199 72 -11 -231 56
2130 56 -193 -4 0 139 62 -137 -14 235 -205 109 342 -99 30 -136 -34 297 -101 79 31 210 -143 -98
$$ packed form
1962b1K25n10M4Q7P2k02K63n4m4M4RoR8j44k5K19p5N0j6m9j9Q2M6J13j79J09k88
1989a71L54K5l64K69j61L9p2l6O5j42JK52k43lK43r9L49m22J67j78J23P6k7j01
2013e6O6J76N6j12k56Q1J38j31jM0R7j66j20l7L40r6p3p4j01K25j96j54K88J29
2037F3n4q4K61p5k94k9L59j25Pk2K23j92l8K16j70LJ71n74K41K79l02O1L20j42
2061A03l46N6M2j4K17j45M3o3l3j9J13m2J53q2K6L42k99K8J02n6k4N5j29j09o2
2086a43K16k65J91M2j76N2k5N1j77J25J08J02l4k77M46k38r2L27m00K11k88M60
2108B16j42r2K48m56M55k86J48j30J66k3J23k84L7n3K19m2j47j56K71q3k20K87
2130E6k49J89MJ39p7j99J23K49m40L14K33m41J29j66J02L31l98J80m8J79l53M5
$$ plain form
2152 -98 28 -25 -113 -106 -124 -148 26 2 -185 -84 178 -47 -30 116 199 169 -13 -48 112 118 102 130 -147 193 2
2177 2 298 159 112 -27 -316 -225 144 -129 -66 -262 -430 135 -58 -194 151 143 -233 -178 119 245 173 -21 2
2200 2 206 156 -143 -53 2 107 76 -20 26 143 -218 74 8 -80 24 193 -74 -69 -207 130 66 54 52 -41 67 -92
2226 -92 -86 134 -147 45 155 -8 113 73 172 -103 -182 -98 103 -113 21 244 13 144 15 102 -340 -164 -27
2249 -27 94 -118 87 -18 -75 -128 -169 80 -48 136 282 43 96 93 295 252 -94 82 27 195 -54 120 -106
2272 -106 -140 24 -112 192 -223 -166 -193 -12 -40 -45 -172 -127 -174 118 130 278 -20 107 123 67 85 171 -39 132
2296 132 -77 326 249 -109 94 87 -62 -163 39 32 -113 177 -52 86 -9 -135 -78 -146 -112 -10 -1 70 110 -34
2320 -34 -12 -226 256 33 -15 237 -29 17 -53 -73 -65 -4 -56 -26 -98 62 -248 -24 2 -3 -135 14 -100 132 -250
$$ packed form
2152i8J26n3q8Pj8k4J74k4j87J01K62k25J7J46Q3l0j82l5J60Oj6K8k77L40j91
2177BK96j39m7j39k89R1L69k73O3j96j68N65j93j36L45ql76N5K97J26p2j94K3
2200BK04n0k99R0N5J05l1r6M6J17l61K92o6q8J04J69k67Nj38L37o4j2kr3J08j59
2226i2OK20k81J92J10j63J21m0R9k75p9Q4K01k16J34K23k31J31j29Q7m42J76J37
2249b7J21k12K05j05n7n3m1K49j28J84J46k39N3lK02m3l46J76n5J68k49J74k26
2272a06l4J64j36L04m15N7k7J81k8nj27M5m7K92J2J48k98J27J6n6J8Q6k10J71
2296A32k09M03p7l58K03pj49j01K02pj45K90k29J38r5j26N7o8L4J02RP1M0j44
2320c4K2k14M82k23m8K52k66M6p0k0QO1n2L0p2J60l10K24K6nj32J49j14K32l82
$$ plain form
2345 -250 2 54 -218 77 -135 97 -94 -27 -90 -283 13 5 -94 114 14 111 -30 -102 33 246 12 186 -35
2368 -35 169 -44 226 65 -237 -62 -182 -91 -105 129 -160 -297 44 -52 -78 -102 24 100 -58 -30 10 -42 15 142
2392 142 -14 25 96 87 -29 198 4 71 -212 -120 66 -113 -25 -267 -437 -198 154 -27 -134 315 -90 368
2414 368 162 137 87 -149 -162 -99 259 200 -95 0 73 -1 84 71 -260 -93 21 -98 -277 -299 100 -90 -141 7
2438 7 51 -209 81 -48 -82 88 -180 140 26 37 188 -49 -177 45 -134 120 -82 -126 -50 90 117 109 50 -13
2462 -13 29 80 -24 -259 -26 -64 178 -127 -132 80 55 -59 44 110 -28 -109 -143 -58 118 -16 10 -63 99 -112
2486 -112 -65 210 105 -158 -67 -35 -66 70 -196 48 183 -30 81 -238 15 -14 -86 -247 -151 61 -125 -199 13
2509 13 203 241 -358 116 -132 184 170 293 370 -98 290 -138 183 -32 4 -152 65 -41 1 64 186 -24
$$ packed form
2345b50K52N2k72K95k12K32j91O7o3j93K96qr9K08j00R7j41p2J35K13k34J74k21
2368c5K04k13K70j61l02J75j20R1j4K34k89j37L41r6k6k4J26P6j58K8M0n2N7J27
2392A42j56L9P1rj16K27j94O7k83R2J86j79Q8k42j70K39L52j81j07M49m05M58
2414C68k06k5n0k36j3O3L58n9k95R5P3p4Q5j3l31J67J14j19j79k2L99j90n1J48
2438GM4k60K90j29l4J70k68L20j14J1J51k37j28K22j79K54k02m4P6J40K7qn9o3
2462a3M2N1j04k35K33l8K42l05nK12k5j14J03O6j38q1l4Q5J76j34K6p3J62k11
2486a12M7K75j05k63R1L2l1J36k66K44J35k13J11l19K53k9p2j61R6K12j86p4K12
2509A3J90L8n99M74k48L16j4J23P7m68L88m28L21k15L6j56K17j06M2O3J22k10
$$ plain form
2531 -24 -122 -2 -93 8 -148 -76 -129 47 -100 -102 9 -125 67 -27 -105 61 -106 -446 -145 305 -195 84 -17
2554 -17 -67 -94 -185 230 38 -87 -280 -106 -2 -29 29 308 67 29 114 64 85 169 13 98 12 107 -30 -69 24
2579 24 -155 192 113 20 136 129 -178 -148 -140 -12 -49 -21 -79 -136 -124 -38 291 228 -162 -74 40 107 -70 -5 156 -116
2605 -116 -108 5 -96 -66 208 -75 176 61 -93 -148 48 -86 -14 -110 -66 19 -139 158 83 97 -55 -38 25 -79
2629 -79 0 -42 -87 -165 97 -50 -137 39 25 -20 -72 105 86 84 294 -288 -181 26 -23 -61 -116 102 37 114 48 -243
2655 -243 17 82 -5 255 27 -48 -48 67 -117 47 83 -39 -14 433 -125 -47 163 -84 -76 -176 -34 -194 37
2678 37 -45 201 16 147 56 -356 -194 160 117 251 118 20 -176 -75 -174 48 -86 34 -27 -36 -28 116 -53 -80
2702 -80 358 -77 77 23 190 -58 3 -208 -260 -2 45 -58 -82 -75 -62 -13 -64 54 -65 119 -18 65 -11 -135
$$ packed form
2531b4r8J20r1J01j56P2n3J76j47kJ11j34J92r4p8J66j67l40L01M50n00K79j01
2554a7n0k7r1M15j92j25j93J74J04k7N8K79k41l8Q5n0K1Q4j56Q5q6R5j37l9R3
2579B4j79L47p9r3J16pl07L0QJ28l7K8n8n7J2Q6L29o3l90Q8J14O7j77O5J61k72
2605a16QJ13j01L0K74k83K51j15j54n5J96j34P2r6M4Q5j58K97p5J4j52J7O3j04
2629g9P9m2m5p8K62j47q7J76j4m5n2J77j9kK10n82J07K07m9l8n5K18o5P7o6k91
2655b43K60O5q7K60k28p5%J15j84J64L6j22K5M47n58P8K10k47Qj00J42j60K31
2678C7q2K46j85J31r1m12J62L54m3J34j33r8j96J01r9K22j34J20o1rQJ44j69k7
2702h0M38m35J54n4J67k48O1k11n2K58M7j03k4PJ3M9n1J18j19J84j37Q3p6j24
$$ plain form
2726 -135 421 -220 103 13 -155 3 -122 15 -59 32 -127 56 -170 -331 -59 179 -164 119 7 -95 -261
2747 -261 -27 -248 10 125 -205 33 -153 51 160 262 -190 -76 -55 83 -26 19 44 68 73 15 -32 197 -242
2770 -242 -83 60 123 -37 -47 -212 37 -120 40 -145 -216 179 -242 -44 -227 278 -164 56 164 235 -18
2791 -18 42 211 -21 -136 7 140 -44 177 -81 121 240 -83 15 -14 -247 -59 -70 -24 -107 -97 -56 25 -21 215
2815 215 -10 59 -185 27 37 -27 158 33 -27 -74 202 -41 15 -76 -93 20 27 -102 21 61 -60 2 -241 -6
2839 -6 108 -85 -40 15 -11 -109 -96 43 -38 -85 16 96 -19 156 -92 74 56 177 18 121 22 -101 -109 -52 -217
2864 -217 -285 57 20 217 -68 167 332 -160 66 150 -116 -169 287 -64 29 -25 237 -110 -138 -41 55 25 -65 92
2888 92 -72 -47 -23 87 -77 -171 101 -160 -216 -238 -191 97 -14 -166 50 73 -280 163 162 160 189 254 -40 142 269
$$ packed form
2726a35N56o41L23r0j68J58j25J37p4R1j59J83k26j61K72K38l43K83j12j02j66
2747b61K34k21K58J15l30K38j86K04J09J02m52J14K1J38j09M5K5K4Nn8m7K29m39
2770b42J59J43O3j60j0j65K49j57J60j85p1L95m21J98j83N05m42K20J08P1k53
2791a8O0J69k32j15J43J33j84K21k58K02J19l23R8k9k33J88j1M6q3J0M1Q1m6K36
2815B15k25O9k44K12J0o4J85j25o0m7K76k43N6r1j7J13Pj29J23M0j21O2k43K35
2839fJ14j93M5N5k6r8J3J39q1m7J01Q0j15J75k48J66j8J21j59J03r9j23qN7j65
2864b17o8L42l7J97k85K35J65m92K26Q4k66n3M56l51R3n4K62l47k8R7R6l0r0J57
2888I2j64K5K4J10j64r4K72k61n6k2M7K88j11j52K16K3l53M43jkK9O5k94J82J27
$$ plain form
2913 269 60 -52 -42 -89 -494 126 -261 -77 -22 -32 -133 101 -25 111 -15 -32 72 -182 -228 272 -70 32
2935 32 31 -118 -161 55 -137 88 28 94 41 -63 42 -21 -220 323 249 -96 354 -8 -60 241 69 -34 192
2958 192 -209 96 -61 -98 -124 105 -191 -106 -12 -160 2 62 -32 181 140 -84 106 131 64 120 -38 -147 -65 -196
2982 -196 -76 8 86 83 -147 -16 0 -228 107 -124 -37 26 -19 -4 8 -90 56 6 80 -14 -144 -18 127 121 287
3007 287 -179 106 -159 -10 73 277 224 81 -148 -189 -62 -182 198 -45 57 194 -166 54 53 90 -34 -6
3029 -6 -105 194 15 129 -88 179 -152 -30 -162 198 -32 13 129 115 -67 -221 348 -73 -3 51 216 -101
3051 -101 -212 131 -43 51 13 -57 110 -36 42 187 30 -93 -16 -354 -38 0 23 139 339 -35 69 78 -156
3074 -156 77 224 -119 40 -109 -12 14 -243 -14 -163 -75 -64 -133 -1 123 126 -67 97 110 270 130 -30 276
$$ packed form
2913B69k09j12J0m7m05O20l87J84N5j0j01K34j26J36j26j7J04k54m6N00l42J02
2935C2jj49m3K16j92K25o0O6n3j04J05o3j99N43p4l45M50l62n2L01j72j03K26
2958A92m01L05j57l7k6K29k96Q5R4j48J62O0r4K13m1k24J90K5o7N6j58j09Q2j31
2982a96J20Q4P8lk30J31J6k28L35k31Q7O3m5J5J2r8J46n0P4r4j30J26J45oJ66
3007B87m66K85k65J49Q3K04n3j43k29m1J27j20L80k43J02J37l60K20jL7j24K8
3029fr9K99j79J14k17K67l31J22j32L60k30M5J16j4j82j54N69m21P0N4J65l17
3051a01j11L43j74R4l8p0J67j46P8J45j57j23P7l38L16L8K3J16K00l74J04Rk34
3074a56K33J47l43J59j49R7K6k57K29j49Q8J1o9J32J24Lj93J64J3J60j40j60L06
$$ plain form
3097 276 -295 68 61 39 -77 74 234 258 -70 141 -152 9 301 -65 3 84 -138 -7 130 71 -167 -104 -51
3120 -51 71 8 25 242 -100 -64 -125 -155 -83 -13 -91 -29 32 -23 43 107 57 -148 31 -54 -6 234 -21 -134 63 -99
3146 -99 -138 85 -24 140 60 -34 -345 43 -275 -169 320 -13 -202 45 210 67 149 -161 -36 30 116 -176
3168 -176 42 152 173 196 91 -25 -8 -102 -107 -120 -47 93 139 -73 -148 -332 69 78 77 102 -127 11 -47 -96 -41 163
3194 163 -222 -28 176 42 102 -177 72 200 42 -108 158 -65 33 -337 -177 -35 88 -210 -302 -9 -216
3215 -216 138 41 -131 109 -198 -128 86 65 237 203 173 -280 -48 -265 -8 95 -230 -186 35 58 124 -288 128
3238 128 14 146 -11 125 10 -132 75 116 110 -132 -98 67 -64 90 -82 12 -119 88 138 28 -81 71
3260 71 241 21 92 168 27 47 -112 -31 -124 38 -26 24 229 -1 196 -77 -146 180 183 160 -24 -143 190 35
$$ packed form
3097B76n71L63pk2j16J51J60K4l28K11k93J61K92l66O8Q1k22J31J37n9k38O3N3
3120e1J22o3J7K17l42L6o1l0P2P0p8O2O1n5O6O4n0k05J79q5M8K40k55j13J97j62
3146i9l9K23j09J64q0r4l11L88l18J06M89l33j89K47J65j43Q2l10J25O6Q6k92
3168a76K18J10K1K3j05j16J7r4nj3P3J40M6k12p5j84M01RjK5k29J38n8m9N5K04
3194A63l85J94K04j34O0k79K49J28j58j50K66k23R8l70J60J42J23k98r2K93k07
3215b16L54r7j72K40l07P0K14k1J72l4l0m53K32k17K57J03l25M4K21K3O6m12M16
3238A28j14J32j57J36j15j42K07M1ok42L4J65j31J54j72R4j31K07N0j10j09J52
3260G1J70k20P1P6j41K0j59Q1r3J62o4N0K05k30J97k73o9L26Lk3j84j19L33j55
$$ plain form
3284 35 373 122 209 91 110 109 121 17 -61 -22 -327 110 -131 207 69 -42 103 -56 -346 92 290 138 -280
3307 -280 -370 -25 57 -38 -22 43 -101 -11 -114 -43 110 -50 139 -39 91 -88 112 -160 -19 35 -88 61 282
3330 282 -94 69 113 -81 -226 -31 43 -194 184 -256 103 27 -104 -30 -264 100 -22 -8 152 -22 149 -128
3352 -128 -23 -190 -177 12 10 37 172 176 2 12 -18 -267 129 149 -69 62 25 79 88 -4 198 -140 -77 111 -186
3377 -186 57 216 86 39 -267 -155 -124 18 -98 175 -11 -446 80 -145 -76 41 -10 -23 -42 61 -10 -89 -385
3400 -385 -96 -10 -13 -131 312 -121 -33 86 1 42 -130 36 142 16 -35 74 -192 -104 40 207 87 -61 -58
3423 -58 -23 -165 122 128 60 113 -246 68 67 -136 184 130 -76 206 -91 25 -138 -193 -60 146 104 -12 -113 37
3447 37 164 -116 -25 -98 83 117 75 -37 -277 146 115 -168 -42 37 -27 238 230 -126 -209 -214 5 17 -38 132 82
$$ packed form
3284C5L38k51Q7j18J9jJ2j04p8L9l05M37k41L38j38j11J45j59k90M38J98j52m18
3307b80r0L45Q2r5J6O5j44R0j03P1J53j60J89j78J30j79K00k72J41N4j23J49K21
3330B82l76J63M4j94j45J95P4k37L78m40L59p6j31P4k34L64j22J4J60j74J71k77
3352a28J05j67J3J89kK7J35Mj74J0l0k49L96K0k18J31l7N4Rr2K02l38O3J88k97
3377a86K43J59j30m7l06J12L1J42j16K73j86m35N26k25O9J17n1j3j9J03p1p9k96
3400c85K89Q6lj18M43m33Q8J19q5M1j72J66J06j26n1J09k66Q8J44J67j20j48L
3423e8L5j42K87Oo8N3l59L14jk03L20n4k06K82k97J16j63n5J33K06m2j16j01J50
3447C7J27k80R1p3J81L4m2j12k40M23l1k83J26P9o4K65ql56q3nK19J2n5J70n0
$$ plain form
3472 82 -7 -180 73 5 -63 -119 -4 -93 156 96 -282 33 190 -139 164 -42 65 -169 -111 -230 96 -83 265
3495 265 307 -38 -15 -218 -107 -207 -1 153 -50 38 1 97 127 -27 105 59 -97 -33 212 -89 -180 36 104
3518 104 129 234 56 -92 92 -154 59 -7 43 -129 -148 23 149 103 75 -87 -95 56 70 -95 22 24 103 194
3542 194 -68 118 16 -92 -176 104 110 -227 -46 130 125 161 102 -279 -75 -35 90 129 -143 149 -44 205 121
3565 121 163 -238 -62 -109 -94 -41 -17 31 20 -23 -330 -119 146 218 -329 -245 -7 -30 -67 37 55 -199 82 -38
3589 -38 69 -146 -39 -70 136 129 77 216 -198 -16 -56 6 -114 -120 -37 -133 218 -41 -46 -46 131 83 96 238 207 -121
3615 -121 42 -114 71 107 87 140 -209 -37 -192 227 -16 -34 -91 -21 180 10 281 -169 -47 70 -3 24 -122
3638 -122 108 -4 77 270 -12 -18 -44 -101 43 58 0 283 -5 -26 6 29 166 -337 -259 85 -67 -222 47 -17
$$ packed form
3472H2q9j73K53o8o8n6J15q9K49o0l78L15J57l29L03k06J07k34N8j19L26j79L48
3495B65M2l45K3k03J11j00K06J54k03Q8l7R6L0j54J32m6j56O4K45l01r1K16O8
3518A04K5J05j78j48J84k46K13o6N0j72j9J71J26m6k8j62qJ51J4j65J17KP9R1
3542A94k62J86j02j08q4K80Ol37J81J76nL6n9l81K04M0J25L9k72K92j93K49q4
3565A21M2m01J76m7J5N3K4M8j1m3l07K11K65P2n47Q4K38k3l7J04J8k54K81j20
3589c8J07k15J07l1K06pn2J39m14J82m0O2j20oQ3r6L51k59n%J77m8J3J42l1l28
3615a21J63j56J85L6k0N3l49J72j55M19k43j8n7P0K01j70K71m50J22J17p3K7j46
3638a22K30j12Q1J93k82ok6n7J44J5n8K83k88k1L2K3J37n03P8L44j52j55K69o4
$$ plain form
3662 -17 13 229 207 120 5 57 160 6 -18 17 120 157 164 -82 -132 125 171 70 -39 -60 16 59 -25 -126 -269
3687 -269 -52 2 17 23 -1 -30 -16 149 42 59 233 -38 -202 54 159 205 -235 207 174 -203 -4 -175 105
3710 105 83 80 -99 182 -171 2 57 -53 117 86 75 -11 374 78 -70 39 -285 204 126 54 -103 -51 -15 -256
3734 -256 -138 87 54 -51 96 168 229 31 210 -60 59 -35 51 97 114 -3 68 -85 -29 -33 170 187 -67 -155
3758 -155 13 -175 32 42 -61 -202 -35 77 -19 12 151 -77 239 -30 17 -190 -23 67 -173 -177 -91 -123 -193
3781 -193 1 -270 60 164 -1 0 -150 -168 -41 -6 29 -47 145 161 -32 -65 97 74 -48 112 160 53 -106
3804 -106 -188 -241 -210 209 -64 9 121 -127 -75 93 62 -94 28 -133 -99 132 56 133 24 -70 -153 -21 -101 68
3828 68 56 44 15 -242 80 -56 138 -52 -17 26 118 97 162 18 45 -12 23 -96 -187 106 80 -131 108 3 -40
$$ packed form
3662a7L0K16k2q7j15N2J03j54k4L5J03L7Pk46n0K57M6j01j09k1P6M3q4j01j43
3687b69K17N4J5Ok4k9J4J65j07J7J74k71j64K56J05M6m40M42l3l77J99j71K80
3710A05k2lj79K81l53J73N5j10J70l1j1q6L85k96j48J09l24M89p8p2j57N2L6k41
3734b56J18K25l3j05J47P2O1j98J79k70J19r4Q6M6J7j17P1j53N6mK03J7k54q8
3758a55J68j88K07J0j03j41J67J12r6L1J39k28L16k69M7k07J67R0k40mQ6l2p0
3781a93J94k71L30J04j65Jj50j8J27L5L5p6J92J6j93l3J62k3j22J60M8j07j59
3804a06q2n3L1M19k73P3J12k48N2J68l1j56J22j61L4K31p6P7j09r4q3J32q0J69
3828F8j2j2k9k57L22j36J94j90L5M3R2k1O5j44K7n7L5j19r1K93k6k11K39j05m3
$$ plain form
3853 -40 -14 -140 -140 148 -249 158 242 -100 21 -119 -36 81 -67 223 -185 99 274 64 160 127 -136 47 179
3876 179 197 197 137 -113 -19 -149 184 171 93 12 49 -250 -138 125 107 162 -26 24 -42 98 28 19 -40 -49 -109 43 -47
3903 -47 -105 152 149 20 45 4 -140 -15 -22 -77 242 111 1 -122 -72 90 36 288 -155 -133 -101 -176 241 58 -27
3928 -27 -92 163 -175 -223 251 -25 -145 -48 -37 -139 -138 -2 188 -34 -103 -143 168 -238 58 -1 281 281 164 -95
3952 -95 -19 171 67 100 40 -54 -32 178 89 33 -35 17 24 98 76 107 187 15 192 51 62 260 39 -48 191 -76
3978 -76 71 -130 33 439 -118 -253 -211 -86 -219 155 -64 72 -55 10 -67 21 14 -102 57 -108 -198 69 245
4001 245 135 6 213 16 -73 -100 -143 93 31 137 74 -333 -44 51 23 180 -90 -119 5 -104 -229 -9 -121
4024 -121 27 -30 -92 134 72 171 47 15 -70 118 81 54 -24 -159 -175 26 173 -31 250 12 41 285 58 101
$$ packed form
3853d0K6j26%K88l97M07Q4l42J21j40Q3J17j48K90m08K84J75k10R6l3k63J83J32
3876A79J8%o0k50R4j30L33j3p8q1L7k99J12K63j8N5j88N0o6J40p0rn9ro0J52r0
3903d7n8K57lj29K5m1j44J25pn5L19j31j10j23N0J62n4K52m43K2L2p5M17j83q5
3928b7o5K55l38m8M74k76j20R7J1j02JJ36J90k22o9m0L11m06K96n9K82%j17k59
3952i5P6J90j04L3o0r4K2K10q9n6o8N2PP4k2L1Q0j72J77j41J1J98k21q7K39k67
3978g6J47k01J63M06n57j35M2J25j33L74k19J36j27O5p7Q8pj16J59j65r0K67J76
4001B45j10j29K07j97q9k7m3K36o2J06o3m07K89R5k8J57k70k9J24j09j25K20j12
4024a21J48n7o2K26o2R9j24l2q5J88l7k7p8j35j6K01J47k04K81k38K9K44k27M3
$$ plain form
4048 101 103 -131 -41 127 117 84 14 12 32 120 -45 -172 73 27 66 -125 -14 152 -169 -45 -77 -197 -64 -329
4072 -329 -130 35 10 43 -131 144 -95 65 94 -177 -136 88 50 -295 42 170 81 -81 4 -129 -225 249 145
4095 145 48 -293 27 95 -42 222 243 -180 -75 138 -83 -70 74 143 -221 57 8 65 -30 31 -179 -209 -57
4118 -57 152 -6 112 -60 -51 -77 -191 29 55 -32 -102 137 -43 -23 -51 -127 61 -175 -100 -139 -101 -73 46 311 -364
4143 -364 140 -58 -69 166 129 274 -112 156 -29 86 -215 59 -43 -42 107 -175 135 113 147 42 -195 -24
4165 -24 213 156 373 48 146 35 -88 65 59 -1 58 -174 -206 -278 -52 166 -144 40 -92 147 -76 20 -99
4188 -99 -142 -101 -16 -64 104 -60 -110 -33 168 23 63 -78 -235 -209 60 -77 180 -104 -382 -263 78 -101 -56
4211 -56 236 0 89 37 77 213 -37 -26 20 -73 220 163 -19 -230 -32 -43 26 273 85 -90 88 -33 -110 259
$$ packed form
4048A01Kk34R0J68j0l3p0kK0Q8j65j27K45m6L9j91J11J66l21J24l2j20J33k65
4072c29J99J65k5L3j74K75k39J60K9k71M1K24l8l45L37J28q9j62Q5j33r6M74j04
4095A45r7l41L20O8j37K64K1m23J05K13k21J3J44O9l64K78m9N7r5O1k10l0J52
4118e7K09j58J18j72Rk6j14K20K6q7p0K39j80K0k8p6J88k36P5l9L8K8J19K65o75
4143c64N04j98j1K35l7J45l86K68j85J15l01K74j02JJ49k82L10k2L4j05k37J71
4165b4K37n7K17l25R8j11j23J53oo0N9k32l2p2K26K18l10J84j32K39k23R6j19
4188i9m3M1Q5m8J68j64n0P7K01j45M0j41j57K6K69j37K57k84k78J19L41j79M5
4211e6K92k36Q9n2M0J36k50J1M6r3K93n7j82k11J98j1O9K47j88j75J78j21p7L69
$$ plain form
4235 259 244 -148 -132 -253 -117 65 -72 -184 -14 -31 108 -215 27 -198 -45 171 -8 -202 -16 -9 75 120
4257 120 -101 -70 65 266 44 -13 6 10 217 130 -189 -9 -49 -218 -96 -67 -57 -195 -117 89 125 -189 -198 87
4281 87 57 138 -38 3 88 165 295 -2 -182 71 60 97 77 -58 203 224 -83 26 -126 -31 224 25 -24 -31 -135
4306 -135 -100 251 55 -51 82 -144 -15 195 89 20 8 205 277 -130 63 -91 171 50 -29 359 147 -195
4328 -195 228 -3 27 28 127 -63 27 -135 -116 -43 -169 -11 -163 -285 97 101 125 -86 110 -78 276 -93 -102 55
4352 55 -89 321 230 -255 81 -36 -34 48 -120 47 280 -237 -90 -80 -81 -4 203 165 66 -2 38 103 97 36 -83 -17
4378 -17 -115 -184 3 232 50 -8 -29 -45 -177 -1 -109 -12 -157 50 -32 -186 214 237 119 177 -123 94 -149
4401 -149 85 -373 113 -167 161 102 92 -63 -105 -38 102 -85 -76 -62 -48 270 3 236 151 126 110 63 38 -94
$$ packed form
4235B59j5l92J6j21J36J82j37j12J70j7J39l23K42k25J53K16j79j94J86PQ4M5
4257A20k21L1J35K01k22n7J9MK07q7l19J80m0j69J22K9J0j38P8K06L6l14rK85
4281H7l0Q1j76M1Q5P7J30k97j80K53j1L7k0j35K61K1l07J09j52R5K55j99m9pj04
4306a35L5L51j96j06J33k26J29K10j06o9j2J97P2m07J93j54K62j21p9L88k12l42
4328a95M23k31L0JR9j90R0j62J9P3j26J58j52j22L82MK4k11J96j88L54l69rJ57
4352E5j44M10r1m85L36j17KQ2j68J67K33n17J47J0jP7K07l8r9o8M0O5oo1j19O6
4378a7r8o9J87K29j82n8k1j6j32J76j08R7j45K07q2j54M00K3j18N8l00K17k43
4401a49K34m58M86k80L28n9j0j55m2O7J40j87RJ4J4L18k67K33q5k5j6m7k5j32
$$ plain form
4425 -94 -94 281 -251 6 -60 -113 -265 76 -89 -149 -61 -145 188 32 -45 -141 11 -58 -60 165 -65 15 155 43 -47
4450 -47 -302 -121 39 -4 81 -40 132 -3 -37 84 -120 35 68 -303 218 48 43 93 -5 169 -95 381 -183
4473 -183 10 177 -3 178 103 85 91 103 91 -11 96 150 -60 -123 9 -37 -332 -200 41 110 143 47 -308 -23
4497 -23 -38 180 14 23 30 -267 -9 83 149 4 65 -107 -304 179 47 191 275 -22 45 -68 -44 115 -83 145
4521 145 -91 -146 -186 -136 -16 -227 -134 44 146 208 160 -84 8 193 -44 129 134 -50 -102 -120 -226 -164 35 -122
4545 -122 371 -57 -41 59 91 -25 -69 30 -105 118 35 171 -60 113 -69 -59 18 20 -305 28 -36 276 142
4568 142 -101 -4 202 183 -61 24 120 252 26 97 -75 -223 -213 15 -49 86 80 -3 220 -73 13 75 39 -106
4592 -106 -163 69 -119 -400 131 70 -74 -131 160 -74 132 -12 -75 -69 -206 71 108 -126 -93 -129 -193 -142 329 161
$$ packed form
4425i4%L75n32K57o6n3j52L41j65o0Q8q4L33j56p7r6J52o9kK25k30Q0J40j12r0
4450d7k55J81J60m3Q5j21J72j35l4J21k04J55L3l71N21j70nN0r8J74k64M76n64
4473a83J93J67j80J81p5j8OJ2j2j02J07N4k10o3J32m6k95J32K41O9L3r6l55K85
4497b3j5K18j66RPk97K58R2O6j45O1j72j97M83j32J44Q4k97O7j13K4J59j98K28
4521A45k36n5m0N0J20k11R3J78J02O2m8k44R2J85k37J73Nj84n2j8j06O2J99j57
4545a22M93m28J6J00L2j16m4R9j35K23q3J36k31J73j82J0P7Kl25L33o4L12j34
4568A42k43R7K06j9k44Q5R6J32k26P1j72j48J0K28o4J35oq3K23k93Q6O2l6j45
4592a06n7K32j88k81N31o1j44n7K91k34K06j44o3Oj37K77L7k34L3l6o4N1M71j68
$$ plain form
4616 161 68 44 -51 241 106 -291 37 -84 -42 113 -292 157 -72 213 132 25 -76 7 -41 139 -140 -16
4638 -16 439 -42 27 0 121 169 -80 -218 5 137 125 87 -120 194 62 143 13 120 141 -81 212 -79 -53
4661 -53 38 136 -64 146 79 14 -143 11 41 -4 -225 163 106 274 -152 -353 -2 -368 206 7 92 116 -253
4684 -253 133 -51 74 4 -127 194 -101 63 304 32 -109 -85 -120 24 218 136 30 -265 9 -8 125 117
4706 117 -223 43 52 283 74 -270 -134 74 -26 -295 85 -40 9 215 -127 269 272 251 -49 28 -64 -9 -21
4729 -21 -32 108 288 -43 109 -98 6 -163 106 -164 -32 67 -78 -218 161 49 -49 -251 -284 161 -21 46
4751 46 -3 104 24 96 -51 -80 -52 -91 -103 77 11 33 -179 -146 52 123 49 82 33 -64 112 -220 85 275 -50
4776 -50 -53 -143 -257 103 95 -89 16 -195 -148 -25 107 98 70 -32 -88 322 -138 50 -157 105 -31 -180 91 -274
$$ packed form
4616A61r3k4r5K92j35l97L28j21M2J55m05M49k29K85q1j07j01Q3m8J80k79J24
4638a6M55m81O9k7J21M8k49j38K23J32j2l8k07L14j32Q1j30J07K1k22K93k91K6
4661e3R1R8k00K10o7o5j57J54L0m5k21L88n7J68m26k01L51l66N74j99Q5K4l69
4684b53L86j84J25p0j31L21k95J64K41k72j41K4l5J44J94q2j06k95K74j7J33q
4706A17l40K66RK31k09l44J36K08j00k69L80j25M9K06l42L96Lk1l00P7r2N5j2
4729b1j1J40J80l31J52k07J04j69K69k70J32R9j45j40L79j12r8k02l3M45j82O7
4751D6m9J07q0P2j47k9K8l9j2J80o6K2k12L3J98P1p4L3m9r7J76l32L05J90l25
4776e0lr0j14L60qj84J05k11M7J23J32rk8j02n6M10m60J88k07K62j36j49K71l65
$$ plain form
4800 -274 166 20 -147 -94 319 101 163 218 146 -34 -64 -55 -297 -51 219 -217 16 -7 -19 -47 -16 -38 -40 -352 103
4825 103 72 -29 -33 284 -232 50 -52 -55 -127 33 180 -83 136 -117 31 193 4 239 94 -53 3 -50 -111
4848 -111 -18 176 331 6 133 125 110 189 -84 120 -98 -190 -138 -13 -15 13 258 52 -419 -72 236 126 -98
4871 -98 9 60 -8 133 -49 -341 -62 -56 -106 -97 71 192 278 161 -179 153 -196 -223 97 21 138 -58 -39 -317
4895 -317 -157 14 -36 48 -97 -25 128 -219 55 -132 -53 45 -145 232 -141 122 -142 -41 -93 -109 -47 94 514
4918 514 -93 -4 -59 52 68 -28 -57 -67 97 -165 122 -176 -275 73 34 -275 185 195 77 157 221 -11 -184 1
4942 1 102 -63 -29 156 -191 313 88 32 -179 -133 201 -128 121 -17 -191 -84 -40 160 2 -21 -254 -48
4964 -48 -1 97 30 -41 -146 65 84 -44 -2 138 -27 155 -165 104 87 -132 -38 41 169 135 -4 -96 10 33
$$ packed form
4800b74M40j46j67N3M13k18O2N5p2j80l0Rk42K46K70m36K33k3j2k8L1k2kl12M55
4825A03l1j01mL17n16K82j02lp2J60J47k63K19k53J48J62j89K35j45j47N6n3o1
4848a11R3J94J55l25J27qj5P9k73K04k18r2N2J25kK8K45k06m71L47L08j10k24
4871i8J07N1o8J41j82k92K79On0RJ68J21Q6j17l40L32l49k7L20p6J17j96J9k78
4895c17J60J71n0Q4j45P2J53l47K74j87P9R8j90L77l73K63k64J01n2j6O2J41M20
4918E14o07Q9n5J11J6r6k9j0J64k62K87k98r9L48l9l09M60J0j18Q0O4k32j73J85
4942AJ01j65L4J85l47N04k25n6k11M6L34l29K49j38j74J07M4K00j58k3k33K06
4964d8M7R8o7p1j05K11J9j28M2J40j65J82l20K69j7k19R4P9J28l4j39r2J06K3
$$ plain form
4988 33 -166 80 68 52 54 -326 133 -1 145 -158 200 -39 132 -243 88 201 -46 -152 -266 -101 56 207
5010 207 85 -184 -109 173 192 45 175 -48 108 115 67 69 37 7 -179 -42 -19 280 -88 87 -85 -121 38 -36
5034 -36 153 -88 12 -106 -108 127 -219 29 -29 -172 -187 -128 -91 -162 -86 -21 -159 -44 -30 -89 18 126 -8 101
5058 101 -72 -211 -75 15 -123 -80 -154 38 135 99 89 52 -60 -86 -5 30 -19 7 -143 57 60 -74 284 58 145
5083 145 -165 -140 -26 -102 2 -4 201 -35 122 52 -98 30 -37 19 132 230 72 -26 -96 137 -82 -193 -178 -28
5107 -28 155 -42 10 -39 62 54 -262 159 -272 91 -219 -72 -94 239 -89 -4 94 -214 -72 137 -99 36 35
5130 35 217 -157 143 54 -144 -98 345 -54 -122 153 257 63 -68 -176 -274 -181 155 203 18 109 -171 -185 -36
5153 -36 116 -131 -114 127 174 74 37 266 -128 30 17 50 -383 7 -165 139 71 -258 2 34 -119 4 14
$$ packed form
4988C3j99K46j2j6Kl80M59j34J46l03L58k39J71l75L31J13k47j06j14J65J57J51
5010B07j22k69P5K82J9j47J30k23J56Pm8Kl2l0j86J37K3K99l68J75j72l6J59p4
5034c6J89k41J00j18kK35l46K48n8j43j5N9L7p1P6O5j38J15J4n9J07J08j34J09
5058A01j73j39J36R0j38M3p4J92R7l6j0l7j12k6Q1L5m9K6j50K00Lj34L58k26Q7
5083A45l10K5J14p6J04oK05k36J57p0j50J28o7N6J13R8j58r8p0K33k19j11J5J50
5107b8J83j97N2m9J01ql16M21m31L63l10J47k2L33l28Q5R8l08J42K09k36J35j
5130C5J82l74L00q9j98M6M43l99o8K75J04j94j31j08r8R3L36M8j85R1k80j4J49
5153c6J52k47J7K41M7j00l7K29l94J58j3L3m33L90j72L04o8l29K60L2j53J23J0
$$ plain form
5176 14 262 -299 77 144 17 16 -206 -257 28 -215 -198 95 -31 49 -97 10 40 14 170 60 -12 90 -76
5199 -76 23 -75 -5 -89 -30 68 21 -10 -159 132 103 17 194 159 -189 -72 -8 89 156 -173 13 20 230 -99 129 -116
5225 -116 215 67 -185 45 -131 -66 -74 -113 60 37 -73 79 110 44 2 111 58 -59 96 -40 66 -168 -137
5248 -137 101 82 221 -26 122 -24 105 34 -23 -49 -2 1 58 -88 -99 74 -14 12 -31 183 -53 184 114 -119
5272 -119 -130 -268 -69 19 -136 -185 63 -73 103 161 -179 20 55 69 -115 202 54 -110 -100 -166 3 -61 -106
5295 -106 34 -190 -16 148 107 26 -97 -37 -33 180 -25 -7 63 -71 -158 -60 -139 -312 117 94 83 -86 -118 69
5319 69 -52 -5 -78 234 -229 3 -36 -19 -29 -11 -71 -24 -199 32 148 -126 130 -130 -126 -75 -159 231 -173 141
5343 141 159 78 -68 -61 39 142 54 384 -120 94 58 112 56 -180 -83 -278 -67 125 6 -144 152 -33 -23
$$ packed form
5176A4K48n61L76O7j27jk22n1K85k43J7K93j26Q0j46J07L0k6J56j10p2J02j66
5199g6R9r8P0q4N9R8m7l1j49K91k9q6J77l5l48J17O4R7O7l29J86PK10l29K28k45
5225a16L31j48k52K30j76O5ql9J73k3j10J52L1o6m2J09n3j17J55j36J06k34L1
5248a37K38j9J39k47J48j46J29p1n7k6M7LN7j46j1J73q8K6m3K14k36K37p0k33
5272a19j1j38J99Q8j55m9K48j36J76N8l40J99L5J4j84L17j48j64J0o6J69o4m5
5295a06J40k24J74J64m1q1j23O0MK13k05J8P0j34q7R8p9j73M29k3j1j69l2J87
5319F9j21M7p3L12m63K32l9J7j0J8o0M7j75K31J16k74K56k60MN1q4L90m04L14
5343A41J8q1j46PJ00J03q8L30n04K14l6N4n6k36R7j95K11J92j19j50K96j85J0
$$ plain form
5366 -23 -264 83 -64 32 30 18 128 18 177 -142 24 200 -4 171 -53 53 31 207 30 158 199 11
5388 11 25 -57 -24 249 -5 -111 -43 282 -289 -36 53 -165 -9 -141 -40 2 -202 32 93 -149 67 -40 161
5411 161 110 86 -163 228 116 97 224 9 28 -104 -80 16 1 38 -110 -352 255 -64 81 18 -241 -275 -226 81
5435 81 -78 106 -86 -25 -31 44 73 -184 24 200 -123 -15 -112 65 -17 199 147 -29 -134 -210 331 27 -64 116
5459 116 -35 16 -220 -146 45 -205 52 -111 -109 -216 100 114 -137 193 208 -127 -139 230 -2 -68 84 -19 -18
5482 -18 -31 -307 8 95 329 167 -88 -25 -11 56 158 -4 -32 80 -225 -41 132 326 23 -274 -80 153
5504 153 -55 330 28 -12 -247 74 -159 -78 -54 -74 177 133 300 -113 226 152 -88 -28 164 -139 50 -102
5526 -102 85 34 0 87 113 -87 83 21 30 69 -114 -139 146 221 66 101 185 -90 190 -2 90 -159 -104 67 -147
$$ packed form
5366b3k41L47j47R6kj2J10j10J59l19J66J76k04J75k24J06k2J76j77J28M1j88
5388A1J4q2L3K73k54j06O8L25n71K53Q9k18J56j32J01M2k04K34O1k42K16j07K01
5411A61n1k4k49L91j12j9J27k15J9j32K4R6j5L7j48k42O07l19J45o3k59l4M9L07
5435H1j59J84j92O1oP5K9k57K08J76l23J08r7J77q2K16n2j76j05p6N41l04r1J80
5459A16j51N1k36P4J91k50K57j63Kj07L16J4k51L30J5l35j2L69k32o6J52j03J
5482a8j3k76L15Q7K34j62k55O3J4O7J02j62k8J12l05J84J73J94l03k97J94K33
5504A53k08L85l02m0k35L21k33Q1K4k0K51m4J67m13L39p4k40O0J92l03J89j52
5526a02J87n1l4Q7K6k00J70o2RL9j83k5K85P5j55L5Q4k75K80j92R2k49N5J71k14
$$ plain form
5551 -147 -15 -53 51 17 14 -47 114 49 -171 -83 -121 33 -2 102 -80 68 159 62 -4 -77 105 123 147 51 -217
5576 -217 116 25 216 -206 -86 -55 -106 153 -97 -20 -88 176 8 -324 -44 -157 95 68 -177 -29 99 118
5598 118 101 -146 -25 -91 -103 -73 -207 42 63 136 -160 -102 -8 -96 -43 -77 -153 -181 69 25 -32 -173 -299 73 121
5623 121 80 -34 73 -252 257 53 -106 43 164 71 -5 8 -23 7 23 -76 -188 35 -39 193 139 16 63 -191
5647 -191 -12 93 18 -77 291 -190 -98 15 -98 -37 108 233 61 182 -219 -111 -24 109 -10 17 -81 247
5669 247 -57 225 87 -320 165 -208 -186 -46 7 -189 104 -95 -234 -44 205 -34 150 -217 3 -113 -35
5690 -35 -44 100 132 -98 120 -46 -75 20 48 -183 13 -152 -76 -39 10 192 160 -259 -143 -144 275 -90 244 -213
5714 -213 138 33 121 354 -150 74 5 -150 53 180 166 -127 -66 58 141 76 161 89 -6 23 -57 -172 95 154
$$ packed form
5551a47J32l8J04l4lo1J61o5k20Q8l8J54l5J04j82J48R1r7o6p3J82J8K4r6k68
5576b17L33r1J91m22J20L1n1K59k50P7o8K64j68l32K80j13K52k7k45J48J28J9
5598A18j7k47J21o6j2L0j34K49K1P3k96N8R4q8N3l4p6k8K50m4n7j41j26L72M8
5623A21m1j14J07l25N09k04j59J49J21r3p6J3l1L0J6r9j12K23p4K32n4j23M7k54
5647a91J79J05p5r5L68m81R2J13j13O1J45J25j72J21m01J08Q7J33j19K7r8L28
5669B47l04K82j38m07M85l73K2J40N3j96K93j99j39J90K49k39J84l67K20j16P8
5690c5rJ44L2k30K18j66k9R5K8k31J96j65P6L7M9J82l2m19J16jM19l65L34m57
5714b13L51j05Q8K33n04K24o9j55K03J27j4k93O1J24Q3o5Q5p2r5K9q0j15K67N9
$$ plain form
5738 154 -1 131 -324 56 203 -9 -176 69 89 -134 89 -28 -59 147 69 100 63 -86 98 -183 -238 244
5760 244 -130 -197 38 -71 19 -256 34 5 113 106 -33 133 67 119 -52 80 -1 60 -90 111 -211 -4 -16
5783 -16 30 -164 203 -21 -126 -71 251 -116 -132 250 -91 206 -145 -137 35 1 17 226 106 166 123 33 1 90
5807 90 192 -53 -237 -48 -113 -388 70 207 0 25 -131 133 -168 150 174 -21 58 -97 103 -92 91 -77
5829 -77 -136 95 -117 111 131 157 -29 -202 30 117 38 -59 149 -200 166 42 -107 -113 -1 -45 175 -55 -276
5852 -276 74 -96 -91 -345 -47 2 8 61 126 -247 114 77 70 -60 2 87 -51 -23 -260 63 -81 -9 -48 -60 -159 177
5878 177 1 224 236 -157 234 5 -69 -141 43 127 -103 139 17 106 185 -176 -91 -306 248 -9 117 120 -16
5901 -16 19 129 -101 228 151 -104 -171 83 58 168 131 86 220 -12 -40 -241 126 72 26 -10 -108 -197 -90 19
$$ packed form
5738A54j55J32m55L80J47k12j67K45K0k23K23j17l1K06p8L1l7j49J84k81n5M82
5760B44l74o7K35j09R0k75K90k9J08pj39J66o6N2j71J32q1O1j50K01l22K07j2
5783a6M6j94L67k24j05N5L22l67j6L82l41K97l51QJ72l4J6K09j20O0m3r0l2Q9
5807I0J02k45j84J89o5k75M58J37k07K5j56K64l01L18K4j95P9j55K00j95J83j68
5829g7n9K31k12K28K0K6j86j73K32Q7p9r7K08l49L66j24j49oJ12m4K20k30k21
5852b76L50j70Nk54K98M9ON3O5l73L61l7pj30O2Q5j38K8k37L23j44P2l9j2r9L36
5878A77j76K23J2l93L91k29p4p2J84Q4k30K42j22Q9P9l61Q5k15N54k57J26Lj36
5901a6L5J10k30L29p7k55o7K54k5J10l7m5J34k32k8k01L67n4m6l6r8q9J07J09
$$ plain form
5925 19 -74 88 87 44 182 -117 146 61 -17 -30 0 -36 85 284 -49 -161 -6 -91 88 -37 68 -187 -50 -38
5949 -38 6 227 59 6 198 -12 107 -24 84 109 -25 48 -29 -78 -117 -176 272 -142 11 -26 -23 76 181 131 30
5974 30 -54 152 114 64 -179 -102 -141 53 -32 91 -24 -24 -156 -106 -111 12 29 -16 -112 -53 -179 80 -100 197 29
5999 29 -340 183 -70 -20 -185 28 -112 8 198 57 26 230 166 -71 1 79 -150 -118 33 243 59 -68
6021 -68 -20 81 90 117 2 -151 -142 -6 57 22 65 281 -225 -44 291 -209 -136 82 136 47 194 -87 -9 -168 125
6046 125 -97 -74 150 381 99 43 -112 28 -237 19 187 236 -284 -150 142 -27 -90 170 -168 -105 -15 -56
6068 -56 -138 102 322 -20 249 20 -6 -107 -174 40 89 112 107 139 -27 291 -120 -41 -99 138 124 97 57 -230 122
6093 122 -158 -42 99 145 169 72 -216 -61 -15 81 15 118 103 -33 -14 -13 -40 103 -143 -99 4 -73 -82 80 -106
$$ packed form
5925A9r3J62jm3J38k99K63q5p8j3L0l6J21J99l33j12J55q5J79j25J05k55J37J2
5949c8M4K21j68n3J92k10J19j31J08K5j34P3p7m9l9n9M48m14J53l7LR9J05n0j01
5974C0q4K06l8n0k43P7l9J94q5J23j15%j32N0nJ23J7m5r6N9j26K59j80K97j68
5999B9l69N23k53N0j65K13j40J20J90j41l1K04o4k37P2P8k29L2J51K10j84j27
6021f8M8J01RK7j15j53RJ36O3l5M3K16n06J81L35n00P3K18N4q9J47k81P8j59K93
6046A25k22K3K24K31k82n6j55J40k65K56J68M9n20J34K92j69o3K60l38O3R0m1
6068e6q2K40K20l42K69k29k6j01o7K14M9K3nL2j66L18m11P9n8K37j4k7m0k87L52
6093A22k80J16J41M6K4r7k88J55M6R6o6J03j5j36J9Jk7J43k46M4J03p7rJ62j86
$$ plain form
6118 -106 202 -249 -142 -33 -46 -6 35 142 -174 55 49 113 54 47 52 -28 110 162 -58 126 128 64 -72 -20 350 151
6144 151 40 -30 75 -104 -138 219 -153 -40 96 -14 -141 -8 55 30 24 75 -156 7 -22 -21 51 253 191 -200
6168 -200 -251 -219 1 -136 -68 88 38 -199 -325 -27 144 -84 75 -218 75 71 79 -14 16 89 -28 80 -130 176
6192 176 54 167 30 46 -41 -13 66 176 -139 -53 96 -21 -67 -23 195 -95 40 -166 107 -53 -71 142 -289
6215 -289 135 -120 -39 38 -224 -80 -71 -76 -151 288 7 120 -407 -94 227 83 -80 -57 31 187 -189 -120 -88 -133
6239 -133 -88 54 -115 -9 176 222 102 -135 -38 -143 -114 -220 142 209 -108 33 41 9 93 125 83 -321 26 50
6263 50 89 232 84 67 55 -38 80 60 111 97 -210 186 45 132 213 -49 -21 -72 -23 -196 199 -74 109 -9
6287 -9 -258 -57 -164 -182 115 -130 39 -74 -52 36 108 -223 274 157 11 82 -144 10 204 132 57 -58 83
$$ packed form
6118a06L08m51J07J09j3M0M1J07l16K29oO4n9pNq0J38N2k20J84Ko4j36N2L70j99
6144A51j11p0J05j79l4L57l72J13J36j10j27J33O3k5oN1k31J63k9JP2K02o2l91
6168b00n1L2K20j37O8J56n0k37j26K98J71k28J59k93K93mQr3L0P3j17J08k10L06
6192A76j22J13j37J6q7K8P9J10l15Q6J49j17m6M4K18k90J35k06K73j60j8K13m31
6215b89M24k55Q1P7k62J44Rnp5M39k81J13n27L13L21j44j63K3Q8J56l76O9L2m5
6239a33M5J42j69J06J85M6j20k37R7j05K9j06L62O7l17J41Ql2Q4L2m2m04L47K4
6263E0L9J43j48j7j2r3J18k0N1j4l07L96j41Q7Q1k62K8n1M9j73L95k73J83j18
6287ik49K01j07j8K97k45J69j13K2Q8P2l31M97j17j46P1k26J54J94p2p5j15J41
$$ plain form
6310 83 0 210 -138 67 68 78 50 89 -109 -78 147 85 139 -42 74 105 -1 -137 136 29 55 40 87 -139 117
6335 117 -128 186 131 31 39 -68 -90 99 -215 -42 178 56 12 -20 -158 27 -28 97 85 150 138 -66 -232
6358 -232 22 -53 -87 115 -54 -32 -82 -135 53 3 160 129 114 -86 63 96 33 109 268 117 112 192 191 -66 -103 197
6384 197 21 437 -172 -89 128 -7 109 -44 -6 -191 17 192 -88 101 -96 54 -224 -8 50 -212 119
6405 119 -79 -278 44 71 25 -63 -24 54 -137 -11 83 -90 13 -10 82 102 38 -122 47 -117 -82 221 41 -4
6429 -4 185 -59 43 -16 -48 95 -120 17 -161 -119 -28 -135 37 -129 19 -151 -66 49 -118 202 86 -52
6451 -52 35 231 -330 -179 307 -48 -140 39 -18 -87 -99 -41 224 159 -42 -29 -257 -18 79 20 -139 -243 145 31
6475 31 82 -20 2 -6 -47 13 -201 59 -411 -1 -59 121 77 235 39 67 -7 53 -20 -81 220 55 8 38 -107
$$ packed form
6310H3q3K10l48K05JJ0k8L9j98L1K25o2N4j81J16L1j06j36K73j07K6j5M7k26K56
6335A17k45L14n5j00Qj07k2J89l14J73K20j22m4l2j38J85n5J25j2O5j2k04j66
6358b32K54p5l4K02j69K2n0n3J88n0J57l1j5k00J49L3o3P6J59j51nQ0jk57l7L00
6384A97j76M16o09Q3K17j35J16j53L8j85K08J75k80J89j97J50k78K16N8k62L31
6405A19j98j99L22K7m6q8L9P8j91J26R4j73J03k3R2K0o4j60J69j64L5L03j80m5
6429dJ89k44J02n9l2J43k15J37j78M2R1j07J72j66J48j70Q5J15j67L20j16j38
6451e2Q7J96n61J51M86l55r2J79n7o9j2N8K65o5k01J3k28K39R7n9j59j04L88j14
6475C1N1j02K2qm1O0k14K60m70M10n8J80m4J58j96K8p4O0p3o1L01j65m7L0j45
$$ plain form
6500 -107 141 -61 22 57 -107 94 -145 -95 3 -39 -290 158 -16 4 85 3 -41 -253 192 -110 -179 75 -59
6523 -59 -78 -52 44 -33 154 -130 9 -229 42 -140 -21 -147 -176 92 -163 206 -19 -62 -151 -127 66 -301 -4
6546 -4 139 150 56 14 246 42 244 23 -164 -108 186 20 -315 -153 -25 127 74 97 112 -163 -56 -92 -97 -3
6570 -3 -124 75 24 -1 169 -89 -87 -56 302 27 -181 54 -93 294 182 69 -113 -141 167 75 18 248 -70
6593 -70 -133 52 -12 88 -11 12 -125 -143 64 -12 117 -211 155 9 38 -278 -37 38 165 47 -45 -85 164 -80
6617 -80 -121 112 68 -15 -83 139 36 402 -115 -201 148 47 117 197 108 -93 82 23 171 137 -73 -89 12 -10
6641 -10 -185 -44 104 -42 -205 15 -128 -40 -74 -77 -380 -127 -6 -3 -60 -248 270 243 80 219 -27 -305 129
6664 129 -230 -28 132 76 131 -14 279 35 12 -99 -26 -199 -61 23 -65 -93 142 112 -98 -44 -123 -12 -207
$$ packed form
6500a07K48k02Q3L5j64K01k39N0R8m2k51M48j74K0Q1q2m4k12M45l02o9K54j34
6523e9j9K6R6p7J87k84J39k38K71j82J19j26k9K68k55L69k25m3q9K4J93l67K97
6546dJ43J1r4m2K32k04K02k21j87N6K94j66l35J62J28J52n3K3J5k75J07l6nR4
6570cj21J99n1k5J70k58KL1L58k75k08K35j47L87j12j13j82k8L08r2n7K30l18
6593g0o3J85o4J00r9K3j37j8K07p6J29l28L66j46K9l16K41P5J27j18r2m0K49k44
6617h0m1K33m4q3o8K22j03L66n17q6L49j01P0Q0q9k01J75n9J48l4k10j6J01k2
6641a0j75J41J48j46j63K20j43Q8l4ll03K53J21Ln7j88N18k7j63J39k46k78M34
6664A29l59K02J60n6N5j45K93k44k3j11P3j73J38Q4q8k8K35l0k10N4p9J11j95
$$ plain form
6687 -207 106 -72 282 -73 -44 -69 37 292 87 94 -345 -25 222 -51 10 -4 -145 97 86 -333 58 56 -208
6710 -208 -81 53 -109 99 102 -24 -13 115 -90 96 27 -70 153 100 48 130 20 49 66 -9 67 -53 284 91
6734 91 6 -123 -39 198 2 -61 78 94 215 48 163 397 150 -265 -27 -52 39 26 66 1 6 41 -21 -146 8
6759 8 53 66 237 -25 -152 -99 145 13 -65 -28 -117 -153 123 -69 -49 51 -41 -123 -93 106 85 187 361 -4 155
6784 155 197 -215 193 191 119 -72 -11 -38 119 -17 -81 52 105 -148 -238 -34 42 -29 -148 -215 153 -142 -81 51
6808 51 -156 88 -257 26 -326 -46 -72 -29 67 -19 114 -158 -47 -36 -262 26 4 135 38 152 -218 -153 -67
6831 -67 -243 -113 -67 22 -120 -158 -32 265 -53 116 -45 95 -252 -147 20 -35 22 -266 204 -121 108 110 52
6854 52 59 -10 103 -124 -94 -97 -248 -230 -11 103 17 -166 9 -37 -153 7 19 228 -185 60 17 -12 -129 -151 190
$$ packed form
6687b07L13j78L54l55K9k5J06K55k05Pm39L20K47k73O1j4j41K42j1m19L91kk64
6710b08J27J34j62K08Lj26J1J28k05J86o9r7K23n3n2Q2j10K9J7p5P6j20L37j93
6734I1q5j29Q4K37j96o3J39J6J21j67J15K34k47m15K38k5R1j3M0o5NL5o2j25J54
6759HM5J3J71k62j27N3K44j32p8L7q9l6K76j92K0J00r2q2L0J99k1J02J74l65J59
6784A55M2m12M08kp2j91O1k7J57j36o4J33N3k53r0K04P6p1j19o7L68k95O1J32
6808E1k07K44l45K83l52K80k6M3R6q6J33k72J11J1k26K88k2J31r7J14l70O5Q6
6831f7j76J30M6Q9j42l8J26K97l18J69j61J40l47J05J67n5N7k88M70l25K29Kn8
6854E2Po9J13k27L0lj51J8K19J14q6j83J75m6j16J60J2K09m13K45m3k9j17k2L41
$$ plain form
6879 190 -59 -139 -108 -14 187 265 18 -27 46 -323 -123 44 -1 -45 131 131 -162 243 -77 -15 29 -240 -191 150
6903 150 78 -98 133 6 -255 -11 -29 -68 60 -8 250 70 154 154 -122 240 19 163 27 -43 -98 83 53
6926 53 -92 166 -195 -163 -72 -96 -62 142 -222 -86 43 78 25 161 -31 -90 107 72 -72 -10 -131 -65 118 95
6950 95 12 -49 22 -359 -14 -131 -171 135 39 76 140 291 34 -56 -80 -55 90 355 -88 -175 -72 31 -8 108
6974 108 -126 90 -71 181 -139 293 -108 -40 151 -168 38 -95 377 15 -7 45 -117 4 61 98 -93 -29
6996 -29 80 147 -27 -147 220 -64 36 -1 54 29 -29 -143 -221 41 -218 -210 -168 156 2 -165 -24 61 -219 -191
7020 -191 181 -89 -164 39 -162 107 143 81 -59 -33 128 -14 221 -214 -81 187 -128 -32 62 -94 26 202
7042 202 13 -234 -77 -12 -195 93 -58 39 -90 -191 190 185 16 -135 -222 -51 -45 59 -30 -71 158 44 -71
$$ packed form
6879A90k49q0L1R4K01P8k47m5P3l69K00J67m5m4J76%k93M05l20O2M4k69M9L41
6903A50p2j76K31j27k61K44j8l9J28o8K58j80Q4%k76L62k21J44j36p0n5J81l0
6926E3j45K58l61L2R1k4L4K04l64J36J29L5n3J36j92n9J97l5j44O2j21O6J83k3
6950I5q3o1P1l81L45j17m0L06r6L7O4J51k57r0k4K5J45K65m43q7J03J03l9J16
6974A08k34K16j61K52l20M32m01O8J91l19K06j33M72l62k2N2j62J21N7L7j91O4
6996b9J09O7j74j20L67k84J00l7N5k5n8j14p8K62k59QM2L24j54j67J41Q5k80K8
7020a91L72k70p5K03k01K69L6o2j40K6J61j42K35m35J33K68l15R6R4j56J20J76
7042B02j89k47J57O5j83K88j51R7j29j01L81nj69j51q7J71OJ04q9m1K29j14j15
$$ plain form
7065 -71 -246 22 116 62 -267 -237 43 -77 -307 177 189 -174 -242 -108 297 -135 16 -72 82 78 89 40 60 66 217
7090 217 -74 131 15 68 11 -191 -125 -2 22 7 -50 98 -254 28 -73 -153 -109 139 -120 -27 76 -56 -26
7113 -26 82 -16 -45 -112 8 -2 -322 200 9 55 82 235 55 -273 115 84 -203 -177 60 210 12 170 -176
7136 -176 -203 -89 -94 89 -103 -125 20 310 -117 74 25 -77 -199 13 -9 -33 10 184 125 -42 90 73 17 -215
7160 -215 -143 -27 131 -6 -68 74 -158 14 171 -49 -79 -95 106 20 -205 -147 -44 8 150 -134 212 -158
7182 -158 -109 45 17 -175 -5 -81 55 -101 34 33 -224 -10 -62 35 -99 107 -10 149 61 217 -45 -90 249
7205 249 -87 -31 -22 -53 184 -127 -99 -72 36 271 -78 148 149 159 -200 29 -82 -65 -131 -70 157 104 9 -62 -68 55
7231 55 -53 -57 27 27 -46 40 -73 -39 -77 -105 213 118 148 4 55 197 41 136 -205 -120 -298 -137 -308 -112 3
$$ packed form
7065g1j75K68R4n4l29L0K80j20k30M84J2l63o8J34M05m32J51q8J54mJ1m9K0OJ51
7090B17k91K05j16N3n7k02O6J23K4j5n7J48l52K82j01q0M4K48k59R3J03j32L0
7113b6J08r8k9o7J20j0l20N22j91M6K7J53j80l28L88l1k87K6K37J50j98J58l46
7136a76k7J14nJ83j92k2J45K90m27J91m9j02j22K12k2k4M3J74n9j67J32j7n6k32
7160b15P2J16J58j37o2J42k32J72J57k20l0j6K01q6k25N8J03N2J42k84L46l70
7182a58M9J54k8j92J70p6J36j56J35jk57K14n2R7j34K06j17J59q8J56k62m5L39
7205B49l36N6Rl1K37l11K8K7J08K35l49K26JJ0l59K29j11J7o6O1K27n3r5p1oJ23
7231E5j08mQ4%p3Q6j13L4l8k8L18r5L0j44N1J42j56R5l41Q5j78J61j71J96J15
$$ plain form
7256 3 -29 74 -18 104 -78 -36 -156 -163 32 -84 16 -2 -71 -19 144 -14 -22 -175 -15 145 117 85 -77 -33 106
7281 106 -87 -116 51 -2 95 35 131 -22 240 141 4 -76 -21 6 -171 -10 98 165 147 -72 -38 -16 77 67 -168
7306 -168 83 -79 122 -45 31 115 -72 81 64 166 201 74 -206 107 -196 -132 -44 257 56 -3 53 10 121
7329 121 131 120 -24 21 41 -152 -110 176 133 118 109 -124 130 -83 64 7 -19 33 -97 -49 6 -158 84 9 -174
7354 -174 73 11 52 -38 -63 -194 -86 -106 -54 -22 -10 18 363 151 268 -196 35 144 269 77 -166 -211 -191 51
7378 51 -34 36 -61 272 -163 86 138 150 46 -239 -93 145 -67 -87 -109 160 -80 -186 -11 120 132 -144 -37
7401 -37 44 158 3 15 -8 -148 72 64 130 -45 -45 -4 -107 -10 -149 28 164 133 196 -72 83 236 32 32 -38
7426 -38 34 -96 -157 124 -18 -1 224 185 -30 77 -84 86 8 -125 -167 128 -39 -16 138 111 -98 -207 -137
$$ packed form
7256Cl2J03r2J22j82M2j20pJ95j16J00j8o9N2J63j58qj53J60J60k8l2j62M4J39
7281A06j93k9J67n3R7o0R6j53K62r9j37q0N5K7j77J61J08O7j8k19L4K2R3j0k35
7306a68K51j62K01j67P6Q4j87J53j7J02L5j27k80L13l03O4Q8L01k01n9N6m3J11
7329A21J0j1j44M5K0j93M2K86m3j5rk33K54k13J47n7k6N2j30M8N5j64K42p5j83
7354a74K47o2M1r0k5j31J08k0N2L2J2K8L45k12J17m64K31J09J25j92k43m5K0K42
7378E1q5P0r7L33m35K49N2J2j04k85J46K38k12k0k2K69k40j06J75J31J2k76J07
7401c7Q1J14j55J2k3j40K20qO6j75%M1j03R7j39J77J36l1O3k68J55J53k04%p0
7426c8P2j30o1K81j42J7K25l9k15J07j61J70p8j33m2K95j67K3J54k7k09j09P0
$$ plain form
7449 -137 -256 -209 139 124 -45 75 -33 4 -77 35 176 -21 -195 -292 56 42 -141 85 -81 -103 125 227
7471 227 -56 129 220 153 27 165 -187 -101 64 61 87 16 -8 -186 190 72 34 75 149 247 38 -87 134 -61
7495 -61 -1 -166 4 -225 -60 -68 59 49 60 73 164 203 -34 71 -76 -5 -122 19 -76 241 252 -11 -16 -34 -21
7520 -21 -198 -83 -14 21 64 -35 143 223 53 -12 191 111 -187 -40 -87 12 254 -95 -26 -27 184 -32 -262 -12
7544 -12 12 -43 -130 -78 -156 -29 101 -128 -74 -7 -12 53 -301 36 220 -56 -18 48 222 352 231 -46 90 -89
7568 -89 -70 -72 -236 -7 46 -217 -127 87 119 -36 -16 -115 291 -58 27 171 -87 265 -126 89 181 -139 304 166
7592 166 -248 117 21 -8 63 107 -275 -59 -206 -406 61 166 242 -107 83 -33 252 -316 -145 -102 -287 133
7614 133 -121 -78 -10 84 66 -107 66 132 41 267 185 -84 33 -48 186 139 3 77 -51 -32 188 38 -71 -63
$$ packed form
7449a37j19M7L48j5j69J20j08L7q1J12J41j97j74r7L48j4j83K26j66k2K28J02
7471B27k83J85R1o7j26J38l52Q6J65lK6p1k4j78L76j18l8M1P4R8k09j25K21j95
7495f1O0j65J70k29J65qJ27j0J1J3R1L9k37J05j47P1j17J41r5L17J1k63nj8J3
7520b1j77J15O9L5M3r9J78Q0j70o5K03q0k98J47m7R9K42l49O9jK11k16k30K50
7544a2K4n5q7N2p8J27J30k29N4O7nO5l54L37J84k76L8O6J74J30j21k77J36j79
7568h9J9kj64K29N3k63R0K14L2j55K0r9M06l49Q5J44k58L52l91K15R2l20M43j38
7592A66m14L65r6k9P1M4l82K16j47k00M67J05P6l49J90j16K85n68J71M3j85M20
7614A33k54M3O8R4j8j73J73O6r1K26q2k69J17q1K34m7j36P4j28J9K20j50j09Q
$$ plain form
7638 -63 -50 168 24 -60 26 166 -184 35 -98 -70 39 -106 79 -59 144 23 -63 65 102 -10 141 121 112
7661 112 -241 292 260 -29 52 -23 142 -102 19 -33 -80 61 37 -28 -87 89 241 -162 -7 -152 -57 -69 258
7684 258 -203 190 45 -105 -18 -136 -69 67 -91 -513 129 49 -78 184 4 174 86 9 -143 -208 13 54
7706 54 171 250 59 -35 -52 123 -210 114 41 115 -44 -132 61 91 138 -106 53 74 30 -48 -21 -181 269 7
7730 7 179 -108 55 167 -135 15 -104 -118 2 132 61 -285 97 31 370 164 144 -28 59 -277 -77 57
7752 57 84 141 0 -49 -193 190 66 -98 368 58 -40 99 -83 200 144 60 -122 25 58 -23 -335 147 87
7775 87 200 7 98 158 -202 96 65 52 169 221 -39 -131 -191 -38 64 312 -1 -128 59 112 320 221 -21
7798 -21 -36 -21 -222 63 -1 63 -22 15 137 -230 9 35 249 -108 -4 -65 -17 -180 -59 255 11 14 -57 -184
$$ packed form
7638f3J3K18j44q4Q6J40l50K19j33K8J09j45J85j38K03j21q6J28L7j12J51k0r
7661A12l53N33l2k89Q1p5J65k44J21n2m7J41k4o5n9J76J52m03J55j45R5j2L27
7684B58m61L93j45j50Q7j18O7J36j58m22O42q0j27K62j80J70q8p7j52o5K21M1
7706E4J17P9j91r4j7J75l33L24p3P4j59q8J93L0M7k44J59K1m4p8K7j60M50k62
7730GJ72k87J63J12l02J50j19j4J20J30p1l46L82o6L39k06k0j72Q7l36K00J34
7752E7K7N7j41m9j44L83j24j64M66l10r8J39j82K83n6q4j82J47L3q1l12M82o0
7775H7J13j93R1O0l60K98l1j3J17N2k60r2o0J53J02K48l13j27J87N3K08r9k42
7798b1j5J5k01K85o4O4q5L7J22l67K39K6K14l57J04o1M8j63J21L14k44Lp1j27
$$ plain form
7822 -184 -243 117 80 207 199 -56 -63 154 190 -42 -7 201 106 -168 66 -71 -93 -174 -147 -82 147 32 -174 -212 66
7847 66 -209 -155 -48 253 184 -24 -157 30 -17 -162 62 66 -41 -143 -213 92 -356 15 -21 134 193 120 -48
7870 -48 62 60 -128 -58 252 -251 -13 -238 -45 82 -90 -132 28 -199 82 157 56 -33 -106 113 -50 76 -132
7893 -132 -25 -132 343 114 17 -184 112 -124 -127 -153 -394 -50 15 85 -203 -3 88 268 106 4 -39 115 -44
7916 -44 -233 -167 -30 1 -70 107 -3 74 93 24 -60 88 81 -23 -73 124 115 -135 -33 4 239 44 145 16 313
7941 313 -59 -196 -232 145 14 -324 -94 -11 95 204 145 137 -35 8 -118 -77 50 -102 -16 -41 95 39 -216
7964 -216 -35 267 -334 83 -274 -26 -28 231 56 8 152 81 -48 4 -96 -247 -140 326 72 -409 213 36
7986 36 71 101 90 -117 -54 5 -117 0 -36 79 65 -64 -150 92 146 -2 -73 189 -181 -117 100 -82 -2 -4 -39
$$ packed form
7822a84n9L60l7J27qk55pK17L6k32L5K08r5k74K34j37k2q1K7O5K29j15k06l8K78
7847F6k75N4J07L01o9k08j33J87m7j45K24Mj07j02p0L05m48L71l6J55N9p3j68
7870d8J10kj88P0L10n03K38k25J93J27j72m2J60k27K81P5j01q9p3K19j63J26k08
7893a32J07j07M75k29r7k01K96k36lk6k41L44O5P0k88K00R1J80j62j02m3J54j59
7916d4j89O6J37L1p1J77j10P7J9o9q4J48pj04n0J97rk50J02L7K35j95J01j29K97
7941C13l72j37l6L77j31l38K30Q3J06J09n9qj72M3j26M1J27j52Q6k5J36n6k55
7964b16J81L02o01M17l57K48kK59j75m8J44p1j29N2j00j51J07M66k54m81O22j77
7986C6L5L0j1k07O3N9j22J17l6J15j4j29q6K42N4j48p1K62l70O4K17j82Q0kl5
$$ plain form
8011 -39 -26 89 -124 158 146 -58 -58 -122 -61 146 231 244 200 103 -116 -96 -182 -81 -123 -6 107 -59 24 200 -95
8036 -95 223 264 196 37 -105 -5 31 -125 -208 -7 -119 133 149 32 -73 106 45 -39 109 -158 -97 176 38
8059 38 21 81 93 135 -2 102 0 -202 -176 289 -93 -45 52 -124 -201 242 99 71 -172 67 -91 -7 -73 -260
8083 -260 56 -40 -40 119 -222 -162 225 0 -243 196 112 -109 149 -216 -136 246 22 -282 -135 -164 -54 -82 -48
8106 -48 -130 33 -287 -96 37 22 -13 -53 78 12 -25 -30 -262 154 29 -181 14 9 341 108 173 -132 42 -61
8130 -61 -42 22 -23 238 -181 62 -35 -107 12 -24 -42 -26 -31 97 -168 -26 237 -50 33 -280 -25 -64 34 275 129
8155 129 -117 -25 34 327 193 -50 -15 61 -56 185 -4 -294 -56 61 -84 43 190 100 265 29 -63 219
8177 219 -214 94 -252 48 5 18 -15 94 -99 -157 108 -196 -192 -37
$$ packed form
8011c9J3J15k13K82j2k04%o4O1K07Q5J3m4r7k19K0q6J01m2J17J13j66Q3J76k95
8036i5L18M1o8j59j42J00L6j56q3K01j12K52J6j17j05J79o1q4J48k67O1K73j38
8059C8j7O0J2M2j37J04j02k02K6M65l82M8R7j76p7M43j43k8k43K39j58Q4o6j87
8083b60L16r6%J59l41O0L87k25k43M39q4k21K58l65Q0L82k24l04J47k9J10k8L4
8106d8q2J63l20J91J33j5l5m0J31o6l7nk32M16j25k10J95nL32k33O5l05J74j03
8130f1J9O4m5K61m19K43r7p2J19l6j8J6nJ28k65J42K63k87Q3l13K55l9R8K41j46
8155A29k46R2N9K93j34k43L5P6j17K41j89k90K38J17j45J27J47r0J65k36r2K82
8177B19m33L08l46L00m3J3l3J09j93n8K65l04MJ55
8191c7
$$ Imaginary data points
##PAGE= N=2
##DATA TABLE= (X++(I..I)), XYDATA
$$ plain form
0 0 0 0 0 0 0 0 0 0 0 0 0 0 0 0 0 0 1 -8 8 -8 8 -8 11 -16 16 -16 24 -24 30 -32 39 -41 48 -55 62 -70 78 -87 96
39 96 -108 119 -133 149 -162 179 -198 219 -241 266 -292 321 -356 391 -433 478 -530 591 -662 743
59 743 -839 957 -1104 1294 -1551 1909 -2452 3366 -5189 10162 -50647 -140223 41384 99458
73 99458 -28577 -41575 63114 29478 -56047 -19006 51517 26816 -15958 -5370 21368 13460
85 13460 -7822 -3404 23214 15638 -18670 -21228 7006 5109 -18136 -14281 9825 8105 -15552
98 -15552 -15846 12852 10811 -28865 -22709 37506 32857 -34071 -25523 37545 18061 -27624 14995
111 14995 45821 -17083 -41690 19509 34275 -10231 -10437 11629 -6275 -21012 -2652 7256 85
124 85 -6576 -15075 -13524 1832 -220 -12589 -1185 9284 -11108 -19095 10517 21950 -4466 -13507
$$ packed form
0@%%%%%%%%%%%%%%%%JrJ6j6J6j6J9k7L2l2M0m8N4o2P1q0Q9j03J17j32J48j65J83
39I6k04K27k52K82l11L41l77M17m60N07n58O13o77P47q24R11j008J121j253J405
59G43j582J796k061K398k845L460m361N818q555J5351o0809q9576J81607N8074
73I9458j28035j2998J04689l3636q5525L7041P0523k4701m2774J0588K6738p908
85A3460k1282M418K6618p576l4308k558K8234j897k3245L855K4106j720k3657
98a5552k94K8698k041l9676O156O0215m649o6928Q548O3068j9484m5685M2619
111A4995L0826o2904k4607O1199J4766m4506k06K2066j7904j4737J8360R908p171
124H5o661q499J551J5356k052j2369J1404J0469k0392p987K9612J1433k6416r041
$$ plain form
138 -13507 11738 18308 -3123 -3636 18646 12482 -12741 -2653 24450 10936 -17529 -4816 15750
151 15750 -2215 -14285 6049 7735 -17211 -15462 6224 3278 -8980 -3118 -869 -8770 -3914
164 -3914 4090 1367 2166 4497 -4209 -4427 11793 11935 -2205 1616 10295 -1130 -6094 11450 12926
179 12926 -7802 -9464 7280 3510 -10283 -2828 6129 -7317 -16059 -191 6937 -7823 -11569
192 -11569 1711 1575 -7884 -1760 8307 852 -6486 2127 7623 3155 3669 6635 2265 366 5742
207 5742 5775 1832 4325 2488 -5920 -2427 7612 1088 -9293 -2400 2776 -8689 -9215 5505 2511
222 2511 -13661 -8119 6785 -3 -9080 1810 7900 -4077 -6133 8094 9344 -1602 -295 7367
236 7367 3626 -654 4994 6820 -29 -2028 1531 870 -815 969 -1802 -6279 -3152 250 -3928
$$ packed form
138a3507K5245O570k1431n13K2282o164k5223J0088K7103j3514k8465J2713K0566
151A5750j7965j2070K0334J686k4946J749K1686k946j2258N862K249p901M856
164c914Q004k723P99K331q706k18J6220J42j4140L821Q679j1425m964J7544J476
179A2926k0728j662J6744l770j3793P455Q957j3446q742J5868P128j4760l746
192a1569J3280j36r459O124J0067p455p338Q613N496m468N14K966m370j899N376
207E742L3l943K493j837q408L493J0039o524j0381O893N176j1465n26J4720k994
222B511j6172N542J4904o788r077J0890O090j1977k056J4227J250j0946J307P662
236G367l741m280N648J826o849j999L559o61j685J784k771m477L127L402m178
$$ plain form
251 -3928 -5342 -423 -2292 -7979 -3048 5165 -452 -6716 895 5365 -1439 -1826 8009 6296 -3011
266 -3011 427 8950 4374 -938 3678 5364 -1722 -1943 4024 2055 -3472 -2753 -1170 -3419 -3171 -873
282 -873 -3082 -5365 -2920 -1639 -3361 -1206 1105 -1354 -3082 1193 3870 1078 820 3776 3405 558
298 558 2517 5589 3409 26 1274 2806 521 -395 1036 -173 -3478 -2398 -935 -1995 -3114 -2849
314 -2849 -3107 -3974 -1687 -803 -2267 -1889 49 -534 -770 2291 3024 738 494 3576 3559 1707 2794 3364
332 3364 1697 522 1546 2226 577 -564 -918 -1158 -1503 -1563 -2223 -2288 -2655 -3386 -2909 -1379 -940 -2384
350 -2384 -2361 -298 144 -545 528 2551 1521 159 1757 4138 2806 595 1904 3488 1108 158
366 158 2477 1803 -1411 -1693 -201 -565 -2138 -2015 -1781 -2719 -2955 -1940 -2050 -1551 -1457 -1936 -1197 805 854
$$ packed form
251c928j414M919j869n687M931Q213n617o264P611M470o804l87R835j713r307
266c011L438Q523m576n312M616J686p086k21N967j969n527P19J583k249K48K298
282h73k209k283K445J281j722K155K311k459j728M275K677k792k58K956l71k847
298E58J959L072k180l383J248J532k285r16J431j209l305J080J463j060j119K65
314b849k58q67K287Q84j464L78J938n83k36L061P33k286k44L082j7j852J087N70
332C364j667j175J024O80j649j141l54k40l45o0o60o5l67p31M77J530M39j444
350b384K3K063M42o89J073K023j030j362J598K381j332k211J309J584k380r50
366A58K319o74l214k82J492l64j573J23K34r38k36J015j10M99R4m79P39K002M9
$$ plain form
385 854 -574 1048 2397 886 701 3436 3743 1150 611 3086 2944 123 322 2208 417 -1859 -882
402 -882 744 -753 -3561 -2127 -472 -2585 -3376 -1262 -393 -2360 -2398 -77 544 -316 -85 1029 1275
419 1275 1259 1504 2087 2316 1970 1217 1848 2476 1792 13 473 1188 -379 -1596 -192 33 -2362 -3251 -974
438 -974 -782 -3019 -2715 -842 -782 -2234 -1516 849 276 -1162 60 2334 1765 622 1837 3016 1303
455 1303 823 2202 2890 1172 151 754 869 -276 -592 -465 -596 -1385 -1875 -1797 -1025 -1805 -2507 -1750 -749
474 -749 -906 -1199 -392 389 -154 -622 1111 2105 899 859 2212 2435 1147 1198 2310 1563 155 32 925
493 925 625 -708 -963 -552 -1007 -1992 -1741 -621 -1544 -2391 -1610 -730 -1074 -1258 -293 99 19 145 669 1334
513 1334 1173 759 1547 1950 1423 1038 1449 1807 1042 451 597 1143 -256 -1112 -586 -509 -1477 -1737 -1096 -1186
$$ packed form
385H54j428J622J349j511j85K735L07k593n39K475j42k821J99J886j791k276R77
402h82J626j497k808J434J655k113p91K114Q69j967l8K321O21q60K31J114K46
419A275j6K45N83K29l46p53O31O28o84j779M60P15j567j217J404K25k395q89K277
438i74J92k237L04J873O0j452P18K365n73j438J222K274n69j143J215J179j713
455A303m80J379O88j718j021O03J15j145l16J27j31p89m90P8P72p80p02P57J001
474g49j57k93Q07P81n43m68J733R94j206m0J353K23j288N1J112p47j408j23Q93
493I25l00j333k55M11m55r85K51J120r23q47P81Q80l44j84R65L92q0J26N24O65
513A334j61m14P88M03n27l85M11L58p65n91J46N46j399q56N26P7r68k60O41r0
$$ plain form
533 -1186 -1712 -1703 -1136 -333 -787 -1176 -53 365 -20 226 1262 1599 696 1106 2039 1712 972 912 1634 1277
553 1277 661 133 358 126 -653 -867 -560 -763 -1754 -1475 -1024 -1389 -1546 -1071 -702 -946 -727 -382 -41 285
573 285 347 294 940 1299 984 909 1911 1577 625 1152 1611 740 149 543 238 -491 -840 -501 -646 -1289 -1194
594 -1194 -1256 -814 -1177 -1580 -844 -472 -893 -779 249 376 -137 279 1134 910 727 992 1452 1302 1159 1103
614 1103 958 867 432 -72 119 172 -601 -842 -684 -748 -1337 -1199 -779 -911 -1761 -795 -495 -794 -683 -407 453
635 453 373 114 765 1106 1197 754 806 1561 777 593 1290 1224 451 159 588 53 -482 -639 -594 -596 -1217 -1223 -1098
658 -1098 -922 -1036 -1274 -729 -289 -439 -623 135 279 82 552 1013 838 547 987 1274 1002 885 716 778
678 778 846 79 -130 232 -52 -582 -707 -325 -802 -1210 -840 -799 -1529 -1139 -602 -686 -572 -592 -22 200 518 172
$$ packed form
533a186n26RN67Q03m54l89J123M18l85K46J036L37r03M10R33l27p40o0P22l57
553A277o16n28K25k32p79k14L07k03r91K79M51l65j57M75L69k44K19L45L41L26
573B85O2n3O46L59l15p5J002l34r52N27M59q71n91L94l05p29l49L39j45o43R5
594a194o2M42l63m03P36L72m21J14J028J27n13M16Q55k24j83K65M60j50j43n6
614A103j45r1m35n04J91N3p73k41J58o4n89J38M20j32q50R66L00k99J11K76Q60
635D53q0k59O51L41R1m43N2P55p84j84O97o6p73k92M29n35n35j57M5ko21oJ25
658a098J76j14k38N45M40j50j84P58J44j97M70M61j75k91M40K87k72j17j69O2
678G78O8p67k09L62k84n30j25L82m77m08L70M1p30L90N37q4J14k0N70K22L18l46
$$ plain form
700 172 614 1105 736 699 981 1069 786 214 603 610 441 -30 225 -74 -461 -452 -363 -419 -901 -1034 -690 -776 -969
723 -969 -667 -623 -303 -311 -295 68 311 -38 481 638 723 418 949 828 922 468 508 698 496 157 246 74 -277
746 -277 -520 -618 -478 -1011 -864 -795 -607 -1013 -991 -478 -437 -509 -237 159 227 344 346 621 570 1108 792 736 899 414
770 414 601 441 717 115 329 71 -93 -215 -635 -301 -634 -1007 -989 -610 -831 -712 -530 -732 -306 -271 30
791 30 257 112 222 574 647 497 610 805 826 506 640 849 552 240 166 61 -294 -313 -78 -358 -579 -750
813 -750 -898 -657 -566 -578 -558 -526 -433 -260 25 60 -186 390 518 242 726 869 685 747 491 756 463 363 587
836 587 105 84 -66 -240 -188 -187 -471 -662 -905 -584 -600 -741 -410 -646 -576 -256 -448 83 21 335 379 342 622
859 622 477 337 512 480 244 728 383 27 2 141 -21 -205 -102 -478 -688 -548 -281 -397 -752 -300 -651
$$ packed form
700A72M42M91l69l7K82Q8k83n72L89Pj69m71K55k99l87RQ9n6m82j33L44q6j93
723i69L02M4L20qJ6L63K43l49N19J57Q5l05N31j21R4m54M0J90k02l39Q9j72l51
746b77k43r8J40n33J47O9J88m06K2N13M1p2K72L96O8J17KK75n1N38l16n6J63m85
770D14J87j60K76o02K14k58j64j22m20L34l33l73J8L79k21J19J82k02M26L5L01
791C0K27j45J10L52P3j50J13J95K1l20J34K09k97l12p4j05l55j9K35k80k21j71
813g50j48K41R1j2K0L2R3J73K85L5k46N76J28k76M84J43j84O2k56K65k93j00K24
836E87m82k1j50j74N2Jk84j91k43L21j6j41L31k36P0L20j92N31o2L14M4l7K80
859F22j45j40J75l2k36M84l45l56k5J39j62j84J03l76k10J40K67j16l55M52l51
$$ plain form
880 -651 -669 -383 -410 29 227 83 39 384 243 582 580 551 415 484 226 483 338 371 363 173 -127 9 -232 -231
904 -231 -195 -451 -698 -102 -408 -523 -291 -292 2 -336 -208 41 65 -14 320 224 469 523 295 389 398 329 534 133
928 133 157 413 177 151 -102 273 -144 -374 -362 -336 -610 -466 -664 -337 -6 -314 75 -310 -284 23 64 190
950 190 389 276 344 375 355 585 437 593 580 77 143 168 -25 289 -86 -69 -453 -119 -447 -365 -458 -311 -483
973 -483 -512 -317 -187 -243 -17 76 65 347 202 201 211 498 305 134 319 380 321 351 308 72 -238 -259 -346 -208 -133
998 -133 -125 -203 -314 -382 -547 -415 -370 -376 -25 -371 -54 -244 195 231 250 413 285 231 471 313 602 330 73 173
1022 173 287 149 166 -54 92 -169 -331 -28 -531 -384 -296 -495 -319 -176 -231 -209 -149 -82 -133 -89 -28 158 101
1045 101 230 450 390 379 329 385 199 360 221 109 160 119 89 -58 -222 -212 -155 -230 -331 -273 -441 -503 -81 -423
$$ packed form
880f51j8K86k7M39J98j44m4L45j41L39kk9j36O9k58K57j45L3qj90l00J36k41J
904b31L6k56k47N96l06j15K32jK94l38J28K49K4p9L34r6K45N4k28R4Ro9K05m01
928A33K4K56k36k6k53L75m17k30J2K6k74J44j98L27L31l08L89l85K6L07M1J26
950A90J99j13O8L1k0K30j48J56j3n03O6K5j93L14l75J7l84L34l28Q2r3J47j72
973d83k9J95J30n6K26R3j1K82j45jJ0K87j93j71J85O1n9L0m3k36l10k1q7J38P5
998a33Qp8j11o8j65J32M5oL51l46L17j90M39L6J9J63j28n4K40j58K89k72k57J00
1022A73J14j38J7k20J46k61j62L03n03J47Q8j99J76J43n5K2O0O7n1M4O1J86n7
1045A01J29K20o0j1n0N6j86J61j39j12N1m1l0j47j64J0N7p5j01N8j68o2M22l42
$$ plain form
1069 -423 -149 -143 78 -173 218 -144 236 157 472 289 148 640 497 103 124 348 270 157 2 159 38 -42
1091 -42 -170 -192 -131 -299 -134 -360 -162 -303 10 145 45 -128 191 -110 107 46 34 -24 426 248 168 183 210
1114 210 264 182 71 18 8 -36 -100 -115 -78 -34 -117 -312 -285 -295 -225 -215 -32 -200 -221 50 -66 -86 -286 249 294 -223
1140 -223 203 38 48 510 16 130 23 -65 195 -19 -192 112 -114 -109 54 -117 -190 -259 -132 -346 -122 -376
1162 -376 -98 -118 -41 -208 -106 25 252 94 -96 -54 143 20 134 110 -58 182 42 -43 102 -35 -222 98
1184 98 -157 -216 -152 -128 -103 -350 -122 -374 -67 -14 -81 -305 -46 -190 -115 -177 14 134 84 206 224 151 247 275 225
1209 225 4 503 -98 -60 -58 -103 4 -14 102 -35 -73 -133 -6 -111 -112 -10 54 86 -46 -142 -169 -38 104 -194
1233 -194 52 219 19 95 218 50 258 344 307 396 276 -144 -21 -131 -84 -9 -93 -307 -143 -68 -226 -110 -153
$$ packed form
1069d23K74OK21k51L91l62L80p9L15j83j41M92j43l94K1K24p8j13j55J57j21q0
1091d2j28k2O1j68J65k26J98j41L13J35j00j73L19l01K17o1j2n8M50j78q0J5K7
1114B10N4q2j11n3j0m4o4j5L7M4q3j95K7j0P0J0J83j68k1K71j16k0k00N35M5n17
1140b23M26j65J0M62m94J14j07q8K60k14j73L04k26NJ63j71p3o9J27k14K24k54
1162c76K78k0P7j67J02J31K27j58j90M2J97j23J14k4j68K40j40q5J45j37j87L20
1184I8k55n9O4K4K5k47K28k52L07N3o7k24K59j44P5o2J91J20n0J22J8p3R6K8n0
1209B25k21M99o01L8Km5J07j8J16j37l8o0J27j05jJ02O4L2j32r6k7J31J42k98
1233a94K46J67k00P6J23j68K08Q6l7Q9j20m20J23j10M7P5q4k14J64P5j58J16m3
$$ plain form
1256 -153 34 8 15 -200 -108 320 -102 -63 -33 166 5 200 40 76 223 16 21 -2 242 -75 321 -72 -55 -62
1280 -62 -184 -109 -133 -132 44 -38 -252 11 -82 -179 -99 -84 123 -103 -92 37 139 296 -96 186 166 210 138 243 53
1305 53 -124 14 -207 70 -113 -36 -159 -273 109 -510 43 -168 -328 -210 -66 -26 -78 -54 -27 -42 93 34 148
1328 148 254 -45 23 214 184 194 118 -56 135 -13 82 -80 -185 -88 -103 -26 -429 -213 -46 -162 55 3 -339
1351 -339 -86 -110 -70 -175 -107 -181 188 -88 320 46 -59 105 254 85 143 -157 359 89 8 189 100 -168
1373 -168 -205 205 -120 -61 -30 52 -59 -96 -310 -7 -230 -29 -355 -145 245 253 -17 -75 58 183 252 434 143
1396 143 67 265 162 223 -34 -293 -58 216 -40 133 -51 -200 -336 -378 -159 -162 -81 -224 -216 -294 -133 -108 -103 -118
1420 -118 -143 4 96 148 -40 180 286 73 -111 6 268 154 26 39 100 -9 -22 44 -280 -3 -365 -389 86
$$ packed form
1256a53J87k6Pk15R2M28m22L9L0J99j61J95j60L6J47k07Nk3K44l17L96l93J7p
1280f2j22P5k4JJ76q2k14K63r3r7Q0J5K07k26J1J29J02J57l92K82k0M4p2J05j90
1305E3j77J38k21K77j83P7j23j14L82o19N53k11j60J18J44M0n2K4K7j5J35n9J14
1328A48J06k99O8J91l0J0p6j74J91j48R5j62j05R7j5P7m03K16J67j16K17n2l42
1351c39K53k4M0j05O8p4L69k76M08k74j05J64J49j69N8l00N16k70q1J81q9k68
1373a68l7M10l25N9L1Q2j11l7k14L03k23K01l26K10L90Qk70n8J33J25O9J82k91
1396A43p6J98j03O1k57k59K35K74k56J73j84j49j36m2K19lQ1j43Qp8J61K5Nj5
1420a18k5J47R2N2j88K20J06k13j84J17K62j14j28J3O1j09j3O6l24K77l62k4M75
$$ plain form
1443 86 -174 156 -54 -78 125 -323 129 268 -23 -140 -120 -70 156 134 163 210 154 149 -37 115 135 267 -208 71
1467 71 60 -69 -157 -256 -257 -97 13 37 -60 13 0 6 46 -215 126 -19 91 269 13 2 132 -35 79 131 226
1492 226 218 144 111 119 -141 -54 255 170 104 -124 243 97 -116 -114 -117 -163 13 -133 -130 -301 -156 -9 -22 -40 72 144
1518 144 28 62 127 -19 27 5 -290 -63 231 308 -84 2 63 68 -93 -103 -234 -28 -219 -225 -110 35 -134 -32
1542 -32 2 -33 -77 -31 -172 -31 125 39 228 85 116 116 59 167 28 76 166 -115 121 125 193 52 -152 95 39
1567 39 -190 11 40 -295 -26 -169 -29 -28 -90 164 -102 58 124 147 -71 -94 -63 -51 50 97 201 105 110 135 25
1592 25 -147 89 -26 101 -76 -131 -131 -30 -169 200 -222 -207 -154 -101 -51 -79 -309 -150 258 334 137 187 172 -26
1616 -26 124 51 -66 178 7 46 28 182 129 -150 44 141 17 -52 -288 150 -135 -53 -63 -334 -303 -74 -126 332
$$ packed form
1443H6k60L30k10k4K03m48M52J39k91j17K0N0K26k2K9M7n6nj86J52K0J32m75K79
1467G1j1j29q8r9jJ60J10K4r7P3j3OM0k61L41j45J10J78k56j1J30j67J14N2R5
1492B26qp4l3Qk60Q7L09q5o6k28L67j46k13Klm6J76j46Lj71J45J47j3j8J12P2
1518A44j16L4O5j46M6k2k95K27K94P7l92Q6O1Nj61j0j31K06j91oJ15J45j69J02
1542c2L4l5m4M6j41J41J56q6J89j43L1%n7J08j39M8R0k81K36MO8j41k04K47n6
1567C9k29K01K9l35K69j43J40Jo2K54k66J60O6K3k18k3L1J2J01M7J04r6NK5j10
1592B5j72K36j15J27j77n5%J01j39L69m22J5N3N3N0k8k30J59M08P6j97N0j5j98
1616b6J50p3j17K44j71L9j8J54n3k79J94R7j24o9k36M38k85Q2j0k71L1K29n2M58
$$ plain form
1640 332 71 175 193 319 -5 25 55 405 113 28 263 -227 -270 165 -47 -93 165 251 -52 97 -44 -52 -38
1663 -38 -136 -189 -80 6 -50 -136 288 45 -255 10 -2 207 -85 222 10 303 50 353 135 37 33 6 90 -264
1687 -264 -174 -43 305 -225 -32 -122 -362 101 -137 -248 -115 72 22 -155 -10 -18 297 68 152 156 5 304 403
1710 403 116 133 133 60 216 178 11 -31 -141 -164 -191 32 -243 -13 -34 -172 -145 -306 -67 105 -6 -85 21 67
1734 67 -42 -140 -68 138 6 169 65 119 59 -52 32 9 244 -74 59 -126 -105 34 -56 -220 -141 247 -329
1757 -329 -59 -31 -229 -83 -157 -44 -37 56 46 -144 -260 85 148 -201 -64 103 46 387 115 -29 -41 -91 45
1780 45 113 112 190 9 -132 5 -54 -82 -179 -47 -318 5 147 -41 172 -10 -64 -44 12 147 11 114 -72 292
1804 292 105 24 10 79 194 310 -74 255 -51 -194 115 82 67 32 -105 -148 -270 327 -224 -101 85 145 106
$$ packed form
1640C32k61J04J8J26l24L0L0L50k92q5K35m90m3M35k12m6K58Q6l03J49j41qJ4
1663c8r8n3J09Q6n6q6M24k43l00K65j2K09k92L07k12K93k53L03k18r8mk7Q4l54
1687b64R0J31L48n30J93r0k40M63k38j11J33J87n0j77J45qL15k29Q4Mj51K99R9
1710D03k87J7%p3J56l8j67m2j10k3k7K23k75K30k1j38K7j61K39J72j11p9J06M6
1734F7j09r8P2K06j32J63j04N4o0j11Q4k3K35l18J33j85K1J39r0j64P9L88n76
1757c29K70K8j98J46p4J13PR3j0j90j16L45O3l49J37J67n7L41k72j44j2n0J36
1780D5O8jP8j81j41J37n9k8r7J32k71L23J42j88K13j82n4K0N6J35j36J03j86L64
1804B92j87q1j4O9J15J16l84L29l06j43L09l3j5l5j37m3j22N97n51J23J86O0l9
$$ plain form
1827 106 44 91 195 299 157 -76 74 -113 122 34 168 91 66 66 89 78 40 3 -21 154 -32 -48 -70 -46 27
1852 27 -148 -63 104 208 -175 -95 -2 -70 -65 217 251 -25 186 7 162 274 228 219 -11 228 138 176 -140 -203 149
1877 149 -39 -33 -209 -132 -214 122 -10 129 -119 166 -52 152 297 -240 212 -158 -150 -14 18 103 317 177 271
1900 271 -155 85 315 -185 22 -106 -172 -120 47 -95 -246 -206 -57 -187 9 -79 -79 -123 -137 203 54 -1 183
1923 183 230 177 139 -160 48 110 166 75 109 245 252 143 -110 -81 -91 -201 -21 -252 -10 -148 -253 184 -214 67
1947 67 -155 182 -110 -240 -152 -158 -225 -123 24 -192 288 7 -106 340 251 239 396 -177 -124 -129 -125 -58 -25 212 80
1972 80 36 370 -208 29 -106 -118 -179 -271 -181 115 -97 248 -250 146 61 102 218 -47 -65 -109 140 -283 -76
1995 -76 118 -36 -49 -28 101 -86 -164 -118 55 46 -110 10 -96 -311 -27 -79 -174 -24 232 72 -106 -185 -40
$$ packed form
1827A06o2M7J04J04j42k33J50j87K35q8J34p7k5%K3j1l8l7k4J75j86j6k2K4P3
1852B7j75Q5J67J04l83Q0R3o8NK82L4k76K11j79J55J12m6rk30K39r0L8l16o3L52
1877A49j88Oj76P7q2L36j32J39k48K85k18K04J45n37M52l70QJ36L2Q5K14j40R4
1900B71m26K40K30n00K07j28o6N2J67j42j51M0J49j30J96q8%m4j4L40j49n5J84
1923A83M7n3l8k99K08O2N6r1L4J36Pj09k53K9j0j10J80k31K42j38j05M37l98K81
1947F7k22L37k92j30Q8oo7J02J47k16M80k81j13M46q9j2J57n73N3nMO7L3K37j32
1972H0m4L34n78K37j35j2o1r2R0K96k12L45m98L96q5M1J16k65j8m4K49m23K07
1995g6J94j54j3K1J29j87p8M6J73rj56J20j06k15K84n2r5J50K56j60j78p9J45
$$ plain form
2018 -40 50 -2 -28 -139 153 100 -93 288 -42 49 210 -69 -49 22 -147 28 9 -157 -6 -129 -181 -309 -50
2041 -50 -2 134 -160 54 43 122 186 225 179 -139 -87 -319 274 235 173 216 37 262 -15 66 -4 -145 -246 -132
2065 -132 -249 -48 -72 101 -54 -30 -206 -79 -62 10 -253 -167 138 -102 -82 312 -121 -105 174 111 14 158 -18
2088 -18 -233 -39 117 196 -155 -9 116 39 -74 -251 187 172 32 39 -124 -84 -38 -172 -297 -55 146 51 54 70
2112 70 -19 191 9 -43 188 106 -7 73 -47 144 275 -218 -161 108 -101 5 -110 76 -221 -39 -39 186 182
2135 182 -14 -186 -91 -199 59 8 48 32 52 149 -99 114 167 -71 118 -43 119 139 -63 7 89 41 5 10 -147
2160 -147 -199 -31 -117 -114 -473 -196 -222 108 109 0 -65 -198 104 238 214 -205 41 -164 -4 -154 47 21 -81
2183 -81 164 268 123 -86 -176 -8 -110 -245 -30 -153 -173 14 -282 -42 127 78 -131 23 141 54 -49 270
$$ packed form
2018d0R0n2k6j11K92n3j93L81l30R1J61k79K0P1j69J75j9j66J51j23n2j28K59
2041e0M8J36k94K14j1P9O4L9m6l18N2k32N93l9o2M3j79K25k77Q1p0j41j01J14
2065a32j17K01k4J73j55K4j76J27J7P2k63Q6L05k40K0L94m33J6K79o3r7J44j76
2088a8k15J94J56P9l51J46J25p7j13j77M38j5j40Pj63M0M6j34j25K42K01r5LJ6
2112G0q9K10j82n2K31q2j13Q0j20J91J31m93N7K69k09J06j15J86k97J82%K25m
2135A82j96j72R5j08K58n1M0j6K0R7k48K13N3k38J89j61J62K0k02P0Q2m8l6Nj57
2160a47n2J68q6Ll59K77k6L30Jj09o5j33L02J34k4m19K46k05J60j50K01k6j02
2183h1K45J04j45k09r0J68j02j35K15j23k0J87k96K40J69m9k09J54J18q7j03L19
$$ plain form
2205 270 82 59 41 -30 207 162 219 -43 251 99 -120 147 147 43 131 185 88 47 -203 87 -5 -143 -105 -14 170
2230 170 -102 233 -167 -69 117 114 197 -22 150 235 328 -124 117 203 49 49 52 -28 -208 -133 92 280 -221 -29
2254 -29 -11 252 -145 -7 -80 -87 32 -30 59 -192 -84 99 92 238 140 164 -119 -188 172 -38 292 104 -100 281
2278 281 -38 209 -66 5 93 100 86 87 -109 24 132 -251 -203 -58 110 318 96 -272 129 28 -82 -281 -54
2301 -54 -177 240 -11 91 -92 233 83 -21 87 -1 67 27 65 -18 47 -174 53 54 -145 47 -59 29 -347
2324 -347 47 -8 -5 -132 -1 173 95 201 361 56 -126 188 47 190 -44 104 247 319 139 131 154 -20 -141
2347 -141 -118 53 232 -364 -76 61 56 -71 -115 -76 -67 77 -41 132 -152 -65 192 14 59 -109 261 111 205
2370 205 41 213 237 217 -88 -26 -17 -12 -38 -24 -3 -180 -26 12 -181 -50 -25 -95 -21 53 226 -202 -11 -263 -226
$$ packed form
2205B70j88k3j8p1K37m5N7k62K94j52k19K67%j04Q8N4r7m1k50K90r2j38L8R1J84
2230A70k72L35m00R8J86lQ3k19J72Q5R3m52K41Q6j54%Lq0j80P5K25J88n01J92
2254b9J8K63l97J38p3pJ19o2Q9k51J08J83pJ46r8K4k83o9L60k10L30j88k04L81
2278B81l19K47k75P1Q8Pj4Jj96J33J08l83M8J45J68K08k22l68M01j01j10j99K27
2301e4j23M17k51J02j83L25j50j04J08q8O8m0L8q3O5k21K27Jj99J92j06Q8l76
2324c47L94n5Lj27J31J74p8J06J60l05j82L14j41J43k34J48J43P2j80qK3j74j21
2347a41K3J71J79n96K88J37nj27m4L9RJ44j18J73k84Q7K57j78M5j68L70j50R4
2370B05j64J72K4k0l05O2RNk6J4K1j77J54L8j93J31K5p0P4P4J73m28J91k52L7
$$ plain form
2395 -226 -52 90 101 -93 9 87 -191 33 -240 10 47 -175 -155 -75 -138 -52 58 46 -188 53 117 -141 -36
2418 -36 -77 -146 0 -188 -158 -175 -3 4 162 -194 -47 -72 49 -94 144 -125 95 232 206 -97 -130 -82 237 -77
2442 -77 148 438 164 -72 -98 -15 179 -36 175 134 -148 -41 196 124 171 -32 165 -122 124 74 -140 -63 -8
2465 -8 313 -80 -70 77 -173 146 -138 -247 -276 -38 -67 -119 59 65 117 -125 -153 -55 -27 144 75 52 -177 68 136
2490 136 -124 47 -57 64 -18 -53 49 -125 118 438 -12 -134 178 264 95 -46 70 -144 -157 -24 -52 276
2512 276 147 46 -177 -16 79 38 35 -273 198 95 41 23 -39 59 127 -180 14 -82 182 25 -174 -8 5 142
2536 142 72 -117 -173 85 8 -50 -165 -16 46 24 95 42 -43 27 -44 75 -191 -10 15 127 32 40 100 -59 -5 -110
2562 -110 49 29 -141 61 176 87 36 41 90 -146 -151 -186 -333 38 105 23 167 18 157 167 -93 -9 -52 13 -168
$$ packed form
2395b26J74J42J1j94J02P8k78K24k73K50L7k22K0Q0o3Q6J10j2k34K41O4k58J05
2418c6m1o9J46j88L0j7J72PJ58l56J47k5J21j43K38k69K20J37k6l03l3M8L19l14
2442g7K25K90k74k36k6Q3J94k15K11m1k82J07K37p2M7k03J97k87K46n0k14P7N5
2465hL21l93J0J47k50L19k84j09k9K38k9n2J78ON2k42k8R8K8J71o9k3k29K45O8
2490A36k60J71j04J21q2l5J02j74K43L20m50j22L12Q6j69j41J16k14j3J33k8L28
2512B76j29j01k23J61R5m1ll08M71j03n4j8o2R8O8l07J94r6K64j57j99J66J3J37
2536A42p0j89n6K58p7n8j15J49O2k2P1n3q5P0p1J19k66J81K5J12r5QO0j59N4j05
2562a10J59k0j70K02J15q9n1NM9k36nl5j47L71O7q2J44j49J39J0k60Q4m3O5j81
$$ plain form
2587 -168 -67 -66 78 103 161 -169 -101 -137 110 -193 154 -145 131 -156 -143 32 -67 5 -165 152 -52 -67 24 89
2611 89 -95 -59 398 22 31 53 -109 7 -6 104 -67 -176 -19 -121 -323 2 -277 305 -32 192 -59 24
2633 24 225 31 192 59 215 -135 -14 -164 175 -4 -182 157 10 157 134 -160 11 138 55 -8 -164
2654 -164 175 -185 134 -105 208 -124 -47 256 154 5 46 -80 251 -15 53 14 -254 -15 161 130 165 -1
2676 -1 -92 167 142 46 -182 211 -54 161 -49 -67 -50 -194 -153 -43 -57 -44 -102 -201 24 68 -145 293 201 -269 108
2701 108 -92 -133 -102 125 59 -45 197 47 81 216 164 -118 -99 -12 -6 101 19 79 -143 25 -138 122 94 200
2725 200 35 -187 217 -43 -101 81 13 161 -133 113 -143 58 71 -5 120 19 -160 77 249 -53 -97 -140
2747 -140 -129 -113 -227 -41 34 2 -54 70 165 101 -64 -324 -15 9 -23 129 -95 -33 -75 -156 -236 27 210 1
$$ packed form
2587a68J01JJ44K5N8l30O8l6K47l03L47k99K76k87J3J75r9P2j70L17k04j5R1O5
2611H9j84L6M57l76RK2j62J16j3J10j71j09J57j02k02L25k79N82l37K24k51Q3
2633B4K01j94J61j33J56l50J21j50L39j79j78L39j47J47k3k94J71J27q3o3j56
2654a64L39l60L19k39L13l32P7L03j02j49M1j26L31k66O8l9k68K39J76l1L5j66
2676ar1K59k5r6k28L93k65K15k10j8J7j44M1J10j4J3n8r9K25M4k13M38r2m70L77
2701A08k00m1L1K27o6j04K42j50L4J35n2k82J9Q7OJ07q2O0k22J68j63K60k8J06
2725B00j65k22M04k60n8J82o8J48k94K46k56K01J3p6J25j01j79K37J72l02m4m3
2747a40J1J6j14J86P5l2n6J24R5o4j65k60L09K4l2J52k24O2m2q1q0K63J83k09
$$ plain form
2771 1 252 104 15 -91 -182 192 -18 0 31 -8 83 -47 -146 -125 -25 14 190 -121 23 181 -9 94 206 294
2795 294 154 -54 -163 -79 -90 48 72 106 -76 -250 127 210 -330 -22 -24 194 165 -1 -4 -83 67 -106 245 -196
2819 -196 28 16 -123 -84 84 -12 -37 -150 196 -108 21 0 108 -11 151 157 100 153 19 179 -142 6 79
2842 79 16 192 -6 -138 -85 -405 176 -18 -45 155 136 -117 -36 108 92 -77 96 136 -61 107 -214 -22 -52
2865 -52 29 93 209 164 5 65 -266 -25 72 120 -51 147 63 -100 288 122 -58 -3 12 20 185 107 16 -2 45
2890 45 72 -82 -146 -142 179 19 206 -40 -252 -10 74 197 -65 74 225 -129 -89 135 66 -112 150 77 89
2913 89 78 40 186 94 4 49 -39 -137 33 73 -242 -25 -329 248 -225 -77 -62 -39 74 109 -167 -69 121 -217
2937 -217 29 -291 270 -163 219 -64 2 -37 -76 -3 5 62 57 -4 -42 2 35 -21 5 -11 129 -33 -15 55 -65 166
$$ packed form
2771AK51j48q9j06r1L74k10J8L1l9R1j30r9K1J00L9J76l11J44J58j90J03J12Q8
2795B94j40k08j09Q4j1J38K4L4j82j74L77Q3n40L08kK18k9j66lp9J50j73L51m41
2819a96K24j2j39L9J68r6k5j13L46l04J29k1J08j19J62On7N3j34J60l21J48P3
2842G9o3J76j98j32N3l20N81j94k7K00j9k53Q1J44j6j69J73M0j97J68l21J92l0
2865e2Q1O4J16m5j59O0l31K41R7M8j71J98q4j63L88j66j80N5J5QJ65p8r1j8M7
2890D5K7j54o4ML21j60J87k46k12K42Q4J23k62J39J51l54M0K24o9j78K62p3J2
2913H9j1l8J46r2r0M5q8r8J70M0l15K17l04N77m73J48J5K3J13L5k76R8J90l38
2937b17K46l20N61m33L82k83O6l9l9P3QN7no1l8M4L3n6K6j6J40j62J8P0j20K31
$$ plain form
2963 166 -223 -61 -24 -68 -118 153 -24 -205 -185 43 30 -68 -81 113 167 -72 54 123 131 -250 -144 -152 118 -149
2987 -149 -195 -100 146 96 -67 22 -107 45 92 -70 -110 -143 193 -160 -160 34 -201 -73 114 0 148 -143 -20
3010 -20 30 93 89 126 142 116 86 -80 -34 144 -45 -146 -138 43 175 -150 111 73 -94 -1 -155 -25 -227 -84 162
3035 162 -191 -9 -43 71 307 -3 20 226 57 83 364 267 174 -108 -159 81 157 -77 -243 225 2 75 53
3058 53 99 -71 -41 -19 -77 40 4 -28 42 11 149 -10 -232 9 -15 16 -162 141 -20 79 -31 21 -63 -176 -124
3083 -124 13 -63 -66 46 261 92 -139 217 192 71 -43 -5 -76 -139 51 -215 -88 8 184 346 -148 81 188
3106 188 146 157 -278 151 53 71 31 -55 80 -48 195 107 46 -56 132 -43 -241 -53 -95 -65 -191 -69 -92 -532
3130 -532 62 9 -71 272 -18 -74 143 141 -76 -95 13 153 56 -132 3 242 -68 109 14 48 45 -2 150 -14
$$ packed form
2963A66l89J62L7m4n0K71j77j81K0K28j3r8j3J94N4k39J26O9Ql81J06qK70k67
2987a49m6R5K46n0j63Q9j29J52M7j62m0l3L36l53%J94k35J28J87j14J48k91J23
3010b0N0O3mL7J6k6l0j66M6J78j89j01QJ81J32l25K61l8j67R3j54J30k02J43K46
3035A62l53J82l4J14K36l10K3K06j69K6K81r7r3k82n1K40P6k34j66M68k23P3k2
3058E3M6j70L0K2n8J17l6l2P0l1J38j59k22K41k4L1j78L03j61R9j10N2q4j13N2
3083a24J37p6lJ12K15j69k31L56k5j21j14L8p1o3J90k66J27R6J76J62m94K29J07
3106A88m2J1m35M29r8J8m0q6J35j28K43q8o1j02J88j75j98J88m2L0j26J22k3m40
3130e32N94n3q0L43k90n6K17kk17j9J08J40r7j88J35K39l10J77r5L4lm7J52j64
$$ plain form
3154 -14 178 25 123 -116 131 -141 -112 -57 -120 50 -184 257 61 164 -16 100 105 39 125 -53 -200 -80 19
3177 19 127 61 -3 80 -60 -14 -13 8 -103 55 -10 -11 179 -172 161 112 -52 24 -148 46 -56 95 -79 -354
3201 -354 223 -5 -128 87 2 183 -5 292 -41 219 -122 -100 -284 49 -133 -85 2 -168 -179 97 -6 -65
3223 -65 68 113 -63 -78 -85 189 101 130 122 -2 108 -51 -118 -220 35 74 138 -98 -289 121 -3 60 -203 89
3247 89 199 -122 -50 -104 39 -82 -91 -79 105 148 -192 77 58 148 -2 87 134 -82 95 -132 -188 -30 265 23
3271 23 23 131 -29 -109 -4 -73 -175 98 -40 -101 -177 60 -93 268 -117 7 152 79 119 -148 -38 -28 94
3294 94 51 315 -140 356 305 -36 -20 98 -49 57 -196 -160 -67 111 21 121 2 135 -222 96 -184 -145 -35
3317 -35 142 323 -63 -41 128 205 31 -96 -69 -185 124 -174 -65 -320 105 -129 71 -13 19 -163 -149 14
$$ packed form
3154a4J92j53R8k39K47k72K9N5o3J70k34M41j96J03j80J16No6Q6j78j47J20R9
3177A9J08o6o4Q3j40M6JK1j11J58o5jJ90l51L33m9j64P6j72J94j02J51j74k75
3201c54N77k28j23K15q5J81j88K97l33K60l41K2j84L33j82M8Q7j70j1K76j03n9
3223f5J33M5j76j5pK74q8K9qj24J10j59o7j02K55L9O4k36j91M10j24O3k63K92
3247H9J10l21P2n4J43j21rJ2J84M3l40K69j9R0j50Q9M7k16J77k27n6J58K95k42
3271B3%J08j60q0J05o9j02K73j38o1p6K37j53L61l85J24J45p3M0k67J10J0J22
3294I4m3K64m55M96n1l41J6J18j47J06k53L6R3J78r0J00j19J33l57L18k80L9J10
3317c5J77J81l86K2J69P7j74j27K7j16L09k98J09k55M25k34K00q4L2j82J4J63
$$ plain form
3339 14 214 -182 -121 46 -213 -59 -230 -4 -4 -101 54 247 23 28 75 -25 -20 -51 -191 257 58 -70 127 12
3363 12 -106 -135 -75 88 -138 123 150 -24 -131 -182 150 9 262 36 -88 67 -206 83 145 79 81 -20 -411
3386 -411 -5 -153 67 80 -81 157 45 63 -157 129 -262 -93 47 -139 28 143 -191 -136 -76 -156 71 78
3408 78 -57 -87 77 41 216 -29 -35 -183 129 76 -54 -66 -78 -133 106 271 -213 -147 188 85 261 172 -31 190
3432 190 -69 101 333 -104 89 -27 113 -175 103 -28 21 240 -58 -47 -80 101 105 -144 -139 42 115 -40 -7
3455 -7 368 70 159 68 -200 -13 -8 70 300 34 80 -21 73 135 -183 -41 -181 -81 65 -198 149 -384 54
3478 54 -183 -8 -65 47 27 48 88 8 184 63 -7 -82 12 -116 178 -207 57 217 -192 -75 24 -40 64 28
3502 28 91 373 -123 -138 46 92 -119 128 98 -158 327 -9 163 122 -73 -153 37 -22 11 -76 -71 101 -83 45
$$ packed form
3339A4K00l96O1J67k59J54j71K26%r7J55J93k24NM7j00Nl1j40M48j99j28J97j15
3363A2j18k9O0J63k26K61K7j74j07n1L32j41K53k26j24J55k73K89O2o6Kj01l91
3386d11M06j48K20J3j61K38j12J8k20K86l91J69J40j86J67J15l34N5O0q0K27P
3408G8j35l0J64l6J75k45oj48L12n3j30j2j2n5K39J65m84O6L35j03J76q9k03K21
3432A90k59J70K32m37J93j16J40k88K78j31M9K19k98J1l3J81Mk49NJ81P3j55L3
3455gL75k98Q9r1k68J87NP8K30k66M6j01R4O2l18J42j40J00J46k63L47n33M38
3478E4k37J75n7J12k0K1M0q0J76j21p0p5R4j28K94l85K64J60m09J17R9o4J04l6
3502B8O3K82m96j5J84M6k11K47l0k56M85l36J72m1j95q0J90n9L3q7NJ72j84J28
$$ plain form
3526 45 173 -330 -194 -138 180 49 41 -25 -117 218 -107 84 -32 -56 81 -73 46 158 -116 246 46 136 133
3549 133 -14 212 37 166 -167 -201 142 -216 -133 31 -121 107 35 96 234 172 78 -84 16 33 -273 30
3571 30 -33 14 -188 76 297 -33 113 115 294 -64 80 329 50 44 -121 -69 41 -56 -25 120 12 -9 -22 147
3595 147 186 122 -125 -177 -145 -73 38 69 -65 -4 -54 63 -33 149 -86 -85 157 117 240 -219 42 171 -39 -8
3619 -8 -50 162 250 -50 -59 43 65 78 -167 -39 -19 50 307 95 141 69 -270 -161 234 -443 -38 -106 96 150 209
3644 209 49 51 223 65 -188 -10 -250 112 35 57 8 -97 -193 -58 68 72 90 -46 105 36 -149 -16 159
3667 159 161 94 -191 199 57 -87 124 -66 47 50 -136 64 -289 44 8 -83 -188 106 17 42 -94 -74 -79 -140
3691 -140 58 -20 -40 -72 4 -383 93 -73 -173 71 15 109 106 180 455 -198 48 59 -2 -3 -6 -13 204 -56 -123 160
$$ packed form
3526D5J28n03J36N6L18j31qo6r2L35l25J91j16k4J37j54J19J12k74L62k00R0l
3549A33j47K26j75J29l33l4L43l58Q3J64j52K28p2O1J38o2r4j62J00J7l06L03
3571C0o3M7k02K64K21l30J46KJ79l58J44K49k79oj65N2J10r7L1J45j08k1j3J69
3595A47L9o4k47n2L2P2J11L1j34O1n0J17r6J82k35JK42m0J23m59K61J29k10L1
3619hm2K12Q8l00rJ02K2J3k45J28K0O9K57k12M6p2l39J09L95o77M05o8K02N4N9
3644B09j60KJ72j58k53J78k40L62p7K2m9j05r6J35J26MJ8j36J51o9j85J33J75
3667A59Ko7k85L90j42j44K11j90J13Lj86K00l53L33l6r1j05K94q9K5j36K0no1
3691a40J98p8k0l2P6l87M76j66j00K44n6R4lP4K75o53K46J1o1jlpK17k60o7K83
$$ plain form
3717 160 -76 -127 -137 -49 -42 119 -17 -15 -161 127 117 29 27 -18 147 38 10 -325 -232 38 -115 200 -106 -63 209
3742 209 -34 185 72 150 -72 -48 -95 -264 205 -77 -46 -137 5 213 -58 -115 21 -268 222 19 -147 150
3764 150 155 -10 -47 226 -34 173 -10 64 -77 43 -160 103 37 -94 -32 28 104 60 -33 97 -108 1 -34 284
3788 284 262 -126 158 39 -116 -224 120 95 -87 37 12 131 -35 -94 128 43 125 -193 -109 139 30 -108
3810 -108 57 178 -69 104 54 -61 -306 -117 73 85 -268 -103 -124 -159 133 -164 -30 34 -140 44 -10 50
3832 50 312 100 -81 -140 184 242 -120 383 -95 44 141 -38 -39 301 33 -10 64 -182 -75 76 -42 50 218
3855 218 61 46 -15 -94 204 -272 44 -41 83 14 123 -72 59 167 -125 191 -162 -71 186 221 -186 -59
3877 -59 4 -70 -137 -6 -133 125 -23 59 104 -65 93 15 128 152 77 108 -63 -95 -66 0 35 307 -46 -125 -151
$$ packed form
3717A60k36n1j0Q8PJ61j36Kj46K88j0q8km5J65j09k8l35R3K70j53L15l06M3K72
3742B09k43K19j13P8k22K4m7j69M69k82L1r1J42K08k71n7J36k89M90k03j66K97
3764A50Nj65l7K73k60K07j83P4j41J20k03K63o6j31O2O0P6m4r3J30k05J09l5L18
3788B84k2l88K84j19j55j08L44k5j82J24k5J19j66n9K22q5Q2l18Q4K48j09j38
3810a08J65J21k47J73n0j15k45J89J90J2l53J65k1l5K92k97J34O4j74J84n4O0
3832E0K62k12j81n9L24N8l62N03m78J39R7j79jL40k68m3P4k46J07J51j18R2J68
3855B18j57j5o1p9K98m76L16q5J24o9J09j95J31J08k92L16l53R1K57L5m07J27
3877e9O3p4o7J31j27K58j48Q2M5j69J58p8J13K4p5L1j71l2K9O6L5K72l53p9k6
$$ plain form
3902 -151 21 169 -158 -160 -196 33 -190 36 -246 126 269 -168 136 22 125 -13 181 -96 245 -10 -162
3923 -162 92 50 132 -190 35 76 -42 18 -14 231 -88 8 82 56 47 -90 -105 128 -112 168 -32 -85 -143 -191 38
3948 38 -95 -171 43 -84 51 25 110 22 -155 -172 110 -204 123 36 -120 227 87 -163 11 -10 22 53 64 144
3972 144 -230 149 -140 250 21 -35 153 -74 100 -137 169 154 186 -52 74 180 -125 294 3 -14 -137
3993 -137 -74 28 -10 50 -77 -70 -155 228 -40 -65 -161 18 -245 -113 -56 66 94 32 -196 55 -47 -35 179 -150
4017 -150 -48 52 140 242 134 63 65 -22 -19 -22 -196 -121 -273 70 -60 -88 63 52 110 -29 101 -69 38 50 79
4042 79 -465 132 -38 42 44 313 -55 164 19 -167 42 142 79 24 200 -51 42 -82 -154 -153 -45 26 -46 25
4066 25 -44 -28 26 -14 -161 -266 139 -222 -228 -119 225 162 200 58 -32 -216 -78 -7 -210 -27 -34 -66 136 10 75
$$ packed form
3902a51J72J48l27kl6K29k23K26k82L72J43m37L04j14J03j38J94k77L41k55j52
3923a62K54m2Q2l22K25M1j18O0l2K45l19R6P4k6rj37j5K33k40K80k00n3n8m8K29
3948C8j33p6K14j27J35k6Q5q8j77j7K82l14L27q7j56L47j40k50J74k1L2L1J1Q0
3972A44l74L79k89L90k29n6J88k27J74k37L06j5L2k38J26J06l05M19k91j7j23
3993a37O3J02l8O0j27Pq5L83k68k5r6J79k63J32N7J22K8o2k28K51j02J2K14l29
4017a50J02J00Q8J02j08p1Kq7Llj74P5j52L43j30k8J51j1N8j39J30j70J07J2K9
4042G9n44N97j70Q0KK69l68K19j45j86K09J00o3n5J76k51R3j24p2JJ08P1p2P1
4066B5o9J6N4m0j47j05M05l61oJ09L44o3L8j42r0j84J38P1k03J83pl2K02j26O5
$$ plain form
4091 75 168 303 90 -62 -27 164 -95 -399 -10 228 42 77 -96 -2 39 -125 194 16 -52 150 -131 217
4113 217 -7 234 -54 50 27 211 155 -86 -93 103 -227 59 -110 -21 128 -7 -167 -253 -3 -52 -4 319 -130
4136 -130 190 12 50 -229 -49 -38 -157 165 -118 95 75 -88 23 28 138 96 -32 137 -48 150 104 -140
4158 -140 -218 120 190 -97 184 62 -19 25 18 -2 0 -31 158 -23 -193 30 -117 55 -23 169 -63 132 59 185
4182 185 -16 -131 -115 -306 -99 -212 -153 -27 61 -14 14 -10 63 -326 53 176 71 -23 151 0 47 29 -63 -82
4206 -82 90 -13 394 -27 116 167 200 209 156 52 -202 188 49 -45 56 63 -95 -212 -51 161 -180 87 96 -39
4230 -39 43 -136 69 209 88 60 -100 -153 55 3 29 -37 219 -29 1 -23 100 208 61 33 48 18 -9 78 75
4255 75 142 -40 -141 45 -142 -103 -305 14 171 -133 94 -38 59 -108 57 -234 156 -157 -117 -73 117 153
$$ packed form
4091G5R3J35k13j52L5J91k59l04L89K38j86L5j73R4M1j64L19j78o8K02k81L48
4113B17k24K41k88J04k3J84n6k41pJ96l30K86j69Q9J49j35j60q6K50m9M8L23m49
4136a30L20j78L8k79J80J1j19L22k83K13k0j63J11NJ10m2j28J69j85J98m6k44
4158a40p8L38P0k87K81j22q1M4pk0Kl1J89j81j70K23j47J72p8J92k32J95p3J26
4182A85k01j15J6j91K07j13N9J26Q8p5K8k4P3l89L79J23j05r4J74j51M7j8r2j9
4206h2J72j03M07m21J43N1L3Rn3j04k54L90j39r4J01Pj58j17J61K12l41K67Rj35
4230c9Q2j79K05J40j21k8j60n3K08n2K6o6K56k48L0k4J23J08j47k8J5l0k7Q7l
4255G5O7j82j01J86j87L9k02L19J57l04K27j32R7j67J65k91L90l13M0M4J90L6
$$ plain form
4277 153 181 59 -83 -33 -138 -1 29 149 -122 123 -23 -12 -34 76 106 25 37 169 -8 83 112 -20 -143
4300 -143 -81 5 -46 -80 137 147 -64 -20 -264 -77 59 -240 -45 88 -131 1 -97 -239 -83 -86 -57 -113 148 201
4324 201 95 -173 -340 -13 251 80 -3 -126 -43 0 19 -32 -122 0 -94 -114 -235 -154 -410 -39 5 122 15
4347 15 -57 -74 88 110 -115 -6 -22 227 -135 -53 -288 111 157 -82 276 -119 20 -98 1 66 249 -48 92
4370 92 -155 209 233 230 -8 -206 -64 147 -65 -54 -341 -109 123 262 -122 -117 -49 -75 -163 -48 65 -146 -244 -111
4394 -111 -63 24 -19 -35 21 320 -93 -304 -53 73 -18 -361 170 -269 -90 -76 -34 67 -158 -72 -30 -104 -28 -201
4418 -201 -142 -71 -48 112 207 134 11 92 9 -10 39 -6 -5 -52 130 -106 53 217 208 175 -82 -124 -67 107 -48 -73
4444 -73 -10 -107 -8 -3 65 102 -103 -22 141 -24 10 -68 -69 -38 43 206 -361 -85 81 -55 58 74 268 47 -109
$$ packed form
4277A53K8j22j42N0j05J37L0J20k71K45j46J1k2J10L0q1J2J32j77R1K9j32j23
4300a43O2Q6n1l4K17J0k11M4k44J87J36k99J95J33k19J32r8j42J56lK9n6K61N3
4324B01j06k68j67L27K64j71q3j23Q3M3J9n1r0J22r4k0j21Q1k56L71M4J17j07
4347A5p2j7J62K2k25J09j6K49l62Q2k35L99M6k39L58l95J39j18R9O5J83k97J40
4370I2k47L64K4lk38j98J42K11k12J1k87K32K32J39l84NO8k6q8J15J13k11r8J33
4394a11M8Q7m3j6N6K99m13k11K51J26r1l43N31m39J79J4M2J01k25Q6M2p4P6j73
4418b01N9P1K3J60R5p3j23Q1q3j9M9m5Jm7J82k36J59J64rl3k57m2N7J74j55k5
4444g3O3r7R9NO8L7k05Q1J63j65L4p8jL1Q1J63n67K76J66j36J13J6J94k21j56
$$ plain form
4469 -109 71 49 -173 -98 -92 -92 34 -52 -237 -110 -124 -148 -250 121 -120 -130 3 -45 -191 -117 56 -63 145 -141
4493 -141 67 7 23 -28 140 70 -60 -72 -97 192 -125 172 -86 -98 108 -35 -8 -77 -2 137 305 149 -200
4516 -200 101 179 15 -75 151 -7 -185 128 -79 85 122 -168 176 -268 -159 -176 -273 -157 -62 -289 -170 65
4538 65 -6 -125 25 33 -148 104 -171 74 244 -15 -192 -116 147 -178 6 153 44 236 174 -233 15 96
4560 96 -22 108 -57 13 0 -49 80 -53 208 36 258 -9 -137 -213 43 -126 -51 -103 83 -144 -74 -97 167
4583 167 8 -99 -48 -99 79 -8 111 -50 -79 -125 -86 318 -55 -14 56 -109 -4 112 -17 11 213 -245 -341
4606 -341 -123 -236 76 -225 88 86 12 -96 43 -68 -327 -97 68 101 -240 -110 -100 -97 -48 -18 -26 22 148 68
4630 68 74 56 36 -89 148 80 -1 50 -189 130 -149 -194 -3 346 -85 10 -213 -84 -12 -126 119 -158 -227 122
$$ packed form
4469a09J80k2k22P5O%J26q6j85J27j4k4j02L71k41j0J33m8j46P4J73j19K08k86
4493a41K08o0J6n1J68p0j30j2k5K89l17K97k58j2K06j43K7o9P5J39J68j56l49
4516b00L01P8j64r0K26j58j78L13k07J64L7k90L44m44J09j7r7J16R5k27J19K35
4538F5p1j19J50Qj81K52k75K45J70k59j77P6K63l25J84J47j09J92o2m07K48Q1
4560I6j18J30j65P0j3m9J29j33K61j72K22k67j28p6K56j69P5n2J86k27P0k3K64
4583A67j59j07N1n1J78q7J19j61k9m6L9M04l73M1P0j65J05J16j29K8K02m58r6
4606c41K18j13L12l01L13kp4j08J39j11k59K30J65L3l41J30J0LM9L0qM8J26q0
4630F8Oj8k0j25K37o8q1N1k39L19k79m5J91L49m31R5k23J29P2j14K45k77o9L49
$$ plain form
4654 122 70 -92 -138 120 112 59 -22 -22 15 -30 -107 -159 -122 47 22 24 -42 -177 -88 -134 -114 -151 19 -140 182 147 -37
4681 -37 -27 107 120 127 179 100 190 0 -47 -89 15 18 122 123 -50 87 -40 -196 100 -101 -171 85 150 -4 0 -9 -81
4708 -81 228 -69 -71 -261 -34 110 125 32 142 -193 -163 259 -90 -52 -208 26 78 285 16 0 -131 186 -94
4731 -94 -56 2 122 -6 27 318 -15 42 -53 -209 -30 -107 18 -145 49 274 131 -298 144 79 -86 -194 -132
4754 -132 5 413 -240 223 57 -152 58 -152 73 -256 -25 33 123 -135 25 69 -72 -21 129 -176 16
4775 16 -149 38 -250 57 262 225 88 55 119 99 -195 209 95 -95 -278 -119 95 77 -76 -11 -1 -137 -34
4798 -34 -283 137 -5 -114 97 111 169 -60 21 -88 -114 108 76 199 122 44 -69 195 65 -202 -102 57 101
4821 101 437 111 53 59 265 -79 -48 -49 -135 -141 101 -226 -13 112 142 -353 -279 8 -90 120 -102 80 166 -165
$$ packed form
4654A22n2j62m6K58qn3q1%L7m5p7n2L7J69k5Ko6j35Q9m6K0l7J70j59L22l5j84
4681c7J0J34J3PN2p9R0j90m7m2J04LJ04Jj73J37j27j56K96k01p0K56O5j54Mrp2
4708h1L09k97kj90K27J44J5r3J10l35L0M22l49L8j56K34N2K07k69j6j31L17k80
4731i4L8N8J20j28L3K91l33N7r5j56J79p7J25j63J94K25j43m29M42o5j65j08O2
4754a32J37M08o53M63j66k09K10k10K25l29K31N8R0k58J60M4j41N1J50l05J92
4775A6j65J87k88L07K05l7j37l3O4k0k94M04j14j90j83J59K14j8j53O5J0j36J03
4798c4k49M20j42j09K11J4N8k29Q1j09k6K22l2J23p7p8j13K64j30k67J00J59M4
4821A01L36l26n8OK06l44L1jq6oK42l27K13J25L0m95P4K87r8K10k22J82Q6l31
$$ plain form
4845 -165 244 125 -96 116 -33 18 -188 71 67 200 -23 -4 46 -229 -59 -122 101 51 -214 119 176 247 -119
4868 -119 -14 91 33 158 -276 161 -93 -237 -130 -220 85 -3 -178 19 -322 -263 168 -52 22 -4 -79 65
4890 65 70 -250 92 -69 -193 -14 120 -334 72 -115 39 51 196 76 -117 -96 -14 -27 87 204 -23 109
4912 109 -170 -47 -8 -21 0 30 5 76 -22 151 170 128 71 -219 -80 -214 -128 -6 235 -47 -273 -64 -10 -189
4936 -189 -131 17 -75 -161 -7 89 10 -10 -4 117 -278 76 64 -175 -14 180 -39 8 -34 -54 24 224 5 -227
4960 -227 -167 -77 -12 222 88 6 -41 -40 -67 71 119 38 -68 -197 -41 45 116 -202 34 94 93 10 -107 -173 60 -70
4986 -70 -101 -50 146 -75 -122 -49 -60 25 29 160 -190 -224 183 108 18 55 267 110 104 -16 157 -19 -23 -83 8 189
5012 189 51 236 126 43 256 27 -5 57 -95 -189 -30 -20 -37 -10 -247 -110 82 -82 -44 9 95 -231 -178 -148
$$ packed form
4845a65M09j19k21K12j49N1k06K59mJ33k23J9N0k75J70o3K23n0k65L33N7P1l66
4868a19J05J05n8J25m34M37k54j44J07r0L05q8j75J97l41N9M31k20P4k6p5J44
4890F5Nl20L42j61j24J79J34m54M06j87J54J2J45j20j93K1Q2j3J14J17k27J32
4912A09k79J23L9j3K1L0k5P1r8J73J9m2n7k90J39j34Q6J22K41k82k26K09N4j79
4936a89N8J48r2q6J54R6p9k0OJ21l95L54j2k39J61J94k19M7m2k0P8K00k19k32
4960b27O0R0O5K34j34q2m7Jk7J38M8q1j06j29J56Q6P1l18K36O0jq3j17o6K33j30
4986g0l1N1J96k21m7P3j1Q5MJ31l50l4M07p5r0L7K12j57oj20J73j76mo0R1J81
5012A89j38J85j10q3K13k29l2O2j52r4J59J0j7K7k37J37J92j64L8N3Q6l26N3L0
$$ plain form
5036 -148 12 -17 -92 -45 -35 -43 -11 21 -218 207 -40 -52 -205 95 -75 -26 120 -76 -73 -55 108 -12 -26 37 -20
5061 -20 3 201 27 -123 88 -116 -140 -74 -284 -121 -151 58 -89 -185 -132 28 -38 -368 54 -150 -36 237 117
5084 117 74 -9 60 -63 -172 65 -160 -55 5 -124 81 -58 47 173 280 -65 106 -1 12 75 142 -141
5106 -141 22 -32 185 -118 15 -301 -16 94 -144 218 261 -134 -100 -104 35 -143 -5 75 122 71 -28 -67 -305
5129 -305 111 151 -66 -26 20 -4 76 96 -262 -51 79 57 -11 -7 -121 -196 -172 34 27 -11 58 -230 220 113 -316
5154 -316 277 -44 55 114 -93 -164 19 -108 -64 -184 117 69 2 17 224 -48 -108 -227 0 74 -108 72 121
5177 121 10 47 -87 110 -10 -79 -36 32 -182 343 -39 142 54 164 6 180 155 -140 -156 3 -20 -74 -70 -102
5201 -102 -111 -153 -76 107 36 -140 16 20 -115 164 73 -76 -95 -28 96 13 287 128 127 -102 -69 -144 -202 -110 73 -67
$$ packed form
5036a48J60k9p5M7J0qL2L2k39M25k47j2j53L00j70M9J46j96LJ8J63j20j4O3n7
5061b0K3J98j74j50K11k04k4O6k10J63l0K09j47r6N3J60o6l30M22k04J14K73j20
5084A17m3q3O9j23j09K37k25J05O0j29K05j39J05J26J07l45J71j07J3O3O7k83
5106a41J63n4K17l03J33l16K85J10k38L62M3l95L4mJ39j78J38Q0M7n1r9l9k38
5129c05M16M0k17M0M6k4Q0K0l58K11J30k2o8Mj14p5K4K06pl8O9k88M50j07m29
5154c16N93l21R9N9k07p1J83j27M4j20L01m8o7J5K07k72o0j19K27P4j82J80M9
5177A21j11L7j34J97j20o9M3O8k14N25l82J81q8J10j58J74k5k95j6J59k3n4Ml2
5201a02rm2P7J83p1j76J56Mj35K79r1j49j9O7J24q3K74j59jk29L3p5n8R2J83j40
$$ plain form
5227 -67 197 -194 160 174 88 169 156 29 75 163 -144 -117 192 -245 -126 29 -68 106 -252 13 -257 136 -33
5250 -33 -104 -1 24 180 -71 -164 -32 -111 27 -54 -281 -185 -46 148 -59 219 -337 179 -49 96 -128 96
5272 96 -155 -180 197 -153 187 11 -106 -49 24 128 -149 3 -162 206 89 62 226 21 -11 185 -203 -60
5294 -60 -73 169 70 -146 -106 99 146 90 30 174 33 189 203 21 114 77 -17 95 16 62 -14 30 -32 -29 102 -188
5320 -188 16 191 28 139 2 -104 54 147 207 31 -40 -326 118 -75 -144 4 -39 -14 -170 144 -35 26
5342 26 -24 -35 -41 -189 -199 -129 177 16 -218 -117 16 50 -116 -65 21 71 106 -113 -230 -79 -4 137 -55 57
5366 57 -116 -298 -69 124 61 83 -97 47 -65 -85 0 -81 86 -234 48 -64 -113 72 -80 -65 70 334 117
5389 117 -129 -44 -218 231 138 117 24 -110 -29 53 205 -59 90 74 -32 342 84 183 -223 -135 -45 62 -143
$$ packed form
5227f7K64l91L54J4q6Q1j3j27M6Q8l07K7L09m37J19J55r7J74l58K65k70L93j69
5250c3p1J03K5J56k51r3J32p9J38q1k27R6J39J94k07K78n56N16k28J45k24K24
5272I6k51k5L77l50L40j76j17N7P3J04k77J52j65L68j17k7J64k05l2J96l88J43
5294f0j3K42r9k16M0K05M7n6o0J44j41J56J4j82R3l7r4J12p9M6p6M4o2LJ31k90
5320a88K04J75j63J11j37j06J58R3O0j76p1k86M44j93o9J48m3K5j56L14j79O1
5342B6n0j1oj48j0P0L06j61k34J01J33L4j66N1Q6N0L5k19j17J51P5J41j92J12
5366E7j73j82K29J93o3K2j80J44j12k0Q5q1J67l20K82j12m9J85j52J5J35K64k17
5389A17k46Q5j74M49r3k1r3j34Q1Q2J52k64J49j6j06L74k58R9m06Q8R0J07k05
$$ plain form
5412 -143 112 -16 74 -131 90 60 195 -194 183 240 133 42 -112 89 -224 -183 7 -68 -177 114 -278 -310
5434 -310 -127 363 -303 -86 98 138 76 -71 -185 -159 -92 42 -6 -74 -16 -50 -155 -103 -32 53 -169 -87 -102 100
5458 100 52 52 -116 -73 -93 189 -95 -90 55 -90 -222 57 57 -53 91 -279 28 -66 -128 221 55 -89 209 -148
5482 -148 131 196 -54 -35 -66 -94 13 -39 117 56 98 95 -149 127 36 85 -120 -163 46 -72 337 -156 134 102
5506 102 -113 138 -109 -157 -27 -9 73 175 46 -15 -126 -16 49 -19 193 -129 -68 -17 -27 -35 186 -131 205 66
5530 66 -95 -44 326 -27 -82 89 194 147 83 106 53 -2 33 321 -17 152 27 125 3 222 202 -102 -77 -115
5554 -115 -33 -37 -146 33 2 -130 -36 368 -196 -243 -203 -252 -93 -86 -89 236 -71 -177 126 -12 -191 132 49 -81
5578 -81 -54 22 22 -84 92 178 56 118 -120 -110 56 -151 -84 158 -36 22 77 190 -44 85 -43 176 -91 -142
$$ packed form
5412a43K55j28R0k05K21l0J35l89L77N7j07r1j54K01l13M1J90p5j09K91l92l2
5434c10J83M90o66K17J84M0o2j47j14K6O7J34m8o8N8l4j05N2P1Q5k22Q2j5K02
5458A00m8%j68M3k0K82k84NJ45j45j32K79%j10J44l70L07r4o2L49j66j44K98l57
5482a48K79O5k50J9l1k8J07n2J56o1M2lk44K76r1M9k05m3K09j18M09m93K90l2
5506A02k15K51k47m8J30J8Q2J02j29o1j11J10O5o8K12l22O1N1j0qK21l17L36j39
5530F6j61N1L70l53n5J71J05m7o4K3n3n5L5K88l38J69j25R8j22K19k0l04K5l8
5554a15Q2mj09J79l1j32R4M04n64m7M0m9J59PlL25l07j06L03j38j79L23q3j30
5578h1K7P6%j06J76Q6j22O2k38J0J66k07O7K42j94N8N5J13k34J29j28K19k67n1
$$ plain form
5602 -142 -129 146 -66 40 311 1 5 -163 81 135 -231 63 -200 -245 211 -132 -102 39 -137 149 98 -57
5624 -57 -46 152 66 132 -122 149 57 -28 -227 -182 -41 -122 -131 72 83 -30 82 198 62 44 -231 38 119 56 -53
5649 -53 -67 31 -134 114 65 -50 -207 -75 -156 103 200 -137 -20 -76 -204 -105 209 -67 107 123 -181 -81 -101
5672 -101 -12 41 -234 44 -80 -266 57 -82 -86 63 92 -22 94 196 -186 103 -75 -46 -3 206 -137 38
5694 38 4 -53 -81 133 -72 41 -18 -27 118 224 -84 -77 244 189 64 -129 -55 9 126 -168 245 -110 -53 -101 -52
5719 -52 -419 -258 -169 -141 -135 52 87 109 105 -223 -235 23 34 -322 126 -93 -57 -54 53 235 -119 54 -191 126 -134
5744 -134 146 62 150 -20 -23 271 -190 38 109 -354 -244 -21 -81 -347 -255 178 -79 -14 65 71 -78 -250 -361 190
5768 190 -119 18 189 -79 22 -119 -152 -133 -186 -180 -12 -55 -178 100 239 89 -124 -181 160 -77 108 26 -77
$$ packed form
5602a42J3K75k12J06K71l10Mj68K44N4l66K94k63m5M56l43L0J41j76K86n1j55
5624e7J1J98q6O6k54K71r2q5j99M5J41q1rK03J1j13J12J16j36j8k75K69Q1o3j09
5649e3j4R8j65K48m9j15j57J32q1K59R7l37J17n6j28R9L14k76J74J6l04J00k0
5672a01Q9N3k75K78j24j86L23j39mJ49K9j14J16J02l82K89j78K9M3K09l43J75
5694C8l4n7k8K14k05J13n9rJ45J06l08PL21n5j25j93P4O4J17k94M13l55N7m8M9
5719e2l67J61Q9K8OJ87L5K2ml28j2K58J1l56M48k19L6LJ07J82l54J73k45L17k60
5744a34K80q4Q8j70lK94m61K28P1m63J10K23o0k66R2M33k57O5P9Oj49j72j11N51
5768A90l09J37J71k68J01j41l3J9n3OJ68m3j23K78J39j50k13n7L41k37J85q2j03
$$ plain form
5791 -77 -83 -47 -183 185 -114 -303 -41 -32 -120 -67 58 -293 123 52 33 63 7 -332 148 -45 -153 43 -237 -97
5815 -97 2 -139 55 -126 -42 144 -24 13 -9 -129 -76 -73 -43 -35 -179 86 -52 96 6 -163 -145 150 110 -27 5
5840 5 -60 -97 -5 -37 -109 -46 104 -129 -39 109 -24 2 203 -74 -138 -149 -94 -25 57 231 191 2 -109 151 -110
5865 -110 -100 26 51 65 85 53 -97 -31 209 -66 155 49 -174 166 -149 279 21 -19 -128 93 152 143 -139
5888 -139 -26 -212 -67 -273 -39 -42 8 113 50 136 228 -79 117 111 51 -111 -87 -116 248 4 -230 -94 -2 96
5912 96 -144 -73 -19 75 -63 113 30 -10 55 161 -125 -48 -15 23 -102 -86 50 84 -90 -41 -50 176 135 -171 266
5937 266 -34 -56 272 -103 -31 65 98 -252 270 120 5 3 -245 -219 -171 19 137 -55 182 -74 163 20 215
5960 215 -86 -139 -19 -189 -107 -92 93 -26 38 104 -62 33 -234 59 -33 -174 160 90 134 -289 -281 188 29 59
$$ packed form
5791g7oL6j36L68k99j89K62Rq8N3J25l51M16p1j9L0n6l39M80j93j08J96k80J40
5815i7R9j41J94j81Q4J86j68L7k2j20N3LL0Qj44K65j38J48r0j69J8K95m0j37L2
5840Eo5l7R2l2p2O3J50k33R0J48j33K6K01k77o4j1N5O9Q2J74m0j89j11K60k61
5865a10J0J26K5J4K0l2j50O6K40k75K21j06k23L40l15M28k58m0j09K21N9rk82
5888a39J13j86J45k06K34lN0J05o3Q6R2l07J96oo0j62K4k9L64k44k34J36R2R8
5912I6k40P1N4R4j38J76q3m0O5J06k86P7L3L8j25J6J36L4j74M9rK26m1l06M37
5937B66l00k2L28l75P2R6L3l50N22j50j15kk48K6M8J90J18j92K37k56K37j43J95
5960B15l01n3J20j70Q2J5J85j19O4O6j66R5k67K93r2j41L34p0M4m23QM69j59L0
$$ plain form
5984 59 154 -52 -76 150 69 150 -2 33 7 -37 164 94 -156 -47 1 -18 149 138 -131 -280 71 -81 -151 71
6008 71 131 19 -105 -56 -32 58 65 203 202 -10 287 -33 71 7 -55 127 148 92 -84 -20 120 34 -97 124 43
6033 43 116 59 -146 234 12 80 -7 -122 95 167 67 -44 -151 36 68 22 106 123 -21 -178 -35 112 6
6056 6 -358 60 -167 -119 74 -80 -161 89 -131 94 14 79 114 42 68 -76 -99 90 86 15 -70 72 139 179 -128
6081 -128 -163 -167 -59 133 133 37 -314 193 118 143 29 138 -32 12 110 -115 172 -238 61 35 57 237 110 187
6105 187 -44 130 37 154 -189 -131 -233 56 -71 -102 57 33 222 -263 395 -184 -170 26 257 -205 16 48
6127 48 -65 0 -20 -311 -256 7 -28 293 -198 -13 55 -131 42 -167 123 126 10 76 -76 -5 -200 -115 100 -17
6151 -17 169 117 -254 -14 24 55 -202 -72 318 -24 260 129 162 -131 -211 74 31 -62 55 130 -15 89 175
$$ packed form
5984E9R5k06k4K26q1Q1j52L5k6m4K01p0k50J09M8j9J67j1k69j49L51j52p0K22
6008G1O0j12j24M9K4R0PJ38jk12K97l20J04o4o2J82K1n6j76O4J40q6j31K21q1
6033D3P3n7k05L80k22O8q7j15K17P2j00j11j07J87L2m6Q4J7j44j57J43J47j06
6056Fl64M18k27M8J93j54q1K50k20K25q0O5L5p2K6j44k3J89mp1q5J42O7M0l07
6081a28l5mJ08J92%r6l51N07p5K5j14J09j70M4R8k25K87m10K99k6K2J80j27P7
6105A87k31J74r3J17l43N8j02K89j27l1J59k4J89m85O58n79J4J96K31m62K21L2
6127D8j13O5k0k91N5K63l5L21m91J85O8j86J73k09K90Lj16O6j52P1j95Q5K15j17
6151a7J86n2l71K40L8L1k57J30L90l42K84j31L3k93q0K85m3r3J17P5j45J04Q6
$$ plain form
6174 175 92 54 31 33 64 -262 100 -4 146 14 201 -94 65 -125 29 -20 -81 149 -103 130 -71 -120 172
6197 172 114 -242 389 21 -168 1 -52 -151 -218 -36 -279 88 -80 -38 -141 -155 81 -31 47 12 155 -107 -183
6220 -183 -170 87 5 54 -82 -171 -62 -52 -42 103 91 -8 187 78 -131 175 86 -132 -169 -74 267 -60 64 149
6244 149 -230 -82 129 -71 168 -56 89 173 8 76 -204 -27 165 -25 126 192 204 -63 -15 212 187 35
6266 35 -56 -3 175 -63 21 26 113 -65 -104 107 -209 -220 -7 33 8 156 40 -23 -15 -102 77 129 -33 -126 55 69
6292 69 -5 -38 -105 215 170 0 148 -221 -32 104 -121 188 -68 158 -147 161 31 129 -39 44 124 215 -30
6315 -30 94 108 167 -160 186 174 -140 -153 62 70 -40 22 34 250 29 -174 137 165 -127 -73 29 102 -284 155
6339 155 -65 -19 125 -214 -84 -282 56 -236 195 229 -15 -118 68 75 -7 71 1 -66 15 58 169 -82 148
$$ packed form
6174A75q3l8k3KL1l26L62j04J50j32J87k95J59j90J54m9o1K30k52K33k01m9K92
6197A72n8l56O31l68j89J69n3r9o7J82k43L67j68M2j03j4K36j12P8l5J43k62p6
6220a83J3K57q2M9j36q9J09J0J0J45j2r9J95j09k09L06q9k18l7R5L41l27J24Q5
6244A49l79J48K11k00K39k24J45Q4j65O8k80J77J92j90J51O6J2k67M8K27k5j52
6266C5r1N3J78k38Q4NQ7j78l9K11l16j1K13M0k5J48j16o3Qq7J79N2j62r3J81J4
6292F9p4l3o7L20m5j70J48l69J89J36k25L09k56K26l05L08j30R8j68Q3Q0R1k45
6315c0J24J4N9l27L46j2l14j3K15Qj10O2J2K16k21k03L11K8k92N4J02P3l86M39
6339A55k20M6J44l39J30j98L38k92M31L4k44j03J86Pq2P8p0o7Q1M3J11k51K30
$$ plain form
6362 148 27 11 -23 -27 312 -93 11 103 33 -103 26 -110 -19 -122 -29 -75 45 113 -77 -62 -58 36 -78 160 -93
6387 -93 -24 -69 15 -69 63 26 -185 -26 -26 -99 218 -34 152 240 -99 -213 -274 -24 -21 -177 94 -118 -5 -112
6411 -112 217 95 330 -20 -8 87 -94 -72 -196 72 -278 83 -67 256 223 -155 165 -23 -49 86 -36 6
6433 6 31 139 59 86 -8 -22 -47 -33 -104 91 -219 -5 280 -92 197 -257 -138 91 -148 213 -17 44 -44 78
$$ packed form
6362A48j21j6l4mL39m05J04R2p0j36J29j36R1j03R3m6J20O8j90J5MR4j14K38k53
6387i3O9m5Q4q4J32l7k11J59%p3L17k52J86Q8l39j14o1K50Lj56K71k12J13j07
6411a12L29j22K35l50J2R5j81K2j24K68l50L61j50L23l3l78L20j88k6J35j22M2
6433FK5J08q0K7r4j4k5J4p1J95l10K14K85l72K89m54J19K29k39L61k30O1q8J22
$$ [...]
8191c92
##END NTUPLES=NMR FID
##END=
